##TITLE=1H_DE-80H_X3
 200.13MHz, d2o
 8 sc
 
 19ns.26.2.2025
##JCAMPDX= 6.0         $$ Bruker NMR JCAMP-DX V2.0
##DATA TYPE= NMR SPECTRUM
##DATA CLASS= NTUPLES
##ORIGIN= UXNMR, Bruker Analytische Messtechnik GmbH
##OWNER= pz
$$ XWIN-NMR		Version 3.5
$$ Fri Mar 27 10:28:21 2026 Russian Standard Time (UT+4h)  Yarkov@DPX200
##.OBSERVE FREQUENCY= 200.1313
##.OBSERVE NUCLEUS= ^1H
##.ACQUISITION MODE= SIMULTANEOUS
##.ACQUISITION SCHEME= undefined
##.AVERAGES= 8
##.DIGITISER RES= 18
##SPECTROMETER/DATA SYSTEM= spect
##.PULSE SEQUENCE= zg30
##.SOLVENT NAME= DMSO
##.SHIFT REFERENCE= (INTERNAL, DMSO, 0, 15.4935)
##AUDIT TRAIL= $$ (NUMBER, WHEN, WHO, WHERE, WHAT)
$$ ##TITLE= Audit trail, XWIN-NMR		Version 3.5
$$ ##JCAMPDX= 5.01
$$ ##ORIGIN= Bruker BioSpin GmbH
$$ ##OWNER= Yarkov
$$ C:/Bruker/XWIN-NMR/data/yarkov2/nmr/H-C/1/pdata/1/auditp.txt
$$ ##AUDIT TRAIL=  $$ (NUMBER, WHEN, WHO, WHERE, WHAT)
(   1,<2026-03-27 10:27:05.01 +0400>,<Yarkov>,<DPX200>,
      <created by zg, POWCHK disabled, PULCHK disabled
       configuration hash MD5:
       00 E9 B6 7A A2 85 ED C7 34 08 36 98 17 FE 4E 26
       data hash MD5: 16K
       AE 47 E7 F2 67 88 04 91 E4 F8 B7 66 E3 42 B4 43>)
(   2,<2026-03-27 10:27:36.50 +0400>,<Yarkov>,<DPX200>,
      <Start of raw data processing
       efp BC_mod = 2 LB = 0.25 FT_mod = 6 PKNL = 1 PHC0 = -5299.148 PHC1 = 6.821927 SI = 16K 
       data hash MD5: 16K
       58 BE DF 32 C6 33 3C B4 EA 07 57 A9 1E 86 13 FF>)
$$ ##END=
$$ 
$$ hash MD5
$$ 04 7B 80 FA E7 2B 35 FC E9 10 2F 29 07 50 E9 03
##$RELAX= 
##$RELAX= 
##$RELAX= 
##$RELAX= 
##$RELAX= 
##$RELAX= 
$$ Bruker specific parameters
$$ --------------------------
##$DU= <C:/Bruker/XWIN-NMR>
##$EXPNO= 1
##$NAME= <H-C>
##$PROCNO= 1
##$TYPE= <nmr>
##$USER= <yarkov2>
##$AMP= (0..31)
100 100 100 100 100 100 100 100 100 100 100 100 100 100 100 100 100 100 
100 100 100 100 100 100 100 100 100 100 100 100 100 100 
##$AQSEQ= 0
##$AQ_mod= 1
##$AUNM= <au_zg>
##$AUTOPOS= <>
##$BF1= 200.13
##$BF2= 200.13
##$BF3= 200.13
##$BF4= 200.13
##$BF5= 200.13
##$BF6= 200.13
##$BF7= 200.13
##$BF8= 200.13
##$BYTORDA= 1
##$CFDGTYP= 0
##$CFRGTYP= 5
##$CHEMSTR= <none>
##$CNST= (0..31)
1 1 145 1 1 1 1 1 1 1 1 1 1 1 1 1 1 1 1 1 1 1 1 1 1 1 1 1 1 1 1 1 
##$CPDPRG= <>
##$CPDPRG1= <>
##$CPDPRG2= <>
##$CPDPRG3= <>
##$CPDPRG4= <mlev>
##$CPDPRG5= <mlev>
##$CPDPRG6= <mlev>
##$CPDPRG7= <mlev>
##$CPDPRG8= <mlev>
##$CPDPRGB= <>
##$CPDPRGT= <>
##$D= (0..31)
0 0.7 0 0 0 0 0 0 0 0 0 0.03 0 0 0 0 0 0 0 0 0 0 0 0 0 0 0 0 0 0 0 0 
##$DATE= 1774592824
##$DBL= (0..7)
120 120 120 120 120 120 120 120 
##$DBP= (0..7)
150 150 150 150 150 150 150 150 
##$DBP07= 0
##$DBPNAM0= <>
##$DBPNAM1= <>
##$DBPNAM2= <>
##$DBPNAM3= <>
##$DBPNAM4= <>
##$DBPNAM5= <>
##$DBPNAM6= <>
##$DBPNAM7= <>
##$DBPOAL= (0..7)
0.5 0.5 0.5 0.5 0.5 0.5 0.5 0.5 
##$DBPOFFS= (0..7)
0 0 0 0 0 0 0 0 
##$DE= 6
##$DECBNUC= <off>
##$DECIM= 32
##$DECNUC= <off>
##$DECSTAT= 4
##$DIGMOD= 1
##$DIGTYP= 9
##$DL= (0..7)
0 120 120 120 120 120 120 120 
##$DP= (0..7)
$$ [...]
##$SUBNAM2= <"">
##$SUBNAM3= <"">
##$SUBNAM4= <"">
##$SUBNAM5= <"">
##$SUBNAM6= <"">
##$SUBNAM7= <"">
##$SUBNAM8= <"">
##$SUBNAM9= <"">
##$SW= 18.0517328524113
##$SWIBOX= (0..15)
0 0 2 0 0 0 0 0 0 0 0 0 0 0 0 0 
##$SW_h= 3612.71676300578
##$TD= 16384
##$TD0= 1
##$TE= 0
##$TE2= 300
##$TE3= 300
##$TEG= 300
##$TL= (0..7)
0 120 120 120 120 120 120 120 
##$TP= (0..7)
150 150 150 150 150 150 150 150 
##$TP07= 0
##$TPNAME0= <>
##$TPNAME1= <>
##$TPNAME2= <>
##$TPNAME3= <>
##$TPNAME4= <>
##$TPNAME5= <>
##$TPNAME6= <>
##$TPNAME7= <>
##$TPOAL= (0..7)
0.5 0.5 0.5 0.5 0.5 0.5 0.5 0.5 
##$TPOFFS= (0..7)
0 0 0 0 0 0 0 0 
##$TUNHIN= 0
##$TUNHOUT= 0
##$TUNXOUT= 0
##$USERA1= <user>
##$USERA2= <user>
##$USERA3= <user>
##$USERA4= <user>
##$USERA5= <user>
##$V9= 5
##$VALIST= <valist>
##$VCLIST= <CCCCCCCCCCCCCCC>
##$VD= 0
##$VDLIST= <DDDDDDDDDDDDDDD>
##$VPLIST= <PPPPPPPPPPPPPPP>
##$VTLIST= <TTTTTTTTTTTTTTT>
##$WBST= 1024
##$WBSW= 4
##$XGAIN= (0..3)
0 0 0 0 
##$XL= 0
##$YL= 0
##$YMAX_a= 77225
##$YMIN_a= -69073
##$ZGOPTNS= <>
##$ZL1= 120
##$ZL2= 120
##$ZL3= 120
##$ZL4= 120
##$ABSF1= 0
##$ABSF2= 0
##$ABSG= 0
##$ABSL= 0
##$ALPHA= 0
##$AQORDER= 0
##$ASSFAC= 0
##$ASSFACI= 0
##$ASSFACX= 0
##$ASSWID= 0
##$AUNMP= <proc_1d>
##$AZFE= 0.1
##$AZFW= 0.1
##$BCFW= 0
##$BC_mod= 2
##$BYTORDP= 0
##$COROFFS= 0
##$CY= -3
##$DATMOD= 1
##$DC= 0
##$DFILT= <>
##$DTYPP= 0
##$F1P= 0
##$F2P= 0
##$FCOR= 1
##$FTSIZE= 16384
##$FT_mod= 6
##$GAMMA= 0
##$GB= 0
##$INTBC= 1
##$INTSCL= 3.241238e-09
##$ISEN= 128
##$LB= 0.25
##$LEV0= 0
##$LPBIN= 0
##$MAXI= 10000
##$MC2= 0
##$MEAN= 0
##$ME_mod= 0
##$MI= 1.114404
##$NCOEF= 0
##$NC_proc= -8
##$NLEV= 6
##$NOISF1= 3.799351
##$NOISF2= 2.8
##$NSP= 0
##$NTH_PI= 0
##$NZP= 0
##$OFFSET= 15.49348
##$PC= 1
##$PHC0= -5299.148
##$PHC1= 6.821927
##$PH_mod= 1
##$PKNL= yes
##$PPARMOD= 0
##$PSCAL= 0
##$PSIGN= 0
##$REVERSE= no
##$SF= 200.130005648809
##$SI= 16384
##$SIGF1= 3
##$SIGF2= 2
##$SINO= 0.751879
##$SIOLD= 32768
##$SREGLST= <19F.Aceton>
##$SSB= 0
##$STSI= 16384
##$STSR= 0
##$SW_p= 3612.71676300578
##$SYMM= 0
##$S_DEV= 0
##$TDeff= 16384
##$TDoff= 0
##$TI= <>
##$TILT= no
##$TM1= 0
##$TM2= 0
##$TOPLEV= 0
##$USERP1= <user>
##$USERP2= <user>
##$USERP3= <user>
##$USERP4= <user>
##$USERP5= <user>
##$WDW= 1
##$XDIM= 16384
##$YMAX_p= 472218645
##$YMIN_p= -1178591
$$ End of Bruker specific parameters
$$ ---------------------------------
##NTUPLES= NMR SPECTRUM
##VAR_NAME=  FREQUENCY,     SPECTRUM/REAL,   SPECTRUM/IMAG
##SYMBOL=    X,             R,               I
##VAR_TYPE=  INDEPENDENT,   DEPENDENT,       DEPENDENT
##VAR_FORM=  AFFN,          ASDF,            ASDF
##VAR_DIM=   16384,         16384,           16384
##UNITS=     HZ,            ARBITRARY UNITS, ARBITRARY UNITS
##FACTOR=    0.220516191357247, 1,           1
##FIRST=     3100.71018562418, 0,            0
##LAST=      -512.006577381595, 0,           0
##MIN=       -512.006577381595, -1178591,    0
##MAX=       3100.71018562418, 472218645,    0
$$ Real data points
##PAGE= N=1
##DATA TABLE= (X++(R..R)), XYDATA
$$ [...]
5188A7362981M93191L60768J23048K20472K82373N64902M77333N30679O3970O54315
$$ 17362981 17856172 18216940 18339988 18560460 18842833 19407735 19885068 20415747 20479717 21134032
5178B1134032N01002M49524K41506M68369N90253M11984L02177J25828Q51182
$$ 21134032 21635034 22084558 22326064 22794433 23384686 23796670 24098847 24224675 25075857
5169B5075857M22793Q63336K28831J10774P33659N57981N16460N38243Q18558
$$ 25075857 25498650 26361986 26590817 26701591 27435250 27993231 28509691 29047934 29866492
5160B9866492L76792L94641P90574P82070N13231J98875O50319K72824L64875
$$ 29866492 30243284 30637925 31428499 32210569 32723800 32922675 33572994 33845818 34210693
5151C4210693P44658O17565O63285P55287O82677M01486M97930K13608N88987
$$ 34210693 34955351 35572916 36236201 36991488 37674165 38075651 38573581 38787189 39376176
5142C9376176O75929O2705N49680O77072N85893J29720K19565M25972J29836N13219
$$ 39376176 40052105 40114810 40664490 41341562 41927455 42057175 42276740 42702712 42832548 43345767
5132D3345767O8868N7882K71498O37524P0055k79695J04118l62135J39830o0692
$$ 43345767 43414635 43472517 43744015 44381539 44451594 44171899 44276017 43913882 44053712 43993020
5122D3993020k79756l03794q7473j93151j49162m6973o97635j02683j15504j51776
$$ 43993020 43713264 43409470 43321997 43128846 42979684 42932711 42235076 42132393 42016889 41865113
5112D1865113p64850p82359k46624k29787k21296n00107m64764o18924k28516
$$ 41865113 41100263 40317904 40071280 39841493 39620197 39120090 38655326 38036402 37807886
5103C7807886m90975l68639l21397r57450k92581l02676n42279l99433p40680
$$ 37807886 37316911 36948272 36626875 35669425 35376844 35074168 34531889 34132456 33391776
5094C3391776m87765o94197K5142l95585j70403o75895q39216k68362n55583j39253
$$ 33391776 32904011 32209814 32234956 31839371 31668968 30993073 30153857 29885495 29329912 29190659
5084B9190659m20923m04964l21651m51856m16266j56287k61292o99845k74421
$$ 29190659 28769736 28364772 28043121 27591265 27174999 27018712 26757420 26057575 25783154
5075B5783154k05980k29262k82422n72763m04137k78176j57370k99447k09852
$$ 25783154 25577174 25347912 25065490 24492727 24088590 23810414 23653044 23353597 23143745
5066B3143745j08087j20248j39126m06895l36752m19087J6962k5304m48684j98429
$$ 23143745 23035658 22915410 22776284 22369389 22032637 21613550 21630512 21605208 21156524 20958095
5056B0958095J80526j44553k59636O3632m53318k32868J51662M26048J66127j31862
$$ 20958095 21138621 20994068 20734432 20798064 20344746 20111878 20263540 20689588 20855715 20723853
5046B0723853l42326n10721K83219J13884P9688n0237n3042J91152l13349J23831
$$ 20723853 20381527 19870806 20154025 20267909 20347597 20297360 20244318 20435470 20122121 20245952
5036B0245952K04528L3714M8813L8792k84574m85213N946K0518K86460o8885n83017
$$ 20245952 20450480 20484194 20533007 20571799 20287225 19802012 19807958 19828476 20114936 20046051 19463034
5025A9463034m0180K41425J30474k12214j91978q27699J0193L69186n9708l16057
$$ 19463034 19422854 19664279 19794753 19582539 19390561 18562862 18573055 18942241 18882533 18566476
5015A8566476j41152K934R0031O1706m28871k99750l46798J75597N32115k58749
$$ 18566476 18425324 18428258 18518289 18579995 18151124 17851374 17504576 17680173 18212288 17953539
5005A7953539k28703j18919P7473m88898o3342j97995L3512M21162k4283M03059
$$ 17953539 17724836 17605917 17683390 17194492 17131150 16933155 16966667 17387829 17363546 17766605
4995A7766605K23392L39403J11353k62428q59882p03958m45374n22411j9797j24993
$$ 17766605 17989997 18329400 18440753 18178325 17318443 16614485 16169111 15646700 15626903 15501910
4985A5501910j2212K67544j85110j27933l1286K11554m00104l04752J37529m0376
$$ 15501910 15489698 15757242 15572132 15444199 15412913 15624467 15224363 14919611 15057140 15016764
4975A5016764P8038n40768J70720j24198J46255L38998J27258o1576l06310L76722
$$ 15016764 15094802 14554034 14724754 14600556 14746811 15085809 15213067 15151491 14845181 15221903
4965A5221903O1180K70376j1578j3453n8825M31179q6604K54607j61446k33672
$$ 15221903 15283083 15553459 15541881 15528428 15469603 15900782 15814178 16068785 15907339 15673667
4955A5673667J05814q1811j69166j20353p3341j1651O0169K03736P6176j69275
$$ 15673667 15779481 15697670 15528504 15408151 15334810 15323159 15383328 15587064 15663240 15493965
4945A5493965J82938o8578k97653l92413o5942M17359r8973j62480N19219k35652
$$ 15493965 15676903 15608325 15310672 14918259 14852317 15269676 15170703 15008223 15527442 15291790
4935A5291790K26324k8803j99395M0529k8658o5738J37451K16139j86501l07412
$$ 15291790 15518114 15489311 15289916 15330445 15301787 15236049 15373500 15589639 15403138 15095726
4925A5095726j80253K3184J13353K4249j14521K96224K01509K26890n038k06195
$$ 15095726 14915473 14938657 15052010 15076259 14961738 15257962 15459471 15686361 15681323 15475128
4915A5475128M41541N01481L82743j55169j14821K1183J23406K54700N6760j73465
$$ 15475128 15916669 16418150 16800893 16645724 16530903 16552086 16675492 16930192 16986952 16813487
4905A6813487P3133M60809L56053L9103j3509r5125p2918N23189K26192k61667
$$ 16813487 16886620 17347429 17703482 17742585 17729076 17633951 17561033 18084222 18310414 18048747
4895A8048747K00023P34092M90036K89506n6225K27920N90410K75893L09531j79999
$$ 18048747 18248770 18982862 19472898 19762404 19706179 19934099 20524509 20800402 21109933 20929934
4885B0929934L8562M97723M79145K36397L86151K29773N3099K84313K0309J64722
$$ 20929934 20968496 21466219 21945364 22181761 22567912 22797685 22850784 23135097 23155406 23320128
4875B3320128j74680r5343J12704k2784J23046j4130J08090O68991K25769j28992
$$ 23320128 23145448 23050105 23162809 23140025 23263071 23248941 23357031 24026022 24251791 24122799
4865B4122799L25019l01750K82489O40977J03867o496J94495M62043O7496K38881
$$ 24122799 24447818 24146068 24428557 25069534 25173401 25166905 25361400 25823443 25890939 26129820
4855B6129820J30267P3975o2771N8458L8239k40391r0859k288k2057O9519k97168
$$ 26129820 26260087 26334062 26271291 26329749 26367988 26127597 26036738 26034450 26012393 26081912 25784744
4844B5784744p724L75303K17789J33486N20401O99208o7264R17095P03492O51267
$$ 25784744 25777020 26152323 26370112 26503598 27023999 27723207 27655943 28573038 29276530 29927797
4834B9927797J126871J591849K452188L656704Q703073J5173411J7697032R434873
$$ 29927797 31054668 32646517 35098705 38755409 47458482 62631893 80328925 89763798
4826H9763798k204160j0795567j3195387j0519619p622077n711876m004142k877105
$$ 89763798 87559638 76764071 63568684 53049065 45426988 39715112 35710970 32833865
4818C2833865k261288j239574j252936r19790n81903p88977q79519n81038m60926
$$ 32833865 30572577 29333003 28080067 27160277 26578374 25789397 24909878 24328840 23867914
4809B3867914r15106n66481p99754p24492l94729m47014k79934n52375j99643
$$ 23867914 22952808 22386327 21586573 20862081 20467352 20020338 19740404 19188029 18988386
4800A8988386j54739k44186j63989j016298k58559K12946K37932l31552l19687
$$ 18988386 18833647 18589461 18425472 17409174 17150615 17363561 17601493 17269941 16950254
4791A6950254k30657o16365p4517m86009m61407q38418j69160j35744k55999l5453
$$ 16950254 16719597 16103232 16028715 15542706 15081299 14242881 14073721 13937977 13681978 13646525
4781A3646525l76612r7274J76582M5409N8097m46449k75829k48845J81329O5753
$$ 13646525 13269913 13172639 13349221 13394630 13452727 13006278 12730449 12481604 12662933 12728686
4771A2728686o09116k45992j9695O3264M3520j29770l14704m9377L82860J50556
$$ 12728686 12119570 11873578 11853883 11917147 11960667 11830897 11516193 11466816 11849676 12000232
4761A2000232j91571n074M36593L51429M52111N0531R716k30834M31634M73537
$$ 12000232 11808661 11803587 12240180 12591609 13043720 13094251 13103967 12873133 13304767 13778304
4751A3778304L4685p5405M55511P53379M11688N89692j54519K67292R02958O53177
$$ 13778304 13812989 13737584 14193095 14946474 15358162 15947854 15793335 16060627 16963585 17616762
4741A7616762J004270M0557R9456O18743J018715R92897L89007N47654O98703
$$ 17616762 18621032 18661589 18761045 19379788 20398503 21391400 21780407 22328061 23026764
4732B3026764J017362P31757O27095N78641P12209Q69850K92827L20163J4688
$$ 23026764 24044126 24775883 25402978 25981619 26693828 27563678 27856505 28176668 28191356
4723B8191356J6214K56949K07367K82059j7590P6834K13828R98076M70404M61904
$$ 28191356 28207570 28464519 28671886 28953945 28936355 29013189 29227017 30225093 30695497 31157401
4713C1157401R84516R50609J461437J194882J104387J192347R45181J150075J522121
$$ 31157401 32141917 33092526 34553963 35748845 36853232 38045579 38990760 40140835 41662956
4704D1662956J165007M93782R22032M65823P231l31781n97372q97652n48384p19782
$$ 41662956 42827963 43321745 44243777 44709600 44716831 44385050 43787678 42890026 42341642 41621860
4694D1621860j022807p99635j112502j236764p59016q89095j096284j085025r72160
$$ 41621860 40599053 39799418 38686916 37450152 36691136 35802041 34705757 33620732 32648572
4685C2648572o49517r4063n07786r01791l47629j70682K87352J84127k67470j051431
$$ 32648572 31999055 31904992 31397206 30495415 30147786 29977104 30264456 30448583 30181113 29129682
4675B9129682p65287n98795m84247j039527j635138r75779n50582o06687r47574
$$ 29129682 28364395 27765600 27281353 26241826 24606688 23630909 23080327 22473640 21526066
4666B1526066j253636j142989r47707o23175n29891p98783o90511m86049j57028
$$ 21526066 20272430 19129441 18181734 17558559 17028668 16229885 15539374 15053325 14896297
4657A4896297k71452m43813q80357k67057k16109k35356p86182n18128l553J12437
$$ 14896297 14624845 14181032 13300675 13033618 12817509 12582153 11795971 11277843 11274290 11386727
4647A1386727q4261k64054k30055k37982J65386Q078K68335k50581l80686J29981
$$ 11386727 11302466 11038412 10808357 10570375 10735761 10743839 11012174 10761593 10380907 10510888
4637A0510888K88214M26995p1293k7957L91937M81276N47630Q87633K581052M463917
$$ 10510888 10799102 11226097 11154804 11126847 11518784 12000060 12547690 13435323 16016375 20480292
4627B0480292N141685K207845r05908l030762l444329k302839j779525j368415
$$ 20480292 25621977 27829822 26923914 23893152 20448823 18145984 16366459 14998044
4619A4998044j216508o46943k82292o4016N21364M57496O82864J099803K028666
$$ 14998044 13781536 13134593 12852301 12788285 13309649 13767145 14450009 15549812 17578478
4610A7578478K574136J573072J048673L79236N48246O06937J600784K615654L251402
$$ 17578478 20152614 21725686 22774359 23153595 23701841 24308778 25909562 28525216 31776618
4601C1776618L639775J780517K33255r15629j307285m1198J674856L313370L852951
$$ 31776618 35416393 37196910 37430165 36514536 35207251 35166053 36840909 40154279 44007230
4592D4007230K302285j36308k006746l112678k932638k080416m04339O04108J129847
$$ 44007230 46309515 46173207 44166461 41053783 38121145 36040729 35636390 36240498 37370345
4583C7370345q9674k331527l325974l455487j781748j380366r41768l28839m37767
$$ 37370345 37280671 34949144 31623170 28167683 26385935 25005569 24063801 23734962 23297195
4574B3297195j145135j786291k113089k449590j716112r42922q93402j341121
$$ 23297195 22152060 20365769 18252680 15803090 14086978 13144056 12250654 10909533
4566A0909533q75086o02642n45364j2630j94554n96406k14520J56361N33726J92330
$$ 10909533 10034447 9431805 8886441 8873811 8679257 8082851 7868331 8024692 8558418 8750748
4556H750748k02858J80149k28798J22047j06202n07695l24547M15097M782j94525
$$ 8750748 8547890 8728039 8499241 8621288 8515086 8007391 7682844 8097941 8102723 7908198
4546G908198m3045o30939m02588K53936l0956J21386j65761o02026J60167N06196
$$ 7908198 7865153 7234214 6831626 7085562 7054606 7175992 7010231 6408205 6568372 7074568
4536G074568Q2846n89330m77636K38966M60620m2882m75390n35899m25937L82701
$$ 7074568 7157414 6568084 6090448 6329414 6790034 6747152 6271762 5735863 5309926 5692627
4526E692627K715k21731J79459k33842L94265L19165l22670p77384m07006Q7230
$$ 5692627 5695342 5473611 5653070 5419228 5813493 6132658 5809988 5032604 4625598 4712828
4516D712828M06K2545m84136k78090L28296K55651K65232m24958K68674j8157
$$ 4712828 4713234 4735779 4251643 3973553 4301849 4557500 4822732 4397774 4666448 4648291
4506D648291Q1986J46099j47583j47295k31196K0105P4876l28336n62541L7663
$$ 4648291 4730277 4876376 4728793 4581498 4350302 4370407 4445283 4116947 3554406 3592069
4496C592069k68395Q1952j39077k99038l8727K48816M09666K98516o5394j62231
$$ 3592069 3323674 3405626 3266549 2967511 2928784 3177600 3587266 3885782 3820388 3658157
4486C658157K40463J94625q6513k07596j64982k64002k11131L08075o3070j5661
$$ 3658157 3898620 4093245 4006732 3799136 3634154 3370152 3159021 3467096 3404026 3388365
4476C388365k60148o3553L11098J83202j03990Q6620K72281L93358O8066m17373
$$ 3388365 3128217 3064664 3375762 3558964 3454974 3541594 3813875 4207233 4275299 3857926
4466C857926l34200J88598J76597J73794j29009k60926K29733K239J73214K98149
$$ 3857926 3523726 3712324 3888921 4062715 3933706 3672780 3902513 3904752 4077966 4376115
4456D376115j85343l30597M40454K82545j24438m16143k98028k11909Q46380k18120
$$ 4376115 4190772 3860175 4300629 4583174 4458736 4042593 3744565 3532656 4379036 4160916
4446D160916k64j35634P7454J29495j56457J62625k67041K82212j06186J90557
$$ 4160916 4160652 4025018 4102472 4231967 4075510 4238135 3971094 4253306 4147120 4337677
4436D337677M08888j05746k29220J08363N4966m59961m78620n66076L26686J7517
$$ 4337677 4746565 4640819 4411599 4519962 4574928 4114967 3636347 3070271 3396957 3414474
4426C414474o5627j56604n06068M48047N23823L49742k15164J48030m55992J50020
$$ 3414474 3348847 3192243 2686175 3134222 3658045 4007787 3792623 3940653 3484661 3634681
4416C634681K9096n35686j7282m40264L35302r756k73046j75039l23896L84465
$$ 3634681 3663777 3128091 3110809 2670545 3005847 2996091 2723045 2548006 2224110 2608575
4406B608575k83972Q5485Q3361J42600L9426n3234Q07l71814K49198j10686j04904
$$ 2608575 2324603 2410088 2493449 2636049 2675475 2622241 2623048 2251234 2500432 2389746 2284842
4395B284842k9461j00580m7436o0085J85018l5598K73635r4592J46111J30820
$$ 2284842 2255381 2154801 2107365 2047280 2232298 2196700 2470335 2375743 2521854 2652674
4385B652674l9741J06579n91733K9746l611L66340j3243M7218j53196k46885L3157
$$ 2652674 2612933 2719512 2127779 2157525 2153914 2520254 2507011 2554229 2401033 2154148 2187305
4374B187305m49359M33393Q5832l32641K20463K40509j5831o295k7029j86201
$$ 2187305 1737946 2171339 2257171 1924530 2144993 2385502 2369671 2363376 2336347 2150146
4364B150146K8518L3404j48004j64204J36038K20727n1050M67496K44938k05997
$$ 2150146 2178664 2212068 2064064 1899860 2035898 2256625 2205575 2673071 2918009 2712012
4354B712012K09113l9674o6610n37112m6044m62183q1593Q9891K54072L91739
$$ 2712012 2921125 2881451 2814841 2277729 2231685 1769502 1687909 1777800 2031872 2423611
4344B423611K4352r1971n58721N28877k43925r9323J66258l92595L26378J53464
$$ 2423611 2447963 2355992 1797271 2326148 2082223 1982900 2149158 1756563 2082941 2236405
4334B236405M1793K2742j13602J02665j87053j93983k87281J83574k64744J40896
$$ 2236405 2278198 2300940 2187338 2290003 2102950 1908967 1621686 1805260 1540516 1681412
4324A681412m6891j01553L61549R5627L10568k3440k85347k44777M02178O99522
$$ 1681412 1634521 1532968 1894517 1990144 2300712 2277272 1991925 1747148 2149326 2848848
4314B848848K65344q6988l11448L60913l27740j04910k10198l21164k81838L20050
$$ 2848848 3114192 3027204 2715756 3076669 2748929 2644019 2433821 2112657 1830819 2150869
4304B150869K96001l66384K42819l93536O281K62275J23465m21851k7019L06634
$$ 2150869 2446870 2080486 2323305 1929769 1936050 2198325 2321790 1899939 1872920 2179554
4294B179554j14091L96490J01535l92627L85530O83784P3831k83040j29209m39516
$$ 2179554 2065463 2461953 2563488 2170861 2556391 3240175 3314006 3030966 2901757 2462241
4284B462241J88414K42757j30898j4408k68511M80059J70771J93487k58017k88151
$$ 2462241 2650655 2893412 2762514 2748106 2479595 2959654 3130425 3323912 3065895 2777744
4274B777744J88898M65134J35134m50322l5467M56840P63934J04334k31315j09860
$$ 2777744 2966642 3431776 3566910 3116588 3081121 3537961 4301895 4406229 4174914 4065054
4264D065054L94426L09206l46191l37170n85556k06509K93236L59740J80409q7110
$$ 4065054 4459480 4768686 4422495 4085325 3499769 3293260 3586496 3946236 4126645 4039535
4254D039535K34217J90135K44979k01546l31956k53612K54337O28152p9922j65535
$$ 4039535 4273752 4463887 4708866 4507320 4175364 3921752 4176089 4804241 4724319 4558784
4244D558784Q2376L903J86065K83890o0520n13764j8433k00590K45590J56830
$$ 4558784 4641160 4645063 4831128 5115018 5054498 4540734 4522301 4321711 4567301 4724131
4234D724131m34973k70047K79901R63446j9953n93168n09101J78616M61070K92689
$$ 4724131 4289158 4019111 4299012 5262458 5242505 4649337 4140236 4318852 4779922 5072611
4224E072611m49805j84510Q37102K86300J38509k18812r7657k44363J04148J76504
$$ 5072611 4622806 4438296 5275398 5561698 5700207 5481395 5383738 5139375 5243523 5420027
4214E420027k38286k86310l88562J39149Q75851j60313q51415m85837N22870L00416
$$ 5420027 5181741 4895431 4506869 4646018 5521869 5361556 4510141 4024304 4547174 4847590
4204D847590k26082k76131J11376L90081O49744K53150j60024l01432l73054j1300
$$ 4847590 4621508 4345377 4456753 4846834 5496578 5749728 5589704 5288272 4915218 4903918
4194D903918j56256J56311l71543k07751M44167N27554O6378j7000l70718k6317
$$ 4903918 4747662 4903973 4532430 4324679 4768846 5296400 5362778 5345778 4975060 4948743
4184D948743L0545j19704o20752N5268J09084j9212K12163j18247k38241P1123
$$ 4948743 4979288 4859584 4238832 4294100 4403184 4383972 4596135 4477888 4239647 4310770
4174D310770J97056K89830p6009k47367n9983J64985O90299L00084j069613p10580
$$ 4310770 4507826 4797656 4721647 4474280 4414297 4579282 5269581 5569665 4500052 3789472
4164C789472O52492J60835j71031m90137l38530J76459L56441q2396k38000j57870
$$ 3789472 4441964 4602799 4431768 3941631 3603101 3779560 4136001 4053605 3815605 3657735
4154C657735J86882K59702M17014j57592l22671J43365L08101N39049k02103n54616
$$ 3657735 3844617 4104319 4521333 4363741 4041070 4184435 4492536 5031585 4829482 4274866
4144D274866j31587L64192L72634m43986p23661k50791L59832M15078M22037P9127
$$ 4274866 4143279 4507471 4880105 4436119 3712458 3461667 3821499 4236577 4658614 4737741
4134D737741r833P5118K10409L01376j05720L1016q8440M88457Q35585Q3786l54298
$$ 4737741 4727908 4803026 5013435 5314811 5209091 5240107 5151667 5640124 6475709 6559495 6205197
4123F205197L47123P10915M85916k33627k37265K01483N76166M48297p7457o6536
$$ 6205197 6552320 7263235 7749151 7515524 7278259 7479742 8055908 8504205 8426748 8360212
4113H360212l2693N52080Q18633N40097o167m61161J00028N32935L57286N23267
$$ 8360212 8327519 8879599 9698232 10238329 10232162 9771001 9871029 10403964 10761250 11284517
4103A1284517J50689O86055J222213N61412J55672j17969N0086K15631P50243
$$ 11284517 11435206 12121261 13343474 13904886 14060558 13942589 13992675 14208306 14958549
4094A4958549J42972l93770J75406J05210P11802J008976P96922m4463R9313R21643
$$ 14958549 15101521 14707751 14883157 14988367 15700169 16709145 17506067 17461604 17560917 18482560
4084A8482560O70993M07327Q9574N20800J357234J330288N13342o3848L34019
$$ 18482560 19153553 19560880 19650454 20171254 21528488 22858776 23372118 23308270 23642289
4075B3642289M49592K26305K19157J71716k98163n5350Q31633M90395J51086J59640
$$ 23642289 24091881 24318186 24537343 24709059 24410896 24355546 25187179 25677574 25828660 25988300
4065B5988300L21271M10332N49747K26043P9466O05995J263564J286750K018714
$$ 25988300 26309571 26719903 27269650 27495693 27575159 28181154 29444718 30731468 32750182
4056C2750182K417724K987297K888878J364737p90612j499913j270512r25054
$$ 32750182 35167906 38155203 41044081 42408818 41618206 40118293 38847781 37922727
4048C7922727q5035O98751P4919j55450K28237P50421K77341p33012m01060j40155
$$ 37922727 37837692 38536443 38611362 38455912 38684149 39434570 39711911 38978899 38577839 38437684
4038C8437684O04334O12907j73043m65482P05994Q13164J24375K81948J09548
$$ 38437684 39042018 39654925 39481882 39016400 39722394 40535558 40659933 40941881 41051429
4029D1051429n95983L66183K12496J32477N42361J7588p5595K84006M33921l80324
$$ 41051429 40455446 40821629 41034125 41166602 41708963 41726551 41650956 41934962 42368883 41988559
4019D1988559r29059m23229j04818j20728l13712j68856K70090P23919n431r6771
$$ 41988559 41059500 40636271 40531453 40410725 40097013 39928157 40198247 40922166 40916735 40819964
4009D0819964l38775K47014l30051k84534q3705o13405p7522k7455L04637r1227
$$ 40819964 40481189 40728203 40398152 40113618 40029913 39416508 39338986 39311531 39616168 39524941
3999C9524941l95449q18088q44722m21424p06462j464483r91161k87104m78898
$$ 39524941 39129492 38311404 37466682 37045258 36338796 34874313 33883152 33596048 33117150
3990C3117150l75132m19795p56906k17708k50070k53312n12765m47441m81750
$$ 33117150 32742018 32322223 31565317 31347609 31097539 30844227 30331462 29884021 29402271
3981B9402271m82515K39144L94964l94198k58246K69764k70821L3542l13132o99208
$$ 29402271 28919756 29158900 29553864 29159666 28901420 29171184 28900363 28933905 28620773 27921565
3971B7921565m70095J4537J81035n48486j19919m14709o53019k31218p04020p56400
$$ 27921565 27451470 27466007 27647042 27098556 26978637 26563928 25910909 25679691 24975671 24219271
3961B4219271m03512k82237k0977J01789J2003k8483J23197Q70617J475415K119956
$$ 24219271 23815759 23533522 23512545 23614334 23626337 23597854 23721051 24591668 26067083 28187039
3951B8187039J375862J5181j540608k048998j902783j491876r01453m74030n21764
$$ 28187039 29562901 29578082 28037474 25988476 24085693 22593817 21692364 21218334 20696570
3942B0696570m33127p10439q59243n15914k64442k82102n13131k77811l58447
$$ 20696570 20263443 19553004 18693761 18177847 17913405 17631303 17118172 16840361 16481914
3933A6481914J91738K69331n6009l51703l82166M9717m11662k03152J77838j43173
$$ 16481914 16673652 16942983 16886974 16535271 16153105 16202822 15791160 15588008 15765846 15622673
3923A5622673Q54412J877939K608294J632516J78444j448522k062689k001567
$$ 15622673 16477085 18355024 20963318 22595834 22774278 21325756 19263067 17261500
3915A7261500j928903j231679k09229p4988j42194m78826j49873j01646P302J29560
$$ 17261500 15332597 14100918 13891689 13816701 13674507 13195681 13045808 12944162 12951464 13081024
3905A3081024l09593m07880M49265L60162k47846J19737j48838K7148j35941N15079
$$ 13081024 12771431 12363551 12812816 13172978 12925132 13044869 12896031 12923179 12787238 13302317
3895A3302317j95130l51057L21192J64970L30877M82807K9899j89419M56604Q1507
$$ 13302317 13107187 12756130 13077322 13242292 13573169 14055976 14085875 13896456 14353060 14434567
3885A4434567L5966l7478j08747j7839j75523L6478k28201K93168l01311m34394
$$ 14434567 14470533 14433055 14324308 14306469 14130946 14167424 13939223 14232391 13931080 13496686
3875A3496686M26828j8100m73832k77186L22297j21438m13865o9102J94920J20806
$$ 13496686 13923514 13905414 13431582 13154396 13476693 13355255 12941390 12872288 13067208 13188014
3865A3188014j10013L24465O6444j07738L05168k34539K49596L35998K24780P201
$$ 13188014 13078001 13402466 13468910 13361172 13666340 13431801 13681397 14017395 14242175 14249376
3855A4249376J30344N02781K43854M8691q2195K10757P02329M57731j71914O39735
$$ 14249376 14379720 14882501 15126355 15175046 15092851 15303608 16005937 16463668 16291754 16931489
3845A6931489O64681N56993O50625M30397P22611M59534M79333K87470P48575
$$ 16931489 17596170 18153163 18803788 19234185 19956796 20416330 20895663 21183133 21931708
3836B1931708O58403N28026J78972N86765M29282l27747L53596K99643j04431
$$ 21931708 22590111 23118137 23297109 23883874 24313156 23985409 24339005 24638648 24534217
3827B4534217j65016J05082l08530O7442M83620j01259M1212N15072j01176L38468
$$ 24534217 24369201 24474283 24165753 24233195 24716815 24615556 24656768 25171840 25070664 25409132
3817B5409132L04895K90032k61988r5445L59621K2865l6058l35304j91644k00791
$$ 25409132 25714027 26004059 25742071 25646626 26006247 26029112 25993054 25657750 25466106 25265315
3807B5265315J87177k89997p15589N70292P25735K72991K96097J91104J2828N16670
$$ 25265315 25452492 25162495 24446906 25017198 25742933 26015924 26312021 26503125 26515953 27032623
3797B7032623J06953J12456N05555N4020J78979K65158L45755J07004j72989k44099
$$ 27032623 27139576 27252032 27757587 27811607 27990586 28255744 28601499 28708503 28535514 28291415
3787B8291415j64897R9959n06513n15077k82297j9831j60036j5128P0970J01188
$$ 28291415 28126518 28226477 27719964 27204887 26922590 26902759 26742723 26727595 26798565 26899753
3777B6899753j85646p81392l64694n33979o24156l11371j030853p73309p13382
$$ 26899753 26714107 25932715 25568021 25034042 24409886 24098515 23067662 22294353 21580971
3768B1580971q88413r93878j041829q84787q17431k77722l29404k17451n40811
$$ 21580971 20692558 19698680 18656851 17772064 16954633 16676911 16347507 16130056 15589245
3759A5589245j76121k48459J797j26156m62208L11063J24247j89243j82857l17604
$$ 15589245 15413124 15164665 15166462 15040306 14578098 14889161 15013408 14824165 14641308 14323704
3749A4323704O9319J67203M69179n7158K71733L14254k09942m39128q2470J23324
$$ 14323704 14393023 14560226 15029405 14972247 15243980 15558234 15348292 14909164 14826694 14950018
3739A4950018n17988j25412J96072J58902j65219l43990j54116k25257m9955l80511
$$ 14950018 14432030 14306618 14502690 14661592 14496373 14152383 13998267 13773010 13723055 13342544
3729A3342544m10728j57588j97716m45854j49148P411l69703k18246m52492k34750
$$ 13342544 12931816 12774228 12576512 12130658 11981510 11988921 11619218 11400972 10948480 10713730
3719A0713730m26700l08315j79671k36951K15256J42938j67383n9494k09807l58657
$$ 10713730 10287030 9978715 9799044 9562093 9777349 9920287 9752904 9693410 9483603 9124946
3709I124946n91160j78339j10044K93576J79533n33388N1930L52803P3052l57029
$$ 9124946 8533786 8355447 8245403 8538979 8718512 8185124 8237054 8589857 8662909 8305880
3699H305880j8959j80397k11224P8239r1448R928J61835j70455K79017L04623
$$ 8305880 8286921 8106524 7895300 7973539 7882091 7892019 8053854 7883399 8162416 8467039
3689H467039J19369j56698k57093r0645k72482m32419K05799K6985o6449J34767
$$ 8467039 8586408 8429710 8172617 8081972 7809490 7377071 7582870 7609855 7543406 7678173
3679G678173J2911K41172J53888K98351J53280J95416j27l02168m8660K76462
$$ 7678173 7691084 7932256 8086144 8384495 8537775 8733191 8733064 8430896 8382236 8658698
3669H658698N317n1335J20406R2068j54729J76248L08712l49901j26786K03559
$$ 8658698 8664015 8612680 8733086 8825154 8670425 8846673 9155385 8805484 8678698 8882257
3659H882257j12320L4444P00958J19656J8986q8842K60047J39932K04881j81114
$$ 8882257 8769937 8804381 9505339 9624995 9643981 9555139 9815186 9955118 10159999 9978885
3649I978885j85606Q23253o8186P0379M36455O97292L8475j70781k14732l55637
$$ 9978885 9793279 10616532 10548346 10618725 11055180 11752472 11790947 11620166 11405434 11049797
3639A1049797N74047K79093k81199L9839m7712L77969n250K95569r9156k99652
$$ 11049797 11623844 11902937 11621738 11661577 11613865 11991834 11986584 12282153 12182997 11883345
3629A1883345J15155J1556Q1532L289K36723K3105P69772L67023j45064k79780
$$ 11883345 11998500 12010056 12091588 12094877 12331600 12354705 13124477 13491500 13346436 13066656
3619A3066656K8171J58714j64898m0874k47105J80187L8093J52148L26310L24437
$$ 13066656 13094827 13253541 13088643 13047769 12800664 12980851 13018944 13171092 13497402 13821839
3609A3821839j15255m79694M52902M2918j6309j05834M74433P31065J12746K49775
$$ 13821839 13706584 13226890 13679792 13722710 13706401 13600567 14075000 14806065 14918811 15168586
3599A5168586k79293J15663K64641r5351n77820j96635J08095k13472j51699k62887
$$ 15168586 14889293 15004956 15269597 15174246 14596426 14399791 14507886 14294414 14142715 13879828
3589A3879828m49196k74215P6185J40130n78326j57831n80461k6813K89467K3183
$$ 13879828 13430632 13156417 13232602 13372732 12794406 12636575 12056114 12029301 12318768 12341951
3579A2341951m26971r2209P42683K50713j90131m67509K4719J02615L57575J63105
$$ 12341951 11914980 11822771 12565454 12816167 12626036 12158527 12183246 12285861 12643436 12806541
3569A2806541j64117O5686J69222K09261M14297j51158j75818k38382j17100l03691
$$ 12806541 12642424 12708110 12877332 13086593 13500890 13349732 13173914 12935532 12818432 12514741
3559A2514741Q5813k11076l17674J21733j15517j7663m96584J61879j32799j21356
$$ 12514741 12600554 12389478 12071804 12193537 12078020 12060357 11563773 11725652 11592853 11471497
3549A1471497j53913l71944Q4422M5316J5706l25326J74712k31832m83674j50278
$$ 11471497 11317584 10945640 11030062 11075378 11091084 10765758 10940470 10708638 10224964 10074686
3539A0074686j38578J08496l05870K50071L75201J33512n81254n17604j12331
$$ 10074686 9936108 10044604 9738734 9988805 10364006 10497518 9916264 9398660 9286329
3530I286329k1289M45755k22477p123k29013J54414N9688M49287J43644q6028
$$ 9286329 9265040 9710795 9488318 9481195 9252182 9406596 9466284 9915571 10059215 9973187
3520I973187K10664J72374k78665k17278K51028J37267J00112K33043k6885k39207
$$ 9973187 10183851 10356225 10077560 9860282 10111310 10248577 10348689 10581732 10554847 10315640
3510A0315640j03957p0716Q7175m4641j62614k95280R1110K05401K01138K11868
$$ 10315640 10211683 10140967 10228142 10183501 10020887 9725607 9816717 10022118 10223256 10435124
3500A0435124K56654j9995K70732N10829m9189l24648J8695L95796J3574P1043
$$ 10435124 10691778 10671783 10942515 11453344 11404155 11079507 11098202 11493998 11507572 11578615
3490A1578615j9794K18831L28242J64538L53511K20801Q546k44196M01490N04170
$$ 11578615 11558821 11777652 12105894 12270432 12623943 12844744 12853290 12609094 13010584 13514754
3480A3514754M58668J68021L82497P57917M73634K79624O5438N98240J217359
$$ 13514754 13973422 14141443 14523940 15281857 15755491 16035115 16100553 16698793 17916152
3471A7916152N47139n8496N65290R73105Q94228P67777P18241R39571J043228
$$ 17916152 18463291 18404795 18970085 19943190 20837418 21605195 22323436 23263007 24306235
3462B4306235J136177J374289J329303J582021J531218K188450K622328K474305
$$ 24306235 25442412 26816701 28146004 29728025 31259243 33447693 36070021 38544326
3454C8544326J851715K259382K816382K881286K805577K138336K423693K270503
$$ 38544326 40396041 42655423 45471805 48353091 51158668 53297004 55720697 57991200
3446E7991200K554852K332437K201592K234848J819064K577560K399201K121615
$$ 57991200 60546052 62878489 65080081 67314929 69133993 71711553 74110754 76232369
3438G6232369J643319J217432P24166L14529l30083j491445j145978j263971j385743
$$ 76232369 77875688 79093120 79817286 80131815 79801732 78310287 77164309 75900338 74514595
3429G4514595j811785k139601j734216j222456j594310r63208j245128k115219
$$ 74514595 72702810 70563209 68828993 67606537 66012227 65049019 63803891 61688672
3421F1688672j384697j918105k253891k053174k077630k239047k315918j692904
$$ 61688672 60303975 58385870 56131979 54078805 52001175 49762128 47446210 45753306
3413D5753306j838567j215603j053783j056033k25109n21162l74895r6938N42540
$$ 45753306 43914739 42699136 41645353 40589320 40364211 39843049 39468154 39371216 39913756
3404C9913756R97138L23082R23006J508183J469466J023454J485198O40181M40224
$$ 39913756 40910894 41233976 42156982 43665165 45134631 46158085 47643283 48283464 48723688
3395D8723688P1853n69543l95539j357088j350217j658434j198802j101918j419452
$$ 48723688 48795541 48225998 47830459 46473371 45123154 43464720 42265918 41164000 39744548
3386C9744548j372548j692244r27531o65084n84314l78006L3168O2365k30143
$$ 39744548 38372000 36679756 35752225 35087141 34502827 34124821 34157989 34220354 33990211
3377C3990211M40058M37198N16495R1851M66091O00178J22873M46345P09200J272742
$$ 33990211 34430269 34867467 35383962 35475813 35941904 36542082 36664955 37111300 37820500 39093242
3367C9093242P74270N18262m08992M3414M65767J8331M4137j12469J66755J64018
$$ 39093242 39867512 40385774 39976782 40020196 40485963 40504294 40548431 40435962 40602717 40766735
3357D0766735N12344R0572N20340N80078J24444M33609P03975N62401O2104O64451
$$ 40766735 41279079 41369651 41889991 42470069 42594513 43028122 43732097 44294498 44356602 45021053
3347D5021053R54600O03190O28704L55697P86117N32738L83860l72338o06249
$$ 45021053 45975653 46578843 47207547 47563244 48349361 48882099 49265959 48893621 48287372
3338D8287372o73087p58852n38194n03993l43153l43852l25371L61947l77233
$$ 48287372 47614285 46855433 46317239 45813246 45470093 45126241 44800870 45162817 44785584
3329D4785584J27474N93793J243060J350643J271996J442558J881438K663855
$$ 44785584 44913058 45506851 46749911 48100554 49372550 50815108 52696546 55360401
3321E5360401J961237J263199M94928J63482o99626j481170j892255j743451j942647
$$ 55360401 57321638 58584837 59079765 59243247 58543621 57062451 55170196 53426745 51484098
3312E1484098j301311r70298l64922N4754j72406Q11489J397828J596194J189768
$$ 51484098 50182787 49212489 48847567 48902321 48729915 49541404 50939232 52535426 53725194
3303E3725194J040114R77229l8097m48703j589043k346098k376870k419271l049122
$$ 53725194 54765308 55742537 55704440 55255737 53666694 51320596 48943726 46524455 43475333
3294D3475333l006417k060124k471737k240903j567241j872406j439320q81314
$$ 43475333 40468916 38408792 35937055 33696152 32128911 30256505 28817185 27935871
3286B7935871p55423n86205q43424o60872r47556n61789k87232m85656m29941
$$ 27935871 27180448 26594243 25750819 25089947 24142391 23580602 23293370 22807714 22377773
3277B2377773j75239J26500j20737K97698j65532M39036J134673P89004K84225
$$ 22377773 22202534 22329034 22208297 22505995 22340463 22779499 23914172 24703176 24987401
3268B4987401Q70693R81831O58402J060914J271109J073239J618181K069126J548430
$$ 24987401 25858094 26839925 27498327 28559241 29830350 30903589 32521770 34590896 36139326
3259C6139326K268148K120138J945903J846745J595192R91455p49651p28824j256373
$$ 36139326 38407474 40527612 42473515 44320260 45915452 46906907 46157256 45428432 44172059
3250D4172059j723193j776320j574452j449006j084206l46277m14301K80512O34952
$$ 44172059 42448866 40672546 39098094 37649088 36564882 36218605 35804304 36084816 36719768
3241C6719768N60566R75429J449068K328899K437297L525163M151369M558464
$$ 36719768 37280334 38255763 39704831 42033730 44471027 47996190 52147559 56706023
3233E6706023N385096M671780L636745K134749L47232j933612l016168l439575
$$ 56706023 62091119 66762899 70399644 72534393 72881625 70948013 67931845 64492270
3225F4492270l684023l552164k969201k112508j681852r89311p72776q23402K80598
$$ 64492270 60808247 57256083 54286882 52174374 50492522 49503211 48730435 47907033 48187631
3216D8187631K28748l01482M4090K70086l29175r12696m64763j044378j103697
$$ 48187631 48416379 48114897 48158987 48429073 48099898 47187202 46722439 45678061 44574364
3207D4574364o83217j541018j367218j324252j652022j608518j574938j476383
$$ 44574364 43891147 42350129 40982911 39658659 38006637 36398119 34823181 33346798
3199C3346798j862583j684519j262839j795834j637213j336605j218993j246267
$$ 33346798 31484215 29799696 28536857 26741023 25103810 23767205 22548212 21301945
3191B1301945j154754j037332q23480p79944r96290q07078n61845n44086l45789
$$ 21301945 20147191 19109859 18286379 17506435 16510145 15703067 15141222 14597136 14251347
3182A4251347p18564k46025o11540j69792l11026o73236j21631l52198n54893
$$ 14251347 13532783 13286758 12675218 12505426 12194400 11521164 11399533 11047335 10492442
3173A0492442l68048K23028j67465m34853l0406l50141j11017m3729m21027Q561
$$ 10492442 10124394 10347422 10179957 9745104 9714698 9364557 9253540 9209811 8788784 8797345
3163H797345k94715m65830k29541k41857q7589k58935n62279K84447L78166Q6882
$$ 8797345 8502630 8036800 7807259 7565402 7477813 7218878 6656599 6941046 7319212 7406094
3153G406094k59690p7178k320L47790k91236n67581M29573j69390j92826m43415
$$ 7406094 7146404 7069226 7066906 7414696 7123460 6555879 6985452 6816062 6623236 6179821
3143F179821l70297q5546m08289K2948l16783j09411J35774K4848l79246J9576
$$ 6179821 5809524 5723978 5315689 5338637 5021854 4912443 5048217 5073065 4693819 4713395
3133D713395L39881P6624J62697O1192m17877k04675r3988J7388J33225J80129
$$ 4713395 5053276 5129900 5292597 5353789 4935912 4731237 4637249 4654637 4787862 4967991
3123D967991k48058j49379o9743j87619l08788j4845K09778k12010P004j41266
$$ 4967991 4719933 4570554 4500811 4313192 4004404 3989559 4199337 3987327 3994331 3853065
3113C853065k18632M09072N768l09632l31199O8231P183K4158r5547k06216k36157
$$ 3853065 3634433 4043505 4049273 3739641 3408442 3476673 3483856 3508014 3412467 3206251 2970094
3102B970094J85845M62855j16107M56999k97779k11261J63070J848n99557j55476
$$ 2970094 3155939 3618794 3502687 3959686 3661907 3450646 3613716 3615564 3016007 2860531
3092B860531M6000k67039P6208j2517K03448K21397J2838q1211j55100K53246
$$ 2860531 2906531 2639492 2715700 2703183 2906631 3128028 3140866 3059655 2904555 3157801
3082C157801k98796K46676J88239j84276J8345l03804L15849p0958j35184k01304
$$ 3157801 2859005 3105681 3293920 3109644 3127989 2824185 3140034 3069076 2933892 2732588
3072B732588m23733j54642J94902J44843j20193l823J01907P90M5869j87771q7163
$$ 2732588 2308855 2154213 2349115 2493958 2373765 2369942 2471849 2472639 2518508 2330737 2243574
3061B243574q3490l7917K39670j02847m51869l34658K63051P08063N8689k67253
$$ 2243574 2160084 2122167 2361837 2258990 1807121 1472463 1735514 2443577 2502266 2235013
3051B235013K39715j07172J08442j06462K1358m99592K62745J11221j74364R9442
$$ 2235013 2474728 2367556 2475998 2369536 2390894 1891302 2154047 2265268 2090904 2190346
3041B190346l55546J08736l91657k872l4338m56928M38294P0748L09535P5267
$$ 2190346 1834800 1943536 1551879 1549007 1514669 1057741 1496035 1566783 1876318 1951585
3031A951585j37717L21209K58675K75941n05242K1636N5515Q2337m8799o6147
$$ 1951585 1813868 2135077 2393752 2669693 2164451 2186087 2241602 2323939 2275140 2208993
3021B208993o2169m3922L24949o19744l575j57766j23746k04317J89317L99996
$$ 2208993 2146824 2102902 2427851 1808107 1804532 1646766 1523020 1318703 1508020 1908016
3011A908016l85942R0223K22567j6029p8002r2735k28373K86940K9353r4954k40953
$$ 1908016 1522074 1612297 1834864 1818835 1740833 1648098 1419725 1706665 1736018 1641064 1400111
3000A400111L20695K22047j52308J28991k41125L1333j06367O9781q7624k39778
$$ 1400111 1720806 1942853 1790545 1919536 1678411 1709744 1603377 1673158 1585534 1345756
2990A345756m5568m70673J31183J09172J3151L43087m9426J47077j60999p096
$$ 1345756 1300188 829515 960698 1069870 1083021 1426108 1376682 1523759 1362760 1355664
2980A355664J49145K2485K79778M1102J46755k38189l4609l86157O1715K74330
$$ 1355664 1504809 1527294 1807072 1848174 1994929 1756740 1722131 1335974 1397689 1672019
2970A672019l09238j87556l05080O8874K70431l7615j58335q7236J14672J88639
$$ 1672019 1362781 1175225 870145 939019 1209450 1171835 1013500 926264 1040936 1229575
2960A229575M47374j52488N076J046K15151J92483j17602k5973K43217j29045
$$ 1229575 1676949 1524461 1529537 1530583 1745734 1938217 1820615 1794642 2037859 1908814
2950A908814k35019q3655n54210J46263M40270j49837l92361l09106J40916K41297
$$ 1908814 1673795 1590140 1035930 1182193 1622463 1472626 1080265 771159 912075 1153372
2940A153372J59152j05913k34756P5566N5623K62776K55847L68954n27990N333
$$ 1153372 1312524 1206611 971855 1047421 1103044 1365820 1621667 1990621 1462631 1467964
2930A467964L43971k03841K7249l43266J55280k97988m1050k09258k70479J19519
$$ 1467964 1811935 1608094 1635343 1292077 1447357 1149369 1108319 899061 628582 748101
2920G48101K83942J77474n40248K29063j07042R5001L39147j60943O1369J12898
$$ 748101 1032043 1209517 669269 898332 791290 886291 1225438 1064495 1125864 1238762
2910A238762k3063L5036J61785m9869o45471K28919M64030R3737k92318k92770
$$ 1238762 1215699 1250735 1412520 1362651 717180 946099 1410129 1503866 1211548 918778
2900I18778j16701K50454K6285l97114J87560o3540J12978k30422p1969j9900
$$ 918778 802077 1052531 1078816 681702 869262 805722 918700 688278 616309 596409
2890E96409n9339J57922J30274Q8331k39991K17326k9910N55877K95996m93394
$$ 596409 537070 694992 825266 913597 673606 890932 861022 1416899 1712895 1219501
2880A219501M8291k63269J07253K216m95490j95591p4414j47409j9938L89145
$$ 1219501 1267792 1004523 1111776 1113992 618502 422911 348497 201088 181150 570295
2870E70295l2059P7458J04506K59698L15866j60801j71344j59434L42575M2485
$$ 570295 538236 615694 720200 979898 1295764 1134963 963619 804185 1146760 1189245
2860A189245j50098l66836l39632L13765J92629j51120j70042J53596k14314K44650
$$ 1189245 1039147 672311 332679 646444 839073 687953 517911 671507 457193 701843
2850G01843J04213o5995K23391j06493l7329J64691m658j18944O148k17692j4462
$$ 701843 806056 740061 963452 856959 819630 984321 979663 860719 866867 649175 634713
2839F34713J25585M4128J75780j86149K65279j46562p6657J00241M699J26763
$$ 634713 760298 804426 980206 794057 1059336 912774 836117 936358 941057 1067820
2829A067820j46454J37612l57059j49478L31155q4209j16929k38782J04584M14614
$$ 1067820 921366 1058978 701919 552441 883596 799387 682458 443676 548260 962874
2819I62874m4740j54485k63763M68986J68391P22j00805j08720Q3041j61912k36636
$$ 962874 918134 763649 499886 968872 1137263 1137985 1037180 928460 1011501 849589 612953
2808F12953j35542m5135j91354K35159p2236k24109J41061J97397N04236K76644
$$ 612953 477411 432276 240922 476081 403845 179736 320797 518194 1022430 1299074
2798A299074k31454m8983j18547J68399K3721j62015k92660J18555J81868k54697
$$ 1299074 1067620 1018637 900090 1068489 1092210 930195 637535 756090 937958 683261
2788F83261o9001j23404l80416q8053N31679m8689n0154K29621L80950J42391
$$ 683261 614260 490856 110440 22387 554066 505377 455223 684844 1065794 1208185
2778A208185j56550j32223P0531J61204J63645k54232l56631j99632k36022J78027
$$ 1208185 1051635 919412 989943 1151147 1314792 1060560 703929 504297 268275 446302
2768D46302L97370J42791k25599k60601K29172m04368k09429J85540q8378J00810
$$ 446302 843672 986463 760864 500263 729435 325067 115638 301178 212800 313610
2758C13610O2576O9554r5979J2985o4254j68105J28121K48179K59751j00132Q0146
$$ 313610 376186 445740 349761 362746 298492 130387 258508 506687 766438 666306 746452
2747G46452J06221n9050M7208j60546J79779k11827j32805M9895l75029q9907
$$ 746452 852673 793623 840831 680285 860064 648237 515432 565327 190298 100391
2737A00391k6702K56658J7928j15447P2065J71981J93245m0440O032l9091K67437
$$ 100391 73689 330347 348275 232828 304893 476874 670119 629679 635711 596620 864057
2726H64057r0725J85010K04233j02363l0813k54294k42922j89680N1436J7840
$$ 864057 773332 958342 1162575 1060212 1029399 775105 532183 342503 393939 411779
2716D11779j1577l0985K28972m6398k23862j37703J66337J52474K7224j11061
$$ 411779 400202 369217 598189 551791 327929 190226 356563 509037 536261 425200
2706D25200j17680K94071K75008K25641m23891j24034j31067K41600J16473j20383
$$ 425200 307520 601591 876599 1102240 678349 554315 423248 664848 781321 660938
2696F60938k46146j75279M77176k0125R7898j0873j64083O8759r3498n7422j40893
$$ 660938 414792 239513 716689 696564 794462 783589 619506 688265 594767 537345 396452
2685C96452j37470L06511K38628j99725j39885L09247K03801K32428l89671k23583
$$ 396452 258982 565493 804121 604396 464511 773758 977559 1209987 820316 596733
2675E96733J25397k8866k5300n0452j53295o803j5342J47953P5682j70172j49756
$$ 596733 722130 693264 667964 617512 464217 457414 442072 590025 665707 495535 345779
2664C45779k75689J14732P9609J07360L26712r5295k8311Q8272k36007j4027K0730
$$ 345779 70090 184822 264431 371791 698503 603208 574897 663169 427162 413135 433865
2653D33865K70608j14250n30354R155J45083n8858K12597J41494l60749j77027
$$ 433865 704473 590223 59869 69024 214107 155249 367846 509340 148591 -28436
2643b8436J57616J08334K31307k51174k3568j4508K38948j64226j30343M01421
$$ -28436 129180 237514 468821 217647 194079 179571 418519 254293 123950 525371
2633E25371r1258P1625j50824K453k72926J93736J68175p9528L72223J51962J19648
$$ 525371 434113 505738 354914 357367 84441 278177 446352 366824 739047 891009 1010657
2622A010657n34775J0021P091j95214K05334n8808j03004L6090j23497l16241
$$ 1010657 475882 485903 492994 297780 503114 444306 341302 377392 253895 -62346
2612f2346K56446K15271J0621K97365o5409L561J07545j1401j52867n8592K83392
$$ -62346 194100 409371 419992 717357 651948 655509 763054 751653 598786 540194 823586
2601H23586k15865J6860k62098M555L82557L43342q2427R75K22843P0578N15765
$$ 823586 607721 624581 362483 367038 749595 1092937 1010510 1011485 1234328 1304906 1820671
2590A820671M39395K88639o1172m70611j44833p7789j62260m36308k38282k20274
$$ 1820671 2260066 2548705 2487533 2016922 1872089 1794300 1632040 1195732 957450 737176
2580G37176m427k8764J41355J02986l66044K44381O4333J35282k86455J96576
$$ 737176 732749 703985 845340 948326 582282 826663 890996 1026278 739823 936399
2570I36399K41110J52598l13679m19264p4445k5468j3134M7476n36384p9739J21569
$$ 936399 1177509 1330107 1016428 597164 522719 497251 484117 531593 -4791 -84530 37039
2559C7039N93421J02167q9111n3636Q7071J39830l2650K51060m08089J55529K62940
$$ 37039 630460 732627 643516 589880 676951 816781 784131 1035191 627102 782631 1045571
2548A045571J41354j17721m00184o1438K8746M2288n63949l08244L35158K58975
$$ 1045571 1186925 1069204 669020 607582 636328 678616 114667 -193577 141581 400556
2538D00556K23140j77459j52827l10971M71320J66107M8119m15816m12653L81329
$$ 400556 623696 446237 293410 -17561 453759 619866 667985 252169 -160484 220845
2528B20845K51009J49772r0778N1072M30992J36523L9020o89673O7917j10471
$$ 220845 471854 621626 530848 581920 1012912 1149435 1188455 498782 566699 456228
2518D56228P8194j26778j74200J67537Q0369N81291l52681k64938j13191m8463
$$ 456228 534422 407644 233444 400981 481350 1062641 709960 445022 331831 283368
2508B83368K90607L96994J97113l01394N82729R8946J29075l26054m13377k41878
$$ 283368 573975 970969 1168082 866688 1449417 1548363 1677438 1351384 938007 696129
2498F96129K06678M58005l39118j49031j31188K65722O889l3627p1771n7148K54684
$$ 696129 902807 1360812 1021694 872663 741475 1007197 1014086 980459 908688 851540 1106224
2487A106224J23295j39085j83723l02485K33835K69058M97335m01176J92201n13820
$$ 1106224 1229519 1090434 906711 604226 838061 1107119 1604454 1203278 1395479 881659
2477H81659J2728K31588l67778R4635m04656K48050j54626L37917J9783K08912
$$ 881659 894387 1125975 758197 852832 448176 696226 541600 879517 899300 1108212
2467A108212o905K4195J83611n96819j80168n9397L10818J99793M6716j23954
$$ 1108212 1101307 1125502 1309113 712294 532126 472729 783547 983340 1030056 906102
2457I06102P3505M90162j1212n3876k31842j15298J82050K69059m6305n49634
$$ 906102 979607 1469769 1458557 1404681 1172839 1057541 1239591 1508650 1462345 912711
2447I12711j05162J22648K10762k08175o3595l37351j32746N15606R4813J57509
$$ 912711 807549 930197 1140959 932784 869189 531838 399092 914698 1009511 1167020
2437A167020K9684L29691k1529K18837r7837o95608J76123K7744L60511L6192
$$ 1167020 1196704 1526395 1504866 1723703 1625866 930258 1106381 1134125 1494636 1530828
2427A530828j6875k24928J4649M71719L9734j79862n93760J13139K64829K04551
$$ 1530828 1513953 1289025 1303674 1775393 1815127 1635265 1041505 1154644 1419473 1624024
2417A624024j27727l52810K95173L45184J91508j76956j61516j01472p4012K61391
$$ 1624024 1496297 1143487 1438660 1783844 1975352 1798396 1636880 1535408 1461396 1722787
2407A722787N1966R1021Q6873M47862K03473L1286l42083k66266N62535P4435
$$ 1722787 1774753 1865774 1952647 2400509 2603982 2635268 2293185 2026919 2589454 2663889
2397B663889m16894o61065K25777N56358K82179N3423m78394P9499n3568O04941
$$ 2663889 2246995 1585930 1811707 2368065 2650244 2703667 2225273 2304772 2251204 2856145
2387B856145K94267j71567m2022n9391K36303M04278O1409j20137K19118K73069
$$ 2856145 3150412 2978845 2936823 2877432 3113735 3518013 3579422 3459285 3678403 3951472
2377C951472j62489k79872p26108l49017K07556J48629J34168q7480L32235m8019
$$ 3951472 3788983 3509111 2783003 2433986 2641542 2790171 2924339 2836859 3169094 3121075
2367C121075N46771K62264K45460J1902J46689K52685K22810K72011O4679J44421
$$ 3121075 3667846 3930110 4175570 4187472 4334161 4586846 4809656 5081667 5146346 5290767
2357E290767J75357N1209K20136N434M35720N25809P85503N28484N71457O68984
$$ 5290767 5466124 5517333 5737469 5742903 6178623 6704432 7489935 8018419 8589876 9258860
2347I258860P40628Q07071J205669J412366J123120J311749J029206J661028L119555
$$ 9258860 9999488 10806559 12012228 13424594 14547714 15859463 16888669 18549697 21669252
2338B1669252M241102M409949K997974J677386P96569J595250K049940L746209
$$ 21669252 25910354 30320303 33318277 34995663 35792232 37387482 39437422 43183631
2330D3183631N788270Q283938J0786644J3989669K1934987M5848457R6261109
$$ 43183631 48971901 57255839 68042483 82032152 103967139 149815596 246076705
2323B46076705J30489000R0733110M919830o7493274r4948750q0276457n9482187
$$ 246076705 376565705 467298815 472218645 404725371 309776621 229500164 170017977
2316A70017977m1651947k8275676k0177055j6154981j1786301p999559m928969
$$ 170017977 128366030 100090354 79913299 63758318 51972017 43972458 39043489
2309C9043489j732440M23241J17296j462415l127204m261293l977524l342855
$$ 39043489 37311049 37734290 37851586 36389171 33261967 29000674 25023150 21680295
2301B1680295k582564j759915j239885r10560n58774q15351o41659l21970j18062
$$ 21680295 19097731 17337816 16097931 15187371 14628597 13813246 13171587 12849617 12731555
2292A2731555N4451m08409l96815k81975O1649k42706o69573o26466k79298j93502
$$ 12731555 12786006 12377597 11980782 11698807 11760456 11517750 10848177 10221711 9942413 9748911
2282I748911k25144p22406m00140j21352M56597j3356o19893n53770j72378j56133
$$ 9748911 9523767 8801361 8401221 8279869 8736466 8723110 8103217 7549447 7377069 7220936
2272G220936J7966j35601k40672q6543n21115k55719m20204l12716J10321J35521
$$ 7220936 7238902 7103301 6862629 6776086 6254971 5999252 5579048 5266332 5376653 5512174
2262E512174k38490j24869k79896j28592k46193k76264k78264m43142r9600J87689
$$ 5512174 5273684 5148815 4868919 4740327 4494134 4217870 3939606 3496464 3396864 3584553
2252C584553N733j38243k7075O3869L09726o6399k44304j33104P3649k20853k40137
$$ 3584553 3590286 3452043 3424968 3488837 3798563 3732164 3487860 3354756 3428405 3207552 2967415
2241B967415K07824p356N4882L54775Q7977l71419o1269k45202j35638k95428
$$ 2967415 3175239 3167883 3222765 3577540 3665517 3294098 3232829 2987627 2851989 2556561
2231B556561Q2586k68677k76889M878K801O0182J76661L03555j47959l59850r8111
$$ 2556561 2639147 2370470 2093581 2098459 2101260 2161442 2338103 2641658 2493699 2133849 2035738
2220B035738j13402M72224L4120j57518l05024N70996K55352j76564k36605l71001
$$ 2035738 1922336 2394560 2428680 2271162 1966138 2537134 2792486 2615922 2379317 2008316
2210B008316J07207l45821k43637l17347K4128r5347m5985K01913P2949L641j84470
$$ 2008316 2115523 1769702 1526065 1208718 1232846 1137499 1091514 1293427 1366376 1370017 1185547
2199A185547K80080L47600j72757N4324l5749L68567K52480j80688m14011l4015
$$ 1185547 1465627 1813227 1640470 1694794 1659045 2027612 2280092 2099404 1685393 1651378
2189A651378j98249R4372k29935m85968j5866m06813L65501K50055K25014k39115
$$ 1651378 1453129 1547501 1317566 831598 815732 408919 774420 1024475 1249489 1010374
2179A010374l63464L45671J80685K4755k63321M94465K71137J84599L37381m26391
$$ 1010374 646910 992581 1173266 1198021 934700 1429165 1700302 1884901 2222282 1795891
2169A795891j41200l23666O2677l61974k22946o1972k225L46943l44407k1346
$$ 1795891 1654691 1331025 1393702 1031728 808782 746810 744585 1091528 747121 725775
2159G25775K3395J47654J04070R8868k37464n23900M92801N1198j0134j7800Q6224
$$ 725775 749170 896824 1000894 1099762 862298 338398 831199 882397 872263 854463 940687
2148I40687p210n744K5498j46531L35098j22202p0478j57456k87932J05161j23069
$$ 940687 933477 927733 953231 806700 1141798 1019596 949118 791662 503730 608891 485822
2137D85822J83658j09931K56838j19422l01689p9774j5477L27842l123K36503
$$ 485822 669480 559549 816387 696965 395276 315502 300025 627867 624744 861247
2127H61247J84130K42186O0961N20445q3817n70884j8408j92092J58280k34402
$$ 861247 1045377 1287563 1348524 1868969 1785152 1214268 1195860 1003768 1162048 927646
2117I27646j90717l16914m1045L45647K93398j716l20627K84127J9172k85250
$$ 927646 736929 420015 378970 724617 1018015 1016299 695672 979799 998971 713721
2107G13721k47030k90709L11475K11777J70956k9249J53341J11136j11198n2605
$$ 713721 466691 175982 487457 699234 870190 840941 994282 1105418 994220 941615
2097I41615n02074J67042l8306K24768J7109J9606k30467p656n0411j28786r347
$$ 941615 439541 606583 568277 793045 810154 829760 599293 591637 541226 412440 403093
2086D03093r6075p8990K37461J19699J31520j48168J45422R7728N58524k48257
$$ 403093 307018 228028 465489 585188 716708 568540 713962 811690 1370214 1121957
2076A121957l51837j84220R293L44941l10810j13842R3093L35670J30921n30958
$$ 1121957 770120 585900 595193 940134 629324 515482 608575 944245 1075166 544208
2066E44208m72148j59111L34914N3786j6835J61110j71633N94468O59787L62444
$$ 544208 72060 -87051 247863 301649 284814 445924 274291 868759 1528546 1890990
2056A890990Q0825R515L48679L85968K92040k80277m96788m00747m3196j59810
$$ 1890990 1971815 1981330 2330009 2715977 3008017 2727740 2230952 1830205 1787009 1627199
2046A627199m06533l84369l06921O6095j18007k3777k05169k51011K51757L79615
$$ 1627199 1220666 836297 529376 595471 477464 453687 248518 -2493 249264 628879
2036F28879P6136Q2209j09838m9404j57551M27200M380J10792L3376j36502k0564
$$ 628879 705015 787224 677386 627982 470431 897631 902011 1012803 1046179 909677 889113
2025H89113k54108K51078k15943j96466L52229o2247j27342j55596j16795n5633
$$ 889113 635005 886083 670140 473674 825903 763656 636314 480718 363923 308290
2015C08290J08001J42961Q6068M5090L10419o6412j99196N8855K7347K6709J30852
$$ 308290 416291 559252 645320 690410 1000829 934417 735221 794076 821423 848132 978984
2004I78984o018k59187k52712k81484p0241L68877J3282k10904j39034J21105
$$ 978984 972966 713779 461067 179583 109342 478219 491501 280597 141563 262668
1994B62668J6485L4296P5241N177K69234M3576n7599k62399l07487N14310Q5942
$$ 262668 279153 313449 388690 393867 663101 706677 649078 386679 79192 593502 679444
1983F79444j07943M9787j50405N2924K49639P9183m98036m35038R7229J50841
$$ 679444 571501 621288 470883 523807 773446 852629 354593 -80445 16784 167625
1973A67625J55600j47725l05684J77929M92311J65976n6993l39653k71957L38433
$$ 167625 323225 175500 -130184 47745 540056 706032 649039 309386 37429 375862
1963C75862J47325m1253l38871p8684J27804L36640K29827O6646k78689P9924
$$ 375862 523187 481934 143063 64379 192183 528823 758650 825296 546607 626531
1953F26531K30183k25806k48490k31551o0475J2187Q7947J2006j41850O3760p7000
$$ 626531 856714 630908 382418 150867 90392 102579 190526 202532 60682 124442 47442
1942D7442L43922K66196p4549j32120L7241M78942j48683n837m40782K0527K84907
$$ 47442 391364 657560 583011 450891 488132 967074 818391 812554 371772 392299 677206
1931F77206l61102r2367l66375L13126K0157j42637j50414J95169M17440L2424
$$ 677206 316104 223737 -142638 170488 190645 48008 -102406 92763 510203 542627
1921E42627o9715l32681o226K87154J9302n2735J71351N548r3437J10053j13990
$$ 542627 472912 140231 134005 421159 440461 387726 559077 564625 471188 581241 467251
1910D67251o1484O339j38935k9270O8169K28494k96464J82952J82117l79382l22919
$$ 467251 405767 412106 273171 243901 312070 540564 244100 427052 609169 229787 -93132
1899i3132J80688J96400l09899P7208N0898J81169p6546K30022N85471l20085
$$ -93132 87556 283956 -25943 51265 102163 283332 206786 436808 1022279 702194
1889G02194K10563l55897L2774j17855m72183M9072J11665M35749L2249K61048
$$ 702194 912757 556860 589634 471779 -404 48668 160333 596082 628331 889379
1879H89379k48617J0796J72409l39531o7552k78428J26427k1070J13070q8428
$$ 889379 640762 651558 823967 484436 416884 138456 264883 243813 356883 268455
1869B68455K06146J1097R1588J50332l57558k5377n6855M8224J81392L0829k22255
$$ 268455 474601 485698 577286 727618 370060 344683 287828 336052 517444 548273 326018
1858C26018J60652J35421j32226l2310j61866k19932L34403K71425P2778r4634
$$ 326018 486670 622091 489865 457555 295689 75757 410160 681585 754363 659729
1848F59729J34749m8501r9303J8805q1552m12977k48963L89051J0504p4820Q2274
$$ 659729 794478 745977 646674 665479 583927 170950 -78013 311038 321542 246722 328996
1837C28996K74859Q1813L9407K84454m45949j64589l89298J65287p4802o8462
$$ 328996 603855 685668 725075 1009529 563580 398991 9693 174980 100178 31716
1827C1716l981N7454M12915k7391m005p5966m8846K03073N991P3662n01186J58324
$$ 31716 27735 85189 498104 470713 466708 390742 341896 544969 550960 624622 123436 281760
1815B81760O2599K67888n422j02332J99369k18071R63n52522K9165L2690k28055
$$ 281760 344359 612247 606825 504493 703862 485791 486754 -65768 -36603 -3913 -231968
1804b31968L02921K76699L25286O423j29090J95193k48412k30270k92307l7741
$$ -231968 70953 347652 672938 679361 550271 745464 497052 266782 -25525 -63266
1794f3266J35831M71855j99284P0618J49826J50985O0874m35894j05344k32757
$$ -63266 72565 544420 345136 415754 565580 716565 777439 341545 236201 3444
1784C444J55516j02344M15098J38727k45819M2113L62159J50450o05827l92737
$$ 3444 158960 56616 471714 610441 364622 406735 768894 919344 313517 -79220
1774g9220j73351L68809J5317l36766m5321L26697K47750K98395j3773m44769
$$ -79220 -252571 116238 131555 -205211 -250532 76165 323915 622310 608537 163768
1764A63768P2172J68298k1910J83590l37747j80712J98466J98565q2981k34419
$$ 163768 235940 404238 382328 565918 228171 47459 245925 444490 361509 127090
1754A27090r2374n7737J55477M517K609P4556M19606J11627k58610j16100k58384
$$ 127090 34716 -23021 132456 136973 139582 214138 633744 745371 486761 370661 112277
1743A12277j32922J02932k8335J03603M7763l6745K65068l2910K97495j42274
$$ 112277 -20645 82287 53952 157555 205318 168573 433641 400731 698226 555952
1733E55952n1710K03104m1516k45796l09541o7915K09738m8336M02644j00000
$$ 555952 504242 707346 665830 420034 110493 42578 252316 203980 606624 506624
1723E06624M3461j59257k34366j2023Q2405J364j77767P4966K42579j87872j5740
$$ 506624 550085 390828 156462 144439 226844 228208 50441 125407 367986 180114 164374
1712A64374j62837n5796K75519J35891R8612k87734M497l4308J11256j72373K83942
$$ 164374 1537 -54259 221260 357151 455763 168029 172526 138218 249474 77101 361043
1701C61043j4369j6898K89994j78774l04306p4346K60836N907L77812m33818j97644
$$ 361043 346674 329776 619770 440996 136690 62344 323180 329087 706899 273081 75437
1690G5437K70258K26849r2042l34055l8318k33984l0890k8202L79089R024J50208
$$ 75437 345695 572544 480502 146447 108129 -125855 -156745 -184947 194142 203166 353374
1679C53374l158k2254L73685k51964k51053M1960J76275l593n66228J02518J34005
$$ 353374 350216 327962 701647 449683 198630 240590 416865 413272 -152956 -50438 83567
1668H3567K17937L9842J45880k19843J95112K10370o09313K83002p7801k12906
$$ 83567 301504 341346 487226 267383 462495 672865 63552 346554 268753 55847
1658E5847K6212N9041K35963q750k4032l14116L00399j81126j28149L2305L21738
$$ 55847 82059 141100 377063 368313 344281 30165 330564 149438 21289 53594 375332
1647C75332L85704k00641k7551l7976l6413j76733j50010r9506j01425J25931
$$ 375332 761036 560395 532844 494868 458455 281722 131712 32206 -69219 56712
1637E6712k63178M13110M98923L16k18443M623j29854q5918P7221j60585l4310
$$ 56712 -206466 206644 705567 705883 487440 492063 362209 276291 353512 192927 158617
1626A58617L6555J91481L65686l2046n2450m21572J44141n4034j19511k55184
$$ 158617 195172 386653 752339 720293 667843 246271 390412 336378 216867 -38317
1616c8317l24251N88421J28974J26608k62582R8454J94662J82725k15319k93038
$$ -38317 -362568 225853 354827 481435 218853 317307 511969 694694 479375 186337
1606A86337N4366j29002L87747K23704j16852j31193k26696J3433k27338J62682
$$ 186337 240703 111701 499448 723152 606300 475107 248411 261844 34506 197188
1596A97188k8070j10875M97964K62242k18158n06461K97860J73089n6282K8206
$$ 197188 169118 58243 556207 818449 600291 93830 391690 564779 508497 536703
1586E36703r7297k93623o9108L40620j35402j92180j03387J4102k5028M63409
$$ 536703 439406 145783 76675 417295 281893 89713 -13674 428 -24600 438809
1576D38809J43095l65093K045L6604K03684o0296r7980P7409j9508K58372k16045
$$ 438809 581904 216811 218856 255460 459144 398848 300868 378277 358769 617141 401096
1565D01096J78785l89020j6803n003K13258J1684l05894j3938j63742L27204J07966
$$ 401096 579881 190861 174058 169055 382313 393997 88103 74165 -89577 237627 345593
1554C45593R3771j60383k17517m9537M7346j84188o124N89661K36724J13276L19128
$$ 345593 439364 278981 61464 11927 59273 -124915 -131039 458622 695346 808622 1127750
1543A127750m06120j33480j61027n22973O8632J69908J21912l29973L40053l9436
$$ 1127750 721630 588150 427123 -95850 -27218 142690 264602 -65371 274682 235246
1533B35246j09069k8633J74117K05097K0195r1249k19738O9017M4962L81524P2611
$$ 235246 126177 97544 271661 476758 496953 405704 185966 254983 299945 681469 754080
1522G54080j78025N9014j74736j17592M8604j12778k83843J31144M37562p6760
$$ 754080 576055 635069 460333 342741 391345 278567 -5276 125868 563430 486670
1512D86670o0719l88570L9798K98517L43251k1778l04526P0450k53738J33500
$$ 486670 425951 37381 77179 375696 718947 697169 392643 463093 209355 342855
1502C42855M4765m37578k9245L5959P8426j0696P9012P7959J59900L67345K0017
$$ 342855 387620 -49958 -79203 -43244 35182 24486 103498 181457 341357 708702 728719
1491G28719l64660O0316J01481k53301j89202k86257L9206K06421k26293q1029
$$ 728719 364059 424375 525856 272555 83353 -202904 -163698 42723 -183570 -264599
1481b64599O7279L49561J08033N1582K93661L650n9614k13143J20995J74404O1018
$$ -264599 -197320 152241 260274 311856 605517 609167 549553 336410 457405 631809 692827
1470F92827j82432j41708Q7044R826j61002j36607J48299J9516k74332K54892
$$ 692827 510395 368687 455731 465557 304555 167948 316247 335763 61431 316323
1460C16323M7095j21523K08505M0757j05288K35498k87481j88575J86430J04499
$$ 316323 363418 241895 450400 491157 385869 621367 333886 145311 331741 436240
1450D36240k30636j36380J87926L2334J56882j362N8790J30633l14405k002J31217
$$ 436240 205604 69224 257150 289484 446366 445004 503794 634427 320022 318020 449237
1439D49237J24724m1585l92446j95212r5209K67397J64580j70770q6328K78654
$$ 449237 573961 532376 139930 -55282 -150491 116906 281486 110716 24388 303042
1429C03042J67520n6318k64449J33037K94573M8221K1250L95123m12270N4410
$$ 303042 470562 414244 149795 282832 577405 625626 646876 1041999 629729 684139
1419F84139j08801J31737l56968m16653j25718L21870J82498j90242l85211l4823
$$ 684139 575338 707075 350107 -66546 -192264 129606 312104 121862 -263349 -298172
1409b98172O19861j22239j08390L43201p4375O1126K45902K3061j61719O94j48972
$$ -298172 321689 199450 91060 434261 359886 421012 666914 689975 528256 528950 379978
1398C79978J74258L23952l43510l09315J8443L85088j8268o3678k28097j24519
$$ 379978 554236 878188 534678 225363 243806 628894 610626 546948 318851 194332
1388A94332N2908Q0797o5347k74088J25305j58327n4892L01279l05531j07701
$$ 194332 247240 328037 262690 -11398 113907 -44420 -99312 201967 -103564 -211265
1378b11265j1965P91417J54025k82106Q9133k1045K05323L5219j54385l41179
$$ -211265 -223230 568187 722212 440106 529239 508194 713517 748736 594351 253172
1368B53172J70553K36092p9407j52020m89386J89219j3188O3970o1803j78845
$$ 253172 423725 659817 580410 428390 -60996 128223 115035 179005 117202 -61643
1358f1643N1660l39679N03204L35600J15568j96061R9980J73059m2199J68574
$$ -61643 -9983 -349662 153542 489142 604710 408649 508629 681688 639489 808063
1348H08063n04536l02032J40778L52736l16730k1912J96282l30048J11696K20023
$$ 808063 303527 1495 142273 495009 178279 156367 352649 22601 134297 354320
1338C54320j39559n83806J69971M59472J16370L75547m25018p1604R4248J27496
$$ 354320 214761 -369045 -199074 260398 376768 752315 327297 255693 349941 477437
1328D77437k57948N2375J63348J5362M28527J31408j91285o82083J68379L50238
$$ 477437 219489 271864 435212 450574 879101 1010509 819224 137141 305520 655758
1318F55758J1593m7298n77955J87418J43389M9018l58247o17664L25709K06694
$$ 655758 667351 620053 42098 229516 372905 421923 63676 -553988 -228279 -21585
1308b1585M70244k23873l03883L28892N47643J46299k26805J7566k07916N22282
$$ -21585 448659 224786 -79097 249795 797438 943737 716932 734498 526582 1048864
1298A048864k73488J33397n96771p01336L47691N53426K0022m81380l63997l4122
$$ 1048864 775376 908773 312002 -389334 -41643 511783 531805 50425 -313572 -347694
1288c47694M21130P2345k23109j32593N9075L01695j36897J22673L4134K57355
$$ -347694 73436 145781 -77328 -209921 -150846 150849 13952 136625 170759 428114
1278D28114J42497P8811K10852p14124J10006L0549K71862j36163m89797r5764
$$ 428114 570611 649422 860274 146150 256156 286705 558567 422404 -67393 -163157
1268a63157L46528M48461k04637k0446k25787J16440J80469j90622J90182l68564
$$ -163157 183371 631832 427195 406749 180962 297402 477871 287249 477431 108867
1258A08867k3731m7196M21430K32145l54488k658o2142K53063L36932k45886o60780
$$ 108867 85136 37940 459370 691515 337027 334369 272227 525290 862222 616336 -44444
1247d4444J32896L89891K7481K49307o66914K6437M4327K43062k08115l54295
$$ -44444 88452 478343 505824 755131 88217 114654 158981 402043 193928 -160367
1237a60367r5830M6307P36719M05294J12754m48590N466L34733j17730M8667p74865
$$ -160367 -256197 -209890 526829 932123 1044877 596287 601753 936486 818756 867423 92558
1226I2558j52700K90223M56547k18649k37566L06764k52788J63846j81000k57060
$$ 92558 -60142 230081 686628 467979 230413 537177 284389 448235 267235 10175
1216A0175j80611K1138o7684K98184M02332m13723R5242M78768J61288o55221
$$ 10175 -170436 -149298 -216982 81202 483534 69811 165053 643821 805109 149888
1206A49888l04489M76860J92407J97680n29000j44185O8630J18763K54690j45252
$$ 149888 -154601 322259 514666 712346 183346 39161 107791 226554 481244 335992
1196C35992j64974j35926j61163k0064K55608l08583k78751P02935R8775O00392
$$ 335992 171018 35092 -126071 -146135 109473 -199110 -477861 225074 323849 924241
1186I24241O7762l77117j4903J91536l85698k52774M1612j72816L44388M52359
$$ 924241 992003 614886 599983 791519 405821 153047 194659 21843 366231 818590
1176H18590L24753o59785j53384P0788m62059J98074Q7699m14905j74146L11345
$$ 818590 1143343 483558 330174 400962 -61097 136977 224676 -190229 -364375 -53030
1166e3030K16591j98106K54885q8867J21455j15836K02643o2945K91338K76391
$$ -53030 163561 -34545 220340 131473 252928 137092 339735 276790 568128 844519
1156H44519n63928J67050j21871k61150J9464M10637J28685j73774o7641m12041
$$ 844519 280591 447641 325770 64620 84084 494721 623406 449632 381991 -30050
1146c0050K54916J4564N3151j2876k46185K11386j66728J74412K12516j5818j76796
$$ -30050 224866 239430 292581 279705 33520 244906 78178 252590 465106 449288 272492
1135B72492L81129J73926n40679J55183k99158K14307L91614l76691o09670m86541
$$ 272492 653621 827547 286868 442051 142893 357200 748814 372123 -237547 -724088
1125g24088O44577j0565o4183J36458J66411L25755M19131l29386o40556j3862
$$ -724088 -79511 -90076 -154259 -17801 148610 474365 893496 564110 -76446 -90308
1115i0308J71719J77921K54931L7756k03949K51788O12150l32215m50590n63197
$$ -90308 81411 259332 514263 552019 348070 599858 1212008 879793 429203 -133994
1105a33994j11461K30539K14985k67129m35888M03922L65818K66711l23217j18557
$$ -133994 -245455 -14916 200069 -67060 -502948 -99026 266792 533503 210286 91729
1095I1729o9508J38183M18626m42021J16123m463K00577K48507J85418m43247
$$ 91729 22221 160404 579030 137009 253132 248669 449246 697753 883171 439924
1085D39924m23728K32705J44282L9543m72227m60236L9488N23459J89320j34404
$$ 439924 16196 248901 393183 432726 -39501 -499737 -460249 63210 252530 118126
1075A18126j44637M55945J33730k90348m8313M7805l508Q9689k9517j8336J71455
$$ 118126 -26511 429434 563164 272816 224503 272308 268800 358489 328972 310636 482091
1064D82091j1717j558J09128p6895n79441P8156M16963j008j09296j67927K6092
$$ 482091 470374 468816 577944 501049 -78392 -236 416727 415719 306423 138496 164588
1053A64588O5991J13820j53270O375j34561J49902j49686L37742L51145k88352
$$ 164588 230579 344399 191129 197504 62943 212845 63159 400901 752046 463694
1043D63694J67584L86k00906k81052N7168K5289j99033M51828o46534n0671K38658
$$ 463694 631278 631664 430758 149706 206874 232163 33130 484958 -161576 -212247 26411
1032B6411K20741l7849J2274p155j96638J05861m5334J25796n1902m0576L2871
$$ 26411 247152 209303 221577 214422 17784 123645 78311 204107 152205 111629 144500
1021A44500L4778K75155M07027k00478p5307j34437l61760m5735p0338K0151J54398
$$ 144500 179278 454433 861460 660982 585675 451238 89478 43743 -26595 -6444 147954
1010A47954q8662J37550Q8957K36095l99932n803K38774p2230l21094N9059L95327
$$ 147954 59292 196842 285799 521894 121962 116159 354933 282703 -38391 20668 415995
999D15995P3936K01455n14797M702L21556M60367p3487o67653K93598l78640J0954
$$ 415995 489931 691386 176589 181291 502847 963214 889727 222074 515672 137032 147986
988A47986K70738k36599N7791j68625j01406j24830j51836N5533J17260L89497
$$ 147986 418724 182125 239916 71291 -30115 -154945 -306781 -251248 -133988 255509
978B55509J39669M6824j38542K83012K17497K68060l38842n22997J7571j33640
$$ 255509 395178 442002 303460 586472 803969 1072029 733187 210190 227761 94121
968I4121K95689j56070Q9323k60595o6244l8495K19947Q839k37479K15339n1626
$$ 94121 389810 233740 323063 62468 -3776 -42271 177676 186515 -50964 164375 112749
957A12749O75j23115J20586J79069R7116m9383n70969K38239J41433K87122L5185
$$ 112749 113424 -9691 110895 289964 387080 337697 -233272 4967 146400 433522 468707
946D68707j93479J834J09076M16417n76931j91191o8174n0327J23038P9829o9050
$$ 468707 275228 277062 386138 802555 225624 34433 -33741 -84068 38970 118799 49749
935D9749o52318M69021L19318J37097L47860j12781m9773l16446K79163p07767
$$ 49749 -602569 -133548 185770 322867 670727 557946 508173 191727 470890 -236877
925b36877K27502O32394N2514q6126m20596M2750j77402M81411l72705k78521
$$ -236877 -9375 623019 675533 589407 168811 211561 34159 515570 142865 -135656
915a35656k19355l15807J10900K52395L60649j70651L00439K11062J86842j48796
$$ -135656 -355011 -670818 -559918 -307523 53126 -117525 182914 393976 580818 432022
905D32022l76708J85759j28240M19783k19495l45590K31551j03486L47422q7286
$$ 432022 55314 241073 112833 532616 313121 -32469 199082 95596 443018 355732
895C55732L56520n75669K23472m9178m2383o4662l49289K42630j9554M80234j73111
$$ 355732 712252 136583 360055 310877 268494 203832 -145457 97173 77619 557853 384742
884C84742k48518m45789k3041N47740K5698K32773j50116L72945L1924k67465
$$ 384742 136224 -309565 -332606 215134 240832 473605 323489 696434 728358 460893
874D60893J0287k40675J08694k70670K58347k44218k10040k39509j17190N31812
$$ 460893 471180 230505 339199 68529 326876 82658 -127382 -366891 -484081 47731
864D7731o9545j33153n72112P18495M16617j11701J39622m22369L50372K4322
$$ 47731 -21814 -154967 -727079 -8584 408033 296332 435954 13585 363957 388279
854C88279L52729l20143m51536J68101J18839R0030l28819K309m16992K64718
$$ 388279 741008 420865 -30671 137430 256269 346299 17480 19789 -397203 -132485
844a32485N06277l92978J46746J03788L88260q6106J19690q47644j36488K75876
$$ -132485 373792 -19186 127560 231348 619608 533502 653192 -194452 -330940 -55064
834e5064J76661K73359l88296o8775j91183N40941L44505k15664k41120j4660
$$ -55064 121597 394956 6660 -62115 -253298 287643 632148 416484 175364 160704
824A60704J69627n6587K03627n97549R5880K73222j93084J40567n95382r7425
$$ 160704 330331 273744 477371 -120178 -24298 248924 55840 196407 -398975 -496400
814d96400M26676L86534j56570k72756J18563M41868N89689j74834M5785k05624
$$ -496400 -69724 316810 160240 -112516 6047 447915 1037604 862770 908555 702931
804G02931N810K60275k41306k30046m29048J11167j2237L36234m57086l94184
$$ 702931 708741 969016 727710 497664 68616 179783 167546 503780 46694 -347490
794c47490L12439P1707n5462k43277L03749j43154K19692K73606L6969q3221m81618
$$ -347490 -35051 36656 -18806 -262083 41666 -101488 118204 391810 428779 345558 -136060
783a36060L34339L80K19841k9189j31882J6823K7001L86502j83189J50786l18457
$$ -136060 198279 198659 418500 389311 257429 274252 301253 687755 504566 655352 336895
772C36895M2867L04650p86022k31807r5917M03457j87384J54186j13491k40556
$$ 336895 379762 684412 -101610 -333417 -429334 -25877 -213261 -59075 -172566 -413122
762d13122J01708r1730M83041L36593L07420k76976K66724K59995n20009p1382
$$ -413122 -311414 -403144 79897 416490 723910 446934 713658 973653 453644 382262
752C82262j16433J42964j13006n4249q35432l57098L27256K83981q071J27822
$$ 382262 265829 408793 295787 241538 -593894 -950992 -623736 -339755 -347826 -220004
742b20004N07197j54110K07650K72155j07759j39999j0576J03200J48978K37949
$$ -220004 287193 133083 340733 612888 505129 365130 354554 457754 606732 844681
732H44681l51374l68700K62462q1134N698n78227K10046m3671K33619o9947m65030
$$ 844681 493307 124607 387069 305935 311633 -266594 -56548 -100219 133400 63453 -401577
721d01577K00740M45421M46748k97411k04783m04130j78793Q00024M18474P6866
$$ -401577 -200837 244584 691332 393921 189138 -214992 -393785 406239 824713 901579
711I01579m83085k623K13265J55109l8721m83034J52076J82923k3614l90725m5067
$$ 901579 418494 415871 629136 784245 745524 262490 414566 597489 573875 183150 138083
700A38083k08196k76427K43814l1237j77398n4838M00522l6141J49776q112m37061
$$ 138083 -70113 -346540 -102726 -133963 -311361 -366199 34323 -1818 147958 139846 -297215
689b97215O54726M45377J67515Q4401L0414j68211l73805N74042l80937q07534
$$ -297215 357511 802888 970403 1054804 1085218 917007 543202 1117244 736307 -71227
679g1227l79393M20336P5151r047j3105k7548M7802J19090K75962l53849j17977
$$ -71227 -450620 -30284 44867 35820 22715 -4833 42969 162059 438021 84172 -33805
668c3805k46409L60619L25293j54037q3899k30445K16701M11075J25766m03390
$$ -33805 -280214 80405 405698 251661 167762 -62683 154018 565093 690859 287469
658B87469m41820K00888L15429K93677l40467Q8538l07578K28818J74753n09617
$$ 287469 -154351 46537 361966 655643 315176 403714 96136 324954 499707 -9910
648i910m06016k19241K95846n840O0259K03866M6574N39954Q2078J60837j83334
$$ -9910 -415926 -635167 -339321 -345161 -284902 -81036 -34462 505492 587570 748407 565073
637E65073K79064r4042Q3749K06134l77458l54616p3591M62323k48391l03559
$$ 565073 844137 750095 833844 1039978 662520 307904 234313 696636 448245 144686
627A44686m75536m04481L06532K76502j91211j35905M36804K51696M6620J64809
$$ 144686 -330850 -735331 -428799 -152297 -343508 -479413 -42609 209087 255707 420516
617D20516o7054J13806r9881N559j22643q7545j17736k43966L67379K00484o7339
$$ 420516 353462 467268 367387 372946 250303 162758 45022 -198944 168435 368919 301580
606C01580p1559K8873n9478K772N1686k01102p4708N8829J66443j44220p8511
$$ 301580 230021 258894 199416 202188 253874 52772 -21936 36893 203336 59116 -19395
595a9395k63741K49630K56296p7042J26513j96336J59130N09749P8131J08660
$$ -19395 -283136 -33506 222790 145748 272261 75925 235055 744804 822935 931595
585I31595J4873J00995K41736m49907p19622n0418j33936j59330J84459J2499
$$ 931595 946468 1047463 1289199 839292 119670 69252 -64684 -224014 -39555 -27056
575b7056P4961j86894J59374L35007j26139J20225k36296L14888k958P7283j97154
$$ -27056 47905 -138989 20385 355392 229253 349478 113182 428070 425112 502395 305241
564C05241p1183K17751L53964J08877m74813j26464m3809J81626k81897r8358
$$ 305241 234058 451809 805773 914650 439837 313373 269564 451190 169293 70935
554G0935j3126P9723K24622P5460k63692k31512Q6568Q3610j34767J0779j06128
$$ 70935 57809 137532 362154 437614 173922 -57590 28978 112588 -22179 -11400 -117528
543a17528l44917K19595N98637K37196j2231J2431P0135N03063k12271k27550
$$ -117528 -462445 -242850 355787 592983 580752 593183 663318 1166381 954110 726560
533G26560J02946k7966l08603l16664R3271l68385O0945O0296q3820k02605k85126
$$ 726560 829506 801540 492937 176273 269544 -98841 -37896 22400 -61420 -264025 -549151
522e49151L09778J75277J79482K2096N3063L17367L21622k0381j45027j24943
$$ -549151 -239373 -64096 115386 137482 190545 507912 829534 809153 664126 539183
512E39183k23774K18334j17200j26283k32877K80687k03676q1907K30014l95178
$$ 539183 315409 533743 416543 290260 57383 338070 134394 52487 282501 -112677
502a12677k66277k89584K59218M23113j48294J14681L89187L62497j28169k25942
$$ -112677 -378954 -668538 -409320 13793 -134501 -19820 369367 731864 603695 377753
492C77753j30661J05474J24567m28991M12165O9546J73897m2605K11150J30248
$$ 377753 247092 352566 477133 48142 460307 529853 703750 661145 872295 1002543
482A002543o07623j92607n91042L28473J10708Q1630o12773k30899N22223k28342
$$ 1002543 394920 202313 -388729 -60256 50452 132082 -480691 -711590 -189367 -417709
472d17709L81071j40113M18666K39274M00332o5644o55691L57438r5756J38999
$$ -417709 -36638 -176751 241915 481189 881521 815877 160186 517624 421868 560867
462E60867P7983l7823k72059N1971K75424l46605l25139l53156j21727K88873
$$ 560867 638850 601027 328968 380939 656363 309758 -15381 -368537 -490264 -201391
452b01391k5094k67699J04560N48157L1982L98750N08509p4643j91605J3248k29217
$$ -201391 -226485 -494184 -389624 158533 190515 589265 1097774 1023131 831526 844774 615557
441F15557k58472K69778m09386L7959q3917J20774m29975k40803N80063k39013
$$ 615557 357085 626863 217477 255436 171519 292293 -137682 -378485 201578 -37435
431c7435J4528l19383Q7804J60527P7246J04542j21652J46253j16125J28953J43309
$$ -37435 -22907 -342290 -254486 -93959 -16713 87829 -33823 112430 -3695 125258 268567
420B68567L43860P4042k93961J47300j72916J38497l20052k94497M4387J83496
$$ 268567 612427 686469 392508 539808 366892 505389 185337 -109160 -64773 118723
410A18723K42857n38186J75336k83214L0349O3402P2p5941j14626N74295J15939
$$ 118723 361580 -176606 -1270 -284484 -254135 -190733 -190661 -266602 -381228 193067 309006
399C09006Q1853k18902O0000M37569N76518Q2900o26267j93544o1756M6838r2677
$$ 309006 390859 171957 231957 669526 1246044 1328944 702677 509133 447377 494215 401538
388D01538j45310o21650N1198M97122m41588l30048J65099L1640J56698L54460
$$ 401538 256228 -365422 -314224 182898 -258690 -588738 -423639 -391999 -235301 119159
378A19159J06167k49049J8238L99046M32363r9920j94470q0915o1330K52502m31790
$$ 119159 225326 -23723 -5485 393561 825924 726004 531534 450619 389289 641791 210001
367B10001j4638l42136m4021N83193J46702m04479m68523R2073l06764M63314
$$ 210001 195363 -146773 -190794 392399 539101 134622 -333901 -241828 -548592 -85278
357h5278m3120J55981k18604K74312O44031l22166L2501l5875L84655L4230l17460
$$ -85278 -128398 27583 -191021 83291 727322 405156 437657 401782 786437 820667 503207
346E03207l99091J0730J51235J23316J05729P695l30248l82100J8411K27585l37808
$$ 503207 104116 114846 266081 389397 495126 502821 172573 -209527 -191116 36469 -301339
335c01339n0056O0202L9207L48010l5230J06262J36491L82914J78512j34254n36075
$$ -301339 -351395 -291193 -251986 96024 60794 167056 303547 686461 864973 730719 194644
324A94644q6667K67398j7274P3563k26648J95626k23410k05662l43764J8651n4051
$$ 194644 107977 375375 358101 431664 205016 400642 177232 -28430 -372194 -353543 -407594
313d07594l49569K50345K86071K39126K39388R0568R5375K34995J14427k07020
$$ -407594 -757163 -506818 -220747 18379 257767 348335 443710 678705 793132 586112
303E86112J3772k9450q108l75432m68400J49199K43366J61669J19506N3395j91590
$$ 586112 599884 570434 562326 186894 -281506 -132307 111059 272728 392234 445629 254039
292B54039m70924L12213O4278o6055l53919j60328L37774K71883J01638j86059
$$ 254039 -216885 95328 159606 93551 -260368 -420696 -82922 188961 290599 104540
282A04540J34273r6339o301l6178j21719J67921J45301L04848M92269l28763o16995
$$ 104540 238813 142474 136173 99995 -21724 146197 291498 596346 1088615 759852 142857
271A42857j15255n895J57667q6128n22324J00456L07063L13657l25667l19240
$$ 142857 27602 21707 179374 93246 -429078 -328622 -21559 292098 -33569 -352809
261c52809K39064O57488J12298j12897l68984J5819K4869L29661K58803j71129
$$ -352809 -113745 543743 656041 543144 174160 189979 214848 544509 803312 632183
251F32183j72257o0813J77118J57692m86839o71048k05407K07235L54802k05348
$$ 632183 459926 399113 576231 733923 247084 -423964 -629371 -422136 -67334 -272682
241b72682N649M49222M21525j87741l28045j38807j68271K73486K79909K35281
$$ -272682 -267033 182189 603714 415973 87928 -50879 -219150 54336 334245 569526
231E69526k60594j28035K21387Q1369L76892l25167m16881J87208J31250j03935
$$ 569526 308932 180897 402284 483653 860545 535378 118497 305705 436955 333020
221C33020l51888j2732K12905J00513J71618o5949j19528M1794j30654l53588
$$ 333020 -18868 -31600 181305 281818 453436 387487 267959 309753 179099 -174489
211a74489K05378j5321m3896M83805L00562K41541k67448n10846J16946K72536
$$ -174489 30889 15568 -28328 455477 756039 997580 730132 219286 336232 608768
201F08768m13434p48696L68604L80303j47315l57585K6275Q1811j4131J85971
$$ 608768 195334 -553362 -184758 195545 48230 -309355 -283080 -201269 -215400 -29429
191b9429J871j22157n1895N96Q3989L43678J10972J03368j51885L13377J92182
$$ -29429 -27558 -149715 -201610 -201014 -117025 226653 337625 440993 289108 602485 794667
180G94667n15799j74046j92812K43960J33835p1632k98533j26695K29966j32001
$$ 794667 278868 104822 -87990 155970 289805 218173 -80360 -207055 22911 -109090
170a09090P4843K38532k56657L3053q546J34971L4329J59617Q8150J57125L50003
$$ -109090 -34247 204285 -52372 -19319 -27865 107106 141435 301052 389202 546327 896330
159H96330j44452m31488j69019k5557k09418L36655k2121j01162j22779J71254
$$ 896330 751878 320390 151371 125814 -83604 253051 230930 129768 6989 178243
149A78243J61118n8493m710l95177M9051J93944j08139j13362k74501N37526L71462
$$ 178243 339361 280868 276158 -119019 -69968 123976 15837 -97525 -372026 165500 536962
138E36962K5687k11698J93849l7253l71j05949j41743K78465l38834q7084l24112
$$ 536962 562649 350951 544800 507547 507176 401227 259484 537949 199115 112031 -212081
127b12081K39842J71533j60096J20227k27230Q0489k87551k77668L43989J65658
$$ -212081 27761 199294 39198 159425 -67805 12684 -274867 -552535 -208546 -42888
117d2888o5137j03035N26868K00597R3742l12023l01237L02888r8682l9958J06474
$$ -42888 -108025 -211060 315808 516405 610147 298124 -3113 299775 201093 161135 267609
106B67609P2851l28939J23804Q7014o5272m3571j48975J30479o1601m1741l13218
$$ 267609 340460 11521 135325 222339 157067 113496 -35479 95000 33399 -8342 -321560
95c21560j50158R3487M01451L38508n2987K40622k88395l1612j05840m3008K22198
$$ -321560 -471718 -378231 23220 361728 308741 549363 260968 229356 123516 80508 302706
84C02706j16627P0434k52218K81280k46193m1031k3257L3132K25599n27236L5549
$$ 302706 186079 256513 4295 285575 39382 -1649 -24906 8226 233825 -293411 -257862
73b57862J98172k871M7602p3861M31358P5360l75329j52890Q9609p0595J7917
$$ -257862 -59690 -62561 -14959 -88820 342538 417898 42569 -110321 -20712 -91307 -73390
62g3390J79939N5029K34356l22692P4335q7080k33932J85556k28287L9334m1090
$$ -73390 106549 161578 395934 73242 147577 60497 -173435 12121 -216166 -176832 -217922
51b17922n3134j31150J92763J39994j43501P944J00376J77276m198K67564j28761
$$ -217922 -271056 -402206 -209443 -69449 -212950 -205006 -104630 72646 68448 336012 207251
40B07251n1381j38174J42918N512j08424p883l3398m8243q8808M7803m3001j26923
$$ 207251 155870 17696 160614 166126 57702 49819 16421 -31822 -120630 -72827 -115828 -242751
28b42751J9199P5036L4357j44642j40824j2685r357N8424R2079L09454n2560n6266
$$ -242751 -223552 -148516 -114159 -258801 -399625 -412310 -421667 -363243 -271164 38290 -14270 -70536
16g0536O2661L7488J45278j54792R5487J02652K99870k705m01898k80062j14319
$$ -70536 -7875 29613 174891 20099 115586 218238 518108 515403 113505 -166557 -280876
5b80876J38002j67058q9627j2909O9557
$$ -280876 -142874 -309932 -399559 -412468 -342911
0c42911
$$ -342911
$$ Imaginary data points
##PAGE= N=2
##DATA TABLE= (X++(I..I)), XYDATA
16383a395645r2315K29195p8167J64762k5781m126j72902m2758K93865k54574
$$ -1395645 -1487960 -1258765 -1336932 -1172170 -1197951 -1202077 -1374979 -1417737 -1123872 -1378446
16373a378446M0752j79325k4377J10643R8351j93122j92079N07963R0312J69906
$$ -1378446 -1337694 -1517019 -1541396 -1430753 -1332402 -1525524 -1717603 -1209640 -1119328 -949422
16363i49422l3068j15737M9534J11834J34268j40625J75045Q7910j08549K92990
$$ -949422 -982490 -1098227 -1048693 -936859 -802591 -943216 -768171 -680261 -788810 -495820
16353d95820j40850k99738j05467J5857L48877n3088p4289j91889Q6974L09411
$$ -495820 -636670 -936408 -1041875 -1026018 -677141 -730229 -804518 -996407 -909433 -600022
16343f00022j73810J11771J64787m8039J15074j10390J41683j23990O295J12822
$$ -600022 -773832 -662061 -497274 -545313 -430239 -540629 -398946 -522936 -516641 -403819
16333d03819K45571O4866k83820K56922j27163J10559j27671j78366J89178l9074
$$ -403819 -158248 -93382 -377202 -120280 -247443 -136884 -264555 -442921 -253743 -292817
16323b92817r2206r0931K76576K3483k01272K36604L6484Q3722k01693q8440L4586
$$ -292817 -385023 -475954 -199378 -175895 -377167 -140563 -104079 -20357 -222050 -310490 -275904
16312b75904K82159K87756m10594P1013J13324M2120Q9384j36498K97054n5624
$$ -275904 6255 294011 -116583 -45570 67754 109874 199258 62760 359814 304190
16302C04190j40973k04125m85K69355r9908m3038j6861L54969j04492j81412j0631
$$ 304190 163217 -40908 -41393 227962 128054 85016 68155 423124 318632 137220 126589
16291A26589J9415j16844L9570O6324K12436K74595m5336Q6665j10017k591k16478
$$ 126589 146004 29160 68730 135054 347490 622085 576749 663414 553397 550806 334328
16280C34328J57229J7560p2974j28802k1585M39750J96937j43083j27507K33693
$$ 334328 491557 509117 436143 307341 285756 725506 922443 779360 651853 885546
16270H85546R5532k11330k55107j74179M88393r261k32785K93043j44311j48090
$$ 885546 981078 769748 514641 340462 828855 819594 586809 879852 735541 587451
16260E87451r539J13018O8805j09819j0819J67295K75659k45913j60505L1735
$$ 587451 577912 690930 759735 649916 639097 806392 1082051 836138 675633 707368
16250G07368L44319J20097k23435r6980l56012K87411J98564J3664k62823M25743
$$ 707368 1051687 1171784 948349 851369 495357 782768 981332 994996 732173 1157916
16240A157916j1840j48723L31794P0626j25762L9670P521j66340l10223R3825
$$ 1157916 1146076 997353 1329147 1399773 1274011 1313681 1321202 1154862 844639 938464
16230I38464J56975l9775J88434k39578j23201J76019J40512j83128K55230J08300
$$ 938464 1095439 1055664 1244098 1004520 881319 1057338 1197850 1014722 1269952 1378252
16220A378252J93245Q7491n1772l48257O7539K73708o28975q389o7904L16995
$$ 1378252 1571497 1658988 1607216 1258959 1326498 1600206 971231 962842 894938 1211933
16210A211933j49453K3528K59667l8510K22858j01280n6729k75816Q9388Q9101
$$ 1211933 1062480 1086008 1345675 1307165 1530023 1428743 1372014 1096198 1185586 1274687
16200A274687M8137M49249l01197l80010J12620J40532j18609J29644L34761L35937
$$ 1274687 1322824 1772073 1470876 1090866 1203486 1344018 1225409 1355053 1689814 2025751
16190B025751j97001m02050k78143J90334M56224k0827j1056j5874j4592P9538
$$ 2025751 1828750 1426700 1148557 1338891 1795115 1774288 1763232 1747358 1732766 1812304
16180A812304k50418j49455J27705k13807O3655J5363L26753k5404p3161k28724
$$ 1812304 1561886 1412431 1540136 1326329 1389984 1405347 1732100 1706696 1633535 1404811
16170A404811N45576P2351l85152k0802J87046K66715m02932j30827k57652K34041
$$ 1404811 1950387 2022738 1637586 1616784 1803830 2070545 1667613 1536786 1279134 1513175
16160A513175O3827O9561L03275p1165m6624k80864O3187J13975J25990L5601
$$ 1513175 1577002 1646563 1949838 1878673 1832049 1551185 1614372 1728347 1854337 1889938
16150A889938R508J98321j96735k82696j73503K22581P6642m83517k9316J67415
$$ 1889938 1899446 2097767 1901032 1618336 1444833 1667414 1744056 1260539 1231223 1398638
16140A398638K40851Q9520j65449J36730P7938M2311l29561K44240L56512k81704
$$ 1398638 1639489 1729009 1563560 1700290 1778228 1820539 1490978 1735218 2091730 1810026
16130A810026j32557P2765J38527k09647j58875l32934J85446K9838M35621M616
$$ 1810026 1677469 1750234 1888761 1679114 1520239 1187305 1372751 1402589 1838210 1842826
16120A842826P1924m8489k75953L79086K10451J772l53880J34029j60435K20829
$$ 1842826 1914750 1866261 1590308 1969394 2179845 2181617 1827737 1961766 1801331 2022160
16110B022160p5009m84129K56131K16493K70124k68657q9948J24996l01906K50528
$$ 2022160 1947151 1463022 1719153 1935646 2205770 1937113 1847165 1972161 1670255 1920783
16100A920783j94362N340L1183R1183r940O8335J50416n33714M3884J76385j7365
$$ 1920783 1726421 1731761 1762944 1854127 1844187 1912522 2062938 1529224 1573108 1749493 1732128
16089A732128j30874n5004M07970M9653N3363l2686J87621O0798J43518o93368
$$ 1732128 1601254 1546250 1954220 2003873 2057236 2024550 2212171 2272969 2416487 1723119
16079A723119l53958L49066N7577J73492J144K48043J8727l25255K18816l5853
$$ 1723119 1369161 1718227 1775804 1949296 1950440 2198483 2217210 1891955 2110771 2074918
16069B074918j73352j11647k38349K88569K27117Q2101k73186q4759k65492K42436
$$ 2074918 1901566 1789919 1551570 1840139 2067256 2149357 1876171 1791412 1525920 1768356
16059A768356k78819L754R7366j34665r7993j86096O98712P2549j7866J58710
$$ 1768356 1489537 1493291 1590657 1455992 1357999 1171903 1870615 1943164 1925298 2084008
16049B084008J07178j74505O0970J8131k43983K54251n5432k68105J41970m8054
$$ 2084008 2191186 2016681 2077651 2095782 1851799 2106050 2050618 1782513 1924483 1876429
16039A876429Q9312l33326j64525m6409J10396L91617M7730K09056j51904Q0224
$$ 1876429 1965741 1632415 1467890 1421481 1531877 1923494 1971224 2180280 2028376 2108600
16029B108600j39429K9558J60205j90019K0608r8839K02859n4924m3731N1621
$$ 2108600 1969171 1998729 2158934 1968915 1989523 1890684 2093543 2038619 1994888 2046509
16019B046509q0352j56803j73554K73466j73033O4897k19375j07386j59750K86027
$$ 2046509 1966157 1809354 1635800 1909266 1736233 1801130 1581755 1474369 1314619 1600646
16009A600646J92472j29184L36426n7594Q423k18288L6693J42028n9625K89580
$$ 1600646 1793118 1663934 2000360 1942766 1951189 1732901 1769594 1911622 1851997 2141577
15999B141577j92768k6544k44293r2178J44459K35217j21001l16194p7461j27777
$$ 2141577 1948809 1922265 1677972 1585794 1730253 1965470 1844469 1528275 1450814 1323037
15989A323037K85172L9523J19182q607J31560N6586k34731L44158N0318o5473
$$ 1323037 1608209 1647732 1766914 1758307 1889867 1946453 1711722 2055880 2106198 2040725
15979B040725o331J13316J92790n62002K20655J7041r2540j10603j80705j18231
$$ 2040725 2034394 2147710 2340500 1778498 1999153 2016194 1923654 1813051 1632346 1514115
15969A514115q9680L36219j8380k3115J85875p8729j32733L7250N52274r0028
$$ 1514115 1424435 1760654 1742274 1719159 1905034 1826305 1693572 1730822 2283096 2193068
15959B193068l62721j02509Q0492k0697q3665Q2493L61494J46844j92226q3748
$$ 2193068 1830347 1727838 1808330 1787633 1703968 1786461 2147955 2294799 2102573 2018825
15949B018825N1349J90959j73929k40620k34925m7561J24770J46884K72475k38185
$$ 2018825 2070174 2261133 2087204 1846584 1611659 1564098 1688868 1835752 2108227 1870042
15939A870042j35573j2461L37820K85402m23845j26869j01995K30876L80530O1399
$$ 1870042 1734469 1722008 2059828 2345230 1921385 1794516 1692521 1923397 2303927 2365326
15929B365326k74829J36239L48672j77625j05020n53289j70690j56935J69478
$$ 2365326 2090497 2226736 2575408 2397783 2292763 1739474 1568784 1411849 1581327
15920A581327J38370O9219J00869j10093k4576k478J12660N5674L65680J834j41836
$$ 1581327 1719697 1788916 1889785 1779692 1755116 1752638 1865298 1920972 2286652 2288486 2146650
15909B146650k42845o2036p4498J40246Q0204J58199m8507o0898k34957R5791
$$ 2146650 1903805 1841769 1767271 1907517 1987721 2145920 2097413 2036515 1801558 1897349
15899A897349l61236L44105M9716k12224P9745M0267L54439j63551j51310N4324
$$ 1897349 1536113 1880218 1929934 1717710 1797455 1837722 2192161 2028610 1877300 1931624
15889A931624J94487j36264N1015j08305k5711J885l22320N08387m19726M5645
$$ 1931624 2126111 1989847 2040862 1932557 1906846 1908731 1586411 2094798 1675072 1720717
15879A720717J53424j70414L78759k61201O1097J68433L49911k99544n29174l7092
$$ 1720717 1874141 1703727 2082486 1821285 1882382 2050815 2400726 2101182 1572008 1534916
15869A534916j07390J68455J8308J98325k42003K15752M13455k71448R934j19077
$$ 1534916 1427526 1595981 1614289 1812614 1570611 1786363 2199818 1928370 1938304 1819227
15859A819227J90811j78749M93549m61566m76771L61260J72946L4219m2875K7872
$$ 1819227 2010038 1831289 2324838 1863272 1386501 1747761 1920707 1954926 1912051 1939923
15849A939923k50090N80833j37791k42871j45454l5253M68290l61977M46726j45177
$$ 1939923 1689833 2270666 2132875 1890004 1744550 1709297 2177587 1815610 2262336 2117159
15839B117159k95370j61613J93868J38943l15609M88459n36117n1651K04167j36821
$$ 2117159 1821789 1660176 1854044 1992987 1677378 2165837 1629720 1578069 1782236 1645415
15829A645415j9075k430O46107l34115K24135l89151l80720M38569j69732l3896
$$ 1645415 1626340 1623910 2270017 1935902 2160037 1770886 1390166 1828735 1659003 1625107
15819A625107j20800Q5904l15356Q858L16539M132j01854L7701N25567k51384
$$ 1625107 1504307 1590211 1274855 1283713 1600252 1604384 1502530 1540231 2065798 1814414
15809A814414O6261M3753J14479K17718j94133j03081j43515N06172l88315m8753
$$ 1814414 1880675 1924428 2038907 2256625 2062492 1959411 1815896 2322068 1933753 1885000
15799A885000J56563K19007k95707k75562J12126j62735K88354p12355J71554
$$ 1885000 2041563 2260570 1964863 1689301 1801427 1638692 1927046 1214691 1386245
15790A386245L79499L10868o6099k64174L82124l81464L36409J85319j52481m34802
$$ 1386245 1765744 2076612 2010513 1746339 2128463 1746999 2083408 2268727 2116246 1681444
15780A681444K8291J86941k62599N47011r0109N3499M47086L4415m66428n20531
$$ 1681444 1709735 1896676 1634077 2181088 2090979 2144478 2591564 2625979 2159551 1639020
15770A639020L36838m82034L13720L0476m38056K45703j80910J17813m37145N13764
$$ 1639020 1975858 1493824 1807544 1838020 1399964 1645667 1464757 1582570 1145425 1659189
15760A659189O080J59421L99488p3333j12192k10959O06162l11566M33152k30889
$$ 1659189 1665269 1824690 2224178 2150845 2038653 1827694 2433856 2122290 2555442 2324553
15750B324553m55415n8492k3796k02707l53925M12171l6867L66198n8448k53150
$$ 2324553 1869138 1810646 1786850 1584143 1230218 1642389 1605522 1971720 1913272 1660122
15740A660122K89623Q0394J65524l60712K52307M7145j72885l30721L64368L48911
$$ 1660122 1949745 2030139 2195663 1834951 2087258 2134403 1961518 1630797 1995165 2344076
15730B344076m50471L61638m22999M25729o3164k30696O4564l913M80997l05962
$$ 2344076 1893605 2255243 1832244 2257973 2194809 1964113 2028677 2024764 2505761 2199799
15720B199799P9901k7480k03770m48569N309J98711l63749M59109j94372J51821
$$ 2199799 2279700 2252220 2048450 1599881 1605190 1803901 1440152 1899261 1704889 1856710
$$ [...]
##END NTUPLES=NMR SPECTRUM
##END=
