##TITLE=1H_DE-80H_X3
 200.13MHz, d2o
 8 sc
 
 19ns.26.2.2025
##JCAMPDX= 6.0         $$ Bruker NMR JCAMP-DX V2.0
##DATA TYPE= NMR SPECTRUM
##DATA CLASS= NTUPLES
##ORIGIN= UXNMR, Bruker Analytische Messtechnik GmbH
##OWNER= pz
$$ XWIN-NMR		Version 3.5
$$ Thu Mar 26 10:23:08 2026 Russian Standard Time (UT+4h)  Yarkov@DPX200
##.OBSERVE FREQUENCY= 200.1313
##.OBSERVE NUCLEUS= ^1H
##.ACQUISITION MODE= SIMULTANEOUS
##.ACQUISITION SCHEME= undefined
##.AVERAGES= 8
##.DIGITISER RES= 18
##SPECTROMETER/DATA SYSTEM= spect
##.PULSE SEQUENCE= zg30
##.SOLVENT NAME= DMSO
##.SHIFT REFERENCE= (INTERNAL, DMSO, 0, 15.4803)
##AUDIT TRAIL= $$ (NUMBER, WHEN, WHO, WHERE, WHAT)
$$ ##TITLE= Audit trail, XWIN-NMR		Version 3.5
$$ ##JCAMPDX= 5.01
$$ ##ORIGIN= Bruker BioSpin GmbH
$$ ##OWNER= Yarkov
$$ C:/Bruker/XWIN-NMR/data/yarkov2/nmr/H-C/1/pdata/1/auditp.txt
$$ ##AUDIT TRAIL=  $$ (NUMBER, WHEN, WHO, WHERE, WHAT)
(   1,<2026-03-26 10:22:04.09 +0400>,<Yarkov>,<DPX200>,
      <created by zg, POWCHK disabled, PULCHK disabled
       configuration hash MD5:
       00 E9 B6 7A A2 85 ED C7 34 08 36 98 17 FE 4E 26
       data hash MD5: 16K
       57 19 54 44 57 2D 8B 32 3C A1 2B 5D 9E D9 44 3F>)
(   2,<2026-03-26 10:22:19.32 +0400>,<Yarkov>,<DPX200>,
      <Start of raw data processing
       efp BC_mod = 2 LB = 0.25 FT_mod = 6 PKNL = 1 PHC0 = -5299.148 PHC1 = 6.821927 SI = 16K 
       data hash MD5: 16K
       AE 12 98 6B E3 95 F9 E1 A9 75 36 94 FA 52 11 D8>)
(   3,<2026-03-26 10:22:26.26 +0400>,<Yarkov>,<DPX200>,
      <abs ABSG = 5 
       data hash MD5: 16K
       1C 4A E7 B8 87 50 77 E8 1F 9F A4 D7 60 CF 86 44>)
$$ ##END=
$$ 
$$ hash MD5
$$ CA 4A 9F 0E FA C7 09 D6 0A 48 65 6B F3 AC FD 21
##$RELAX= 
##$RELAX= 
##$RELAX= 
##$RELAX= 
##$RELAX= 
##$RELAX= 
$$ Bruker specific parameters
$$ --------------------------
##$DU= <C:/Bruker/XWIN-NMR>
##$EXPNO= 1
##$NAME= <H-C>
##$PROCNO= 1
##$TYPE= <nmr>
##$USER= <yarkov2>
##$AMP= (0..31)
100 100 100 100 100 100 100 100 100 100 100 100 100 100 100 100 100 100 
100 100 100 100 100 100 100 100 100 100 100 100 100 100 
##$AQSEQ= 0
##$AQ_mod= 1
##$AUNM= <au_zg>
##$AUTOPOS= <>
##$BF1= 200.13
##$BF2= 200.13
##$BF3= 200.13
##$BF4= 200.13
##$BF5= 200.13
##$BF6= 200.13
##$BF7= 200.13
##$BF8= 200.13
##$BYTORDA= 1
##$CFDGTYP= 0
##$CFRGTYP= 5
##$CHEMSTR= <none>
##$CNST= (0..31)
1 1 145 1 1 1 1 1 1 1 1 1 1 1 1 1 1 1 1 1 1 1 1 1 1 1 1 1 1 1 1 1 
##$CPDPRG= <>
##$CPDPRG1= <>
##$CPDPRG2= <>
##$CPDPRG3= <>
##$CPDPRG4= <mlev>
##$CPDPRG5= <mlev>
##$CPDPRG6= <mlev>
##$CPDPRG7= <mlev>
##$CPDPRG8= <mlev>
##$CPDPRGB= <>
##$CPDPRGT= <>
##$D= (0..31)
0 0.7 0 0 0 0 0 0 0 0 0 0.03 0 0 0 0 0 0 0 0 0 0 0 0 0 0 0 0 0 0 0 0 
##$DATE= 1774506123
##$DBL= (0..7)
120 120 120 120 120 120 120 120 
##$DBP= (0..7)
150 150 150 150 150 150 150 150 
##$DBP07= 0
##$DBPNAM0= <>
##$DBPNAM1= <>
##$DBPNAM2= <>
##$DBPNAM3= <>
##$DBPNAM4= <>
##$DBPNAM5= <>
##$DBPNAM6= <>
##$DBPNAM7= <>
##$DBPOAL= (0..7)
0.5 0.5 0.5 0.5 0.5 0.5 0.5 0.5 
##$DBPOFFS= (0..7)
0 0 0 0 0 0 0 0 
##$DE= 6
$$ [...]
##$SUBNAM3= <"">
##$SUBNAM4= <"">
##$SUBNAM5= <"">
##$SUBNAM6= <"">
##$SUBNAM7= <"">
##$SUBNAM8= <"">
##$SUBNAM9= <"">
##$SW= 18.0517328524113
##$SWIBOX= (0..15)
0 0 2 0 0 0 0 0 0 0 0 0 0 0 0 0 
##$SW_h= 3612.71676300578
##$TD= 16384
##$TD0= 1
##$TE= 0
##$TE2= 300
##$TE3= 300
##$TEG= 300
##$TL= (0..7)
0 120 120 120 120 120 120 120 
##$TP= (0..7)
150 150 150 150 150 150 150 150 
##$TP07= 0
##$TPNAME0= <>
##$TPNAME1= <>
##$TPNAME2= <>
##$TPNAME3= <>
##$TPNAME4= <>
##$TPNAME5= <>
##$TPNAME6= <>
##$TPNAME7= <>
##$TPOAL= (0..7)
0.5 0.5 0.5 0.5 0.5 0.5 0.5 0.5 
##$TPOFFS= (0..7)
0 0 0 0 0 0 0 0 
##$TUNHIN= 0
##$TUNHOUT= 0
##$TUNXOUT= 0
##$USERA1= <user>
##$USERA2= <user>
##$USERA3= <user>
##$USERA4= <user>
##$USERA5= <user>
##$V9= 5
##$VALIST= <valist>
##$VCLIST= <CCCCCCCCCCCCCCC>
##$VD= 0
##$VDLIST= <DDDDDDDDDDDDDDD>
##$VPLIST= <PPPPPPPPPPPPPPP>
##$VTLIST= <TTTTTTTTTTTTTTT>
##$WBST= 1024
##$WBSW= 4
##$XGAIN= (0..3)
0 0 0 0 
##$XL= 0
##$YL= 0
##$YMAX_a= 100463
##$YMIN_a= -91069
##$ZGOPTNS= <>
##$ZL1= 120
##$ZL2= 120
##$ZL3= 120
##$ZL4= 120
##$ABSF1= 15.5067
##$ABSF2= -2.54515
##$ABSG= 5
##$ABSL= 3
##$ALPHA= 0
##$AQORDER= 0
##$ASSFAC= 0
##$ASSFACI= 0
##$ASSFACX= 0
##$ASSWID= 0
##$AUNMP= <proc_1d>
##$AZFE= 0.1
##$AZFW= 0.1
##$BCFW= 0
##$BC_mod= 2
##$BYTORDP= 0
##$COROFFS= 0
##$CY= -3
##$DATMOD= 1
##$DC= 0
##$DFILT= <>
##$DTYPP= 0
##$F1P= 0
##$F2P= 0
##$FCOR= 1
##$FTSIZE= 16384
##$FT_mod= 6
##$GAMMA= 0
##$GB= 0
##$INTBC= 1
##$INTSCL= 3.241238e-09
##$ISEN= 128
##$LB= 0.25
##$LEV0= 0
##$LPBIN= 0
##$MAXI= 10000
##$MC2= 0
##$MEAN= 0
##$ME_mod= 0
##$MI= 1.114404
##$NCOEF= 0
##$NC_proc= -8
##$NLEV= 6
##$NOISF1= 3.799351
##$NOISF2= 2.8
##$NSP= 0
##$NTH_PI= 0
##$NZP= 0
##$OFFSET= 15.48025
##$PC= 1
##$PHC0= -5299.148
##$PHC1= 6.821927
##$PH_mod= 1
##$PKNL= yes
##$PPARMOD= 0
##$PSCAL= 0
##$PSIGN= 0
##$REVERSE= no
##$SF= 200.130008295574
##$SI= 16384
##$SIGF1= 3
##$SIGF2= 2
##$SINO= 0.751879
##$SIOLD= 32768
##$SREGLST= <19F.Aceton>
##$SSB= 0
##$STSI= 16384
##$STSR= 0
##$SW_p= 3612.71676300578
##$SYMM= 0
##$S_DEV= 0
##$TDeff= 16384
##$TDoff= 0
##$TI= <>
##$TILT= no
##$TM1= 0
##$TM2= 0
##$TOPLEV= 0
##$USERP1= <user>
##$USERP2= <user>
##$USERP3= <user>
##$USERP4= <user>
##$USERP5= <user>
##$WDW= 1
##$XDIM= 16384
##$YMAX_p= 461299919
##$YMIN_p= -831203
$$ End of Bruker specific parameters
$$ ---------------------------------
##NTUPLES= NMR SPECTRUM
##VAR_NAME=  FREQUENCY,     SPECTRUM/REAL,   SPECTRUM/IMAG
##SYMBOL=    X,             R,               I
##VAR_TYPE=  INDEPENDENT,   DEPENDENT,       DEPENDENT
##VAR_FORM=  AFFN,          ASDF,            ASDF
##VAR_DIM=   16384,         16384,           16384
##UNITS=     HZ,            ARBITRARY UNITS, ARBITRARY UNITS
##FACTOR=    0.220516191357247, 1,           1
##FIRST=     3098.06263268049, 0,            0
##LAST=      -514.654130325294, 0,           0
##MIN=       -514.654130325294, -831203,     0
##MAX=       3098.06263268049, 461299919,    0
$$ Real data points
##PAGE= N=1
##DATA TABLE= (X++(R..R)), XYDATA
$$ [...]
5149B051532L82953K00691M2708j48085k17793p4553m1665K66294k08388J43463
5139B397157K02329l5194K1384J43276N856O5455m1470j5848K38459L99579o4217
5128C316766K28302M26715N6041Q7884L58093M82230N40367L77237Q985L53965
5118F236585K22699J91589j48473P0381q3929j51467P1554Q1572N5674J65601
5108F711786K83435K46642l9806k63914n29530j08741j05357j25245k22348k13129
5098E633793k40624j2801R2534k81187O2042L82047k27603M9650N315l5122K83576
5087E711620M47424K72997K73938L63991J25393P76327Q58175Q63529P74649Q89973
5077A1358016N20180O82056P33805M03158K9367j507K20243J73698M25631M81207
$$ plain form
5149 2051532 2434485 2635176 2677884 2529799 2312006 2237453 2195788 2462082 2253694 2397157
5139 2397157 2599486 2564292 2585676 2728952 2734808 2800263 2758793 2742945 2981404 3380983 3316766
5128 3316766 3545068 3971783 4027824 4115708 4473801 4956031 5496398 5873635 5882620 6236585
5118 6236585 6459284 6650873 6502400 6572781 6488852 6337385 6408939 6490511 6546185 6711786
5108 6711786 6995221 7241863 7202057 6938143 6408613 6299872 6194515 6069270 5846922 5633793
5098 5633793 5393169 5380368 5472902 5191715 5253757 5635804 5408201 5457851 5463166 5428044 5711620
5087 5711620 6159044 6432041 6705979 7069970 7195363 7971690 8829865 9693394 10468043 11358016
5077 11358016 11878196 12560252 13294057 13697215 13726582 13725075 13945318 14119016 14544647 15025854
5067A5025854P90426J005644J080597M04509M0430k15361j50579n91849n89871
5058A6799800o19985j28622q5151j76890J0147K06845K25277J80046Q1387k07511
5048A6285343k06910n74167l38568l13762j17929l71218k79589m48273J84991
5039A3819918L36612o49953k00156o13053l67564k35851j19444l81153q116k07736
5029A1373504q3160K85437K61795M76792M79701Q21202J077886R65901Q04556
5020A6463614J177203M45084J89586k8013k38533m38851j28848J15681Q7853L73743
5010A8018519L40322M82858M46734Q1313n0240k33743k78993j12198J58654J15848
5000A8969074N6916L64161R68275R23092Q19853N82881M16990J63735K78398l7651
$$ plain form
5067 15025854 15816280 16821924 17902521 18307030 18347460 18132099 17981520 17389671 16799800
5058 16799800 16179815 16051193 15966042 15789152 15799299 16006144 16231421 16411467 16492854 16285343
5048 16285343 16078433 15504266 15165698 14851936 14734007 14362789 14083200 13634927 13819918
5039 13819918 14156530 13506577 13306421 12693368 12325804 12089953 11970509 11589356 11581240 11373504
5029 11373504 11290344 11575781 11837576 12314368 12794069 13615271 14693157 15659058 16463614
5020 16463614 17640817 18085901 18275487 18247474 18008941 17570090 17441242 17556923 17644776 18018519
5010 18018519 18358841 18841699 19288433 19369746 19319506 19085763 18806770 18694572 18853226 18969074
5000 18969074 19025990 19390151 20358426 21281518 22101371 22684252 23101242 23264977 23543375 23505724
4990B3505724j18529J82475p5811K4324P0380q5500j96311l03982k69308n08800
4980B2224662r17544j115787j299253j246823j328152j368646j138346r80803
4972A2829308q34287r04961n86598q12080l98914l63923k62783m00046n85068
4963G680648k15162J60846J43907k11529n36942p4912N0440J11719K92680p9064
4953G322631L0222K23485J21486K01527K91039N14066O93048K29021j21428K01569
4943I706666Q4653j53197l03782j95066l38551n33592k98451n8925q5907l50312
4933G473536j58056k2887p6270K1365K06713p1541j08248J62669J66347J02916
4923G696544K38413R2948q1101l12993J81368j32020J91189K10819J72713P0118
$$ plain form
4990 23505724 23387195 23569670 23493859 23518183 23588563 23503063 23306752 23002770 22733462 22224662
4980 22224662 21307118 20191331 18892078 17645255 16317103 14948457 13810111 12829308
4972 12829308 11995021 11090060 10503462 9691382 9292468 8928545 8665762 8265716 7680648
4963 7680648 7465486 7626332 7770239 7558710 7021768 6946856 6997296 7109015 7401695 7322631
4953 7322631 7352853 7576338 7697824 7899351 8190390 8704456 9397504 9626525 9505097 9706666
4943 9706666 9791319 9638122 9334340 9139274 8800723 8267131 7968680 7909755 7823848 7473536
4933 7473536 7315480 7292593 7216323 7237688 7444401 7372860 7264612 7427281 7593628 7696544
4923 7696544 7934957 8027905 7946804 7633811 7815179 7683159 7874348 8085167 8257880 8327998
4913H327998L93641L91229M46485O21340L08093L76409P06947Q73015N92951J38440
4903A3176548K25567j34374j57479J97915J47156j66202m30308j12817q7053k48633
4893A2410320m88221J036O3537Q8017J31470j44614R9352n6634J1710K3901L25758
4882A2465632O086n0722P9151M63282Q930N3170K45751K91947N07280Q5581L31666
4871A4487754K29740N30755N10005P26778O41728O44449J139960J212761P27118
4862B0851048J045190N57723K20390R9447j30533J50532k91848m46559n14498
4853B1540892n52282K26339r8286o55704j91373p1857l17716j24361l58529j80324
4843A9216799L8063r9952K4772o9985J38746K08472O57555O17933N90923N98843
$$ plain form
4913 8327998 8721639 9112868 9559353 10180693 10488786 10865195 11572142 12445157 13038108 13176548
4903 13176548 13402115 13267741 13110262 13308177 13455333 13289131 12858823 12746006 12658953 12410320
4893 12410320 11922099 11923135 11986672 12074689 12206159 12061545 12160897 12104263 12115973 12139874 12465632
4882 12465632 12471718 12420996 12500147 12963429 12972359 13025529 13271280 13563227 14070507 14156088 14487754
4871 14487754 14717494 15248249 15758254 16485032 17126760 17771209 18911169 20123930 20851048
4862 20851048 21896238 22453961 22674351 22773798 22643265 22793797 22501949 22055390 21540892
4853 21540892 20988610 21214949 21116663 20460959 20269586 20197729 19880013 19755652 19397123 19216799
4843 19216799 19254862 19154910 19179682 19109697 19248443 19456915 20114470 20732403 21323326 21922169
4833B1922169N20098M23095O50817R31258P92946O49916Q05470J224798J014368
4824B8934935J082988J039698J544439J577565J375441J386459J111229J076913
4816C9129667N89235L25409L494j98224l13236j08706K02189o9297m33252O5375
4806C9192654J08111L242k1835p55968q11020n21136m61445r79522o19265l95732
4796C4738084n13189m78945k41894j91276J47842L11990M20527L58474P09848
4787C5261461J019546R21797N79198Q46635R71872P45690Q49676O37634N94367
4778D2427876N89533P02739P91005O72775O51213P0094p0418n8008p2492k21334
4768D5482983o00790j84112J36576L624K33505O49595O6264J81393K25016K11780
$$ plain form
4833 21922169 22442267 22865362 23516179 24447437 25240383 25890299 26695769 27920567 28934935
4824 28934935 30017923 31057621 32602060 34179625 35555066 36941525 38052754 39129667
4816 39129667 39718902 40044311 40047805 39849581 39536345 39427639 39629828 39560531 39127279 39192654
4806 39192654 39300765 39304007 39282172 38526204 37715184 37194048 36732603 35753081 35133816 34738084
4796 34738084 34224895 33745950 33504056 33312780 33460622 33772612 34193139 34551613 35261461
4787 35261461 36281007 37202804 37782002 38628637 39600509 40346199 41195875 41833509 42427876
4778 42427876 43017409 43720148 44511153 45183928 45835141 45905235 45834817 45776809 45704317 45482983
4768 45482983 44882193 44698081 44834657 44838281 45071786 45721381 45787645 45969038 46194054 46405834
4758D6405834L5131l43884n47055p91950o62853l79588q55298o49326o16496o43899
4748D0950616o16225k58094j54871l80059m10037J66456R5517j81605K94043P36248
4738D0241989N48999O48914N18248Q56319J114691P21684O35832O38231N60003
4729D6484910P30167N79466J29905L42321N16517M25351L69910M64965M28591
4720E0472103Q70492J193282Q38069O76069P46891J179216Q69988P50158Q79108
4711E8475376Q28864J090817J374712J305407O50906L51032L80912L78479k36928
4702F4599577l94612m55599p27286p26405j154882j217214j100449o84621m00954
4693E7737555r95244p74646k33121k65409l21291j91198k76022j06453k44772
$$ plain form
4758 46405834 46440965 46097081 45550026 44758076 44095223 43715635 42860337 42211011 41594515 40950616
4748 40950616 40334391 40076297 39921426 39541367 39131330 39297786 39393303 39211698 39505741 40241989
4738 40241989 40790988 41439902 41958150 42814469 43929160 44650844 45286676 45924907 46484910
4729 46484910 47215077 47794543 47924448 48266769 48783286 49208637 49578547 50043512 50472103
4720 50472103 51342595 52535877 53373946 54050015 54796906 55976122 56846110 57596268 58475376
4711 58475376 59304240 60395057 61769769 63075176 63726082 64077114 64458026 64836505 64599577
4702 64599577 64204965 63749366 63022080 62295675 61140793 59923579 58823130 58138509 57737555
4693 57737555 56742311 55967665 55734544 55469135 55147844 54956646 54680624 54574171 54329399
4684E4329399K92379J69862j62242m24092j50425n18971p10196p66274j113076
4675E0946364j219866j230454j256973j655894j842724j694581j772395j573094
4667C8700383j485947j475054j559595j348746j272869r07635j111167j116852
4659B8422518r89458r27498q36665l88567n09162n17196o98613n98323o90245
4650B2266791p17539m54286p02957q64752n16861q13418j031411o93865q12764
4641A5658938q68059q22565q69761r94417m74750n33424l94257m32164n69431
4632I700110n89919j73901k41008l44175l04298j70125l60106J07175j06271n5069
4622G462413k57678j87965l24514k84779l86691J3249n4537k13678k1581k15617
$$ plain form
4684 54329399 54621778 54791640 54629398 54205306 54054881 53535910 52825714 52059440 50946364
4675 50946364 49726498 48496044 47239071 45583177 43740453 42045872 40273477 38700383
4667 38700383 37214436 35739382 34179787 32831041 31558172 30650537 29539370 28422518
4659 28422518 27433060 26505562 25668897 25280330 24771168 24253972 23555359 22957036 22266791
4650 22266791 21549252 21094966 20392009 19527257 19010396 18196978 17165567 16471702 15658938
4641 15658938 14790879 13968314 13098553 12104136 11629386 11095962 10701705 10269541 9700110
4632 9700110 9110191 8936290 8695282 8351107 8046809 7876684 7516578 7623753 7517482 7462413
4622 7462413 7204735 7016770 6692256 6407477 6020786 6034035 5979498 5765820 5744239 5528622
4612E528622k79080k06705m7002J09904k23692k42119J53801j15156k9691j1333
4602D637549j19812O5056k89593k61564Q8943m4184j7255j79326k19574K04313
4592C864553p2353n6777r7929J36323j03456m29670j74170L16042J72698j72201
4582C383060J31921j7233Q4044n1273q0792J97929m44661r3385K27709j3585j03790
4571C219944N7009L7700J33039Q9293n8599N5205L9338p1940p8248L50894l8912
4560C734723J70310K9140l1237K72132n8418O3987L46697J51674M1768M9947N2401
4549D823124L79178K97011L79415R9670m7235L54173O3055O07011R55977R23869
4539H835248L30353P78124J041883J022196J763799J819653J863206K129249J887131
$$ plain form
4612 5528622 5249542 5042837 4995835 5105739 4882047 4639928 4793729 4678573 4648882 4637549
4602 4637549 4517737 4582793 4293200 4031636 4120579 4076395 4059140 3879814 3660240 3864553
4592 3864553 3792200 3735423 3637494 3773817 3670361 3240691 3066521 3382563 3555261 3383060
4582 3383060 3514981 3497748 3581792 3530519 3449727 3647656 3202995 3109610 3337319 3323734 3219944
4571 3219944 3276953 3314653 3447692 3536985 3478386 3533591 3572929 3500989 3422741 3773635 3734723
4560 3734723 3905033 3934173 3902936 4175068 4116650 4180637 4527334 4679008 4720776 4770723 4823124
4549 4823124 5202302 5499313 5878728 5978398 5931163 6285336 6348391 6955402 7911379 8835248
4539 8835248 9165601 9943725 10985608 12007804 13771603 15591256 17454462 19583711 21470842
4530B1470842J764292R78932J023570O02230L16171J02202O2465j53618k65515
4521B5901571o12153j028914j266853j740664j793838j762871j602878j289935
4513A4803465r72240p15314m59601k32918k89276K21247L89160Q41740Q14795
4504A4401058J009297J203014R54293J314132O28040P27335L09288J46565Q9344
4495B0782366n13941n10312l2986m29110r89182j073316j427928j837606j506743
4486A2461242j366186j180970j033804j038783o69810m20969o04472n47162k48672
4477E350414n91822m70568j75293n8053j91104n88469n0832j87430J19774J84308
4467C340925l92188p8453k06179j19372K09085K9246l60644j95904K8289K92800
$$ plain form
4530 21470842 23235134 24214066 25237636 25839866 26156037 26258239 26320704 26167086 25901571
4521 25901571 25289418 24260504 22993651 21252987 19459149 17696278 16093400 14803465
4513 14803465 13831225 13115911 12656310 12423392 12134116 12355363 12744523 13586263 14401058
4504 14401058 15410355 16613369 17567662 18881794 19509834 20237169 20546457 20693022 20782366
4495 20782366 20268425 19758113 19725127 19296017 18306835 17233519 15805591 13967985 12461242
4486 12461242 11095056 9914086 8880282 7841499 7171689 6750720 6146248 5599086 5350414
4477 5350414 4758592 4288024 4112731 4054678 3863574 3275105 3224273 3036843 3156617 3340925
4467 3340925 2948737 2870284 2664105 2544733 2753818 2783064 2422420 2226516 2254805 2547605
4457B547605j34774r6264J3203j46181k398O5395n8273R363j36562q3645n2735
4446A924734k67923J78731n8309j43463J84470K50792N7583n5863K31316k18699
4436B083369j43701k82609r5234J72101K01129o5168P2020K5189j40958J18380
4426A944518j30038J39409k61744j52767K22507K22413J41857n5532j73255j37121
4416A760247J14102L35170l24397J7395J14097k10499j33010K63954J05498j23703
4406A918854j21722n421p018O3921O9514L16542J21875j32304K42K60913r3287
4395B392109m532L54955M5234M9600L95863K25475K26255J2755k06689k75512
4385C215513j52671j39789K68299J69311k30190J15188R8177R8994L91462l1932
$$ plain form
4457 2547605 2412831 2316567 2329770 2183589 2181191 2246586 2188313 2197676 2061114 1977469 1924734
4446 1924734 1656811 1835542 1777233 1633770 1818240 2069032 2126615 2070752 2302068 2083369
4436 2083369 1939668 1657059 1561825 1733926 1935055 1869887 1941907 1967096 1826138 1944518
4426 1944518 1814480 1953889 1692145 1539378 1761885 1984298 2126155 2070623 1897368 1760247
4416 1760247 1874349 2209519 1885122 1902517 2016614 1806115 1673105 1937059 2042557 1918854
4406 1918854 1797132 1791711 1784693 1848614 1918128 2234670 2356545 2224241 2224483 2485396 2392109
4395 2392109 2387577 2742532 2787766 2837366 3233229 3458704 3684959 3697714 3491025 3215513
4385 3215513 3062842 2923053 3191352 3360663 3130473 3245661 3343838 3442832 3834294 3802362
4375C802362J49917J76149K45821M12594L31049J86201N77582R20155N92769P04364
4365H098963O96331J047316J166007R06107J038614Q91333O17831O33906K23269
4356A5319677N3268m20211j95157n18386o25641r69869q12041r45053r59517r64374
4346H962696j087097q72106n94071p94661m23254k60482n29391l63692l69799
4337C668143m8836k47976Q528p4078r5601n7386M7970Q1822j65280Q711M8708
4326C174725l59732r3963M06851J24742k19706k70875N1285Q7293J80230r1793
4316B989057J21851J45152L34492l672J63500K92612K68553L90345M22180J03788
4306E227858n61927n33481m97730q3102l06571j07394J27516j47319q8441l33860
$$ plain form
4375 3802362 3952279 4128428 4374249 4786843 5117892 5304093 5881675 6801830 7394599 8098963
4365 8098963 8795294 9842610 11008617 11914724 12953338 13844671 14462502 15096408 15319677
4356 15319677 15372945 14952734 14757577 14239191 13613550 12643681 11831640 10886587 9927070 8962696
4346 8962696 7875599 7003493 6409422 5614761 5191507 4931025 4401634 4037942 3668143
4337 3668143 3619307 3371331 3379859 3305781 3210180 3152794 3200764 3282586 3117306 3126017 3174725
4326 3174725 2814993 2721030 3127881 3252623 3032917 2762042 2813327 2900620 3080850 2989057
4316 2989057 3110908 3256060 3590552 3586880 3750380 4042992 4311545 4701890 5124070 5227858
4306 5227858 4665931 4132450 3634720 3551618 3245047 3137653 3265169 3117850 3029409 2695549
4296B695549l7921J8210Q533K5920n6240k26486Q8322R2594J37723j54910o6912
4285B524382J7192j07869R7556L0892k7295Q415l2173j11027J14627K11859O900
4274B733459K13706j23212j96782r8063j33756L39276J2833K8115O7643Q0643
4264B923862k82867P3737r0692o2230M1893L61852o7770J23346J32690j46601
4254C007220K29045j11370P3672L62449O8084j65639p3550j0039K64719K1524
4244C666115N3490K73701l5044J60527J32921L78579L73377L88814L91407K24370
4234F008257L30655L30376M52713R34118R85714R19598J271365J138171R45593
4225A3316560O49373N17291O31297J31330K90680j2772m80185l6710o04717m86545
$$ plain form
4296 2695549 2657628 2675838 2684371 2710291 2654051 2427565 2515887 2608481 2746204 2591294 2524382
4285 2524382 2541574 2433705 2531261 2562153 2534858 2543273 2511100 2400073 2514700 2726559 2733459
4274 2733459 2947165 2823953 2627171 2529108 2395352 2734628 2747461 2775576 2843219 2923862
4264 2923862 2640995 2714732 2624040 2561810 2603703 2965555 2897785 3021131 3153821 3007220
4254 3007220 3236265 3124895 3198567 3561016 3629100 3463461 3389911 3379872 3644591 3666115
4244 3666115 3719605 3993306 3958262 4118789 4251710 4630289 5003666 5392480 5783887 6008257
4234 6008257 6338912 6669288 7122001 8056119 9041833 9961431 11232796 12370967 13316560
4225 13316560 13965933 14483224 15114521 15245851 15536531 15523759 15043574 15006864 14402147 13915602
4215A3915602j095385j295069j040926j170533q47404p80708n85597m60889o46808
4206E992283j84890k58679m89416j02608q2804J88890l08460K430K22136o7106
4196D911776j46970n3390J61205M06489j13372j39215j74861k23661q1532J17032
4186D663501K31603p0419k08617r3443J48999J27572J94844J44303L04394R763
4176E452500j01903R6195J19354M33095M99717N9786K10441K20093L36377m064
4166G321591O2532L13806L66846J36204K58813M44508K05521M02403M03948J34328
4156A0050500j30556J78352K23458K24777L51786J23226J02117P1095J80181L11043
4146A1685979O9483m3383K00048j71331k91178K17961q818L87241M59669P1379
$$ plain form
4215 13915602 12820217 11525148 10484222 9313689 8466285 7685577 7099980 6639091 5992283
4206 5992283 5807393 5548714 5059298 4956690 4873886 5062776 4754316 4756746 4978882 4911776
4196 4911776 4764806 4711416 4872621 5279110 5165738 5026523 4851662 4628001 4546469 4663501
4186 4663501 4895104 4824685 4616068 4522625 4671624 4799196 4994040 5138343 5442737 5452500
4176 5452500 5350597 5446792 5566146 5999241 6498958 6558744 6769185 6989278 7325655 7321591
4166 7321591 7384123 7697929 8064775 8200979 8459792 8904300 9109821 9512224 9916172 10050500
4156 10050500 9919944 10098296 10321754 10546531 10898317 11021543 11123660 11194755 11374936 11685979
4146 11685979 11755462 11712079 11912127 11740796 11449618 11667579 11658761 12046002 12505671 12577050
4136A2577050j41306k96093r927o1317J66339k12850r2674R1165n1848J64689
4126A2133228N1257J69098K42637Q156J49331K18300j83494K68925J01021N25091
4116A3683550M54568J58871L21223L97619L00811M10492L96141K88285P46203
4107A7157763N90710K99701N20129O79019M46861L21050L64046L70680K61438
4098B1011397K52328N44801P10850N86497J48973K79370O33363P64274N17052
4089B5448905M71353N41625K94587M28558L43926N60163N41280L66913L59022
4080B9356332p497R7756N40054L88478L87883K85904L31481K35742N89015K88062
4070C2493210M51281P71252P34816O21778R64688N86919Q05665R58199Q48456
$$ plain form
4136 12577050 12435744 12139651 12129724 12068407 12234746 12021896 11929222 12020387 11968539 12133228
4126 12133228 12184485 12353583 12596220 12604376 12753707 12972007 12788513 13057438 13158459 13683550
4116 13683550 14138118 14296989 14618212 15015831 15316642 15727134 16123275 16411560 17157763
4107 17157763 17748473 18048174 18568303 19247322 19694183 20015233 20379279 20749959 21011397
4098 21011397 21263725 21808526 22519376 23105873 23254846 23534216 24167579 24931853 25448905
4089 25448905 25920258 26461883 26756470 27185028 27528954 28089117 28630397 28997310 29356332
4080 29356332 29348835 29446591 29986645 30375123 30763006 31048910 31380391 31616133 32205148 32493210
4070 32493210 32944491 33715743 34450559 35072337 36037025 36623944 37429609 38387808 39236264
4061C9236264N23931L10140L75870J84115L64119M30567N35870M04796K09684
4052D2575356M41711L96507L96751M31329M46170Q18172P01994Q65822K24884
4043D7298696O21462N04840O11989O88932R80660R76421J105046J496355J078041
4034E5362442J217091J495423J154320J089222J308902R24127O16840O28318P87379
4025F4584064M36779K07097K56841M57979J87174k40660J91843L60812K13877
4016F6655806K80610K21441J03309J19089M31220K30544L62555K51978J42311
4007F8798863L96362K84016J1930P1630K979n5114J9127k04202n63660J25133
3997F8887064j26348l78779j65328n24661o97187m98219m91575j000156j112176
$$ plain form
4061 39236264 39760195 40070335 40446205 40630320 40994439 41425006 41960876 42365672 42575356
4052 42575356 43017067 43413574 43810325 44241654 44687824 45505996 46207990 47073812 47298696
4043 47298696 47920158 48424998 49036987 49725919 50706579 51683000 52788046 54284401 55362442
4034 55362442 56579533 58074956 59229276 60318498 61627400 62551527 63168367 63796685 64584064
4025 64584064 65020843 65227940 65484781 65942760 66129934 65889274 66081117 66441929 66655806
4016 66655806 66936416 67157857 67261166 67380255 67811475 68042019 68404574 68656552 68798863
4007 68798863 69195225 69479241 69491171 69562801 69565780 69510666 69529793 69325591 68761931 68887064
3997 68887064 68760716 68381937 68216609 67691948 66994761 66496542 66004967 65004811 63892635
3988F3892635j333043j059471r75913j200953j221455j053281p00947q13884o24023
3979E4909665l50074n01883m10347l95820o54713r30800k24879o46945o73340
3970E0120864q58564n73704n09235q00261n34679m42659l47908p43258p19348
3961D4591248p75918n90419r53594q90601q31425o21496k61060o37025o76193
3952C8353517o43871p68486n71083n14053m79644j82473p58538p42563q67822
3943C2824984l02750m73913l75839k28194m56456n47648m76060n09331o48742
3934B8806051o38030o96168n84139n01994l10450n32865l15610j56722m40542
3925B4629531m87559p0932k50852k94765m84990J52568K2969k44449j07030j3064
$$ plain form
3988 63892635 62559592 61500121 60524208 59323255 58101800 57048519 56347572 55533688 54909665
3979 54909665 54559591 54057708 53647361 53251541 52596828 51666028 51441149 50794204 50120864
3970 50120864 49262300 48688596 48179361 47379100 46844421 46401762 46053854 45310596 44591248
3961 44591248 43815330 43224911 42271317 41380716 40549291 39927795 39666735 39029710 38353517
3952 38353517 37709646 36941160 36370077 35856024 35376380 35193907 34435369 33692806 32824984
3943 32824984 32522234 32048321 31672482 31444288 30987832 30440184 29964124 29454793 28806051
3934 28806051 28168021 27471853 26887714 26385720 26075270 25542405 25226795 25070073 24629531
3925 24629531 24141972 24071040 23820188 23525423 23040433 23193001 23215970 22971521 22864491 22851427
3915B2851427k91240k62843p558k17243k28986J25139K43452k24608J64210j84404
3905B1967346J8345L24709p4032R1401K0273K68645K1129Q6080K75979K31240
3895B3231115n5011o5947L10419L15772J32835j62966m13688L1480J84745q3880
3885B3424874K06902K59756L7581o5523K84545L92896J40222J7179M53816Q60177
3875B6012425L40083Q88571R04806R03403J294816P97998J254163J709758J152968
3866C5258991J237452J783773J507787J258012J311483J357476R72070P39628
3858D5426672M88029N55970P53607P10085N81928O52918J024047J096780Q02280
3849E2092316R70034J021305J086888J191466Q61832N43825M70236L02564K5562
$$ plain form
3915 22851427 22560187 22297344 22289786 22072543 21843557 21968696 22212148 21987540 22151750 21967346
3905 21967346 21985691 22310400 22236368 22327769 22348042 22616687 22637816 22723896 22999875 23231115
3895 23231115 23176104 23110157 23420576 23736348 23869183 23706217 23292529 23324009 23508754 23424874
3885 23424874 23631776 23891532 23929113 23863590 24148135 24541031 24681253 24698432 25152248 26012425
3875 26012425 26352508 27241079 28145885 29049288 30344104 31142102 32396265 34106023 35258991
3866 35258991 36496443 38280216 39788003 41046015 42357498 43714974 44687044 45426672
3858 45426672 45914701 46470671 47224278 47934363 48516291 49169209 50193256 51290036 52092316
3849 52092316 53062350 54083655 55170543 56362009 57223841 57767666 58237902 58540466 58566028
3840E8566028k41041m54897o63030m86516k49672k97880m88312l95595n90991
3831E4698094r00629j408003j136141j497925j480312j206845j010518r22672
3823D5135049m67421l69114m56802j40585j35468R8842k74121k96476k75184l69593
3813D2449127j030576r80884j650326j378597j130123j527054j542481j491894
3805C1717192j427830j126497j305022j072575o83632n00045o99824p28295p60657
3796B3412815l21173j20477m35553k25437m83447m28228j49868l96507l52169
3787B0499956k84545l92249m98420j95898k43221j52831m50072m34184k84440
3778A7564096j91462P6266k77962n43012m14641j13433l25823j82097n3829j96639
$$ plain form
3840 58566028 58324987 57870090 57207060 56720544 56470872 56172992 55684680 55289085 54698094
3831 54698094 53797465 52389462 51253321 49755396 48275084 47068239 46057721 45135049
3823 45135049 44667628 44298514 43841712 43701127 43565659 43664501 43390380 43093904 42818720 42449127
3813 42449127 41418551 40437667 38787341 37408744 36278621 34751567 33209086 31717192
3805 31717192 30289362 29162865 27857843 26785268 26101636 25601591 24901767 24173472 23412815
3796 23412815 23091642 22971165 22535612 22310175 21826728 21398500 21248632 20852125 20499956
3787 20499956 20215411 19823162 19324742 19128844 18885623 18732792 18282720 17848536 17564096
3778 17564096 17372634 17448900 17170938 16627926 16213285 16099852 15774029 15591932 15538103 15341464
3768A5341464k12125M27035M56773K16769K39440L29603N9289K58493M04661L62772
3758A7884174J03648J04359N89312j25637k8090K46776J41019L92856K45684J87290
3748A9741391J33205K80445J72959K08424L9957J19913K99699M06179O0502N5036
3738B1517710J89699O43647K42077K16180J92665P4275M91072K08316j62200k17554
3728B3395887k2938L5436n3118K7240l92222o25236l44397m51486l40080k96160
3718B0932926p13571q50690j20917l86815m33453n74937k03807m2396k61121l55684
3708A6989535P861j07952J04736R7261K77792M53791L19241L71423O23506P52221
3698A9889415O23318Q80563O30183J109033P79366O59781P57460Q34713R50603
$$ plain form
3768 15341464 15129339 15556374 16013147 16229916 16469356 16798959 16858248 17116741 17521402 17884174
3758 17884174 17987822 18092181 18681493 18555856 18527766 18774542 18915561 19308417 19554101 19741391
3748 19741391 19874596 20155041 20328000 20536424 20576381 20696294 20995993 21402172 21462674 21517710
3738 21517710 21707409 22351056 22593133 22809313 23001978 23076253 23567325 23775641 23613441 23395887
3728 23395887 23372949 23408385 23355267 23382507 22990285 22365049 22020652 21569166 21229086 20932926
3718 20932926 20219355 19368665 19247748 18860933 18427480 17852543 17648736 17606340 17345219 16989535
3708 16989535 16997396 16889444 16994180 17091441 17369233 17823024 18142265 18513688 19137194 19889415
3698 19889415 20512733 21393296 22023479 23132512 23911878 24571659 25329119 26163832 27114435
3689B7114435J053638M30733M54567O99952P92329N95744N55376K66161L39206
3680C2302141K27750K23622l84865o71813k27054o07089r26285o40771l39590
3671B8956046q03060l59263n34281n75017m26431m76599p19809l40453j5101k74292
3661B4431740o37145q06859m95188o59898l07852k97615l36745o56755k21400
3652B0012283j8028J12397k693K79204M11077N18952M19893K97635L73713j027
3642B2403406J21907n8371K8136J6182m41472J98813L70886L68244R46227N68772
3632B4522730N96153N74779O15207J86374M09744K47658k05058k68828m04813
3623B6273946m42599l61197k69478M4773k83872J31930L54922O33136L37041K05595
$$ plain form
3689 27114435 28168073 28598806 29053373 29753325 30545654 31141398 31696774 31962935 32302141
3680 32302141 32529891 32753513 32368648 31696835 31469781 30862692 29936407 29295636 28956046
3671 28956046 28152986 27793723 27259442 26684425 26257994 25781395 25061586 24721133 24706032 24431740
3661 24431740 23794595 22987736 22492548 21832650 21524798 21227183 20890438 20233683 20012283
3652 20012283 19994255 20106652 20103959 20383163 20794240 21313192 21733085 22030720 22404433 22403406
3642 22403406 22525313 22466942 22495078 22511260 22069788 22268601 22639487 23007731 23953958 24522730
3632 24522730 25118883 25693662 26308869 26495243 26904987 27152645 26947587 26678759 26273946
3623 26273946 25831347 25470150 25200672 25245445 24961573 25093503 25448425 26081561 26418602 26624197
3613B6624197M20625M64682J67802M3154j69811n35193n44148l51210o92520n53618
3603B4873960l36249r3724p7337P1733M08450J05811M72396L37334J80272L32445
3593B6275091k1403n012o9243k59494n89079l30582r0200l18624k86418j59481
3583B4145555j76794r0273j35124j79552o50270l96667p15624p17041m83674p36441
3573A9864095m27649p37113n44400n59049l10999m79911n79790l98896m15840
3564A5410448m50767n92156m62214l90648m56079j87230k04722o5510l58531p20481
3554A1522110k56757k78540L732N7332k34998J89838j85210j02478K6515J2686
3544A0754230r7977j01245L47415J16749l34403J01592J55132M5068Q6697n6429
$$ plain form
3613 26624197 27044822 27509504 27677306 27720460 27550649 27015456 26471308 26120098 25427578 24873960
3603 24873960 24537711 24443987 24366650 24438383 24846833 24952644 25425040 25762374 25942646 26275091
3593 26275091 26253688 26248676 26179433 25919939 25330860 25000278 24910078 24591454 24305036 24145555
3583 24145555 23968761 23878488 23743364 23563812 22913542 22516875 21801251 21084210 20600536 19864095
3573 19864095 19436446 18699333 18154933 17595884 17284885 16804974 16225184 15826288 15410448
3564 15410448 14959681 14367525 13905311 13514663 13058584 12871354 12666632 12601122 12242591 11522110
3554 11522110 11265353 10986813 10990545 11047877 10812879 11002717 10817507 10715029 10741544 10754230
3544 10754230 10656253 10555008 10902423 11019172 10684769 10786361 10941493 10986561 11073258 11016829
3534A1016829M54275K32603Q1962k2191l15125J43436K97792k0954l14632Q7966
3524A1641961K6550O2514k14054K43649O7598l90222K3851J53347l4173k4857
3514A1556164J55078J37715r2652j76051q2851K53013j28403j76222K36440K57259
3504A1939490m3688K39315L27989J64120J40463K94046L12580K95611J73534J90225
3494A4033685l783M29525J77600L07787P31683P18696O96648O11291N81633Q12122
3484A9096887R58852J013452J519042J310320J410928J593590K401475K769275
3476C2073821L222644M075383M572266N634472P200393Q122191Q890062Q593861
3468H2385093O542103L039321r40593m275973p213946q378035q161135p678283
$$ plain form
3534 11016829 11471104 11703707 11785669 11763478 11448353 11591789 11889581 11868627 11553995 11641961
3524 11641961 11668511 11731025 11516971 11760620 11828218 11437996 11461847 11615194 11581021 11556164
3514 11556164 11711242 11848957 11756305 11580254 11497403 11750416 11622013 11445791 11682231 11939490
3504 11939490 11895802 12135117 12463106 12627226 12767689 13061735 13374315 13669926 13843460 14033685
3494 14033685 14029902 14459427 14637027 14944814 15676497 16395193 17091841 17703132 18284765 19096887
3484 19096887 20055739 21069191 22588233 23898553 25309481 26903071 29304546 32073821
3476 32073821 35296465 39371848 43944114 49578586 56778979 64901170 73791232 82385093
3468 82385093 88927196 91966517 91025924 86749951 79536005 71157970 62996835 55318552
3460E5318552o305475n296544m166552l289525k104875j626988j424858j127799
3452B9975936r25466o82474l44166k3828K91601L86944L42474P42710Q40936J059383
3442C1664050J431993J164721J790189K383727K702200L020001L917327M348535
3434E2422743M346863L888865L487908J829168L03870j180854k583846l155744
3426E9358973l624291l205317k542500k492607j864383j301984j235333r03725
3418D2188833o35688o41437o27037j52131M87n85372o23779k56771o02157n06801
3408C7558147o0325r2556k53368K5267O47609J292101J370638J647494K370281
3399D4505288K754677L246106L995764M025525M778618M812571N012747M598514
$$ plain form
3460 55318552 49013077 43716533 39549981 36260456 34155581 32528593 31103735 29975936
3452 29975936 29050470 28367996 28023830 28000002 28291603 28678547 29021021 29763731 30604667 31664050
3442 31664050 33096043 34260764 36050953 38434680 41136880 44156881 48074208 52422743
3434 52422743 56769606 60658471 64146379 65975547 66279417 65098563 62514717 59358973
3426 59358973 55734682 52529365 49986865 47494258 45629875 44327891 43092558 42188833
3418 42188833 41553145 40911708 40284671 40132540 40133027 39547655 38923876 38667105 38064948 37558147
3408 37558147 37497822 37405266 37151898 37177165 37824774 39116875 40487513 42135007 44505288
3399 44505288 47259965 50506071 54501835 58527360 63305978 68118549 73131296 77729810
3391G7729810L799931K925770J729769l87247j936839k895843l255434l520309
3383G4189608l296152k713533j969678j191155k04234R31085J894698K797687
3375G0438326L823287M919344N919969P493909R766737J2281605J4761862J6901977
3367A46307016J6534757J3309528P398712k2523o428168j0432926j2604204j3618082
3359A40444110j3574309j2556522j1373556r499857p844407o312074n101414l471397
3351G0710574k090901j157526k07337P43444J333639J776772K407140K755678
3343G6271483L553845L676353K675884J033058o17231k220002l479347m225462
3335G6668581m197789m071463l422576k911025k578912j557133j090563r03525
$$ plain form
3391 77729810 81529741 84455511 86185280 85798033 83861194 80965351 77709917 74189608
3383 74189608 70893456 68179923 66210245 65019090 64814856 65745941 67640639 70438326
3375 70438326 74261613 79180957 85100926 92594835 102361572 114643177 129405039 146307016
3367 146307016 162841773 176151301 183550013 183527490 177099322 166666396 154062192 140444110
3359 140444110 126869801 114313279 102939723 93439866 85595459 79283385 74181971 70710574
3351 70710574 68619673 67462147 67254810 67998254 69331893 71108665 73515805 76271483
3343 76271483 79825328 83501681 86177565 87210623 86593392 84373390 80894043 76668581
3335 76668581 72470792 68399329 64976753 62065728 59486816 57929683 56839120 55935595
3327E5935595q30283l60924n33522k35499j99283m20302j05338J88471J9352K40575
3317E3698842P86535Q79452J105414J490163J668248K395093K621047K800531
3309F7445325L526057L675435L297692L111330K489205R98531n18246j774772
3301H2250557l160768m169962m606458m267900m016350l912374l454190l052787
3293E1609768k121548j666882j445140q64793n35854m70268P460J70244k3853
3284D4659134J35636K99011j48571K65477J09037m46k9300l51227j72927j34122
3274D4631702o60611n86942p62970j079189j082547r38910j283481p64914m73045
3265C6999093o33574m50944m94155k56685k50874K55177j03923l5537O27155O44864
$$ plain form
3327 55935595 55105312 54744388 54210866 53975367 53776084 53355782 53250444 53438915 53458267 53698842
3317 53698842 54485377 55364829 56470243 57960406 59628654 62023747 64644794 67445325
3309 67445325 70971382 74646817 77944509 81055839 83545044 84543575 84025329 82250557
3301 82250557 79089789 74919827 70313369 66045469 62029119 58116745 54662555 51609768
3293 51609768 49488220 47821338 46376198 45511405 44975551 44505283 44512743 44682987 44659134
3284 44659134 44794770 45093781 44945210 45210687 45319724 45319278 45289978 44938751 44765824 44631702
3274 44631702 43971091 43384149 42621179 41541990 40459443 39520533 38237052 37472138 36999093
3265 36999093 36365519 35914575 35420420 35163735 34912861 35168038 35064115 35028578 35655733 36300597
3255C6300597N84673Q69295J190277J380873K030737K355450K699537L885365
3247E1296804M180322M801543N261244N575421N260103L503323J687560k32941
3239H1333379j762843l316111m056201l897219l312749k506891k284134j313964
3231E8883267j58319K60525J227926J600275K559132L237539M291229N177580
3223G7079154O365544Q460132J0107078J1847522J3840411J4755782J4328211
3216A56783834J2259353P394962J019870n098367j0574350j3373506j4709259
3209A33702537j4766469j3006928j1583231r844469q415906p044404n389235m595860
3201E9056035l838442l030193k173432j344709j096722l81018L96456J056512
$$ plain form
3255 36300597 36885270 37754565 38944842 40325715 42356452 44711902 47411439 51296804
3247 51296804 55477126 60278669 65539913 71115334 76375437 79878760 81566320 81333379
3239 81333379 79570536 76254425 72198224 68301005 64988256 62481365 60197231 58883267
3231 58883267 58724948 58985473 60213399 61813674 64372806 67610345 71901574 77079154
3223 77079154 83444698 91904830 102011908 113859430 127699841 142455623 156783834
3216 156783834 169043187 176438149 177458019 172359652 161785302 148411796 133702537
3209 133702537 118936068 105929140 94345909 84501440 76085534 69041130 63651895 59056035
3201 59056035 55217593 52187400 50013968 48669259 47572537 47191519 47587975 48644487
3193D8644487J271146K124031K639580L459363M646600M815848M961149M639950
3185G7202154L486374K435472J108009o2244m5422J030840K102950M103035O317703
3176I7678871Q172221Q613295O965820L735801j580082o815909j0286930j2269354
3168I4213733j2083892j1120565r554998q195715o997237n583407m880824m047159
3160C1749936l205224k261736k405884k320510j495961j085244j317124j317762
3152A6340491r77524r07154n58970o49747m73542m01293o80693n60212n99437
3143A0531919k79264k97963m18671m11127n46811n15632O185j2951m80973P451
3133G582163p1884k21292k58083k85341j35743k3232k64144k89756k44520k30027
$$ plain form
3193 48644487 49915633 52039664 54679244 58138607 62785207 67601055 72562204 77202154
3185 77202154 80688528 83124000 84232009 84169765 84124343 85155183 87258133 91361168 97678871
3176 97678871 105851092 114464387 121430207 125166008 123585926 116770017 106483087 94213733
3168 94213733 82129841 71009276 61454278 53258563 46261326 40677919 35797095 31749936
3160 31749936 28544712 26282976 23877092 21556582 20060621 18975377 17658253 16340491
3152 16340491 15362967 14455813 13896843 13247096 12773554 12372261 11691568 11131356 10531919
3143 10531919 10252655 9954692 9536021 9124894 8578083 8062451 8068636 8055685 7574712 7582163
3133 7582163 7510279 7288987 7030904 6745563 6609820 6586588 6322444 6032688 5788168 5558141
3123E558141o830M8348m10196j29826k34390M9021k02698J02376j95815l95715
3113D182416k9444O4520j56203k24917P9580L1620j55728j45457j08145P4104
3103C612346P5518k99472K18524j22337J649l31397j80737l12807j00671J39705
3093B700321l28268j61523L14235K15982J33987j40853q0474R9161J27319j10443
3083B769444m03102R0320K61831j08079q0094j97264k93259L6853j01724p2822
3073A902104r8220k19530J84894O0445j50669j013n5841J02241J3062j65953k54897
3062A316623k00130R6354J20945J92487J28404j27205q5940j21039M8950n5154
3052A314295j11552j48189r3238M694K12026O5035l50457j9692K00216j04593
$$ plain form
3123 5558141 5551311 5599659 5189463 5059637 4825247 4874268 4671570 4773946 4578131 4182416
3113 4182416 4152972 4217492 4061289 3836372 3915952 3947572 3791844 3646387 3538242 3612346
3103 3612346 3687864 3388392 3606916 3484579 3486228 3154831 2974094 2661287 2560616 2700321
3093 2700321 2372053 2210530 2524765 2740747 2874734 2733881 2653407 2752568 2879887 2769444
3083 2769444 2366342 2456662 2718493 2610414 2530320 2333056 2039797 2076650 1974926 1902104
3073 1902104 1803884 1584354 1769248 1829693 1679024 1678011 1622170 1724411 1737473 1571520 1316623
3062 1316623 1116493 1212847 1333792 1526279 1654683 1527478 1441538 1320499 1369449 1314295
3052 1314295 1202743 1054554 961316 966010 1178036 1243071 892614 872922 1073138 968545
3042I68545O193K6391k91556j04135J57402J62525j51158Q707r0287M9482j14303
3031F27806l899J67382n272j3477J81715j43372P3402j32023j26518K67386K11712
3020A104842l08501j72464J67729l1010j51766m9756n1986K33423k15420l4122
3010D90969p4376L5869j41291P9147K81190k37261k42589N465J34671p7047j8787
2999B35960m5160o8367L5968L0767o9671j49738k65979J19139j53668K41242K37640
2988A48133j30594N4925K5721J39172q208q6707j7595o6125K57438k37912M680
2977H2928l8440j046j30640m6958K38319J07619r8996m5380J57007J50279l8066
2966C36626j03121o8756j75847j00306K20570K08834L5026j13939j13372J58857
$$ plain form
3042 968545 974738 1001129 709573 605438 762840 925365 774207 782914 692627 742109 627806
3031 627806 623907 791289 786017 772540 954255 810883 884285 752262 625744 893130 1104842
3020 1104842 796341 623877 791606 760596 608830 559074 507088 740511 525091 490969
3010 490969 416593 452462 311171 390318 671508 434247 191658 197123 331794 254747 235960
2999 235960 190800 122433 158401 189168 119497 -30241 -296220 -177081 -330749 -89507 148133
2988 148133 17539 72464 98185 237357 229149 142442 124847 58722 316160 78248 82928
2977 82928 44488 43442 -87198 -134156 104163 211782 112786 67406 224413 374692 336626
2966 336626 233505 164749 -11098 -111404 109166 318000 353026 239087 125715 284572
2956B84572O9845k60940Q9803m5224k4242j94664R4467J86968j0827k22556J85309
2945A52511M8323k18105J0660p8086J28341j7947J5751k23234J40152R4301L4651
2934H7318K54240k5520L38571m0709q9114l90655M78301O4745j44982l0341p0625
2923D31229N879o4299k5819l27418l5487l5453p5255J06365K25160j96258j7524
2912h880J4874k8957j95777k9201K85654K83716k93424o1804P9487P8582m6063
2901G8207J13592R378J00430p5604k88012l00839M14037J61347p9489q9467J65156
2890B08736r087j09176J69010K3290J87999j27810J88975j16907n6433l74739
2880a6142l06381P1860J96009k5730o4877J25366j39939J509J15604l51390K62377
$$ plain form
2956 284572 354417 93477 183280 138056 113814 -80850 13617 200585 189758 -32798 152511
2945 152511 200834 -17271 -6611 -84697 43644 25697 41448 -181786 -41634 52667 87318
2934 87318 341558 316038 654609 613900 524786 134131 612432 677177 532195 501854 431229
2923 431229 437108 372809 346990 19572 -15915 -51368 -126623 -20258 204902 8644 -8880
2912 -8880 5994 -22963 -218740 -247941 37713 321429 28005 -33799 45688 124270 78207
2901 78207 191799 201177 301607 226003 -62009 -362848 51189 212536 133047 43580 208736
2890 208736 199649 90473 259483 282773 470772 342962 531937 415030 358597 -16142
2880 -16142 -322523 -250663 -54654 -80384 -145261 -19895 -159834 -158325 -42721 -394111 -131734
2869a31734j41985l45085J69952k703K06121n1793q351N3013j74637K6244L12907
2858h8051n4353p8868K8226q1202R6869R4550k29490K6419L33595k36032j79937
2847c68274M6069j39250J06373j03669J70529o8420j79485K7K90549J03447j64417
2836c06521p0929J98795q7996L27148p464k87001j9005J37598k4879k79976L1416
2825c88814j27655K91100j04658o2525J16209k31064J60264K71496K37084n2561
2815A08876K3351p4111J69584k54605k54317L11328P3177p7138m7926j39454l32676
2804d93911O963J17227K9807P3661j13467J449r9756J0571J89544j54064K73863
2793a58113Q7543k73025j47654j20747L3549J75219k54153M5522K4079k43423
$$ plain form
2869 -131734 -273719 -618804 -448852 -451555 -245434 -297227 -305578 -252565 -427202 -400958 -88051
2858 -88051 -142404 -221272 -193046 -274248 -177379 -82829 -312319 -285900 47695 -188337 -368274
2847 -368274 -322205 -461455 -355082 -458751 -288222 -356642 -536127 -536100 -245551 -142104 -306521
2836 -306521 -377450 -178655 -266651 60497 53033 -233968 -252973 -115375 -140254 -420230 -388814
2825 -388814 -516469 -225369 -330027 -392552 -276343 -507407 -347143 -75647 161437 108876
2815 108876 132227 58116 227700 -26905 -281222 30106 103283 26145 -21781 -161235 -493911
2804 -493911 -486948 -369721 -339914 -266253 -379720 -378271 -478027 -467456 -277912 -431976 -158113
2793 -158113 -70570 -343595 -491249 -611996 -578447 -403228 -657381 -611859 -587780 -831203
2783h31203N8405P6626L18298K38280K52029j27501j78512r5887O0734R4698j73527
2772c07560J59113j45061q7895J19002L4780R4883J75487m8493j57261j61399
2762c24404N3829r2315P7296J96380J37244m2095j14016N3851J96198k03315N2804
2751h543j73586K5734J38720l20137J17985J05903L1039K71074n343q3853J69350
2740B68343k19696m4474j16760M9728l63643K40540K41775k43106J17982j16931
2730a86242j37290K61188J97879k68061q3247O6641j01957j8340J89981J47829
2720F8381Q7472j95460r2856l48339K68127J56823O8483l8185j80893j53321j40639
2709e00407K56944J30409j3244o5479J52950j13104m3437J11314K75012j59372
$$ plain form
2783 -831203 -772798 -696172 -377874 -139594 112435 -15066 -193578 -289465 -228731 -134033 -307560
2772 -307560 -148447 -293508 -381403 -262401 -227621 -132738 42749 -5744 -163005 -324404
2762 -324404 -270575 -362890 -285594 -89214 48030 5935 -108081 -54230 141968 -61347 -8543
2751 -8543 -182129 -156395 -17675 -337812 -219827 -113924 -82885 188189 182846 98993 268343
2740 268343 48647 4173 -112587 -62859 -426502 -185962 55813 -187293 -69311 -186242
2730 -186242 -323532 -62344 135535 -132526 -215773 -149132 -251089 -269429 -79448 68381
2720 68381 155853 -39607 -132463 -480802 -212675 -55852 12631 -25554 -206447 -359768 -500407
2709 -500407 -243463 -113054 -126298 -191777 -38827 -151931 -195368 -84054 190958 31586
2699C1586l0904J74936o6957J85579p9827m29041j94322M61335K29260l5166j66204
2688H0275q9248N53J68931k08143j47399Q1422K04952m1011J35272M8526k34176
2677d6j33238J55906m7061n9693J5431p2546O9512q4994n9088K98102J10534k23520
2665c0701R004j45820r4420J49694n7265r7173Q7965J9784l6648J04396M4048
2654d7136o9170K6742j46311K6853k8914J21779R9003J19512q6963j95401j68536
2643c48542j25446j01520O5659N25322K591k3444k9444r4515k38190J18366L66768
2632A17605J4626L8999k15099k4600J70028J41437k21117k5728K4135n3859j29876
2621a63449Q6317J65430O8408k13900K07033Q22j5098M6828J43960j97426P395
$$ plain form
2699 31586 682 175618 108661 294240 214413 -214628 -408950 52385 281645 246479 80275
2688 80275 -8973 -8420 160511 -47632 -195031 -113609 91343 50332 185604 234130 -46
2677 -46 -133284 22622 -24439 -84132 -68701 -141247 -71735 -156729 -215817 82285 192819 -30701
2665 -30701 -21697 -167517 -261937 -112243 -169508 -266681 -178716 -158932 -195580 -91184 -47136
2654 -47136 -116306 -89564 -235875 -209022 -237936 -116157 -17154 102358 15395 -180006 -348542
2643 -348542 -473988 -575508 -509849 15473 18064 -5380 -34824 -129339 -367529 -249163 117605
2632 117605 132231 171230 -43869 -68469 101559 242996 21879 -3849 20286 -33573 -163449
2621 -163449 -77132 88298 156706 -57194 149839 150661 135563 182391 326351 128925 136320
2610A36320l5784J63249N2682Q5898R7186N06194J92913L78954K44211k5253K28255
2599B024825k33594k03837l71101K8672l90116k21240l8999l00516O3165K7127
2589C84386N4182p4521m0719K34640k64138J62676q8069M3004o1781J87945k1278
2578E16327l24421L78060l2264j05802k62728k78144J80047K80934J36424j04368
2568C84065o9561q1895Q0821m3153j87808r1858K54656O2234k79882K22068J56562
2557D06249m1319Q6386n4835q0003j82804k390J16611j54434J57881K05430L6501
2546D93273k01101k73027L61259J18786l08783J91602J60006R4450N4982r8466
2536E92981k02219l42082L49825P7071O2373r1006j76101J447N8552K33510l9114
$$ plain form
2610 136320 100536 263785 316467 402365 499551 1005745 1198658 1577612 1821823 1796570 2024825
2599 2024825 1791231 1587394 1216293 1244965 854849 633609 594610 294094 357259 384386
2589 384386 438568 364047 323328 557968 293830 456506 368437 411441 349660 537605 516327
2578 516327 191906 569966 537702 431900 169172 -108972 71075 352009 488433 384065
2568 384065 314504 232609 313430 270277 82469 -9389 245267 307501 27619 249687 406249
2557 406249 364930 451316 396481 316478 133674 131284 247895 93461 251342 456772 493273
2546 493273 292172 19145 380404 499190 190407 382009 542015 636465 691447 592981
2536 592981 390762 48680 398505 475576 537949 446943 270842 272289 330841 564351 525237
2525E25237P4182j28600K2850P3001j36104j80816J29602J96644K16314L5057
2515H27367l06115J47387K16489j01708P1053o4691j15853k63775j32651K59908
2505E37411J00033M2520Q4407J03389n2751q1936Q3495J67847J3455N3962k19359
2494H32473R4378J66459J51623k63412r0562j53930L1485m2647R4706K03410k10915
2483H13068K69609p3645j92129L54545O1377k34176k02085j7834L61467j1358
2473A128839J02495k9095K2488K40743m31143J7807L23288Q2409K24451k28385
2463A453897m7293K27839j18822p6728J05440n4592Q0745Q4607k13837K08034
2453A649290j88474J43777K04239K1968l02955o2553J16098P8088q4235r2559
$$ plain form
2525 525237 599419 470819 493669 566670 430566 249750 379352 575996 792310 827367
2515 827367 521252 668639 885128 783420 854473 789782 673929 410154 277503 537411
2505 537411 637444 679964 764371 867760 815009 733073 816568 984415 997870 1051832 832473
2494 832473 926851 1093310 1244933 981521 890959 737029 768514 725867 820573 1023983 813068
2483 813068 1082677 1009032 816903 1171448 1232825 998649 796564 778730 1140197 1128839
2473 1128839 1231334 1202239 1224727 1465470 1034327 1052134 1375422 1457831 1682282 1453897
2463 1453897 1406604 1634443 1515621 1438893 1544333 1489741 1570486 1655093 1441256 1649290
2453 1649290 1460816 1604593 1808832 1830800 1527845 1465292 1581390 1659478 1575243 1482684
2443A482684J61080k4538J04584k0511J56173K30020J21422J4555j29355O3849
2433B159963j2646J72677k68671J6998L35164k69063J60423j21302J2208M21002
2423B606753r6298l8199J77924J59293j35393J73728l5916R9501J97412j20409
2413B988396L88617P8502R026j39887J55138P3702K09470O9290j21338L59473
2403D070389k5975n2251J73341J11498J65576J98375J0204k14448j9537o0142
2393D357030J95988J03651K19294J82187n5458J25076J97699L13450J64978J49604
2383E953499K38089r7497K14009O2131K07369M04080J30837K73958M08419K03551
2373G998445J30742K44277L68972K6796L34055K75415L35909M60685M15717J90118
$$ plain form
2443 1482684 1643764 1619226 1723810 1703299 1859472 2089492 2210914 2225469 2096114 2159963
2433 2159963 2147317 2319994 2051323 2068321 2403485 2134422 2294845 2173543 2185751 2606753
2423 2606753 2510455 2472256 2650180 2809473 2674080 2847808 2811892 2911393 3108805 2988396
2413 2988396 3377013 3455515 3464541 3324654 3479792 3553494 3762964 3832254 3710916 4070389
2403 4070389 4044414 3992163 4165504 4277002 4442578 4640953 4651157 4436709 4417172 4357030
2393 4357030 4553018 4656669 4875963 5058150 5002692 5127768 5325467 5638917 5803895 5953499
2383 5953499 6191588 6094091 6308100 6370231 6577600 6981680 7112517 7386475 7794894 7998445
2373 7998445 8129187 8373464 8742436 8769232 9103287 9378702 9714611 10175296 10591013 10781131
2363A0781131l9589N28555L70928J32707Q26713M87855Q04325J143147K119685
2354A7155457J895569K441768L193475M273478L981118L317657J159263O51076
2346C8068861P69179K662525L680462N457418O287117Q732435J1550964J9158788
2338I6367749L4040390O6681404R9270773J07135857N7803746k1835555q1307241
2331C58157123r8442497o7989105m7986408l4935064k6200979j9558325j5021657
2324D8023088r613847n082406j440738k14213L79070q08738k470556l047961l185592
2315B2538107k904317j991257j562792j260202j020737n88625r79921r19986k97003
2306A1013267m42927r26368o00152l98643m02414l16831j18878l16489k30856
$$ plain form
2363 10781131 10741542 11270097 11641025 11773732 12600445 13088300 13892625 15035772 17155457
2354 17155457 19051026 21492794 24686269 28959747 32940865 36258522 37417785 38068861
2346 38068861 38838040 41500565 45181027 50638445 56925562 65657997 77208961 96367749
2338 96367749 130408139 197089543 296360316 403496173 461299919 439464364 358157123
2331 358157123 259714626 191725521 143739113 108804049 82603070 63044745 48023088
2324 48023088 38409241 33326835 31886097 31671884 32050954 31242216 28771660 25723699 22538107
2315 22538107 19633790 17642533 16079741 14819539 13798802 13210177 12230256 11310270 11013267
2306 11013267 10570340 9643972 9043820 8645177 8242763 7925932 7807054 7490565 7259709
2297G259709k63023k39738j25466n47712j76580r4654j34393k96121k520J14343
2287E493845k56954l90918l9942j46357k71046j4387K81434j26347m92876k19267
2277C817185j14940j64681j85108J07357j18068k42127J42864j22022m22349l22576
2267B375535j10771j38394m893j92571n3821O3865j6171k20959M4684k44861k08567
2256A293076K18826L59534r2749P0190J13813l03197j40415J19675k46898r3848
2246A298007l59444J61102j5938J43495j26783j08311J2682l5143K67289l24476
2236I12480o21P1252m76440J6481J27165j8732J04063L63436l9346j82948K4303
2225I01093j07173m1299k6978J25101n8597K71081l02433k82689j50741l3135
$$ plain form
2297 7259709 6996686 6756948 6631482 6083770 5907190 5812536 5678143 5382022 5379502 5493845
2287 5493845 5236891 4845973 4806031 4659674 4388628 4374241 4655675 4529328 4036452 3817185
2277 3817185 3702245 3537564 3352456 3459813 3341745 3099618 3242482 3120460 2698111 2375535
2267 2375535 2264764 2126370 2121477 1928906 1875085 1938950 1922779 1701820 1746504 1501643 1293076
2256 1293076 1511902 1871436 1778687 1848877 1962690 1659493 1519078 1638753 1391855 1298007
2246 1298007 938563 1099665 1083727 1227222 1100439 992128 1004810 969667 1236956 912480
2236 912480 911859 983111 506671 523152 650317 631585 735648 1099084 1059738 876790 901093
2225 901093 793920 752621 725643 850744 792147 1063228 760795 478106 327365 294230
2215B94230j557K472L1087m09360J17128J58882L07386K8179j20516n5800J37459
2204D89590l61138J9718L1805l1923J19288J57928k2547K742K10891k0985j09097
2193D86272N6150j93543l7917l35309J22245p2503k5969J20376O1008J8149j74776
2182B4183r0716J11814j23127l8402k597J09995R0405N2763l47048L4005L51452
2171A72727M244N7386j59587L2701J59077J42134K9353j89406K0396K5880l47788
2160e2883j26994q7428K2203j81333N567J10421J18286q7585J38641J22638q3519
2149a01986m1291O6294J13381m1113j85959l8848j12685o0648J45625P0819o4910
2138b51321n8824J11294J68613M474K53993j22756j5920k1684j26923j90642k73423
$$ plain form
2215 294230 292673 295145 326232 -83128 34000 192882 500268 528447 407931 352131 489590
2204 489590 128452 148170 179975 148052 267340 425268 402721 405463 616354 595369 486272
2193 486272 542422 348879 310962 -24347 97898 25395 -574 119802 180810 198959 24183
2182 24183 -66533 45281 -77846 -116248 -118845 -8850 81555 134318 -212730 -178725 172727
2171 172727 176971 234357 74770 107471 266548 408682 438035 248629 269025 294905 -52883
2160 -52883 -179877 -267305 -245102 -426435 -420868 -310447 -192161 -279746 -141105 -18467 -101986
2149 -101986 -143277 -76983 36398 -4715 -190674 -229522 -342207 -402855 -257230 -186411 -251321
2138 -251321 -310145 -198851 -30238 -25764 228229 105473 89553 67869 -59054 -249696 -523119
2127e23119K52693K72467l48229J31929j15624J31226L17199m00615k71901L52455
2117b01519j8501J12407j53532K6441J32126p3201k47822K11328l296K92706J77856
2106B54993l93461j46001k2704K75712p8986j22080K11957o8881K0449N7702r1379
2095a02679j10685Q0459O9959J72235j3030j9231k42098j56556J33882R73P5821
2084a10950o2223L1726P8087j05464j65191p7813m7021J28859L17496J06280J42964
2073B36750J91349j56139j44678P4087K79704L63952M94402J06137K93957L9807
2063A779328R3075k19064m86545n98160j82126j99014j30722r8376j22970J19028
2053d5546J17507k5787O2546m2949p1575K13286j91623m5528J2972j04550m1116
$$ plain form
2127 -523119 -270426 2041 -346188 -214259 -329883 -198657 118542 -282073 -553974 -201519
2117 -201519 -220020 -107613 -261145 -234704 -102578 -175779 -423601 -212273 -215569 77137 254993
2106 254993 -138468 -284469 -307173 -31461 -110447 -232527 -20570 -89451 -69002 -11300 -102679
2095 -102679 -213364 -132905 -62946 109289 96259 77028 -165070 -321626 -187744 -186771 -110950
2084 -110950 -173173 -141447 -63360 -168824 -334015 -411828 -458849 -329990 -12494 93786 236750
2073 236750 428099 271960 127282 201369 481073 845025 1339427 1445564 1739521 1779328
2063 1779328 1872403 1653339 1166794 568634 386508 187494 56772 -41604 -164574 -45546
2053 -45546 71961 46174 108720 65771 -5804 207482 15859 -29669 -16697 -121247 -162363
2042a62363l53038j22680J43702J35179P5404j10101J88530j17959o7836J96792
2032a94370N1962q6034j9456l801j90826K00111J61002k40920j30125K44454J83263
2021b4740p7119k57923J39927m4954j97498K44745J20737q0488p0968K44206O6037
2010F1962m3951J21706j69755J93847P3265l34215j46622j8667j73355J91933
2000b43852J3766J05307j59518l6396N2057l62930N8737K10647M0196Q5242q4240
1989c20984j20755j51540K54984l0455M190J8626J25761O2664l91611J56496K51625
1978a40999k05027J12218J62069l9777N2273o8525L47921N8660j43038j51901
1968a6126q9268R9634J45336k38000j12798N5915l2449J786O4893k19029j01028
$$ plain form
2042 -162363 -515401 -638081 -494379 -359200 -283796 -393897 -205367 -323326 -391162 -194370
2032 -194370 -142408 -228442 -247898 -251699 -442525 -242414 -81412 -322332 -452457 -208003 -24740
2021 -24740 -101859 -359782 -219855 -264809 -462307 -217562 -96825 -177313 -248281 -4075 61962
2010 61962 18011 139717 -30038 163809 237074 -97141 -243763 -262430 -435785 -243852
2000 -243852 -230086 -124779 -284297 -320693 -268636 -631566 -572829 -362182 -321986 -236744 -320984
1989 -320984 -441739 -593279 -338295 -368750 -364560 -345934 -220173 -157509 -549120 -392624 -140999
1978 -140999 -346026 -233808 -71739 -111516 -59243 -127768 220153 278813 135775 -16126
1968 -16126 -105394 -5760 139576 -98424 -211222 -155307 -187756 -185970 -121077 -340106 -441134
1957d41134K87284P0597M4088j74371m4463J8257r9947m239K26196j8714n3772
1946a90218P8179R3779k26187k2974k21564K2969p2681j09950J72702J13954K36080
1935a25911j83990M4735J26225J80714k36167J48610o8198N1723l1472j44551
1925b38282j14292L839k6675J69863K51054L608o9429j36419r5467J9777j65866
1914c98289M628J152J14017k43192q7058J57597J67910J71186K59229J17768k28870
1903C6078M8093n7408m2206j31322j08543j63491J87235L4877k60929J78066p839
1892b87389O3017L8573K3658R0185n8552O5926N9168j28176j22141K97181j10713
1881f9263j34551l1937N7282q2395m1068O0084j7393M4200m5668n363J16931J05624
$$ plain form
1957 -441134 -153850 -83253 -39165 -213536 -257999 -239742 -339689 -343928 -117732 -136446 -190218
1946 -190218 -112039 -18260 -244447 -267421 -488985 -466016 -538697 -648647 -475945 -361991 -125911
1935 -125911 -309901 -265166 -138941 41773 -194394 -45784 -113982 -62259 -93731 -238282
1925 -238282 -352574 -348735 -375410 -205547 45507 49115 -20314 -156733 -252200 -232423 -398289
1914 -398289 -393661 -392509 -278492 -521684 -608742 -451145 -283235 -112049 147180 264948 36078
1903 36078 84171 26763 -15443 -146765 -255308 -418799 -231564 -196687 -457616 -279550 -287389
1892 -287389 -224372 -185799 -162141 -71956 -130508 -64582 -5414 -133590 -255731 41450 -69263
1881 -69263 -203814 -235751 -178469 -260864 -301932 -241848 -259241 -215041 -260709 -266072 -149141 -43517
1869d3517l2179j09887r2651k47130o8446M0971K00196o4782j83409M35002k05317
1858c71149J00196J84963j7796j7824P4587L5797k87153M1659m3510j71471p8697
1847e50398M46285L02698m3348l78857R5908n2423M7723j50550K2725K1728j93356
1836d31865J70524q5590L10675J34712p0590p2252O6429J45937r7168m81628L8393
1825c72423K26298J55293k8103L3791L7156q5925m7525J9526M14750j90004n48989
1814c86155l9187M12478L6829j17942p4144K0451p3498J01060J55732k04427J1973
1803a56830j79261n7250J36900J84007m5346P299m9462L9922p80p7779k31273
1792d29853J60254N5669j43369q1978R8625K45203J94005K4210l76108j69981
$$ plain form
1869 -43517 -75696 -185583 -278234 -525364 -593810 -552839 -352643 -417425 -600834 -165832 -371149
1858 -371149 -270953 -85990 -103786 -121610 -47023 -11226 -298379 -256720 -300230 -471701 -550398
1847 -550398 -104113 198585 155237 -223620 -127712 -180135 -132412 -282962 -260237 -238509 -431865
1836 -431865 -261341 -346931 -36256 98456 27866 -44386 22043 167980 70812 -410816 -372423
1825 -372423 -146125 9168 -18935 14856 52012 -33913 -81438 -61912 352838 162834 -386155
1814 -386155 -425342 -12864 23965 -93977 -168121 -147670 -221168 -120108 35624 -168803 -156830
1803 -156830 -336091 -393341 -256441 -72434 -117780 -110481 -159943 -120021 -120801 -198580 -429853
1792 -429853 -269599 -213930 -357299 -439277 -340652 -95449 98556 122766 -253342 -423323
1782d23323J39326J88057j6434J85983k15231k07277k5325M61647K40327j46531
1772A81219j92015j20461J1806J17803l1265j24303j22709J99298Q2404j33050
1762a31273l54572j13073M64352l3875o3439o5137L5765J12117P1322P5650k01161
1751b03324l6496q2388O7355L64753j28867o4135l8520r0735k32159J35534J63250
1740a45732k37102N1723R6313p2608J99094Q8509M8249o0082J16748k11026m3223
1729a69137P330o9873J33748r0881K55695r5836l11138J21292J19301k1314M31044
1718C10231m23215j20465p8337R0949l0270K15210L453k38176K10347J27702J72479
1707B39908o8823j83513j12918K51883q8170M4698j17917k33665p0941K17316
$$ plain form
1782 -423323 -283997 -95940 -112374 73609 -141622 -348899 -374224 87423 327750 181219
1772 181219 -10796 -131257 -119451 -1648 -32913 -157216 -279925 -80627 1777 -131273
1762 -131273 -485845 -598918 -134566 -168441 -231880 -297017 -261252 -149135 -77813 -2163 -203324
1751 -203324 -239820 -322208 -254853 109900 -18967 -83102 -121622 -212357 -444516 -308982 -145732
1740 -145732 -382834 -331111 -234798 -307406 -108312 -19803 28446 -31636 85112 -125914 -169137
1729 -169137 -161807 -231680 -97932 -188813 66882 -28954 -340092 -218800 -99499 -120813 310231
1718 310231 -112984 -233449 -311786 -220837 -251107 -35897 -32444 -270620 -60273 67429 239908
1707 239908 171085 -12428 -125346 126537 38367 83065 -34852 -268517 -339458 -122142
1697a22142K16108j66779l3712k5098J6934j33315M17704J6494o3657m4081j45740
1686f7284p0949o5015J31974J03553k9683j3129q800J24131j98251j70189N5675
1675b07967m9013r9080N7300K58281j34698j38415p665J88480p7072K05760j15010
1664a19099J17321j50396j9016J82513m7698o0037k959J69899p6391K2344r4164
1653g7683j34658j5092J24020L52678m3733k29683j26813Q6168q3386P5456j67087
1642b39813j5032J60647q8410k6542J6212m0122J81203j99513J89958K0200M106
1631c7106k15155r7048K90382M9094l34623q9623K59009k572m7756J11818J18707
1620E127N6358R6978l22869j06027L0081m4028N5386J96154k37764K3853j23471
$$ plain form
1697 -122142 93966 -72813 -106525 -131623 -114689 -248004 169700 186194 122537 78456 -67284
1686 -67284 -138233 -203248 -71274 32279 2596 -10533 -19333 104798 -93453 -263642 -207967
1675 -207967 -256980 -356060 -298760 -40479 -175177 -313592 -321257 -132777 -209849 -4089 -119099
1664 -119099 -1778 -152174 -171190 11323 -36375 -96412 -99371 70528 -5863 16481 -77683
1653 -77683 -212341 -227433 -103413 249265 205532 -24151 -150964 -64796 -148182 -72726 -239813
1642 -239813 -254845 -94198 -182608 -209150 -192938 -233060 -51857 -251370 -61412 -41212 -37106
1631 -37106 -252261 -349309 -58927 -9833 -344456 -434079 -175070 -177642 -225398 -113580 5127
1620 5127 61485 158463 -164406 -270433 -240352 -284380 -228994 -32840 -270604 -246751 -370222
1609c70222N6386K86192K04052R0947j4655J5270j1561k60503k82044J7584J40686
1598a27868K3445Q8960j65815J70432J52102l10210m7724O9431J20067J70886
1588A43706l256r2347J37741J87548p2096k61670q1725L28458j22135j27645K14359
1577B50938j56393j66703L3447j28746k40754J79483M9312j29529K51169K88304
1567B30528K1471J661l98379l4972K67431k02148j88161J57294l2403k52690K31825
1556a98543Q9496M3231K08309j47261l28186P5794J40987Q0610l3039m5313k93350
1545d07265j08119L69163l7806K44079J36177j56073j62453J68627k7019j64312
1535a45001j8353M1381R537j92063K69290N5787o5853J78682j444L8331J29709
$$ plain form
1609 -370222 -313836 -27644 176408 267355 252700 267970 256409 -4094 -286138 -268554 -127868
1598 -127868 -104423 -15463 -181278 -10846 141256 -168954 -216678 -147247 -27180 143706
1588 143706 140450 48103 185844 373392 301296 39626 -42099 286359 164224 36579 250938
1577 250938 94545 -72158 -38711 -167457 -408211 -228728 -179416 -308945 -57776 230528
1567 230528 251999 253660 -144719 -179691 87740 -114408 -302569 -145275 -177678 -430368 -198543
1556 -198543 -109047 -65816 142493 -4768 -332954 -257160 -116173 -35563 -68602 -113915 -407265
1545 -407265 -515384 -146221 -184027 60052 196229 40156 -122297 46330 19311 -145001
1535 -145001 -163354 -121973 -112436 -304499 -35209 20578 -45275 133407 131963 170294 300003
1524C00003l9299M9639l19814P8046R8377o1030l27361J15288q4307j1996M21635
1513B19181j12762k00528k07642j88626L34851l36082J27509K15475o2853R9283
1503a12194j99869K39402L2765O8948M7552k3219j00306j22240K63669O8904k98387
1492a34975J2285j46533J80254J02631K67897m0216l05577n9459J03272K20704
1482B00283j31638L47402p8331l16810j67148K05957P5087q2012k4361l87130
1472c58701l7701L20970Q8241O1668n9886L6399O686O5287K28019j32618l1458
1461A86906j0560m0617k46270j26178n784j1897j36615R596J48898K25904N8921
1450E2304j25010n3266L87699k46644L5747k2999P9985j80640j44066J32562q2636
$$ plain form
1524 300003 260704 310343 -9471 68575 166952 105922 -221439 -106151 -190458 -202454 219181
1513 219181 106419 -94109 -301751 -490377 -155526 -491608 -364099 -148624 -211477 -112194
1503 -112194 -312063 -72661 -39896 29052 76604 53385 -46921 -169161 94508 163412 -134975
1492 -134975 -122690 -269223 -88969 13662 281559 241343 -64234 -123693 -20421 200283
1482 200283 68645 416047 337716 20906 -146242 59715 134802 52790 28429 -358701
1472 -358701 -396402 -75432 12809 74477 14591 50990 57676 122963 350982 218364 186906
1461 186906 176346 135729 -110541 -236719 -242503 -254400 -391015 -381419 -232521 -6617 52304
1450 52304 -72706 -125972 261727 15083 50830 27831 107816 -72824 -216890 -84328 -166964
1439a66964j86699L0282K11028J26647J65602Q3480m2492k18636k30993K9521
1429a99224J14595Q0900J84574k8282j10858j32091Q3932J45321q8389n5411k4288
1418b9221q1627j96138L1531j12712K27667J18598R732l1213n7681J530k47424
1407c66958J92425P2608K3862J52602M3955J19923q8149j79496j05125O5653L1864
1396c6836J0008M2740m0747K12055k72527r8240P3599J65959k08974J42615J44818
1385A34470K7328m3989j36112j45135l2292j55556k0647J84324N2453m4957O4565
1374a15548L16799n2165j99113o7901m3872j56088Q5421j05884K36624J97349
1364I5622O3455k22250j30553m4396P2988K39229J7425r2482l16015J17258J58890
$$ plain form
1439 -166964 -353663 -323381 -112353 14294 179896 263376 220884 2248 -228745 -199224
1429 -199224 -84629 -3729 180845 152563 41705 -90386 -6454 138867 50478 -4933 -29221
1418 -29221 -110848 -306986 -275455 -388167 -160500 -41902 -32170 -63383 -121064 -119534 -366958
1407 -366958 -174533 -101925 -78063 74539 118494 238417 150268 -29228 -134353 -68700 -36836
1396 -36836 -26828 15912 -24835 187220 -85307 -183547 -109948 56011 -152963 -10348 134470
1385 134470 161798 117809 -18303 -163438 -195730 -351286 -371933 -187609 -135156 -180113 -115548
1374 -115548 201251 149086 -50027 -117928 -161800 -317888 -232467 -338351 -101727 95622
1364 95622 159077 -63173 -193726 -238122 -165134 74095 91520 -962 -316977 -199719 -40829
1353d0829J0658l42802K45077K05658j18574j10722p0685N7485J83916j63292
1343a44110k38683J87450J44895k5544j97312o3971K19258j03285j37485J56178
1333b02609L4458j65221K72238J74162l63555m2862J36884R1352Q1230J15383
1323A31460K36577j42162j92048O6762n8736j43174k69596J59608L62689K987
1313A54367J22196l52708k76626J99389K72418L5822l2883m30481K68413l6418
1303g6511j6324K43466j36920O0498k3235J06480O1624j60649j59983J11149m733
1292D862Q5080N9412o8201j08214J33751k49155J60271j18385j97605J36968K86524
1281A25308k03287m8530K24534r9384j30349J16125P8844J04241K5052P1939p0587
$$ plain form
1353 -40829 -30171 -372973 -127896 77762 -40812 -151534 -222219 -164734 19182 -144110
1343 -144110 -382793 -195343 -50448 -75992 -273304 -337275 -118017 -221302 -358787 -202609
1333 -202609 -168151 -333372 -61134 113028 -250527 -293389 -156505 -65153 16077 131460
1323 131460 368037 225875 33827 100589 41853 -101321 -370917 -211309 151380 154367
1313 154367 276563 -76145 -352771 -153382 119036 154858 121975 -308506 -40093 -76511
1303 -76511 -92835 150631 13711 74209 50974 157454 219078 58429 -101554 9595 4862
1292 4862 89942 149354 81153 -27061 106690 -142465 17806 -100579 -298184 -161216 125308
1281 125308 -77979 -126509 98025 -1359 -131708 -15583 63261 167502 192554 264493 193906
1270A93906l1987l8658o2455R6330L2160j73064q1206Q6007N4552J0820j80746
1259i4341J17786R9317j75709N5603J57712q8367J47449J70687l1895j32162l88130
1248a62050J12783l66651J67112K42618J46227K2994k56882M5728N2123J21842
1238A25844O9833m8964j59951J01260M4317J11404J551n2865j4164l0015j38876
1227I374L31403P454l92912J46p1175j44319K25173N9197J8902j66430J41172
1216A7985K10215j00913j30646j08574k15146J28519J33360J09772l2197R4211
1206A06586J12494r887j08789j55393n7780Q8580J03488M02194O332o02644q734
1195a23553j10506J21108J2593j32534k3314J08226L29332q1655q1253J22147
$$ plain form
1270 193906 161919 123261 60806 157136 189296 16232 -64974 21033 75585 86405 -94341
1259 -94341 23445 122762 -52947 2656 160368 72001 219450 390137 358242 226080 -162050
1248 -162050 -49267 -415918 -248806 -6188 140039 163033 -93849 -48121 4002 125844
1238 125844 195677 146713 -13238 88022 132339 243743 245294 192429 178265 148250 9374
1227 9374 340777 348231 -44681 -44535 -115710 -260029 -34856 24341 43243 -123187 17985
1216 17985 228200 127287 -3359 -111933 -327079 -198560 -65200 44572 12375 106586
1206 106586 219080 209193 100404 -54989 -112769 -24189 79299 481493 487825 -114819 -123553
1195 -123553 -234059 -112951 -100358 -232892 -256206 -147980 181352 99697 18444 140591
1185A40591l3291j10276K04906J71916l5634R4134L4999j78106m0707l38716r5443
1174a85627J41545J2410K04500P0387p9841m664J70105K98215k18225l71661Q7762
1163A24906K03713m3179l4063j56391L5190J96520j27303j17490J22362J65668
1153C69933m03765j46698K14020J65016j32814J1129l8392k72137K1649J24335
1143h7724R8725R8613P3082N021l17724K3377L11145K66665R6947N4005k06622
1132D15510q6447q8810m14472J15724K27137L1624k9930q9941j19131O2783j1342
1121A2705M947j85257J94198j48367l8738J34824j90581J85259k24428J01983
1111a53455P593j7428j2768Q1505l1866K4365N2967R099J24850k2644m55380P8966
$$ plain form
1185 140591 107300 -2976 201930 373846 338212 432346 467345 289239 248532 -90184 -185627
1174 -185627 -44082 -31672 172828 243215 163374 158710 328815 627030 408805 37144 124906
1163 124906 328619 285440 251377 94986 130176 326696 199393 81903 204265 369933
1153 369933 -33832 -180530 33490 198506 65692 76821 38429 -233708 -212059 -87724
1143 -87724 11001 109614 182696 187717 -130007 -106630 204515 471180 568127 622132 415510
1132 415510 329063 240253 -174219 -58495 168642 200266 170336 80395 -38736 24047 12705
1121 12705 17652 -167605 26593 -121774 -160512 -25688 -216269 -31010 -255438 -153455
1111 -153455 -145862 -163290 -176058 -94553 -126419 -102054 -49087 -39988 84862 62218 -393162 -314196
1099c14196J91164J71942j18728l5859J24934o6276N0708l19j6837j2832M6558
1088B0259j22004j18203o4089J75768K59365l00331J75824K28263p0566R8755
1078B83041j08354J65424k02776Q3308o7794M7545J84519m1632k16419j43518
1068a6656M7970j06966K42281k32101l891J96828j46279K2518j60600K2743J33307
1057h46J81438j59615m6792j77481l1816K28574J94057n180j48202l7620m1766
1046d5249m0577K50448L9240j55987M6007M2679j75800R350M11295K26127k60778
1035C46755k05680r9546j47864J88350n8611j65785L37038l614K47690J00624
1025E39357r5046l09026r5222L599J23886K2196k15757n9395q5384q6729K43594
$$ plain form
1099 -314196 -123032 48910 -69818 -105677 19257 -47019 3689 3370 -13467 -26299 20259
1088 20259 -101745 -219948 -284037 -108269 151096 -149235 26589 254852 184286 283041
1078 283041 174687 340111 137335 220643 152849 200394 384913 343281 126862 -16656
1068 -16656 31314 -75652 166629 -65472 -69363 127465 -18814 3704 -156896 -134153 -846
1057 -846 180592 20977 -25815 -203296 -235112 -6538 187519 182339 34137 -3483 -45249
1046 -45249 -85826 164622 203862 47875 93882 136561 -39239 -29889 381406 607533 346755
1035 346755 141075 41529 -106335 82015 23404 -142381 194657 191043 438733 539357
1025 539357 444311 135285 40063 43662 167548 189744 -26013 -85408 -170792 -257521 -13927
1014a3927J5682k9361J43116k66375J9157m0691J37462J17365J9977L8419q2939
1003E7885j77230L6342l1115Q8155J45477R0284j31521k8792k26185q6826P7751
992a85775P7050J36743M0543R7372J78929j0350n0773k20256J18617j59729o679
981A5692q3063k58301K41115J55089J22659p9978M5829q7016l06675J63323J68624
970I7298j55765Q7579j13233M8457j61084J44421J29065l85578R7210N3118m513
959a63025L69842k29141l2551K4286K8574j31541K7785j13992q7212L47047q8000
948d7928n9496j8586J03999L2863J96284q1460j9485k16613j92863k5284L15555
937a3014L28823M9977k28004k60258J54630J76876k72284K6755J98935r720j98158
$$ plain form
1014 -13927 1755 -27606 115510 -150865 -131708 -172399 -34937 82428 102405 140824 57885
1003 57885 -119345 -83003 -114118 -25963 119514 209798 78277 49485 -176700 -263526 -185775
992 -185775 -108725 28018 68561 165933 344862 334512 283739 63483 182100 22371 15692
981 15692 -67371 -325672 -84557 70532 193191 113213 159042 72026 -234649 -71326 97298
970 97298 -58467 29112 -84121 -35664 -196748 -52327 76738 -308840 -211630 -158512 -163025
959 -163025 206817 -22324 -54875 -30589 -2015 -133556 -105771 -219763 -306975 40072 -47928
948 -47928 -107424 -126010 -22011 10852 207136 125676 106191 -110422 -303285 -328569 -13014
937 -13014 315809 365786 137782 -122476 32154 209030 -63254 -36499 162436 152716 -45442
926d5442p8530L19031J3920k9028O9835j48947q3163O1j02207o6171k02686j56093
914e09420N90170J33520o2683J47117k31380j9226R3601j52081J51604j50282
904i060K56265Q4399m05749j01373K46112K82770j97730j54453j03299L96906
894B94788N99m16972k03282K42489k6911J34861j13685J16087K8714p9971J80426
883A57143l13214J34100O3041k07920J86604J54399J92456j01709j4929j41829
873A08142R0924l7806k41522j48763J17757K53591P1597O0591k51763R298L7692
862F9738R0734L3655P7863q1114p3671k19633K61852P462J59614j14878j46376
851F5246J46798O8271J95926l21576J54365l8001q2885J25214k77187m4149O887
$$ plain form
926 -45442 -123972 195059 208979 179951 249786 100839 17676 17737 -84470 -150641 -353327 -509420
914 -509420 80750 214270 151587 298704 67324 48098 141699 -10382 141222 -9060
904 -9060 247205 331604 -74145 -175518 70594 353364 155634 1181 -102118 294788
894 294788 295387 -121585 -324867 -82378 -109289 25572 -88113 27974 56688 -23283 157143
883 157143 -156071 -21971 41070 -166850 19754 174153 366609 264900 249971 108142
873 108142 199066 161260 -80262 -229025 -111268 142323 213920 274511 22748 32046 69738
862 69738 160472 194127 271990 190876 117205 -102428 159424 166886 326500 211622 65246
851 65246 212044 280315 476241 154665 309030 271029 188144 313358 36171 -7978 -1091
840a091q3113J10095J41667l52245L5344J99416j16572J33264J66686o021J02712
829C30142Q3834l27577j10943j16676K61508m9464j69433j46067j60395K16074
819a88997J60542l0595J91818L3118k12695k02896L91112J31433o4754k78811
809g0725l06660P3381L03479K82383j43550j29930K20909L00132k55819j57115
799A16485K43653j74473o2728k1664Q7590K12278j16457p5981J31368l5332k37437
788F7302j7294j09116j05562J07207J87074r841j56441J82897l3239j25599P685
777d927K91017L48322l24544P0050R3034k8063k11664j33429L67294J41999k12397
766C96692j10306l14889K176J52749k9333m5401l7778M6320J57063n6985l09701
$$ plain form
840 -1091 -84204 25891 167558 -184687 -149343 50073 -66499 66765 233451 227430 330142
829 330142 413976 86399 -24544 -141220 120288 70824 -98609 -244676 -405071 -188997
819 -188997 -28455 -59050 132768 165886 -46809 -249705 141407 272840 208086 -70725
809 -70725 -377385 -304004 -525 281858 138308 8378 229287 529419 273600 116485
799 116485 360138 185665 122937 101273 188863 401141 284684 208703 340071 304739 67302
788 67302 50008 -59108 -164670 -57463 129611 119770 -36671 146226 112987 -12612 -4927
777 -4927 286090 634412 309868 379918 472952 444889 233225 99796 467090 609089 396692
766 396692 286386 -28503 -26327 126422 97089 51688 13910 60230 217293 160308 -149393
755a49393j12633K67258K21412k2688o3983q1686J96037k13267j07097Q8392J92407
744B14759J39963k98422p7024N07464l03429j34231K17900K6720j1854k05178
734G6668j83214L48K15105k0334m0456k35353Q0361J0147J26802J59694m2263
723A47505m43394R9741J50750J60235j87425j56929K73726K27276J2204j65523
713A18166P6230j8943j22961L1021l7556j11697J002K97886J54974k19190k45472
702g6540k3371O0740j0439r9817K24470K03424k8246K9948j41215p9338L7563
691I7179J60704P1788K4348o8759q2776K9572J5196l4084J4981J24512j49366
680B03295j50550j51896R1809o5776K65101k50372k23872J25255J52819k9423
$$ plain form
755 -149393 -262026 5232 226644 203956 139973 58287 254324 41057 -66040 22352 214759
744 214759 354722 56300 -20724 486740 183311 49080 266980 293700 281846 76668
734 76668 -106546 -106198 108907 88573 48117 -187236 -106875 -96728 30074 189768 147505
723 147505 -295889 -196148 -45398 114837 -72588 -229517 44209 271485 283689 118166
713 118166 194396 175453 52492 83513 45957 -65740 -64738 233148 388122 168932 -76540
702 -76540 -99911 -39171 -49610 -149427 75043 278467 250221 280169 138954 59616 97179
691 97179 257883 329671 354019 285260 202484 232056 247252 213168 228149 352661 203295
680 203295 52745 -99151 -7342 -73118 191983 -58389 -282261 -157006 -4187 -33610
670c3610k326K03036k01054J44159M5173l22572l1950n2079J64609J88375J85625
659B87386O8514k68883M8909J52567p5922n9505L0287j98927K05339j07408J80130
648B62487j00946l7548q5388k22757p9040L84343M045J0400l7449j83892J80402
637I4657m8015O7762n6318M2550L9233k51145L35351O6283m1605q36n4751l7734
625A55432J78934j17024j33471l7649L6935j62211j6505j11960M6792K09398j37167
614h8496J74864p9592l9512J07929o4081J48062j88544R9771j9197N2015J82963
603B86182j0649k8072r6415k28357M1273K85053J00075j10781q1928j44631j25870
592a14120L91089j52663K14861j05840k12513k05933K80396R6406k35081J31144
$$ plain form
670 -33610 -35936 167100 -33954 110205 155378 -167194 -199144 -251223 -86614 101761 287386
659 287386 355900 87017 135926 288493 212571 153066 183353 -15574 189765 82357 262487
648 262487 161541 123993 38605 -184152 -263192 121151 125196 135596 98147 -85745 94657
637 94657 46642 114404 58086 100636 139869 -111276 224075 290358 248753 247917 193166 155432
625 155432 334366 217342 83871 46222 83157 -79054 -95559 -207519 -160727 48671 -88496
614 -88496 86368 6776 -32736 75193 11112 159174 -29370 70401 51204 103219 286182
603 286182 275533 247461 151046 -77311 -36038 249015 349090 238309 156381 11750 -114120
592 -114120 276969 124306 339167 233327 20814 -185119 95277 191683 -43398 87746
582H7746l34738m22830K82731J85009K29335k01561j7711M81451J69295j27631
572C31096j15247l07671k13752M1488K6769P7524J45533K63708j96693N868q9900
561c1277J21773N6144L4430K55086j98699P6676n876n6277q4549K7816K05441
550D00688r8600j54116j59618m4007J91047R5886K82296k39275l39130P8449J7444
539C1064P9032n4342r4094j23037K39274L8646j58492j43772M5761k00666M35480
528I4854L56529k85449J17824K3002k56977j48771l0151n547J85225l6141j02277
517h7879J12585J37434J72534j3867R9714j71381j95858K29271k5459k81020M0833
506A6907Q2052M0167o047j35941j1714M8124k27227P1802L6146O3181K79531j51552
$$ plain form
582 87746 -246992 -669822 -387091 -202082 27253 -174308 -192019 289432 458727 331096
572 331096 215849 -91822 -305574 -264086 -237317 -159793 -14260 249448 52755 58623 -31277
561 -31277 90496 146640 181070 436156 237457 314133 308257 251980 167431 195247 400688
550 400688 302088 147972 -11646 -55653 135394 231280 513576 274301 -64829 13620 31064
539 31064 110096 55754 -38340 -161377 77897 116543 -41949 -185721 -139960 -340626 94854
528 94854 451383 165934 283758 306760 49783 -98988 -129139 -134686 50539 14398 -87879
517 -87879 24706 162140 334674 320807 420521 249140 53282 282553 257094 -23926 16907
506 16907 98959 139126 133079 -2862 -14576 33548 -193679 -121877 -85731 -22550 256981 105429
494A05429J5164r4290J89890k92910L60131o1933L5556K3408K5794j27918l75
483A77946l07882k06550K04144L80959J03321r9234j14148r6246K40620j65029
473A17901n423K1592m22263k01203L04662N8587p3070K50987J97564k2733q1791
462A44810n4462r7346o1094j53675J90040L73106p6504j19190j5940j47345j39010
451a56610K20547K9795J36635k4089k25600j14791K1940j60160K31266j22382
441a63449L25311J01080j85039j2035R4166O9518j46984j30922q5386Q5158J6092
430c2490K53961J45186k05367k99247P3067L46115j3522K74638n2969j04911m6538
419C37923k82066k61480L608K46165N4545j56875j5079m4194M06870j51245j36801
$$ plain form
494 105429 120593 26303 216193 -76717 283414 221481 257037 280445 306239 178321 177946
483 177946 -129936 -336486 -132342 248617 351938 252704 138556 42310 282930 117901
473 117901 112478 134070 -288193 -489396 -184734 -126147 -199217 51770 249334 226601 144810
462 144810 90348 -6998 -68092 -221767 -31727 341379 264875 145685 129745 -17600 -156610
451 -156610 63937 93732 230367 206278 -19322 -134113 -112173 -272333 -41067 -163449
441 -163449 161862 262942 77903 65868 160034 229552 82568 -48354 -133740 -48582 -32490
430 -32490 221471 366657 161290 -137957 -64890 281225 267703 542341 489372 384461 337923
419 337923 55857 -205623 -202015 44150 98695 -58180 -73259 -117453 289417 138172 1371
408A371k3585J87905k2683j40048O8036J78085J62494l17955N7118L18576j37083
397C32231k9521j64847N4417n6793M2509j79334m1956J50635j21939n4493j48160
386b17251K4929J01894J56603o5256r625P3376J09823j97888j0898L9198k58127
375b53222l2115J30039J19336L74000k45326p4764q7050K08593J88673j8773k18389
364I1002K4620M5982j71550r8613J42569J17366Q0565K06845o1903k34006q5201
353E7676L40099J7729o9700l76920r6471L21577o4967K25576J93030l31268j16904
342I9457K27087k53956l288j8599Q3240k0344r0863p9227P0076l5339r7412n5575
330a74743o6020M32995K08943j8926n7143k07054l22613j1873K25831K78240L9315
$$ plain form
408 1371 -22214 165691 143008 2960 70996 249081 411575 93620 150738 469314 332231
397 332231 302710 137863 192280 135487 177996 -1338 -43294 107341 -14598 -69091 -217251
386 -217251 -192322 -90428 66175 919 -8706 64670 174493 -23395 -34293 4905 -253222
375 -253222 -285337 -155298 -35962 338038 92712 17948 -69102 139491 328164 309391 91002
364 91002 115622 161604 -9946 -108559 34010 151376 231941 438786 376883 142877 57676
353 57676 397775 415504 345804 -31116 -127587 193990 129023 354599 547629 216361 99457
342 99457 326544 72588 69300 50701 133941 113597 22734 -56493 13583 -21756 -119168 -174743
330 -174743 -240763 192232 401175 382249 325106 118052 -204561 -216434 9397 287637 326952
319C26952j00046Q7351k22880j16368J80913k07786j53946K46551J62259j02640
309A00360k379J05823j22736R496j82897j80810K87156o6106j25366K75242J32592
298B30375J06039k16234m9811K10865j19225J33740q4817k19196Q7467K12538
288B91741K4992k07049k5001m3495J13995M1023k4473J91600q0349k97576J31497
277A16905R3163P4605l32575o0741L7515j5453L7979o1714m6318L66989j18881
266I1474j04680J83344j05368J77491J65867j59214l01740N0733n4957l1475j28871
255b17396L22758K95317k08364k6463j46884l1664K05871P2153J46128l50633
245F0823n7765l01702L2308K4685K04978J01884K2242J7982k23570j34115K34477
$$ plain form
319 326952 226906 314257 91377 -24991 155922 -51864 -205810 40741 203000 100360
309 100360 97981 203804 81068 90564 -92333 -273143 14013 -52093 -177459 97783 230375
298 230375 336414 120180 70369 281234 162009 295749 210932 -8264 79203 291741
288 291741 316733 109684 84683 41188 155183 196206 171733 363333 282984 -14592 116905
277 116905 210068 284673 -47902 -108643 -71128 -86581 -48602 -110316 -156634 210355 91474
266 91474 -13206 170138 64770 242261 408128 248914 -52826 -2093 -57050 -88525 -217396
255 -217396 105362 400679 192315 165852 18968 -12696 193175 265328 411456 60823
245 60823 3058 -298644 -266336 -241651 -36673 65211 87453 105435 -118135 -252250 -17773
234a7773J61963j65871J77316n3131K6166J2764P1073k95975j39533J08648O2904
223e1449O1009K43110J06276k23369m6064r087o0181m676o2479J9469k2386j8659
211f8486J48229Q2415j66388o6899r1383o9660J24942K23376O6060o4800P7921
200A95327O8009J64360k48310j17973J10605K6700j27622j57948J55117N5167
190A23432j06626L98484j39620r8869k93884J65543j4152j96662J58619q6052
180h9787J31072K11380p53q2516l9751K55018r4046l18942R9103O8046K82832
169D21656j49268p8938J25398o7105k59407R9244r0006J1248p660P3223K12999
158B91384m8579L2274j35516J7221J4578j67982Q9617J07940r7055P8794L3092
$$ plain form
234 -17773 144190 -21681 155635 102504 128670 141434 212507 -83468 -223001 -114353 -51449
223 -51449 9560 252670 358946 135577 89513 80426 20245 15569 -46910 -27441 -49827 -68486
211 -68486 79743 162158 -4230 -71129 -162512 -232172 -107230 116146 182206 117406 195327
200 195327 263336 427696 179386 61413 172018 198718 71096 -86852 68265 123432
190 123432 16806 415290 275670 176801 -117083 48460 34308 -162354 -3735 -89787
180 -89787 41285 252665 251912 169396 129645 384663 290617 -28325 70778 138824 421656
169 421656 272388 193450 318848 251743 -7664 91580 1574 12822 5162 78385 291384
158 291384 242805 275079 139563 156784 171362 3380 92997 200937 103882 182676 215768
147B15768j33013o6841K8794J90646q5307q7854l9508p8886O5973j01774J41628
136D9626l434o9997M9647j43365J47113o9598m2390J50985n5860n0510m0149j70832
124b48764M484J57132J25637J07359K077O937m2143K50383m4565k3171k18009
113G7357k04539J48456k1031J42416O056q1520J33979j64081p2037J3972J08607
102H7635K13052l21712J16766J18587l1386J50217k4184m6584k47114q5427O8363
91a787O0472p48j88374K65480k0391k98949N2125Q6506k8022R1120p6517Q3964
79B4879J58479R4328P4106l29747j13620J33161M3724j29083o4764J29784J29319
68A50566N604o5458J72906j88096q3526J09126P3757j99848n6066J29775J02885
$$ plain form
147 215768 82755 15914 44708 235354 150047 62193 22685 -56201 9772 -92002 49626
136 49626 46192 -23805 25842 -117523 29590 -40008 -82398 68587 12727 -37783 -77932 -248764
124 -248764 -244280 -87148 38489 145848 147925 154862 112719 363102 318537 295366 77357
113 77357 -127182 21274 243 142659 148715 67195 201174 37093 -34944 -20972 87635
102 87635 300687 -21025 95741 214328 182942 333159 308975 262391 15277 -70150 -1787
91 -1787 58685 57937 -130437 135043 114652 -184297 -132172 -45666 -73688 17432 -59085 24879
79 24879 183358 277686 351792 22045 -91575 41586 85310 -43773 -108537 21247 150566
68 150566 156170 90712 263618 75522 -8004 101122 174879 -24969 -81035 48740 151625
57A51625k58233K5046R8845K94614p9351j24563j31250k17254J14082O5644J05642
46D4847j5809Q3925j2705o7168p4279P8219l5295j39153K84008l8658j31190P0216
34D6958k9262Q1970K63172j03444N4216q3028k60405J67584R5949m4639o8641
23A20430N7712K4961k5242k54573J07112o1174j91877k2555J20750L0698J24931
12C1173R902M1975N9011j25362j0904L05593M1862j88976j72286j7347J22754
1I7395r4262
0C133
$$ plain form
57 151625 -106608 -81562 17283 311897 232546 107983 -23267 -240521 -126439 -60795 44847
46 44847 29038 112963 100258 33090 -41189 37030 1735 -137418 146590 107932 -23258 46958
34 46958 17696 99666 362838 259394 313610 230582 -29823 137761 233710 189071 120430
23 120430 178142 203103 177861 -76712 30400 -30774 -222651 -245206 -124456 -93758 31173
12 31173 41075 83050 142061 16699 5795 311388 353250 164274 -8012 -25359 97395
1 97395 3133
0 3133
$$ Imaginary data points
##PAGE= N=2
##DATA TABLE= (X++(I..I)), XYDATA
16383a874969o5606P3690j29908M5650r4793R5377J37569n8728o4381P420N0207
16372a878472J10576l141M4784N215k2852J36484J28484R3769j30293J27955o119
16361a393610L4107j3787N0056m4251J76344j61579l716J66627J93567J15473
16351h80769j39677K7671J29415j49639O816J57598j34743Q9787k0923M2063K42932
16340f29469N9333o2760P6839N1100Q6733K861n0825j72467o496R6559p3321J82441
16328d39472L8990q9795K390k7268J8346J63416L247P2687j83393R8652K30520
16317a11680p0631J1522j03457L8893L62722k7742l618r3349R2722L7315j70603
16306c7906J11230K0503J1517J08428L9827J11732l12111P8628O099J27956q2143
$$ plain form
16383 -1874969 -1940575 -1866885 -1996793 -1951143 -2045936 -1950559 -1812990 -1871718 -1936099 -1928679 -1878472
16372 -1878472 -1767896 -1771037 -1726253 -1721038 -1743890 -1607406 -1478922 -1385153 -1515446 -1387491 -1393610
16361 -1393610 -1359503 -1373290 -1323234 -1367485 -1191141 -1352720 -1356436 -1189809 -996242 -880769
16351 -880769 -1020446 -992775 -863360 -1012999 -1006183 -848585 -983328 -893541 -914464 -872401 -629469
16340 -629469 -570136 -632896 -556057 -504957 -418224 -415363 -466188 -638655 -645151 -548592 -621913 -439472
16328 -439472 -400482 -490277 -487887 -515155 -496809 -333393 -330146 -257459 -440852 -342200 -111680
16317 -111680 -182311 -170789 -274246 -235353 127369 99627 96009 2660 95382 132697 -37906
16306 -37906 73324 93827 105344 213772 253599 365331 53220 131848 137947 265903 183760
16295A83760p5458J59197R812J63456J47704j48204j52305L9328J59150p0143
16285D16297j26097K64672n2974j1974L43732o840n3999K3155r7249P9514j77222
16274F01015L4307l2157P9212K75660N5291k26507k52913R3920K07571Q1710K13
16263I17322R9291N1842j3884p912l7638n6854p274K97995n5175k67720m0256
16252H79737J75414K51216Q4187k84794j05793N6520R4769K43944N0906p7429
16242A368677K13643j23713L9332P2550Q8075J15362k06863j55248q3804J80509
16232A508520P0540k36317K4798J68693j64336j4843K97174r824j42724j14597
16222A387084J33855J14591K49579p9055M3296k20134J70310K22985k40286J12200
$$ plain form
16295 183760 108302 267499 277311 440767 588471 440267 287962 327290 486440 416297
16285 416297 290200 554872 501898 489924 833656 826816 772817 795972 698723 778237 601015
16274 601015 635322 603165 682377 958037 1013328 786821 533908 627828 835399 917109 917322
16263 917322 1016613 1068455 1054571 1046659 1009021 952167 944893 1242888 1187713 919993 879737
16252 879737 1055151 1306367 1390554 1105760 999967 1056487 1151256 1395200 1446106 1368677
16242 1368677 1582320 1458607 1497939 1570489 1658564 1773926 1567063 1411815 1328011 1508520
16232 1508520 1579060 1342743 1367541 1536234 1371898 1357055 1654229 1644405 1501681 1387084
16222 1387084 1520939 1635530 1885109 1806054 1849350 1629216 1799526 2022511 1782225 1894425
16212A894425J23690k10359j27711J4320N8923l7795k7511n9462J70860J37068
16202A936448J5768J48116l9534p3613j00163p177j18644K24792N366O180j1924
16191A985615L215j416j00910j99895j04046k0938K62706K90163Q269m6494J61742
16180B238011j82455r8425J40410j31834p9247J08670R8912J63223k56635K04872
16170B205502J78711j09471n1092k6565k1330M1774K09273j68938O8755l8697
16160B287922j56214K08323P5905J17355r5257j55967L38844j34265Q9350m0812
16150B535184k41477J02815j15261J28973K45991l34113o7007p9702J78933l946
16140B350390k64587J49859J10191J39569k6036Q5082K8100k61285q4320J23969
$$ plain form
16212 1894425 2018115 1807756 1680045 1694365 1753288 1715493 1687982 1628520 1799380 1936448
16202 1936448 1952216 2100332 2060798 1987185 1887022 1879845 1761201 1985993 1991359 1997539 1985615
16191 1985615 1988830 1987414 1886504 1686609 1582563 1561625 1824331 2114494 2122763 2076269 2238011
16180 2238011 2055556 1957131 2097541 1965707 1886460 1995130 2094042 2257265 2000630 2205502
16170 2205502 2384213 2274742 2223650 2197085 2175755 2217529 2426802 2257864 2326619 2287922
16160 2287922 2131708 2340031 2415936 2533291 2438034 2282067 2620911 2486646 2575996 2535184
16150 2535184 2293707 2396522 2281261 2410234 2656225 2322112 2255105 2175403 2354336 2350390
16140 2350390 2085803 2235662 2345853 2485422 2459386 2544468 2572568 2311283 2226963 2350932
16130B350932K04337j21763j53197j78948q7381L25072J30481J17690j31396k38961
16120B216866j76116J79820M40504K71183k86499l60721J52806R6074J55350j40403
16110B548864k97948J59351J15763J05039l5623j49329j06528J89614J56783l07613
16100B378373j92267l2100J09093J69962J12459m2398M785j02922r9355p381M5036
16089B343285j0112P1044J19995J30405l39798J35870L15191k46461j61401K47736
16079B605754P4927k99332n6044J37305l8547m8979J60116J6982P3004k31363
16069B393823N9916j54924K00753K58792j11375q092k10244J03026N6043q5006
16059B502712K02355j00118J37345k41373m152O1401j48853P1381J3958J26242
$$ plain form
16130 2350932 2555269 2433506 2280309 2101361 2013980 2339052 2469533 2587223 2455827 2216866
16120 2216866 2040750 2220570 2661074 2932257 2645758 2285037 2437843 2533917 2689267 2548864
16110 2548864 2250916 2410267 2526030 2631069 2595446 2446117 2339589 2529203 2685986 2378373
16100 2378373 2186106 2154006 2263099 2433061 2545520 2503122 2507907 2404985 2305630 2298249 2343285
16089 2343285 2333173 2404217 2524212 2654617 2314819 2450689 2765880 2519419 2358018 2605754
16079 2605754 2680681 2381349 2325305 2462610 2424063 2375084 2535200 2552182 2625186 2393823
16069 2393823 2453739 2298815 2499568 2758360 2646985 2638893 2428649 2531675 2587718 2502712
16059 2502712 2705067 2604949 2742294 2500921 2496769 2558170 2409317 2480698 2494656 2620898
16049B620898p3778j53207q855p1395k9139K42570M6863j1449k23214J16395q8126
16038B367563K8939K22755j41107j30100Q2555Q5985p5300J69458j43916j13287
16028B353545N745J29630m12652L0507K83491p7785N7127K72875p7499l25427
16018B239557J67622j38774O5680J66032N1770j90299l03256K67566j9955O8532
16008B374475J54966p81k154J19229j67527o0074L69794j12406O1252j01765o9860
15997B565149r2153O6632K7739J62202J06166l8711q3555r8159K6955K04767k66813
15986B580219k76362J27870j970N9012K72172M047j84836P1235l4541Q0636j5418
15975B682064j00122j57857q7795J98554N0479J45989p8558l03190k1393O9468
$$ plain form
16049 2620898 2547120 2393913 2385058 2313663 2284524 2527094 2573957 2562508 2339294 2455689 2367563
16038 2367563 2396502 2619257 2478150 2348050 2430605 2516590 2441290 2610748 2466832 2353545
16028 2353545 2359290 2488920 2076268 2106775 2390266 2312481 2369608 2642483 2564984 2239557
16018 2239557 2407179 2268405 2334085 2500117 2551887 2361588 2058332 2325898 2305943 2374475
16008 2374475 2529441 2528660 2526506 2645735 2478208 2418134 2787928 2675522 2736774 2635009 2565149
15997 2565149 2472996 2539628 2567367 2729569 2835735 2797024 2713469 2615310 2642265 2847032 2580219
15986 2580219 2303857 2431727 2429757 2488769 2760941 2764988 2580152 2651387 2616846 2697482 2682064
15975 2682064 2581942 2424085 2336290 2534844 2585323 2731312 2652754 2349564 2328171 2397639
15965B397639m8262L68694O0441j44210R120l8743j8044M7618J9511j37255K23544
15954B740053k14541r5210j2575R0905m7060J32559N0755O565J74800j60109Q67
15943B667009j87122P4030j66172J37524J09336j8322j71734k3058j96874K35726
15933B460343J99319j03168l2196J37821J00372q2377j93677P6717K15545J09473
15923B888172j14871j14286j5578k65507J68442K40543p5644l41671L8874M614
15913B413088M5948N4659J51869j41661l6619J79483n5037k26084M630L76165
15903B766441Q2715l14837m7421j94765N7928O0990K44256J0320k23855k5181
15893B416591l0554j77868J53506r1457l2783L77222j62296K22370R8946l02904
$$ plain form
15965 2397639 2349377 2718071 2778512 2634302 2643422 2604679 2586635 2634253 2653764 2516509 2740053
15954 2740053 2525512 2430302 2417727 2508632 2461572 2594131 2644886 2651451 2826251 2666142 2667009
15943 2667009 2479887 2553917 2387745 2525269 2634605 2616283 2444549 2421491 2224617 2460343
15933 2460343 2659662 2556494 2524298 2662119 2762491 2680114 2486437 2563154 2778699 2888172
15923 2888172 2773301 2659015 2643437 2377930 2546372 2786915 2711271 2369600 2408474 2413088
15913 2413088 2459036 2513695 2665564 2523903 2487284 2666767 2611730 2385646 2390276 2766441
15903 2766441 2849156 2534319 2486898 2292133 2350061 2411051 2655307 2665627 2441772 2416591
15893 2416591 2386037 2208169 2361675 2270218 2237435 2614657 2452361 2674731 2773677 2470773
15883B470773j26174k1119J58885j2687N1993k7874k39806k04244J66392p812
15873B208327K42398j07344P271Q7149q1954J30703K29766O4605l7738l39900
15863B403283k55227J34868j09875J47419Q7190Q4881N2345n7122j02453R2736
15853B478045J7347p4501J84045n7573j26098j01637M9452J83588O046j57665
15843B401049k07677r8786J9496J75776N2368K26044j26454P917J31606j50428
15833B430911j15754J05575j5806J04382j13311p2910K37524R9892J16975K01796
15823B979274k92343R4752p0571j96831n9951K7571J84534q8963M8093m0392K5456
15812B610629m9079k02793J24388N6909N9124p0299j87278K40877J66603k02209
$$ plain form
15883 2470773 2344599 2323480 2482365 2469678 2521671 2493797 2253991 2049747 2216139 2208327
15873 2208327 2450725 2343381 2350652 2437801 2355847 2486550 2716316 2780921 2743183 2403283
15863 2403283 2148056 2282924 2173049 2320468 2407658 2492539 2544884 2487762 2385309 2478045
15853 2478045 2495392 2420891 2604936 2547363 2421265 2319628 2369080 2552668 2558714 2401049
15843 2401049 2193372 2094586 2114082 2289858 2342226 2568270 2441816 2449733 2581339 2430911
15833 2430911 2315157 2420732 2404926 2509308 2395997 2323087 2560611 2660503 2777478 2979274
15823 2979274 2686931 2781683 2711112 2514281 2454330 2481901 2666435 2577472 2625565 2585173 2610629
15812 2610629 2561550 2358757 2483145 2540054 2599178 2528879 2341601 2582478 2749081 2546872
15802B546872j3438J89778J35089k77982j14626L0538J83942M9599p2892j64224
15792B492656l9022P7432R1387j73169k3012J73591J23946j59324n491N2902n0309
15781B561587N8347k2823j97151J22638K44453j18058L79079k24692l50425Q5914
15771B538869L73024j28236j68449k41233n4037J62355q8118m1610J14528L91694
15761B858787j57640j93468l1814O3753J78029k1148j6932j75735L6757J1893
15751B552482J96724k30737J49198j17788Q1652K48852j45227l20817L1861K66702
15741B712902k1004l02238K12840L1233J35522O3139j30740k6873k26349j59059
15731B289373K27736K61451m292J13543K14842k28164l41870j53676l39857J40479
$$ plain form
15802 2546872 2533434 2723212 2858301 2580319 2465693 2496231 2680173 2729772 2656880 2492656
15792 2492656 2453634 2531066 2622453 2449284 2426272 2599863 2723809 2564485 2558994 2611896 2561587
15781 2561587 2619934 2597111 2399960 2522598 2767051 2648993 3028072 2803380 2452955 2538869
15771 2538869 2911893 2783657 2615208 2373975 2319938 2482293 2394175 2352565 2467093 2858787
15761 2858787 2701147 2507679 2475865 2539618 2717647 2696499 2679567 2503832 2540589 2552482
15751 2552482 2749206 2518469 2667667 2549879 2631531 2880383 2735156 2414339 2446200 2712902
15741 2712902 2691898 2389660 2602500 2633733 2769255 2832394 2701654 2674781 2448432 2289373
15731 2289373 2517109 2778560 2774268 2887811 3102653 2874489 2532619 2378943 2039086 2179565
15721B179565P6263N29826K60373k89332J10750j10713k03418Q2040j20369J79464
15711B694449J03528k02320N9744J702J72142j12253k80811K3427J25391L5757
15701B620756J35892J92168r2297J66900j91178j75989p6234J04472n9221j92565
15691B432704K45745L6797k97309p6086P5205J22140l6036j28416n1811K53527
15681B576460K68471j11199l64622Q5856K62168j29363k45780K01874N9202K1587
15671B624654k68517K94135k29437N5721K02224M1899m7818j27188p8942j27048
15661B339683L26803K82915j57936l9088k3240j7283L65522J88796k34386r3997
15651B937789J11851J46216k25795k04087p3972J82772k6336m29415M53609j43319
$$ plain form
15721 2179565 2255828 2785654 3046027 2756695 2867445 2756732 2553314 2635354 2514985 2694449
15711 2694449 2797977 2595657 2655401 2657103 2829245 2716992 2436181 2459608 2584999 2620756
15701 2620756 2756648 2948816 2856519 3023419 2832241 2656252 2580018 2684490 2625269 2432704
15691 2432704 2678449 2715246 2417937 2341851 2417056 2539196 2503160 2374744 2322933 2576460
15681 2576460 2844931 2733732 2369110 2454966 2717134 2587771 2341991 2543865 2603067 2624654
15671 2624654 2356137 2650272 2420835 2476556 2678780 2720679 2672861 2545673 2466731 2339683
15661 2339683 2666486 2949401 2791465 2752377 2729137 2711854 3077376 3266172 3031786 2937789
15651 2937789 3049640 3195856 2970061 2765974 2692002 2874774 2848438 2419023 2872632 2729313
$$ [...]
##END NTUPLES=NMR SPECTRUM
##END=
