##TITLE=1H_DE-80H_X3
 200.13MHz, d2o
 8 sc
 
 19ns.26.2.2025
##JCAMPDX= 6.0         $$ Bruker NMR JCAMP-DX V2.0
##DATA TYPE= NMR SPECTRUM
##DATA CLASS= NTUPLES
##ORIGIN= UXNMR, Bruker Analytische Messtechnik GmbH
##OWNER= pz
$$ XWIN-NMR		Version 3.5
$$ Wed Mar 25 12:08:20 2026 Russian Standard Time (UT+4h)  Yarkov@DPX200
##.OBSERVE FREQUENCY= 200.1313
##.OBSERVE NUCLEUS= ^1H
##.ACQUISITION MODE= SIMULTANEOUS
##.ACQUISITION SCHEME= undefined
##.AVERAGES= 8
##.DIGITISER RES= 18
##SPECTROMETER/DATA SYSTEM= spect
##.PULSE SEQUENCE= zg30
##.SOLVENT NAME= DMSO
##.SHIFT REFERENCE= (INTERNAL, DMSO, 0, 15.5067)
##AUDIT TRAIL= $$ (NUMBER, WHEN, WHO, WHERE, WHAT)
$$ ##TITLE= Audit trail, XWIN-NMR		Version 3.5
$$ ##JCAMPDX= 5.01
$$ ##ORIGIN= Bruker BioSpin GmbH
$$ ##OWNER= Yarkov
$$ C:/Bruker/XWIN-NMR/data/yarkov2/nmr/H-C/1/pdata/1/auditp.txt
$$ ##AUDIT TRAIL=  $$ (NUMBER, WHEN, WHO, WHERE, WHAT)
(   1,<2026-03-25 12:07:17.20 +0400>,<Yarkov>,<DPX200>,
      <created by zg, POWCHK disabled, PULCHK disabled
       configuration hash MD5:
       00 E9 B6 7A A2 85 ED C7 34 08 36 98 17 FE 4E 26
       data hash MD5: 16K
       7C 74 E3 4E DC A8 50 EA 5B 46 0E 5A FF 39 23 43>)
(   2,<2026-03-25 12:07:41.01 +0400>,<Yarkov>,<DPX200>,
      <Start of raw data processing
       efp BC_mod = 2 LB = 0.25 FT_mod = 6 PKNL = 1 PHC0 = -5299.148 PHC1 = 6.821927 SI = 16K 
       data hash MD5: 16K
       B1 F4 E8 D9 1A EF 00 3A 1D 21 45 97 25 A2 1B AA>)
$$ ##END=
$$ 
$$ hash MD5
$$ AC 8A BB 34 9C 58 EC 1A 4E 4B 8B 76 9A 8F A9 E1
##$RELAX= 
##$RELAX= 
##$RELAX= 
##$RELAX= 
##$RELAX= 
##$RELAX= 
$$ Bruker specific parameters
$$ --------------------------
##$DU= <C:/Bruker/XWIN-NMR>
##$EXPNO= 1
##$NAME= <H-C>
##$PROCNO= 1
##$TYPE= <nmr>
##$USER= <yarkov2>
##$AMP= (0..31)
100 100 100 100 100 100 100 100 100 100 100 100 100 100 100 100 100 100 
100 100 100 100 100 100 100 100 100 100 100 100 100 100 
##$AQSEQ= 0
##$AQ_mod= 1
##$AUNM= <au_zg>
##$AUTOPOS= <>
##$BF1= 200.13
##$BF2= 200.13
##$BF3= 200.13
##$BF4= 200.13
##$BF5= 200.13
##$BF6= 200.13
##$BF7= 200.13
##$BF8= 200.13
##$BYTORDA= 1
##$CFDGTYP= 0
##$CFRGTYP= 5
##$CHEMSTR= <none>
##$CNST= (0..31)
1 1 145 1 1 1 1 1 1 1 1 1 1 1 1 1 1 1 1 1 1 1 1 1 1 1 1 1 1 1 1 1 
##$CPDPRG= <>
##$CPDPRG1= <>
##$CPDPRG2= <>
##$CPDPRG3= <>
##$CPDPRG4= <mlev>
##$CPDPRG5= <mlev>
##$CPDPRG6= <mlev>
##$CPDPRG7= <mlev>
##$CPDPRG8= <mlev>
##$CPDPRGB= <>
##$CPDPRGT= <>
##$D= (0..31)
0 0.7 0 0 0 0 0 0 0 0 0 0.03 0 0 0 0 0 0 0 0 0 0 0 0 0 0 0 0 0 0 0 0 
##$DATE= 1774426036
##$DBL= (0..7)
120 120 120 120 120 120 120 120 
##$DBP= (0..7)
150 150 150 150 150 150 150 150 
##$DBP07= 0
##$DBPNAM0= <>
##$DBPNAM1= <>
##$DBPNAM2= <>
##$DBPNAM3= <>
##$DBPNAM4= <>
##$DBPNAM5= <>
##$DBPNAM6= <>
##$DBPNAM7= <>
##$DBPOAL= (0..7)
0.5 0.5 0.5 0.5 0.5 0.5 0.5 0.5 
##$DBPOFFS= (0..7)
0 0 0 0 0 0 0 0 
##$DE= 6
##$DECBNUC= <off>
##$DECIM= 32
##$DECNUC= <off>
##$DECSTAT= 4
##$DIGMOD= 1
##$DIGTYP= 9
##$DL= (0..7)
0 120 120 120 120 120 120 120 
##$DP= (0..7)
$$ [...]
##$SUBNAM2= <"">
##$SUBNAM3= <"">
##$SUBNAM4= <"">
##$SUBNAM5= <"">
##$SUBNAM6= <"">
##$SUBNAM7= <"">
##$SUBNAM8= <"">
##$SUBNAM9= <"">
##$SW= 18.0517328524113
##$SWIBOX= (0..15)
0 0 2 0 0 0 0 0 0 0 0 0 0 0 0 0 
##$SW_h= 3612.71676300578
##$TD= 16384
##$TD0= 1
##$TE= 0
##$TE2= 300
##$TE3= 300
##$TEG= 300
##$TL= (0..7)
0 120 120 120 120 120 120 120 
##$TP= (0..7)
150 150 150 150 150 150 150 150 
##$TP07= 0
##$TPNAME0= <>
##$TPNAME1= <>
##$TPNAME2= <>
##$TPNAME3= <>
##$TPNAME4= <>
##$TPNAME5= <>
##$TPNAME6= <>
##$TPNAME7= <>
##$TPOAL= (0..7)
0.5 0.5 0.5 0.5 0.5 0.5 0.5 0.5 
##$TPOFFS= (0..7)
0 0 0 0 0 0 0 0 
##$TUNHIN= 0
##$TUNHOUT= 0
##$TUNXOUT= 0
##$USERA1= <user>
##$USERA2= <user>
##$USERA3= <user>
##$USERA4= <user>
##$USERA5= <user>
##$V9= 5
##$VALIST= <valist>
##$VCLIST= <CCCCCCCCCCCCCCC>
##$VD= 0
##$VDLIST= <DDDDDDDDDDDDDDD>
##$VPLIST= <PPPPPPPPPPPPPPP>
##$VTLIST= <TTTTTTTTTTTTTTT>
##$WBST= 1024
##$WBSW= 4
##$XGAIN= (0..3)
0 0 0 0 
##$XL= 0
##$YL= 0
##$YMAX_a= 105587
##$YMIN_a= -74595
##$ZGOPTNS= <>
##$ZL1= 120
##$ZL2= 120
##$ZL3= 120
##$ZL4= 120
##$ABSF1= 0
##$ABSF2= 0
##$ABSG= 0
##$ABSL= 0
##$ALPHA= 0
##$AQORDER= 0
##$ASSFAC= 0
##$ASSFACI= 0
##$ASSFACX= 0
##$ASSWID= 0
##$AUNMP= <proc_1d>
##$AZFE= 0.1
##$AZFW= 0.1
##$BCFW= 0
##$BC_mod= 2
##$BYTORDP= 0
##$COROFFS= 0
##$CY= -3
##$DATMOD= 1
##$DC= 0
##$DFILT= <>
##$DTYPP= 0
##$F1P= 0
##$F2P= 0
##$FCOR= 1
##$FTSIZE= 16384
##$FT_mod= 6
##$GAMMA= 0
##$GB= 0
##$INTBC= 1
##$INTSCL= 3.241238e-09
##$ISEN= 128
##$LB= 0.25
##$LEV0= 0
##$LPBIN= 0
##$MAXI= 10000
##$MC2= 0
##$MEAN= 0
##$ME_mod= 0
##$MI= 1.114404
##$NCOEF= 0
##$NC_proc= -8
##$NLEV= 6
##$NOISF1= 3.799351
##$NOISF2= 2.8
##$NSP= 0
##$NTH_PI= 0
##$NZP= 0
##$OFFSET= 15.5067
##$PC= 1
##$PHC0= -5299.148
##$PHC1= 6.821927
##$PH_mod= 1
##$PKNL= yes
##$PPARMOD= 0
##$PSCAL= 0
##$PSIGN= 0
##$REVERSE= no
##$SF= 200.13000300313
##$SI= 16384
##$SIGF1= 3
##$SIGF2= 2
##$SINO= 0.751879
##$SIOLD= 32768
##$SREGLST= <19F.Aceton>
##$SSB= 0
##$STSI= 16384
##$STSR= 0
##$SW_p= 3612.71676300578
##$SYMM= 0
##$S_DEV= 0
##$TDeff= 16384
##$TDoff= 0
##$TI= <>
##$TILT= no
##$TM1= 0
##$TM2= 0
##$TOPLEV= 0
##$USERP1= <user>
##$USERP2= <user>
##$USERP3= <user>
##$USERP4= <user>
##$USERP5= <user>
##$WDW= 1
##$XDIM= 16384
##$YMAX_p= 517808043
##$YMIN_p= -1361168
$$ End of Bruker specific parameters
$$ ---------------------------------
##NTUPLES= NMR SPECTRUM
##VAR_NAME=  FREQUENCY,     SPECTRUM/REAL,   SPECTRUM/IMAG
##SYMBOL=    X,             R,               I
##VAR_TYPE=  INDEPENDENT,   DEPENDENT,       DEPENDENT
##VAR_FORM=  AFFN,          ASDF,            ASDF
##VAR_DIM=   16384,         16384,           16384
##UNITS=     HZ,            ARBITRARY UNITS, ARBITRARY UNITS
##FACTOR=    0.220516191357247, 1,           1
##FIRST=     3103.35582992625, 0,            0
##LAST=      -509.360933079525, 0,           0
##MIN=       -509.360933079525, -1361168,    0
##MAX=       3103.35582992625, 517808043,    0
$$ Real data points
##PAGE= N=1
##DATA TABLE= (X++(R..R)), XYDATA
$$ [...]
7086h34026K70161J04231R8568m9202O4280J18406k14137k11494J41116J56140
7076c55957J45738J55380J78294o9867k27333j63277K28839k5006k09961J67200
7066a75950k01666l6374o0671N7061J93788J30201k02382P9121k92176K57961
7056b51087L6281J7386n607k42511J80265K5046m8057n5348P4890K71150l24868
7045c22460m48339L06460Q2111J63385M0158m13122j5187Q4981p9515K44632k06172
7034e63068q2076J25831M8144N4974o0273M68860j30129k15086J4654j0040j21209
7023d69418j04100N9467J3863K61545j86600O0136j33829L55760K38902l00145
7013b04419J77357k20685k66513j09890M9171K91394j93093K8258K88246J74210
$$ y = [-834026, -563865, -459634, -361066, -410268, -345988, -227582, -441719, -653213, -512097, -355957, -210219, -54839, 123455, 53588, -173745, -337022, -108183, -133189, -343150, -175950, -377616, -413990, -474661, -417600, -223812, -93611, -295993, -216872, -509048, -251087, -214806, -197420, -203027, -445538, -265273, -240227, -288284, -343632, -268742, 2408, -322460, -770799, -464339, -382228, -218843, -178685, -591807, -606994, -522013, -601528, -356896, -563068, -645144, -519313, -471169, -416195, -476468, -7608, -137737, -352823, -338169, -348209, -469418, -573518, -514051, -500188, -238643, -425243, -365107, -498936, -143176, 95726, -204419, -27062, -247747, -514260, -624150, -574979, -283585, -476678, -448420, -160174, 14036]
7003A4036l3002j72807K1565m56837O9578J11500L27435l8264k03557l9915P6383
6992c23885m5092j18644j553j2464K08645J11088p7416l7533N6163j39124l39062
6981g18877k2786K82079J86650M4729j67531k10671J37803M6312P3297J11008
6971b37987L5527J79179j4546j03561l9128p8700k5796l1873r8421n5477l52308
6960h23091j7563J57764R7705J1031p0172n0028O7721K828N5072K67750R5690
6949b05293R7479m05473K553K03474j216n1352j23425l1641j4957K6531J57340
6938c45980q5492M5067J55425m5221m4952k39476K22757J57836J49883j71886
6928b02039p1054r6671J46809j41832N9360j15042K21869J15324j66701q674K18414
$$ y = [14036, -18966, -191773, -170208, -627045, -557467, -445967, -118532, -156796, -360353, -400268, -323885, -368977, -487621, -489174, -501638, -292993, -181905, -259321, -296854, -240691, -379815, -718877, -741663, -459584, -272934, -228205, -395736, -606407, -468604, -422292, -348995, -237987, -202460, -23281, -37827, -141388, -180516, -259216, -285012, -316885, -415306, -470783, -823091, -840654, -682890, -585185, -574154, -644326, -694354, -626633, -623805, -568733, -300983, -205293, -107814, -513287, -510734, -307260, -308476, -359828, -483253, -514894, -529851, -503320, -345980, -431472, -386405, -230980, -276201, -321153, -560629, -337872, -180036, -30153, -202039, -273093, -369764, -222955, -364787, -305427, -420469, -198600, -83276, -249977, -258651, -40237]
6917d0237k40414J9266j11284L3494K94908J06281J563k96594q0615J05961O2247
6906a45424j85478J30856l96228K0534K01847J4296K18470J00587p0124r7143
6896b07807J78319k26440j67796K23089j01041k50917M4697K87145r0265J6719
6886b94297j44052j46172J48233k4902m2263K64301j2994j99823J51175J06606
6876a94188O199n5107J62605J46457J08772l40969M9000M048j37334J09077j74699
6865c16139K09964L9545l2736l6369k0345k02618J00639Q8252P9476k63271j34846
6854d88448L6066K23859j4144l122Q6628J83644p8754k51106j02496m5071Q4486
6843c68458R9855p3485K26588j31682j31297J34659j0390j21124M2986J82018
$$ y = [-40237, -280651, -261385, -372669, -339175, -44267, 62014, 63577, -233017, -313632, -207671, -145424, -330902, -200046, -596274, -575740, -373893, -359597, -141127, -40540, -110664, -207807, -29488, -255928, -423724, -200635, -301676, -552593, -507896, -220751, -311016, -294297, -438349, -584521, -436288, -461190, -503453, -239152, -252146, -451969, -300794, -194188, -187989, -243096, -80491, 65966, 174738, -166231, -117231, -113183, -250517, -141440, -316139, -106175, -66630, -99366, -135735, -156080, -358698, -258059, -169807, -90331, -353602, -488448, -452382, -228523, -242667, -245789, -159161, 24483, -54271, -305377, -407873, -452944, -368458, -268603, -342088, -115500, -247182, -378479, -243820, -254210, -375334, -332348, -150330]
6833a50330l8788r1478j08702j94277J90842J4630Q1964K20449j16153J6323k43261
6822d18781j05870l3271N5990k6511J21068o0592J08130p1593j51083j4759J69868
6811d27404K38720P5557j65148p1458o1224j29419K76284O5837j545k3024L1016
6800a91808K25570j01617j8856j31509K5216K2918o5255q1634j5671J91569m6519
6789a87596J6166K11820J3593j8505j0164M1085J11777k29829l51133n0706K03196
6778b50296R8147M607j23926J09846j35549J54172K1878j75425P197k5698L05897
6767i150j62412n1261j63321j80803k6673L01791K03867m4742k4332l01225K98199
6756a60062M3436m07137K00462J13734n5925L46653r9870l06376J69268k6111
$$ y = [-150330, -189118, -280596, -389298, -583575, -392733, -378103, -296139, -75690, -191843, -175520, -418781, -524651, -557922, -501932, -528443, -407375, -467967, -359837, -431430, -582513, -597272, -427404, -188684, -113127, -278275, -349733, -410957, -540376, -264092, -198255, -199800, -222824, -191808, 33762, -67855, -86711, -218220, -193004, -170086, -235341, -316975, -332646, -141077, -187596, -171430, 40390, 53983, 35478, 25314, 66399, 178176, -51653, -402786, -453492, -250296, -152149, -147542, -271468, -161622, -297171, -142999, -121121, -296546, -289349, -315047, -9150, -171562, -222823, -386144, -566947, -593620, -291829, -87962, -132704, -157036, -458261, -160062, -116626, -523763, -323301, -209567, -265492, 81161, -18709, -325085, -155817, -181928]
6746a81928K06628l7532j64592j0102q7010R7327J00861p8449K07830j28851O1963
6735a3855R2238l22840O5491O5200j69618l0608K30178L4182o6843R8382O0537
6724D2444j99517k86399K25309K32076j83835l6601J72951K30452k58715k24892
6714b86727K63848r1756j5958P9773j50950K75862j73061r6954j37018j36190
6704d69131J34521P9648L37815Q4463q9637k03368j90829l21253J23856K75944
6694b37971J33569M1303n7956L1128j43111J10105r0795J15104j32231K4583J89515
6683a6757l09168J42388K43331j52422k05087l2167K40334k4220r9222j89615
6673d02605J23808q480j14358K29885J41682L3752K570j75176k93744p8227R9761
$$ y = [-181928, 24700, -12832, -177424, -187526, -274536, -177209, -76348, -154797, 53033, -75818, -13855, 78383, -244457, -178966, -113766, -283384, -313992, -83814, -49632, -116475, -18093, 42444, -157073, -443472, -218163, 13913, -169922, -206523, -33572, 196880, -61835, -286727, -22879, -114635, -130593, -50820, -201770, 74092, -98969, -195923, -332941, -469131, -334610, -254962, 82853, 167316, 77679, -125689, -316518, -637771, -513915, -237971, -104402, -63099, -121055, -89927, -233038, -122933, -213728, -98624, -230855, -206272, -16757, -325925, -183537, 59794, -92628, -297715, -329882, -89548, -113768, -212990, -402605, -278797, -287277, -401635, -171750, -30068, 3684, 6254, -168922, -462666, -540893, -441132]
6662d41132O2539P9827N9674Q4118j18428j25644J18558K26167n4346m9891o6178
6651b24736K86661j02877k92315K94498J52953N5684K92583k7552m68673o6440
6641a00214J53564K95285k4316j72494j37261O368J10160j27889L9155p5240k68092
6630c00974K35509P8562j9709k2118j40270J10452q380Q8187M1212r734K32425
6619B85162L6147p82k79217J81823j96036Q4102K51887l41523l5650K39926n9857
6608A65982M7076J81664k81331p4214K13759j52398j44446M9947K54790j73420
6598H7409M7777Q5495q8215r0509l348K47435j35369p4239J90771j3025q2835
6587A71347j09389K56946O7518k04376N3676K423N2535M0001j80153j07880L69690
$$ y = [-441132, -378593, -298766, -239092, -154974, -273402, -399046, -280488, -54321, -108667, -158558, -224736, 61925, -40952, -333267, -38769, 114184, 169868, 462451, 434899, -33774, -100214, 53350, 348635, 324319, 151825, 14564, 20932, 131092, 3203, 42358, -32882, -300974, -65465, 13097, -6612, -28730, -169000, -58548, -66928, 21259, 62471, 52737, 285162, 321309, 320527, 41310, 223133, 27097, 111199, 363086, 21563, -14087, 225839, 165982, 213058, 394722, 113391, 39177, 252936, 100538, -43908, 6039, 260829, 87409, 135186, 220681, 132466, 41957, 38609, 286044, 150675, 76436, 267207, 254182, 171347, 61958, 318904, 386422, 182046, 235722, 238145, 290680, 330681, 150528, 42648, 412338]
6576D12338R4804k76504K74915L23260k07354m41879J31643N5655n3478J2691
6566C26091L833J98806q0497n6112J06201o3248k68404J89384J25970Q6843k68742
6555C00125J9673m2582r348K36399J06817j57406j21100L52029l0448K7752K51294
6544I33205j51580J4998k67272Q4389J31432l7781p0672j65421J03051j0615j14565
6533D49169L65837O7853k01310j86865P6375J63512R7940J76705K50426p5841
6523A183801k23922j28097J72806r3048J87935M3630N9621K44932q1509k95962
6513A070187k31691J49461K29223K55613j84971j94257j46485K18604J63142K06548
6503A535374k41562r1108j05877J43799M0838J99904p3975j22444J32403L5605
$$ y = [412338, 507142, 230638, 505553, 828813, 621459, 179580, 311223, 366878, 313400, 326091, 329924, 528730, 448233, 392121, 498322, 435074, 166670, 356054, 482024, 568867, 300125, 319798, 277216, 267868, 504267, 611084, 453678, 332578, 684607, 654159, 681911, 933205, 781625, 796623, 529351, 613740, 745172, 707391, 636719, 471298, 574349, 563734, 449169, 815006, 882859, 681549, 494684, 571059, 734571, 832511, 1009216, 1259642, 1183801, 959879, 831782, 1004588, 911540, 1099475, 1143105, 1202726, 1447658, 1366149, 1070187, 838496, 987957, 1217180, 1472793, 1287822, 1093565, 947080, 1165684, 1328826, 1535374, 1293812, 1202704, 1096827, 1240626, 1281464, 1481368, 1407393, 1284949, 1417352, 1452957]
6493A452957L1549j2049r7666K31632K57200l16431r4584r8212K7697r1157J0726
6482A301662L29404J29064l23507K03646R3712m2173k66605Q0785L01685j4672
6472A793001n4924J41057J28902k40174q9596K12198K37834l32134L80040j9000
6462B157204j52832n348p9348n3772K22891j53165J58244J21397J65296O9240
6452B449807j57071Q8812L3157K645j42651K9776N2569K90755j86233n9559k111
6441B399896J60567J44467J02682m0102j29210K24092l707j71569K8799O9997
6431B785912M81559J55495J68733m37284n7778o7424k4740J94492J15488Q9836
6421C404289j68383K04011j11024L01910j83926n6136O4599K50363J3043K83420
$$ y = [1452957, 1484506, 1472457, 1374791, 1606423, 1863623, 1547192, 1452608, 1354396, 1382093, 1290936, 1301662, 1631066, 1760130, 1436623, 1640269, 1733981, 1691808, 1425203, 1505988, 1807673, 1793001, 1738077, 1879134, 2008036, 1767862, 1678266, 1890464, 2128298, 1796164, 2176204, 2157204, 2004372, 1999024, 1919676, 1865904, 2088795, 1935630, 2093874, 2215271, 2380567, 2449807, 2292736, 2381548, 2414705, 2417350, 2274699, 2304475, 2357044, 2647799, 2461566, 2402007, 2399896, 2560463, 2704930, 2807612, 2767510, 2638300, 2862392, 2858685, 2687116, 2715915, 2785912, 3267471, 3422966, 3591699, 3154415, 3096637, 3029213, 3004473, 3198965, 3314453, 3404289, 3235906, 3439917, 3328893, 3630803, 3446877, 3390741, 3455340, 3705703, 3718746, 4002166]
6411D002166J30780k08454L18956K3562K34869L19263M5815r6553O6648L0477
6401D867529L3231K16961K41470J96724Q6145n4185L51434K11172L7055J88849
6391F376385K43138K39367r1273J05925J00128R0200K76297J33216K45298L26708
6381H045389K58848L0651O2526K31551L92003L4108J49375L79117L5462L25463
6371I944493L01175J10342K16057J61019J93526K68187K80474M39850N92743K28116
6361A2735982J45028L65219L05528K64684N49983L54568K23626M76849K26544
6352A5648011L04915L65459K77885N5437J6049J49559J81318K8400J77578K05322
6342A7409933K56841P4409Q8479J61845N9476K98601K79314L78547L17641J49922
$$ y = [4002166, 4132946, 3924492, 4243448, 4267010, 4501879, 4821142, 4866957, 4770404, 4837052, 4867529, 4900760, 5117721, 5359191, 5555915, 5642060, 5587875, 5939309, 6150481, 6187536, 6376385, 6619523, 6858890, 6767617, 6873542, 6973670, 7063870, 7340167, 7473383, 7718681, 8045389, 8304237, 8334888, 8397414, 8628965, 9020968, 9055076, 9204451, 9583568, 9619030, 9944493, 10245668, 10356010, 10572067, 10733086, 10926612, 11194799, 11475273, 11915123, 12507866, 12735982, 12881010, 13246229, 13551757, 13816441, 14366424, 14720992, 14944618, 15421467, 15648011, 15952926, 16318385, 16596270, 16651707, 16667756, 16817315, 16998633, 17027033, 17204611, 17409933, 17666774, 17741183, 17829662, 17991507, 18050983, 18349584, 18628898, 19007445, 19325086, 19475008]
6332A9475008K79160M26723L32861J63234L91649N72298L15085o3179L59683P6176
6322B2328698K42476K69722M17058L41425j14106M18235J60448M043P035K23334
6312B4298368J92295J08405P898m5296M87813M74613N9381J16786J91962K56738
6302B6148963Q110K32668K20716J91636K29608L26047K20643K01561K32266M82264
6292B8494482M15247M93887J98156N59346L27263J63420M27732M49341N81030
6283C2109904K86530P06600M18091O00706N93150L29315J68822O22159L85190
6274C6220467M80069N01975P54910O99880M64334R03000P64078O01639P37095
6265D2127447Q56713P51884R34313Q41349Q66739R87117J008819J261140R94816
$$ y = [19475008, 19754168, 20180891, 20513752, 20676986, 21068635, 21640933, 21956018, 21892839, 22252522, 22328698, 22571174, 22840896, 23257954, 23599379, 23485273, 23903508, 24063956, 24067999, 24075034, 24298368, 24490663, 24599068, 24606966, 24561670, 25049483, 25524096, 25583477, 25700263, 25892225, 26148963, 26157073, 26389741, 26610457, 26802093, 27031701, 27357748, 27578391, 27779952, 28012218, 28494482, 28909729, 29403616, 29601772, 30161118, 30488381, 30651801, 31079533, 31528874, 32109904, 32396434, 33103034, 33521125, 34121831, 34714981, 35044296, 35213118, 35835277, 36220467, 36700536, 37202511, 37957421, 38657301, 39121635, 40024635, 40788713, 41390352, 42127447, 42984160, 43736044, 44670357, 45511706, 46378445, 47365562, 48374381, 49635521, 50630337]
6256E0630337J279017J266094R65916Q84381J480559J452931R70261J467019J271692
6247F1668207J325722J393447J486289J342727J263439J424234J642076J314761
6239G2860902J271613J741784J413022J425718J752989J261514J288771J285471
6231H4301784J306228Q72324J312053J496611J192477J162835J188917J014327
6223I3847556J096787O69485P60762M83396N76632R23839N06117R75279N58624
6214A00398477L17962L20135K34325L95180K43115J53707J86081L0208K07095
6205A02486285M7085j20492k00654K05038j09559J8469J7480k45552n4427R9403
6195A02143076K38251j71921k51536K34535J46820R7942N6119j06101j42529j56505
$$ y = [50630337, 51909354, 53175448, 54141364, 55025745, 56506304, 57959235, 58929496, 60396515, 61668207, 62993929, 64387376, 65873665, 67216392, 68479831, 69904065, 71546141, 72860902, 74132515, 75874299, 77287321, 78713039, 80466028, 81727542, 83016313, 84301784, 85608012, 86480336, 87792389, 89289000, 90481477, 91644312, 92833229, 93847556, 94944343, 95613828, 96374590, 96857986, 97434618, 98358457, 98864574, 99839853, 100398477, 100716439, 101036574, 101270899, 101666079, 101909194, 102062901, 102248982, 102279190, 102486285, 102533370, 102412878, 102212224, 102417262, 102307703, 102326172, 102343652, 102098100, 102043673, 102143076, 102381327, 102209406, 101957870, 102192405, 102339225, 102437167, 102493286, 102387185, 102244656, 102088151]
6185A02088151O9967M20924J61960n4982L03798p4746J16558P8458R3501J25218
6175A03328807J12427K41724M4296Q0480K4937R8247J42078n0970K10488K00233
6165A04432747q468j97821j65095J31750k55465j45810j88999J29635O4950k36356
6155A03561068l00004l9173l83117j85516l82065j42265l77310l31929o00554
6146A00819135o50206l79688m03859l03256m29459n23075o46843n49769o42463
6137I6290517q00164n77852o21876l90085m14161r46667o41808p25193q80491
6128I0292220j179956q97829p73361n98632o70896p15597q12888q41881j175888
6119H2625292q74397p62381r83843j310378j114310j112825j029719p83553o57515
$$ y = [102088151, 102158118, 102579042, 102741002, 102686020, 102989818, 102915072, 103031630, 103110088, 103203589, 103328807, 103441234, 103682958, 103727254, 103807734, 103832671, 103930918, 104072996, 104022026, 104232514, 104432747, 104424279, 104226458, 104061363, 104193113, 103937648, 103791838, 103602839, 103732474, 103797424, 103561068, 103261064, 103221891, 102838774, 102653258, 102271193, 102128928, 101751618, 101419689, 100819135, 100168929, 99789241, 99385382, 99082126, 98652667, 98129592, 97482749, 96932980, 96290517, 95490353, 94912501, 94290625, 93900540, 93486379, 92539712, 91897904, 91172711, 90292220, 89112264, 88214435, 87441074, 86842442, 86171546, 85455949, 84643061, 83801180, 82625292, 81750895, 80988514, 80004671, 78694293, 77579983, 76467158, 75437439, 74653886, 73996371]
6110G3996371j062819j081543j012869j069183r08967r00355p61806j035771j268383
6101F4894675r85377q44616r06032q82846q53286r54863r24807k82675j055402
6092E7204771j039533q28225j104371n03363r77892j066347r47755q99552o39680
6083D9198053o17625r65205p59968n36117j004371o01295q96841p08329n11470
6074D2596832k37388n29044o57880o34454q52326n52096n56607o82350n69409
6065C7325278n42502o74654m61631l9620n48191m22072m66042p00229k84130n22506
6055C2663701l18146n33211l31249n55056l42358k28290k07631n53331l47827
6046B9246602k4760j01j37575J45252k6374K1887J81472K89706L39484L30943
$$ y = [73996371, 72933552, 71852009, 70839140, 69769957, 68860990, 67960635, 67198829, 66163058, 64894675, 63909298, 63064682, 62158650, 61275804, 60422518, 59467655, 58542848, 58260173, 57204771, 56165238, 55337013, 54232642, 53729279, 52751387, 51685040, 50737285, 49837733, 49198053, 48580428, 47615223, 46855255, 46319138, 45314767, 44713472, 43816631, 43108302, 42596832, 42359444, 41830400, 41172520, 40538066, 39685740, 39133644, 38577037, 37894687, 37325278, 36782776, 36108122, 35646491, 35606871, 35058680, 34636608, 34170566, 33470337, 33186207, 32663701, 32345555, 31812344, 31481095, 30926039, 30583681, 30355391, 30147760, 29594429, 29246602, 29221842, 29221741, 29084166, 29229418, 29203044, 29224931, 29406403, 29696109, 30035593, 30366536]
6036C0366536K83241L92367Q71502R21884M92447O41463O98983N88984J078514
6027C6335921R85492P72042M26272O97672O50459O26264O06025M93266O51145
6018D2244558N68780Q32361Q92406N24090O05725Q24020P08400Q02922K57440
6009D8260702M49001M40057J43620j25989n23839o18636l86395p65774q22858
6000D6049889j194369j206086q35654j056912j233311j122904j076185j136432
5992C7188036m85471p76846o92715j014554q04383p98147k47504j76435m23618
5983C1768363m38486j46427l04669K81804L4550P6505k39176L38p4583j49229
5973C0808990l21623n83273m64230o11490q57162j403102j197794p65222r81836
$$ y = [30366536, 30649777, 31042144, 31913646, 32835530, 33327977, 33969440, 34668423, 35257407, 36335921, 37321413, 38093455, 38519727, 39217399, 39867858, 40494122, 41100147, 41593413, 42244558, 42813338, 43645699, 44538105, 45062195, 45667920, 46491940, 47200340, 48003262, 48260702, 48709703, 49149760, 49293380, 49167391, 48643552, 48024916, 47638521, 46872747, 46049889, 44855520, 43649434, 42813780, 41756868, 40523557, 39400653, 38324468, 37188036, 36702565, 35925719, 35233004, 34218450, 33414067, 32615920, 32368416, 32191981, 31768363, 31329877, 31183450, 30878781, 31160585, 31195135, 31271640, 31032464, 31032802, 30958219, 30808990, 30487367, 29904094, 29439864, 28828374, 27971212, 26568110, 25370316, 24605094, 23623258]
5964B3623258j243969j059209p02295p46404o91431o55518o81284m48398o97108
5955A6697642m62805n30719n92123q9069J0319l47492J31399j50444l20265j27048
5945A4219395L01989K80428l0507j17364O3239j56422n0219j0694l26746k39592
5935A3933507m7105j88697k11922r1809j22184l61447m27978l25261P000j03824
5925A2060280m91806m25924j42173j23033l19593J79837K46015N6508k98364J95805
5915A0937552J7898R4980Q4573M3438J16360r2368Q0567K70674J42n12907q4668
5904A0956241k47412J5616l2989k58396k13570n21745m55833j93514j79172l1573
5894H837653j88127k35517j52891J09477l42441l87373j75882L6647m0478m1897
$$ y = [23623258, 22379289, 21320080, 20617785, 19871381, 19179950, 18524432, 17843148, 17394750, 16697642, 16234837, 15704118, 15111995, 15022926, 15033245, 14685753, 14817152, 14666708, 14346443, 14219395, 14521384, 14801812, 14771305, 14653941, 14717180, 14560758, 14510539, 14499845, 14173099, 13933507, 13886402, 13697705, 13485783, 13393974, 13271790, 12910343, 12482365, 12157104, 12164104, 12060280, 11568474, 11142550, 11000377, 10877344, 10557751, 10737588, 10983603, 11040111, 10741747, 10937552, 10955450, 11050430, 11135003, 11178441, 11294801, 11202433, 11283000, 11553674, 11553816, 11040909, 10956241, 10708829, 10724445, 10691456, 10433060, 10219490, 9697745, 9241912, 9048398, 8869226, 8837653, 8649526, 8414009, 8261118, 8370595, 8028154, 7640781, 7464899, 7501546, 7461068, 7419171]
5884G419171o2530k4237m05759j89050J07641R655j69721J936k22989l71461j68864
5873E923792j31995j35487N773j6833J064J18378R037k12521l96950K82257q4478
5862E362037J3864m5568L0261j08042l40583p284k6963j45112j24899m820j0459
5851D592432p3049J27554l29885J07126M6851O2483K98127l08857j20735J05130
5841D507177J71626j61292n7597k79730j58630J75916j31489M792L41004j78554
5831D233223k44745p7686j30001J25823J6160R8098k73198k14891Q2563N4587
5821C669933k44022k3370J39239j00844n4282j49163J80574J28014K95102M7241
5811C888422k68071L86708J70437J2623j26798l45471l20674J46085J5899R3620
$$ y = [7419171, 7356641, 7332404, 6926645, 6737595, 6845236, 6854891, 6685170, 6687106, 6464117, 6092656, 5923792, 5791797, 5656310, 5662083, 5645250, 5646314, 5764692, 5773729, 5561208, 5164258, 5446515, 5362037, 5375901, 5330333, 5360594, 5252552, 4911969, 4904685, 4877722, 4732610, 4607711, 4602891, 4592432, 4519383, 4646937, 4317052, 4424178, 4471029, 4533512, 4831639, 4522782, 4402047, 4507177, 4678803, 4517511, 4459914, 4180184, 4021554, 4197470, 4065981, 4070773, 4411777, 4233223, 3988478, 3910792, 3780791, 3906614, 3922774, 4020872, 3747674, 3532783, 3615346, 3669933, 3425911, 3402541, 3541780, 3440936, 3386654, 3237491, 3418065, 3546079, 3841181, 3888422, 3620351, 4007059, 4177496, 4190119, 4063321, 3717850, 3397176, 3543261, 3559160, 3652780]
5801C652780m067J59810j86390k45233j202j26036K45249K13711K5082k55003
5791C478701m41503l5478M35711R1233j23210P9155j28803J53738J80868r3418
5781C596994j03199J47321K29471j67743L06104j84405J19602K33464k3924K19695
5771D373380L4699j21827J66185j13546O5214L04636L69920J97945J89500M1826
5761E507932O54633P79946N37101M65299O36872O51507J275240J292317J333940
5752A3134787J653721K490425M049293P360593J2406328J8035823K0755294J6702245
5744I6588509K302655j1657123j5485472j5063982j2503246r664315p125464n411196
5736B1980366m331024l201394k064725j702260j094233o80990m69673o33440l92048
$$ y = [3652780, 3648713, 3808523, 3622133, 3376900, 3375698, 3249662, 3494911, 3708622, 3733704, 3478701, 3037198, 3001720, 3437431, 3528664, 3405454, 3484609, 3355806, 3509544, 3690412, 3596994, 3493795, 3641116, 3870587, 3702844, 4008948, 3824543, 3944145, 4177609, 4153685, 4373380, 4408079, 4286252, 4452437, 4338891, 4404105, 4708741, 5078661, 5276606, 5466106, 5507932, 6162565, 6942511, 7479612, 7944911, 8581783, 9233290, 10508530, 11800847, 13134787, 14788508, 17278933, 21328226, 28688819, 41095147, 59130970, 79886264, 96588509, 98891164, 87234041, 71748569, 56684587, 44181341, 34517026, 27391562, 21980366, 17649342, 14447948, 12383223, 10680963, 9586730, 8905740, 8436067, 7802627, 7410579]
5727G410579l32644k19548k13973k2649m44435L8082k91058k66967j16496m80849
5717E060042l07174j86047j79628k35098k8037J82841l60l38826m5748K11373
5707D133338k21471P9547l8154K5107l54397j05685j5346J54853k03848J7852
5697C471796k07737j19222J27839J62502p8155m9161R2951o7859m69129l9916
5687B823909J44557q5675m0474Q8255j74247j86209N1429K9280Q7050J11471K00975
5676C050321k85451k6073L8586Q130j84177q815q811J5052K0003J71880j69688
5665B620957k0464n8496N7886j06422K07973j55927j42195p2174M1000n2051j02656
5654B217431P5959k98J73929o6557l5780j03101k78446K96960j81223k8816m01
$$ y = [7410579, 7077935, 6858387, 6644414, 6621765, 6177330, 6215412, 5924354, 5657387, 5540891, 5060042, 4752868, 4566821, 4387193, 4152095, 4124058, 4306899, 4306539, 3967713, 3921965, 4133338, 3911867, 3991414, 3953260, 3978367, 3623970, 3518285, 3502939, 3657792, 3453944, 3471796, 3264059, 3144837, 3272676, 3435178, 3357023, 3307862, 3400813, 3332954, 2863825, 2823909, 2968466, 2882791, 2842317, 2930572, 2756325, 2570116, 2621545, 2650825, 2737875, 2849346, 3050321, 2764870, 2738797, 2777383, 2785513, 2601336, 2592521, 2583710, 2598762, 2618765, 2790645, 2620957, 2600493, 2541997, 2599883, 2493461, 2701434, 2545507, 2403312, 2331138, 2372138, 2320087, 2217431, 2293390, 2293092, 2467021, 2400464, 2364684, 2261583, 1983137, 2280097, 2098874, 2070058, 2069657]
5643B069657m4325r0162l1151o7013k9271j0508L6642l15703L61167l5877k79733
5632A563723J46076R4604k1097j17026k09800J25884P3919L4545J93409m2580
5622A841657k22285M4359j38472l4985L05225n5060j32267o7605L50661J1081
5612A902309j73786r0933J60064k72419N3996J00187k08727K39610K61288r5964
5602A875625l12906k0843j8080M5679O4890r7674l3781n3463p1712R4444J74960
5591A647139j0498J74222m3108j0687l00478P5920J28984j63171m0748m1046k03675
5580A212854j32043J91122K4878O7493Q7255L06063n3034l18671J24752o5672
5570A444997J85698j32913k71918R6996M36265k18513N6149k29896j55549P1967
$$ y = [2069657, 2025332, 1935170, 1904019, 1837006, 1807735, 1797227, 1833869, 1518166, 1879333, 1843456, 1563723, 1709799, 1804403, 1783306, 1666280, 1456480, 1582364, 1656283, 1690828, 1884237, 1841657, 1619372, 1663731, 1525259, 1490274, 1795499, 1740439, 1608172, 1540567, 1891228, 1902309, 1728523, 1637590, 1797654, 1525235, 1579231, 1679418, 1470691, 1710301, 1971589, 1875625, 1562719, 1541876, 1523796, 1569475, 1634365, 1536691, 1502910, 1449447, 1377735, 1472179, 1647139, 1636641, 1810863, 1767755, 1757068, 1456590, 1532510, 1661494, 1498323, 1457575, 1416529, 1212854, 1080811, 1271933, 1296811, 1364304, 1451559, 1757622, 1704588, 1385917, 1510669, 1444997, 1630695, 1497782, 1225864, 1322860, 1759125, 1540612, 1596761, 1366865, 1211316, 1283283]
5560A283283l3453n8309n4403M28692j52335k05152m1064Q0521J20767j10953
5550A257594j77691P8998Q1011n3572J73005K0044l86482L39203j990r4040J32722
5539A368802J77262k01482o1700K10136k37744q9893J09325n7744J5255n8605
5529A173612j8238K20162l72744k8457L13593j12884j83972K14173Q9378j24394
5519A170229j47531o057J8157R2099J2785M25724j67588o7677K17355r8002k9779
5508A419715K36012j72702l46094J13561P5785j10287J3912J41503J2323j11325
5498A272403j32618j57287P6623J65749J23660o7309j1810J96330j23941j74458
5488A167342p203L5873j55828m233j36883q2700J17145r9592K46713k7116n7000
$$ y = [1283283, 1249830, 1191521, 1137118, 1565810, 1413475, 1208323, 1167259, 1247780, 1368547, 1257594, 1079903, 1158901, 1239912, 1186340, 1359345, 1379389, 992907, 1332110, 1330120, 1236080, 1368802, 1546064, 1344582, 1282882, 1493018, 1255274, 1165381, 1274706, 1216962, 1232217, 1173612, 1155374, 1375536, 1002792, 974335, 1287928, 1175044, 991072, 1205245, 1294623, 1170229, 1022698, 1016641, 1034798, 1126897, 1139682, 1565406, 1397818, 1330141, 1547496, 1449494, 1419715, 1655727, 1483025, 1136931, 1250492, 1326277, 1215990, 1229902, 1371405, 1383728, 1272403, 1139785, 982498, 1059121, 1224870, 1348530, 1281221, 1269411, 1465741, 1341800, 1167342, 1160139, 1196012, 1040184, 1035951, 899068, 816368, 933513, 833921, 1080634, 1053518, 996518]
5477I96518P4510j5362q9826O1922L7370j25146p6325j06822n7592R469J28763
5466H37479j87499K08535K63012k71192J1066P7066n00091J29002n132J99197
5456G61443J02080l3807j62286l5254L61852J10940k55933j44935J47528J26890
5446I78518o4825j85184k99652K54981L27016Q7101j32788k12277J24702m9002
5436H28590J46706q3755k15231Q2478J64848J61005j1533M3016j38842L5890l0178
5425I82994l15753Q2531m8517Q3498R536J45260K15914m24983l7060K44965K03086
5414A141471Q4534l52199n482j6963k46678J10941N5599J44361O5895j0470k1135
5403I49874P9167k09831j80651J84050L64J12402L08015j69341k45531o6910J29679
$$ y = [996518, 1071028, 1055666, 965840, 1027762, 1065132, 939986, 863661, 756839, 699247, 708716, 837479, 649980, 858515, 1121527, 850335, 861401, 938467, 438376, 567378, 562246, 761443, 863523, 829716, 667430, 632176, 994028, 1104968, 849035, 704100, 851628, 978518, 913693, 728509, 428857, 683838, 1010854, 1097955, 965167, 752890, 877592, 828590, 975296, 891541, 676310, 758788, 923636, 1084641, 1073108, 1116124, 977282, 1013172, 982994, 667241, 749772, 701255, 784753, 794289, 939549, 1155463, 730480, 693420, 938385, 1141471, 1226005, 873806, 868324, 851361, 604683, 715624, 771223, 915584, 981479, 971009, 949874, 1029041, 819210, 638559, 822609, 822973, 935375, 1243390, 1074049, 828518, 761608, 891287]
5392H91287M4024K20921l5983j23454k17198m4119K17074J501l1031o9917m2568
5381H10537k8420j19077p7395r742K73456k4347J1697m3812p7819k13066o3707
5370D38305R3250K69707J77801o2800J38157j11832K31406o5166q8506k33398
5360G86924k89502J87556K14118j75300Q6650J2739J11057l9297n521P6259J66748
5349A132431l50154J2564J49350r4791k6013N0705M2691L47756j02968k58975
5339I02596R7364j10459j03690M6826j67439J14073O4081J1160K7514J08608L46706
5328A337340O5563k03415m12600q3127j77597j58613K66117l703J67704k91269
5318E06400K82328Q1379K3740O4283j72975j45690j49319K9422J33307J95853
$$ y = [891287, 935311, 1156232, 1120249, 996795, 779597, 735478, 952552, 954053, 923022, 853105, 810537, 782117, 663040, 585645, 575903, 849359, 825012, 836709, 792897, 715078, 502012, 438305, 531555, 801262, 979063, 916263, 1054420, 942588, 1173994, 1108828, 1020322, 786924, 497422, 684978, 899096, 723796, 810446, 823185, 934242, 894945, 889424, 965683, 1132431, 782277, 794841, 944191, 849400, 823387, 874092, 916783, 1264539, 1161571, 902596, 999960, 889501, 785811, 832637, 665198, 779271, 843352, 854512, 882026, 990634, 1337340, 1402903, 1199488, 786888, 703761, 526164, 367551, 633668, 629965, 797669, 506400, 788728, 870107, 893847, 958130, 785155, 639465, 490146, 519568, 652875, 848728]
5308H48728k16903J20574k6001r0004r4285K7228p9280J79415J28049J24076Q7002
5297A008599p8064k65242N0637K70148l53558l51901M72288J23257n6515j52060
5287F67589P7108l06467K13755K63837r2576Q6108J3107l7541M0168k08039k04570
5276E12479K17996j13780l9452l2973K24130L7789J34755O7638q6414m33081J23309
5265F12396N99140K04688k21470k12184J08261k66174k59705K37919k5654M7281
5255H24498J8358j98088L05049J04501K0220K1498L60053N4675l71723j16562
5245A022479R9358M6537o174J62120J13281P9666N8147j5803r6190j14946K50070
5234A598545j52824M2331J56907k63721K7749J26712m723m3316K23714J36059
$$ y = [848728, 631825, 752399, 726398, 636394, 542109, 569337, 490057, 669472, 797521, 921597, 1008599, 930535, 665293, 715930, 986078, 632520, 280619, 752907, 876164, 819649, 667589, 744697, 438230, 651985, 915822, 823246, 909354, 922461, 884920, 925088, 717049, 512479, 730475, 616695, 577243, 544270, 768400, 806189, 940944, 1008582, 922168, 489087, 612396, 1211536, 1416224, 1194754, 982570, 1090831, 824657, 564952, 802871, 777217, 824498, 842856, 644768, 949817, 1054318, 1074538, 1096036, 1456089, 1510764, 1139041, 1022479, 1121837, 1168374, 1162200, 1324320, 1437601, 1517267, 1575414, 1559611, 1463421, 1348475, 1598545, 1445721, 1488052, 1644959, 1381238, 1408987, 1535699, 1530976, 1487660, 1711374, 1847433]
5224A847433L8295R5935Q4023L34780M8613j23528k01363K7768j1469J97546l9003
5213B299030o2057J67746j58062J36416K14327j31422n0531M20185Q8525j87121
5203B737036q652J42879N332J17133l2816J54517k68618j44239J51816J95014
5193C049402Q3654j27956q3594j019J81941J06839K26768J0833j32128M7471M4757
5182C406968m8373M9689Q8022Q0853q9717L45558L04487j81353j95326J21353
5172C882161N076Q2321K15533J63463M8886r5424J55628P0017J37614j5146J00221
5161D750350j60087J74039K78166J69256N7409k27199k53013J17513L20243M3546
5151E270223O1911k85017Q5920o2735J33754R4215N3475K1254k3479r6281m5103
$$ y = [1847433, 1885728, 1981663, 2065686, 2400466, 2449079, 2325551, 2124188, 2151956, 2140487, 2338033, 2299030, 2236973, 2404719, 2246657, 2383073, 2597400, 2465978, 2415447, 2835632, 2924157, 2737036, 2728384, 2871263, 2876595, 2993728, 2960912, 3115429, 2846811, 2702572, 2854388, 3049402, 3133056, 3005100, 2921506, 2920487, 3102428, 3209267, 3436035, 3446868, 3314740, 3362211, 3406968, 3358595, 3408284, 3496306, 3577159, 3487442, 3833000, 4137487, 3956134, 3760808, 3882161, 3887237, 3969558, 4185091, 4348554, 4397440, 4302016, 4457644, 4527661, 4665275, 4650129, 4750350, 4590263, 4764302, 5042468, 5211724, 5269133, 5041934, 4788921, 4906434, 5226677, 5270223, 5332134, 5047117, 5133037, 5070302, 5204056, 5298271, 5351746, 5373000, 5349521, 5253240, 5208137]
5140E208137K02168j81164J04467l9411j2910J96716K29165N7845p524k07071
5130E550418j27642N06231R0641j3239K44269Q7711O2395P4175J00520l9508j8882
5119F517089K26446L23842N7458Q1948m2242J09088l2349l42831J54353J82443
5109G235245j64870P5306O817L33578L49249Q0910K38993J88409j9108j95543
5099H128986J0924M22453R7420J411J42816o9318J10020L33422J46904j55795
5089I169243J25855J97000K35453p9168L16574K88546J67857n1115J68392j26735
5079A0411902j73997n5861N8163J2811j14030J22842O5437J51909q8580l14929
5069A0075667j04101N9228l6571J15966O2403K82277L5646o2838J21579K9445
$$ y = [5208137, 5410305, 5229141, 5333608, 5294197, 5281287, 5478003, 5707168, 5765013, 5757489, 5550418, 5422776, 5929007, 6019648, 6006409, 6250678, 6338389, 6400784, 6474959, 6575479, 6535971, 6517089, 6743535, 7067377, 7124835, 7206783, 7164541, 7273629, 7241280, 6898449, 7052802, 7235245, 7070375, 7145681, 7152498, 7486076, 7835325, 7916235, 8155228, 8343637, 8324529, 8128986, 8139910, 8562363, 8659783, 8661194, 8804010, 8734692, 8844712, 9178134, 9325038, 9169243, 9295098, 9492098, 9727551, 9648383, 9964957, 10253503, 10421360, 10370245, 10538637, 10411902, 10237905, 10182044, 10240207, 10253018, 10138988, 10261830, 10327267, 10479176, 10390596, 10075667, 9971566, 10030794, 9994223, 10110189, 10172592, 10454869, 10490515, 10427677, 10549256, 10578701]
5059A0578701k41516l22241K91870K20314m8928j20475l31479l3051l8526K98790
5049A0253459J84735m400k6233j62158j2173J1646J07142N7156o8415J62000q2961
5038A0419798r2409R790J72232J87902m3175M1673J09233j96535J71878J23309
5028A0903696j57332R1227J42118p9666K86067K38405k16371j0135j74220J21877
5018A1145666J14657M8000L06158j2075L0390J0004J46J47783L7938j24779J64007
5007A1867895Q6728m5354R7600n8606l4743N9015L72060K56658r2991N3763j038
4996A2560987N27287K79167o0177L85895N32218Q60456O40792O21802K19390L64343
4986A6932160o759m28819q55960r36384o01136m21187m73619m49659K30681l32493
$$ y = [10578701, 10337185, 10014944, 10306814, 10527128, 10478200, 10357725, 10026246, 9993195, 9954669, 10253459, 10438194, 10433794, 10407561, 10245403, 10233230, 10244876, 10352018, 10409174, 10340759, 10502759, 10419798, 10327389, 10337179, 10509411, 10697313, 10654138, 10695811, 10805044, 10608509, 10780387, 10903696, 10746364, 10837591, 10979709, 10900043, 11186110, 11424515, 11208144, 11198009, 11023789, 11145666, 11260323, 11308323, 11614481, 11602406, 11632796, 11642800, 11642946, 11790729, 11828667, 11703888, 11867895, 11954623, 11909269, 12006869, 11948263, 11913520, 11972535, 12344595, 12601253, 12508262, 12562025, 12560987, 13088274, 13367441, 13307264, 13693159, 14225377, 15085833, 15726625, 16348427, 16567817, 16932160, 16925401, 16496582, 15640622, 14704238, 14103102, 13681915, 13208296, 12758637, 12989318, 12656825]
4976A2656825k12386j56953l75607j2495M2728L03406L2007J03143j23235r0787
4966A2166646O6246k79762o3912l3245M3361J7244k9070K58836J91149l93139
4956A1944354j80571j33597m8689J7153r5161K6015R6898K38813K5189l51911
4946A1538493k2296K26590R1702J3556K52759O8780l03787O3976J89150k9267
4936A2089656R9488J54670l03320n4109J46063j87396j6952k77103r5692q2756
4926A1472549j49413K06432k0077j34244m5121J10690J5542L04067j23744K81159
4916A1917840p9330K34879j49747j43K91792K10585L89855R2871R9563K03985
4906A3212150L54091J41250K14591L82640P4723R8729O99703M85416J99454L56944
$$ y = [12656825, 12444439, 12287486, 11911879, 11899384, 11942112, 12245518, 12277525, 12380668, 12257433, 12166646, 12232892, 11953130, 11889218, 11855973, 11899334, 11916578, 11887508, 12146344, 12337493, 11944354, 11763783, 11630186, 11581497, 11598650, 11503489, 11529504, 11626402, 11865215, 11890404, 11538493, 11516197, 11742787, 11834489, 11848045, 12100804, 12169584, 11865797, 11929773, 12118923, 12089656, 12189144, 12343814, 12040494, 11986385, 12132448, 11945052, 11928100, 11650997, 11555305, 11472549, 11323136, 11529568, 11509491, 11375247, 11330126, 11440816, 11456358, 11760425, 11636681, 11917840, 11838510, 12073389, 11923642, 11923499, 12215291, 12425876, 12815731, 12908602, 13008165, 13212150, 13566241, 13707491, 13922082, 14304722, 14379445, 14478174, 15177877, 15663293, 15862747, 16219691]
4896A6219691K16424M60302N35128L93442M47902N49913M04790L56483M59280
4887B0043355K68094L13987N60987M24390K20575K27168k20933L00631M80372
4878B2618626K92951J21414J45253L87063L52830J73855K17109J48215J83646
4869B4640962j6488L42459K75833j76518k4757k10176l4690J44511j53199j07620
4859B4680317l17097P5270l4979n07497j14310j54704j17520r1208j89491K11454
4849B3440235M38857M92487K36100K84780J79443j04141l76303l94390j40179
4840B4056889j2925j89542j85571k20049J48820N9987k60117J55544J08911m8058
4830B3613889M75597M11274M61927N09039M42987N56421O48588N60008Q49789
$$ y = [16219691, 16436115, 16896417, 17431545, 17824987, 18272889, 18822802, 19227592, 19584075, 20043355, 20311449, 20625436, 21186423, 21610813, 21831388, 22058556, 21837623, 22138254, 22618626, 22911577, 23032991, 23178244, 23565307, 23918137, 24091992, 24309101, 24457316, 24640962, 24624474, 24966933, 25242766, 25066248, 25041491, 24831315, 24796625, 24941136, 24787937, 24680317, 24363220, 24438490, 24403511, 23896014, 23781704, 23627000, 23509480, 23418272, 23228781, 23440235, 23879092, 24371579, 24607679, 24892459, 25071902, 24967761, 24591458, 24197068, 24056889, 24043964, 23854422, 23668851, 23448802, 23597622, 23657609, 23397492, 23553036, 23661947, 23613889, 24089486, 24500760, 24962687, 25471726, 25914713, 26471134, 27119722, 27679730, 28529519]
4821B8529519J329237K056781L937001O363028R968720J3518849J4953036J0266929
4813I0923100k048948j0131021j1405344j0570970r053129o860703m879356m372847
4805C1600782l211423k703986j469753j110603j168453q54165q05819n93106q42287
4796A8841187l58993o7584m88371l26982l04087o00932k90602j30012m88685l97142
4786A5387797j82980l84178l08385k50887j44338k29514k07141k43588j3895Q06
4776A3423697n7240j3575l35100j18998q7058j85169J600r7186k53470J03165
4766A2380666K28633J46055r8434n1838J06168R9577n2547O50871K44307j46060
4756A3507398J50320K68221K23013K06366J96241K68395K28876J48895K20719
$$ y = [28529519, 29858756, 31915537, 35852538, 42215566, 52184286, 65703135, 80656171, 90923100, 88874152, 78743131, 67337787, 56766817, 47713688, 40852985, 35973629, 31600782, 28389359, 25685373, 24215620, 23105017, 21936564, 21082399, 20276580, 19683474, 18841187, 18482194, 18414610, 17926239, 17599257, 17295170, 16694238, 16403636, 16273624, 15784939, 15387797, 15204817, 14820639, 14512254, 14261367, 14117029, 13887515, 13680374, 13436786, 13422891, 13423697, 13366457, 13352882, 13017782, 12898784, 12811726, 12626557, 12628157, 12530971, 12277501, 12380666, 12609299, 12755354, 12656920, 12605082, 12711250, 12810827, 12758280, 13409151, 13653458, 13507398, 13657718, 13925939, 14148952, 14355318, 14551559, 14819954, 15048830, 15197725, 15418444]
4747A5418444J44700J61697K77030J32154L92315K65747J30607K75143M71959
4738A7669796L97732L63472N34725K0002L23454N68206K39416N35586N31042N39599
4728B1723030N98625O81977J034686P49211M15296O66705Q38800Q89273O94635
4719B8292238J018468Q76921N10532O18882N20996N43845K95083M11362M07184
4710C3495511q2825J88808M2431L37946N29819K4339O37077O04111P57678Q13525
4700C7348420P89875R70509R45419J072058J093629J111508J259091R19222P92256
4691D6301987P47218L79317L22535P7022l67927k71925n31757j155413j155226
4682D4345831j113645j252248j297950q89758j062369j001044j013332r30073
$$ y = [15418444, 15563144, 15724841, 16001871, 16134025, 16526340, 16792087, 16922694, 17197837, 17669796, 18067528, 18431000, 18965725, 18985727, 19309181, 19877387, 20116803, 20652389, 21183431, 21723030, 22321655, 23003632, 24038318, 24787529, 25202825, 25869530, 26708330, 27597603, 28292238, 29310706, 30187627, 30698159, 31317041, 31838037, 32381882, 32676965, 33088327, 33495511, 33412686, 33601494, 33643925, 33981871, 34511690, 34536029, 35173106, 35777217, 36534895, 37348420, 38138295, 39108804, 40054223, 41126281, 42219910, 43331418, 44590509, 45509731, 46301987, 47049205, 47428522, 47751057, 47828079, 47460152, 47188227, 46656470, 45501057, 44345831, 43232186, 41979938, 40681988, 39792230, 38729861, 37728817, 36715485, 35785412]
4674C5785412q17087p39944m14538n72696m14640m0361p26594m10998o28935n14047
4664C0505572o55228o96214q34738j049344p36588j164007j327061q46706p21927
4655B2473759j108433j135631r94431p62343j106063q62005o38114o57037o04956
4646A4604746m32192o73116m13925l93387p3331k88032J06219k13501k19285J72664
4636A2176860r8262L3136N6038K93690Q50448P78959J145665K505104L673381
4627B1415019K943713K029499M23210j930169k787650k209157j699668j042342
4619A7142455q87356o22413l13055k70956N1669R71862J017562J438255J780093
4610B0308116J904026J745740J165858P80123O22261J210506J799160K851151
$$ y = [35785412, 34968325, 34228381, 33813843, 33241147, 32826507, 32786146, 32059552, 31648554, 31019619, 30505572, 29850344, 29154130, 28319392, 27270048, 26533460, 25369453, 24042392, 23195686, 22473759, 21365326, 20229695, 19235264, 18472921, 17366858, 16504853, 15866739, 15209702, 14604746, 14172554, 13499438, 13085513, 12692126, 12618795, 12330763, 12436982, 12223481, 12004196, 12176860, 12078598, 12111734, 12167772, 12461462, 13311910, 14090869, 15236534, 17741638, 21415019, 24358732, 26388231, 26811441, 24881272, 22093622, 19884465, 18184797, 17142455, 16255099, 15632686, 15319631, 15048675, 15100344, 16072206, 17089768, 18528023, 20308116, 22212142, 23957882, 25123740, 25903863, 26526124, 27736630, 29535790, 32386941]
4602C2386941K855069K300798J384236L21416j79954j84135Q03121K118365K681447
4593D4487304K120023R33855k75953j972088k460788k069712j142273l05470n0344
4584C9264554k13333q41543k145790l074758k866702j939731j294823j442749
4576B5445125j332541j220528j410038j903787k082100j878214j653846j336982
4568A2627089j289589q10566q40762o91256m83916l44233m70242l86222n20069
4559F790234j98346j02034j65845m4208k8612j78385J46585j87313O2995J42483
4549F237554M0278L90671K21927P3903L1372P9397l96264k94545l11122j27277
4539E945894o67341l46210m6126j85487k48708j30370q154J4740P8856n5176K08789
$$ y = [32386941, 35242010, 37542808, 38927044, 39248460, 39068506, 38884371, 39687492, 41805857, 44487304, 46607327, 47541182, 47265229, 45293141, 42832353, 40762641, 39620368, 39314898, 39264554, 39051221, 38209678, 36063888, 32989130, 30122428, 28182697, 26887874, 25445125, 24112584, 22892056, 21482018, 19578231, 17496131, 15617917, 13964071, 12627089, 11337500, 10526934, 9686172, 8994916, 8511000, 8166767, 7696525, 7310303, 6790234, 6591888, 6489854, 6324009, 6279801, 6251189, 6072804, 6219389, 6032076, 6095071, 6237554, 6277832, 6668503, 6890430, 6964333, 6995705, 7075102, 6678838, 6384293, 6073171, 5945894, 5278553, 4932343, 4886217, 4700730, 4452022, 4321652, 4313498, 4328238, 4407094, 4351918, 4560707]
4528D560707N6415k92797k657J61759L767K3491J71823N3444k16147O924j15032
4517D411697R6077K09023N6896l8435K35720J84233L65456O6528J9833M98415
4507F105443N21735K85713M2371O470m9731k06917j02618j21793k95751m0738
4497F144184j7757l4984k6943p7656J18355j59719l18270r7803k13261k24899
4487E091247M668m361Q4038j63261k31131q7380j52667P2418K90503m5113j76720
4476D682241j01916k16029q3300k28576K65117r0260j00093L81217j76987l19958
4466D011456k96368k9197j36407j75846l7415k75354j36307J46989j0492l32650
4456B728409k92367j196L41954J41911k96650j13316m3225q3369j49197M3419
$$ y = [4560707, 4617122, 4324325, 4321668, 4483427, 4487194, 4510685, 4682508, 4735952, 4519805, 4526729, 4411697, 4507774, 4716797, 4773693, 4735258, 4970978, 5155211, 5520667, 5587195, 5607028, 6105443, 6627178, 6912891, 6955262, 6961732, 6912001, 6705084, 6602466, 6480673, 6184922, 6144184, 6126427, 6091443, 6064500, 5986844, 6105199, 5945480, 5627210, 5529407, 5316146, 5091247, 5095915, 5091554, 5175592, 5012331, 4781200, 4693820, 4541153, 4613571, 4904074, 4858961, 4682241, 4580325, 4364296, 4280996, 4052420, 4317537, 4227277, 4127184, 4508401, 4331414, 4011456, 3715088, 3685891, 3549484, 3373638, 3336223, 3060869, 2924562, 3071551, 3061059, 2728409, 2436042, 2434846, 2776800, 2918711, 2622061, 2508745, 2465520, 2382151, 2232954, 2276373]
4446B276373q2918K75546k30637l53366J61442j8398j3963k2879N5190l57006
4436A689384L9532q1801R7861K58959J91179p4859k41667R3680j16500l7143M1740
4425A860365o8682L1022j61103L764j4628O5199l3046J67042J4043k3485k46641
4414A593850m06421k03709k06048P8602L00695M08942j58596j52390Q7471N5974
4404A398370K9943J78919l7289k23998O8950j56930R8714N3583M7056J20263k32239
4393A345342L8066p3651q4418J36767k9371K14606j40166J50768J49726r2819
4383A614850o1318j01902k23571L94066n1565k38592K94341Q0301k45964l4543
4373A426103k6584Q3908o8372K12557M7340k38530K61250K54965j74605J81040
$$ y = [2276373, 2193455, 2469001, 2238364, 1884998, 2046440, 2028042, 2014079, 1991200, 2046390, 1689384, 1728916, 1647115, 1744976, 2003935, 2195114, 2120255, 1878588, 1972268, 1855768, 1818625, 1860365, 1791683, 1822705, 1661602, 1665366, 1650738, 1715937, 1682891, 1849933, 1863976, 1840491, 1593850, 1187429, 983720, 777672, 856274, 1156969, 1565911, 1407315, 1254925, 1342396, 1398370, 1428313, 1607232, 1569943, 1345945, 1414895, 1257965, 1356679, 1410262, 1457318, 1577581, 1345342, 1383408, 1309757, 1225339, 1362106, 1332735, 1547341, 1407175, 1557943, 1707669, 1614850, 1553532, 1451630, 1228059, 1622125, 1570560, 1331968, 1626309, 1706610, 1460646, 1426103, 1399519, 1483427, 1415055, 1627612, 1674952, 1436422, 1697672, 1952637, 1778032, 1959072]
4363A959072M158n7838Q0289j41075M8040o6241l2236J97726j28991K16499J14682
4352B194085J15806K90079j6789J14182K9165M34542p0576K09950K53269J48938
4342C702651J56501J21339l9457J13621j5560J32210M01688L04666j76100l8176
4332D663383J62638K16929J93J22131k3856j1480k5798k11528q8972K05939L9194
4321E048773m19465j24075P45q7281j75544J54517Q858m6071J78551M8387l34785
4310D252610l89891K33715N1567K28862j04835K00921J11939P7641k64173K17010
4300D615366M19936J20531J17486M10339K48533K69511K56483K30426o3350J75342
4290F800603K0914L62368N93557M72172M64573N87550J72474P1552L28461R1930
$$ y = [1959072, 1963230, 1905392, 1985681, 1844606, 1892646, 1826405, 1794169, 1991895, 1862904, 2079403, 2194085, 2309891, 2599970, 2583181, 2697363, 2726528, 3161070, 3090494, 3300444, 3553713, 3702651, 3859152, 3980491, 3941034, 4054655, 4039095, 4171305, 4572993, 4877659, 4701559, 4663383, 4826021, 5042950, 5043143, 5165274, 5141418, 5129938, 5104140, 4892612, 4803640, 5009579, 5048773, 4629308, 4505233, 4505978, 4418697, 4243153, 4397670, 4406528, 4360457, 4539008, 4587395, 4252610, 3862719, 4096434, 4148001, 4376863, 4272028, 4472949, 4584888, 4662529, 4398356, 4615366, 5035302, 5155833, 5273319, 5683658, 5932191, 6201702, 6458185, 6688611, 6625261, 6800603, 6821517, 7183885, 7777442, 8249614, 8714187, 9301737, 9474211, 9545763, 9874224, 9966154]
4280I966154K34692J01783J82543K2379J23739p9705M67905k53865n36331j34772
4270A0094522k18230l46187K0720M27124N10261O68046J117162J065142O52014
4261A3990574J70751l64601m82077p64082q82568o70553r8586l1112K5959q2981
4251A0810724O72531J041660R42522J126067J432139J196493J005400Q62249M00957
4242A9490742J4048o0745J00921L00401O93428J031461J458348K178649K979065
4233B8186318L536628L410175L552949L383053L914260M368685M433430O932113
4225F1717611J0664245J5944999K7198185M8738106P6757424R6645382R0396292
4218D28062244M4797411l4230946p3964494p4397282o4572596m9398001l8093865
$$ y = [9966154, 10200846, 10302629, 10485172, 10507551, 10631290, 10551585, 11019490, 10765625, 10229294, 10094522, 9876292, 9530105, 9550825, 9977949, 10488210, 11156256, 12273418, 13338560, 13990574, 14161325, 13796724, 13314647, 12550565, 11667997, 10997444, 10898858, 10867746, 10893705, 10810724, 11483255, 12524915, 13467437, 14593504, 16025643, 17222136, 18227536, 19089785, 19490742, 19504790, 19444045, 19544966, 19845367, 20538795, 21570256, 23028604, 25207253, 28186318, 31722946, 35133121, 38686070, 42069123, 45983383, 50352068, 54785498, 61717611, 72381856, 88326855, 115525040, 164263146, 241020570, 337665952, 428062244, 472859655, 438628709, 364664215, 290266933, 225694337, 176296336, 138202471]
4211A38202471k9367856k2081423j6676057j2088432o222660l206177k074237
4204D6485629k132116k761427k513084k280026k319265j361626j495869j501151
4196C0121065j658655j617029j259317j067720j397431j350159j794358j477819
4188A8498577j225362j125338r95598n86026o12188o45748l81083m15434k88193
4179A2223607k00513l53442m85827k72220q6069m45965l75223l42115l09173m25575
4169H927485N4838k75870m40110j59217o6119j45579k87057j80840j06227J02919
4159G424223R4260k72225j33796j98024j4320k98076L01483r8086r3155L15960
4149G028244M89927J1700J96636o2077J9549N8074J83859k9213q2132j89704q9606
$$ y = [138202471, 108834615, 86753192, 70077135, 57988703, 51766043, 48559866, 46485629, 44353513, 41592086, 39079002, 36798976, 34479711, 33118085, 31622216, 30121065, 28462410, 26845381, 25586064, 24518344, 23120913, 21770754, 19976396, 18498577, 17273215, 16147877, 15152279, 14566253, 13954065, 13308317, 12927234, 12511800, 12223607, 12023094, 11669652, 11183825, 10911605, 10825536, 10379571, 10004348, 9662233, 9353060, 8927485, 8982323, 8706453, 8266343, 8107126, 8041007, 7895428, 7608371, 7427531, 7321304, 7424223, 7518483, 7246258, 7112462, 6914438, 6900118, 6602042, 6903525, 6805439, 6712284, 7028244, 7518171, 7529871, 7726507, 7664430, 7683979, 7742053, 7925912, 7896699, 7814567, 7624863, 7535257]
4138G535257O9905K46160J42848J3368k2133q5320J28524K90599m3953J46196
4128H421451k02588o4509J12776J3237N49773Q3552j37686K39058L5746L90358
4118I441168K0132K22867N64431K02957J13511J51652J65931K6704M71741M77367
4108A1858461R1832L48272N72227l8931K57459N14634L30738J63624M59944L72919
4098A4931179L32031K2711L50317L62294M18056L05636M57077M91455n467L28116
4088A7993405P65853M36337K58859L76147J01443L23466O79348P04636O54121
4079B2293615K74946P90123L78978P09957L85793O40034O91484L51304K99043
4070B6815277N20100L63237P91990K60934K51648N57928K84578M50806L67164
$$ y = [7535257, 7605162, 7851322, 7994170, 8007538, 7985405, 7900085, 8028609, 8319208, 8275255, 8421451, 8218863, 8154354, 8267130, 8280367, 8830140, 8913692, 8776006, 9015064, 9050810, 9441168, 9461300, 9684167, 10248598, 10451555, 10565066, 10716718, 10882649, 10909353, 11381094, 11858461, 11950293, 12298565, 12870792, 12831861, 13089320, 13603954, 13934692, 14098316, 14558260, 14931179, 15263210, 15285921, 15636238, 15998532, 16416588, 16722224, 17179301, 17670756, 17665289, 17993405, 18759258, 19195595, 19454454, 19830601, 19932044, 20255510, 20934858, 21639494, 22293615, 22568561, 23358684, 23737662, 24447619, 24833412, 25473446, 26164930, 26516234, 26815277, 27335377, 27698614, 28490604, 28751538, 29003186, 29561114, 29845692, 30296498, 30663662]
4061C0663662J65712K79174K95349K11038K25098L94338Q05378L85477K85287
4052C3710513O79316J154789J413199K143993K913468K742374K085211Q94688
4044D7737551o86470q75192r53309n15878m7648k3406j3346J63228K87218L46575
4034D5419323K18843J37723K15540Q2209J07070L01146J89514J95918J71745M76511
4024D7515542J91141k3408N56049N05874O31701J123161Q61375Q49982J106827
4015E3318244R50397M23125O4287O00297J19556K38974l84012m50743m88555q46648
4005E3544922j102170r10048l20052l47001l01885k70249m14918l04446j85764
3996D9388389q5590K1663R4917k81619n42284J44874k12544m54283k53219n94629
$$ y = [30663662, 30829374, 31108548, 31403897, 31614935, 31840033, 32234371, 33039749, 33425226, 33710513, 34389829, 35544618, 36957817, 39101810, 42015278, 44757652, 46842863, 47737551, 47051081, 46175889, 45222580, 44706702, 44659054, 44635648, 44622302, 44785530, 45072748, 45419323, 45638166, 45775889, 45991429, 46073638, 46180708, 46481854, 46671368, 46867286, 47039031, 47515542, 47706683, 47683275, 48239324, 48745198, 49376899, 50500060, 51361435, 52211417, 53318244, 54268641, 54691766, 54756053, 55356350, 55475906, 55714880, 55330868, 54880125, 54391570, 53544922, 52442752, 51532704, 51212652, 50865651, 50563766, 50293517, 49878599, 49574153, 49388389, 49302799, 49324462, 49419379, 49137760, 48595476, 48740350, 48527806, 48073523, 47820304, 47225675]
3986D7225675m74722m34858n77518m24083q23703q56983n37522n92199o28439
3977D1875648m94095o21966k34595l72968o86441m14050l36197q65460n62804
3968C7287072l53086j52322o14234l89237n16418k67023j49709n47473p2226m29795
3958C3795549n23826k16440o36865m17226m44715l90675m92551l57801l75043
3949B9940407j95063j34410p9776K75712O86411J262770K046739K273722J365509
3940C7442021n02692j297866j482754k010734j494050j186422n73313j97067l72524
3931B8324599j90642k2178k54586l28130p33326n16125m12557n20136l81698o24192
3921B4341029m33463n41500n64256n69985l80058M7908j94066J87218R99432J735123
$$ y = [47225675, 46750953, 46316095, 45738577, 45314494, 44490791, 43633808, 43096286, 42504087, 41875648, 41381553, 40759587, 40524992, 40152024, 39465583, 39051533, 38715336, 37849876, 37287072, 36933986, 36781664, 36167430, 35778193, 35261775, 34994752, 34845043, 34297570, 34225344, 33795549, 33271723, 33055283, 32418418, 32001192, 31556477, 31165802, 30673251, 30315450, 29940407, 29745344, 29610934, 29531158, 29806870, 30493281, 31756051, 33802790, 36076512, 37442021, 36939329, 35641463, 34158709, 32147975, 30653925, 29467503, 28894190, 28697123, 28324599, 28133957, 28111779, 27857193, 27529063, 26795737, 26279612, 25867055, 25346919, 24965221, 24341029, 23907566, 23366066, 22801810, 22231825, 21851767, 21899675, 21705609, 21892827, 22892259, 24627382]
3911B4627382J904820J295452k98612j726869k430538k225727j925973j278651
3903A7941284j171376p60518q47137p24420m57485l02951L8181j00717q4369P4469
3893A3604961k61281j30979l0465k79927k47699K5763L26127n2513J36482M1699
3883A3132168M064J9982L30300M6878m9019J20862n4442L2235j04823J43252k22110
3872A3399347O8175O8707j6079k06341q4149J26357j50846J08207K39184k16327
3862A3336235j23679J55126J28063j87960J75984N25888K2813K20639K65686L52374
3852A4871169N28328L12728O59544N08239M43172Q53154O99463R10172P93058
3843B0579027P59169R57365P12502Q79277J103327Q68034N68221O39298N62071
$$ y = [24627382, 26532202, 27827654, 27529042, 25802173, 23371635, 21145908, 19219935, 17941284, 16769908, 16009390, 15162253, 14437833, 13980348, 13677397, 13715578, 13614861, 13530492, 13604961, 13343680, 13212701, 13182236, 12902309, 12654610, 12680373, 13006500, 12953987, 13090469, 13132168, 13136232, 13156214, 13486514, 13533392, 13484373, 13605235, 13550793, 13583028, 13478205, 13621457, 13399347, 13467522, 13536229, 13520150, 13313809, 13229660, 13356017, 13205171, 13313378, 13552562, 13336235, 13212556, 13367682, 13495745, 13307785, 13483769, 14009657, 14032470, 14253109, 14518795, 14871169, 15399497, 15712225, 16371769, 16880008, 17323180, 18176334, 18875797, 19785969, 20579027, 21338196, 22295561, 23008063, 23887340, 24990667, 25858701, 26426922, 27066220, 27628291]
3834B7628291M89551O23116P97945Q64648R12322J200191J292248J771463K182487
3825C7762262K993521K758538J245608J58986p65164j852903k112574j742652
3817C8445622j507110j526881j114110j243738j203979r65025o86069q45347p21920
3808B8631443o20234j128909r30301q73l29540o33745n89110k81356n40971k45025
3798B3331379M200l58626R3021L55800j05917J61370J77328P4491J1606k05848
3788B3538804j9210M807K68288J24609L45785L50126M92844O24451N66574O00141
3778B6897219O92242L54857J50520K35693M79259k46508k19790l26987p08522
3769B7307983n61762n90592o92848n94692r65460o82204o27942p34098m29572
$$ y = [27628291, 28117842, 28740958, 29538903, 30403551, 31315873, 32516064, 33808312, 35579775, 37762262, 40755783, 43514321, 44759929, 44918915, 44153751, 42300848, 40188274, 38445622, 36938512, 35411631, 34297521, 33053783, 31849804, 30884779, 30198710, 29353363, 28631443, 28011209, 26882300, 25951999, 25951126, 25621586, 24987841, 24398731, 24117375, 23576404, 23331379, 23335579, 22976953, 23069974, 23425774, 23319857, 23481227, 23658555, 23733046, 23744652, 23538804, 23519594, 23524401, 23792689, 23917298, 24263083, 24613209, 25106053, 25730504, 26297078, 26897219, 27589461, 27944318, 28094838, 28330531, 28809790, 28563282, 28343492, 28016505, 27307983, 26746221, 26155629, 25462781, 24868089, 23902629, 23220425, 22592483, 21858385, 21428813]
3760B1428813p68046r94676r32495m64589m60452p09231k90277p05436q20137
3751A5283474o08820l46858m26488k83815q46580o24524k59400p3287j24174l05060
3741A1384468l94035j770j41915l90387n9785l06069j74662j83126k57844k10407
3731I264468k06434k29446J78841n0749R4351m9090j17939j56671K04947r5552
3721H836726k64292R6392l0634l9927O184L18522L19109O4055l1429n7230M41275
3710I658751L03161p4323k20002K66757Q4741J5662K18162J53942j8962j51129
3700A0236760j17538J99192k48739J4515m33169M9986N91549N7245j45133j24384
3690A0080284j26499k5827K76743O2789j93185J08607K76876j77382Q7698j27332
$$ y = [21428813, 20660767, 19666091, 18733596, 18269007, 17808555, 17099324, 16809047, 16103611, 15283474, 14674654, 14327796, 13901308, 13617493, 12770913, 12146389, 11886989, 11813702, 11689528, 11384468, 10990433, 10988663, 10846748, 10456361, 10396576, 10090507, 9915845, 9732719, 9474875, 9264468, 9058034, 8828588, 9007429, 8956680, 9051031, 9001941, 8884002, 8727331, 8932278, 8836726, 8572434, 8668826, 8638192, 8598265, 8604449, 8922971, 9242080, 9306135, 9274706, 9217476, 9658751, 9961912, 9887589, 9667587, 9934344, 10019085, 10034747, 10252909, 10406851, 10387889, 10236760, 10119222, 10318414, 10069675, 10084190, 9651021, 9701007, 10292556, 10349801, 10204668, 10080284, 9953785, 9927958, 10204701, 10267490, 10074305, 10182912, 10459788, 10282406, 10370104, 10242772]
3680A0242772n4970j72557j41856J20428N8514J53758K38492n2856K04773J55390
3670A0751888l1761J77921N62356L48628K91498k355N6671L3340Q4820J64246
3660A2437252k58309L9808M7101K5691k88434q6150J46010l10327K30673J08276
3650A2091591k63187o5698r3224L52561l2961j5536O4201N1907R7407P4935J26114
3639A2388110j19926j97539j92855J25951j94161k6029k75849j6861M2709n6257
3629A1477293J38143k40265J00479K59338J05720J20473K85348p6392J05209R3087
3619A2368433k0957L23441M44559K22236K14840K95416k68424m099l87350j44881
3609A3043214J78122j40206K5517K52649L73596J39949J67448J32322o9035R4862
$$ y = [10242772, 10187802, 10015245, 9873389, 9993817, 10052331, 10206089, 10444581, 10391725, 10596498, 10751888, 10720127, 10898048, 11460404, 11809032, 12100530, 12098175, 12154846, 12188186, 12273006, 12437252, 12178943, 12218751, 12265852, 12291543, 12003109, 11916959, 12062969, 11752642, 11983315, 12091591, 11828404, 11762706, 11669482, 12022043, 11989082, 11973546, 12037747, 12089654, 12187061, 12261996, 12388110, 12268184, 12070645, 11877790, 12003741, 11809580, 11783551, 11507702, 11490841, 11533550, 11477293, 11615436, 11375171, 11475650, 11734988, 11840708, 11961181, 12246529, 12170137, 12275346, 12368433, 12347476, 12670917, 13115476, 13337712, 13552552, 13847968, 13579544, 13575445, 13188095, 13043214, 13221336, 13081130, 13106647, 13359296, 13732892, 13872841, 14040289, 14172611, 14103576, 14198438]
3599A4198438K53303P8335O3460q5664J73940p6731N3694k16523m54621J84793
3589A4172424k02094l21025m4461M4571j61252k86199j01612j22980m79318j83937
3579A2314117j57154m14425q9548Q3289l89n8609J60236Q7693J97612q7416J88914
3568A2224320J85576K35357L02911l30305L034K44409N10023L09082K03370l56466
3558A3531311J25215K02140j96527N94269L73468j73005K69894Q9190J41838l36181
3548A4621612k28526N701m06438k47044k92926m9186r1885l8292j85036Q681k97984
3537A2798677N6908J46557P6929M3965n892J13234K40392J06360j84502r8424
3527A3294204J86164k2201j44975L7838l50932j45896L66798K0785K15176L55458
$$ y = [14198438, 14451741, 14530076, 14593536, 14507872, 14681812, 14605081, 14658775, 14442252, 13987631, 14172424, 13970330, 13649305, 13604844, 13649415, 13488163, 13201964, 13100352, 12977372, 12498054, 12314117, 12156963, 11742538, 11652990, 11736279, 11735890, 11677281, 11837517, 11925210, 12122822, 12035406, 12224320, 12409896, 12645253, 12948164, 12617859, 12620893, 12865302, 13375325, 13684407, 13887777, 13531311, 13656526, 13858666, 13662139, 14256408, 14629876, 14456871, 14726765, 14815955, 14957793, 14621612, 14393086, 14398787, 13992349, 13745305, 13452379, 13403193, 13311308, 13273016, 13087980, 13096661, 12798677, 12855585, 13002142, 13079071, 13123036, 13117144, 13230378, 13470770, 13577130, 13392628, 13294204, 13480368, 13458167, 13313192, 13351030, 13000098, 12854202, 13221000, 13241785, 13456961, 13812419]
3517A3812419n2160j66786k46256j44052J2808L89084L53154P0464K91146J7908
3507A4337729P9372J62351L27539L09743K03724L63114K33188K31631L99269M96934
3497A7144594L54526M61839O63466O98066O54165Q79246N29042Q71022J173202
3488B3429168J321444J418133J579896J886489J947069K264744K357875K767650
3480C8972468L644747M131214M395719N494582O383213P219368Q143857Q114349
3472H6499517P134002N820573M302022K388468J085573P05485K13971J91337R07729
3463A09248677J172821J415240P44064k13467j665136l710582n565247o848548
3455I4577822p400574p516591o654193o078614n687081m762057l914804l195847
$$ y = [13812419, 13760259, 13593473, 13347217, 13203165, 13215973, 13605057, 13958211, 14028675, 14319821, 14337729, 14417101, 14579452, 14906991, 15216734, 15420458, 15783572, 16016760, 16248391, 16647660, 17144594, 17499120, 17960959, 18624425, 19322491, 19976656, 20855902, 21384944, 22255966, 23429168, 24750612, 26168745, 27748641, 29635130, 31582199, 33846943, 36204818, 38972468, 42617215, 46748429, 51144148, 56638730, 63021943, 70241311, 78385168, 86499517, 93633519, 99454092, 103756114, 106144582, 107230155, 107935640, 108149611, 108340948, 109248677, 110421498, 111836738, 112580802, 112367335, 110702199, 106991617, 101426370, 94577822, 87177248, 79660657, 73006464, 66927850, 61240769, 56478712, 52563908, 49368061]
3447D9368061l014147k382641j845131j626489j346780j213403q50016o96340
3439C6393114p03165l51279n1477o2569j95251P7811L70066K54159J35091O32538
3429C6499038P60021J201496J701150J568547K260555K289215K883016L631327
3421E2794365L825990L877935M160173M277873L807210L265099K769848J877384
3413H0655877M08309r15005j903179k746455l320151l928575l722772l784386
3405F0743663l721656l167063l252380k755482k168339j949993j729444j501665
3397D0497641j552255j221078p69809o68863j59742j21565J15183P3381K38460
3388C6431353L53942M46046Q65681Q23451Q73690J087479J263582J562503J587175
$$ y = [49368061, 46353914, 43971273, 42126142, 40499653, 39152873, 37939470, 37089454, 36393114, 35689949, 35338670, 35287193, 35224624, 35029373, 35107184, 35477250, 35731409, 35866500, 36499038, 37259059, 38460555, 40161705, 41730252, 43990807, 46280022, 49163038, 52794365, 56620355, 60498290, 64658463, 68936336, 72743546, 76008645, 78778493, 80655877, 81064186, 80149181, 78246002, 75499547, 72179396, 68250821, 64528049, 60743663, 57022007, 53854944, 50602564, 47847082, 45678743, 43728750, 41999306, 40497641, 38945386, 37724308, 36954499, 36285636, 36125894, 36004329, 36119512, 36192893, 36431353, 36785295, 37231341, 38097022, 38920473, 39794163, 40881642, 42145224, 43707727, 45294902]
3379D5294902J621909J128463N30123N44107j00321q58105r31841j404690j781835
3370D4042712j403396j277892j608698j322193r86572r06601l79761J69734O75717
3361C7003050Q60786Q58581J63002m19224j360353j897271j748972j411939j019946
3352C1027714q48040r56951k38249j5187r7004K03975K36279N5049L11321L95530
3342C0074437J17063K69567M01390J98477J22457L33002K73791j41673J37849
3333C1786360M29137M14006N45047Q53808Q73602J014278J393882J714750J920354
3324D0945224K253045K791811L041354L618823M287606M148856M614254M169987
3316F9870960L334987K729704J890314K28770j576655l002430m081120m603826
$$ y = [45294902, 46916811, 48045274, 48575397, 49119504, 49019183, 48161078, 47229237, 45824547, 44042712, 42639316, 41361424, 39752726, 38430533, 37443961, 36537360, 36157599, 36327333, 37003050, 37863836, 38722417, 38885419, 38466195, 37105842, 35208571, 33459599, 32047660, 31027714, 30179674, 29222723, 28984474, 28969287, 28872283, 29076258, 29312537, 29367586, 29678907, 30074437, 30191500, 30461067, 30862457, 31060934, 31183391, 31516393, 31790184, 31648511, 31786360, 32215497, 32629503, 33174550, 34028358, 34901960, 35916238, 37310120, 39024870, 40945224, 43198269, 45990080, 49031434, 52650257, 56937863, 61086719, 65700973, 69870960, 73205947, 75935651, 77825965, 78054735, 76478080, 73475650, 69394530, 64790704]
3308F4790704m863046m643779m488491l724434l378790l307878k617548j967432
3300C5799306j646172j463098j531833j110670p62420l58326n52960M9500N52044
3291B8975371M61358O76715j3306l17041n43502j032780p90230m12703o98732
3282B6305150o44560m91744o2861J73099l06L08171M44212R57035P38984P83972
3272B8511152J260399J444953J351558J431578K016743K448443K650565K825453
3264D3940844K750644L258960L841708M339264M052864L806635L591373L366607
3256G2948899K062542J026164Q8206j002001j709300k227163k464733l008862
3248F5713752k688015k673880k006272j383042j010480l16653M95215J173891
$$ y = [64790704, 59927658, 55283879, 50795388, 47070954, 43692164, 40384286, 37766738, 35799306, 34153134, 32690036, 31158203, 30047533, 29285113, 28926787, 28373827, 28423327, 28975371, 29436729, 30113444, 30100138, 29783097, 29239595, 28206815, 27416585, 27003882, 26305150, 25660590, 25168846, 25105985, 25279084, 25278778, 25586949, 26031161, 26988196, 27727180, 28511152, 29771551, 31216504, 32568062, 33999640, 36016383, 38464826, 41115391, 43940844, 46691488, 49950448, 53792156, 58131420, 62184284, 65990919, 69582292, 72948899, 75011441, 76037605, 76125811, 75123810, 73414510, 71187347, 68722614, 65713752, 63025737, 60351857, 58345585, 56962543, 55952063, 55635410, 56130625, 57304516]
3240E7304516J646664K253830K646052J982391J372859Q31234p44137k275377
3232F5018032l582560l841030m237848m017991l789572l379170l202770k454957
3224C6512134k129628k042342j910888j528475q46832j096776q89670o94540q27638
3215B4545345n27714l12232l30112k6118m3854N29992O12728L17651L3607m31797
3205B4367496n58619q76473n49815l47409r0999j50723n25119r00921j193442
3196A9173976j263613j397214j241661j242804p53875q93956o02283k56303l46977
3187A1175290o19927l48004k64331k37708l37131r8839r1542m62822m49293l9841
3177H225852k30191Q6124J3729m94061l45904M0147J23287r4039n18917l84213
$$ y = [57304516, 58951180, 61205010, 63851062, 65833453, 67206312, 68037546, 67293409, 65018032, 61435472, 57594442, 53356594, 49338603, 45549031, 42169861, 38967091, 36512134, 34382506, 32340164, 30429276, 28900801, 28053969, 26957193, 26067523, 25372983, 24545345, 24017631, 23705399, 23375287, 23349169, 23305315, 23835307, 24448035, 24765686, 24799293, 24367496, 23808877, 22932404, 22382589, 22035180, 21944181, 21793458, 21268339, 20367418, 19173976, 17910363, 16513149, 15271488, 14028684, 13274809, 12380853, 11778570, 11522267, 11175290, 10555363, 10207359, 9943028, 9705320, 9368189, 9269350, 9177808, 8714986, 8265693, 8225852, 7995661, 8081785, 8095514, 7601453, 7255549, 7295696, 7418983, 7324944, 6806027, 6421814]
3167F421814k29293J60470K42327l21631j80824k65061j67587J03220p4826L22241
3157F010850k78515l362j79362j3292r1295j20712Q262j19013j11423j8696M9713
3146E133155j40241j00503K00826j44523O0702j23697k46684L67723l7760j22559
3136D846439j62430M484R716J65678j19190j78200j44531q8882J39721M48994
3126D921799q3998o6656j39840k3945m1280K702l85488J15310m9875j45446m9362
3115D053921P941p3616J33655J44190k0607J88402j41302l54456K09800l54692
3105C793236P6019M7950k47175J44426o9634k3173k41247J54814Q9053j12961
3095C611308j11928R3892j68521r402p2938p7734K81002J36072r4157J22849m0920
$$ y = [6421814, 6192521, 6352991, 6595318, 6273687, 6092863, 5827802, 5660215, 5763435, 5688609, 6010850, 5732335, 5728973, 5549611, 5536319, 5445024, 5324312, 5332574, 5213561, 5102138, 5083442, 5133155, 4992914, 4892411, 5093237, 4948714, 5009416, 4885719, 4639035, 5006758, 4968998, 4846439, 4684009, 4688493, 4698209, 4863887, 4744697, 4566497, 4421966, 4333084, 4472805, 4921799, 4837801, 4771145, 4631305, 4607360, 4566080, 4568782, 4183294, 4298604, 4248729, 4103283, 4053921, 4061862, 3988246, 4121901, 4266091, 4245484, 4433886, 4292584, 3938128, 4147928, 3793236, 3869255, 3917205, 3670030, 3814456, 3744822, 3721649, 3480402, 3635216, 3724269, 3611308, 3499380, 3593272, 3424751, 3415349, 3342411, 3264677, 3545679, 3681751, 3587594, 3710443, 3669523]
3084C669523j58195K7023m1878J94417k4838q0785m281l6432K40599P0552J52597
3073D008302Q8456l36889m05941l7768k1804j18175o702J17482J96962l44597
3063C139326k69154k9522R1623n893j82301J87462n3112n9171m8865J0934L337
3052B784664j14836l9395l77402K21607K64197J80771j8005k18308j9451q6547
3042B577295J54942m3673j37157j1509j76242j1728J34723j16697r5583Q6546
3032B360917K7581j7629Q812K18165J82068l21653k6229l3153j07947K2037j29957
3021B183012j13398l24791J11902J39186K8731n4173k46739k3285J50150j35022
3011A715573J59265J73796j50080R8930k22060L061K44280j27088J73830j60971
$$ y = [3669523, 3511328, 3538351, 3496473, 3690890, 3666052, 3585267, 3580986, 3544554, 3785153, 3855705, 4008302, 4096758, 3759869, 3353928, 3316160, 3294356, 3176181, 3169479, 3286961, 3483923, 3139326, 2870172, 2840650, 2932273, 2926380, 2744079, 2931541, 2878429, 2819258, 2770393, 2781327, 2784664, 2669828, 2630433, 2253031, 2474638, 2738835, 2919606, 2901601, 2683293, 2663842, 2577295, 2732237, 2688564, 2551407, 2539898, 2363656, 2351928, 2486651, 2369954, 2274371, 2360917, 2388498, 2370869, 2379681, 2597846, 2779914, 2458261, 2432032, 2398879, 2290932, 2312969, 2183012, 2069614, 1744823, 1856725, 1995911, 2024642, 1970469, 1723730, 1700445, 1850595, 1715573, 1874838, 2048634, 1898554, 1997484, 1775424, 1778485, 2022765, 1895677, 2069507, 1908536]
3001A908536r8176Q968j59660J74723l20103J74486j30277l03405J91872L00614
2991A747578Q7818p956j0082R257o768K52542j06572J31009o5896n06804J2617
2980A536743L63325L2995k61609k37060K47740P6515m2234j56799p6430Q26J6614
2969A500626J09728j12974J04498J09976m9271j50086j9250R8843J02284k75389
2959A418985j37906j46893L8081K33382P3523k0060j9236o0203k8618J3553K79581
2948A644189j09549K35891K0880j65828j4847J17646q4880l06141K4793M312J65329
2937A531795L4702Q6015K3074j84379k611j43952l5015N827l3797l7594k14082
2926A029983M02914Q6527k9670J47147k33523j4808O2076j94344J20689m6225
$$ y = [1908536, 1810360, 1819328, 1659668, 1834391, 1514288, 1688774, 1558497, 1255092, 1446964, 1747578, 1835396, 1827440, 1817358, 1826615, 1819847, 2072389, 1965817, 2096826, 2030930, 1524126, 1536743, 1900068, 1933063, 1671454, 1434394, 1682134, 1758649, 1716415, 1559616, 1483186, 1484012, 1500626, 1610354, 1497380, 1601878, 1711854, 1662583, 1512497, 1493247, 1592090, 1694374, 1418985, 1281079, 1134186, 1172267, 1405649, 1479172, 1459112, 1439876, 1379673, 1351055, 1364608, 1644189, 1534640, 1770531, 1791411, 1625583, 1610736, 1728382, 1643502, 1337361, 1362154, 1366466, 1531795, 1566497, 1652512, 1675586, 1491207, 1488596, 1344644, 1309629, 1315456, 1281659, 1244065, 1029983, 1432897, 1519424, 1489754, 1636901, 1403378, 1388570, 1450646, 1256302, 1376991, 1330766]
2916A330766J27597n0344k05256k14800O5873J12766J02834J5744k1034J30099
2906A394245p2955m6095o9362M0352o1727l9732r5598J16296K28190k63955j46751
2895I82908J83455R3478N2992m21214l7870K0360K16388l6043j04606p9414K37435
2884A107869p8490k04809L17279m3055N3102k22557q1517r946J21841l5019j28153
2873G96545J17515K39239j65992k65113Q2212R8509j7854K13552K07859j3153
2863A293319k96780l24757O9182m7760J18642J9710K50433J1687J08128J7477
2853A219281j72519k00012J2511J0741l7395P7387j329j773m8903j9773J7053
2842H55269m9295Q6248L37198J41246j18214k63158K1946J2106J12359l1876p730
$$ y = [1330766, 1458363, 1408019, 1202763, 987963, 1053836, 1166602, 1269436, 1285180, 1264146, 1394245, 1321290, 1275195, 1205833, 1246185, 1184458, 1144726, 1049128, 1165424, 1393614, 1129659, 982908, 1166363, 1259841, 1312833, 891619, 853749, 874109, 1090497, 1054454, 949848, 870434, 1107869, 1029379, 824570, 1141849, 1098794, 1151896, 929339, 847822, 837876, 959717, 924698, 796545, 914060, 1153299, 987307, 722194, 804406, 902915, 885061, 1098613, 1306472, 1293319, 996539, 671782, 740964, 693204, 811846, 831556, 1081989, 1093676, 1201804, 1219281, 1046762, 846750, 859261, 870002, 832607, 909994, 908665, 906892, 857989, 838216, 855269, 805974, 892222, 1229420, 1370666, 1252452, 989294, 1011240, 1023346, 1135705, 1103829, 1096099]
2831A096099j58141k9760J24079k63308K26941K70178J46270R7815m9450k62417
2821A198306m8203K290l63354K24920j62248r0643L63372j90404j54160O2034
2811H41910R235j59376P0084J09350q3175J58421K65480k44302l7118q77j6142
2800I13490J84623j07059j36521j00295L36350j03940m79048J96287J03499l8998
2790G68388o1262r5023j33836o8558L34412l2068K70190o6208J94385K17243p5781
2779A251882k50294o6898N8279k4762j94224j46734L69254Q6201k73037p1328
2769G38339J87241l3250r0392Q6127K07094J3254j35100k5688K59856q8046k28955
2758H90480j31497J24433Q3841j61051L3526R9139l87130M1910J62296L8059J01676
$$ y = [1096099, 937958, 908198, 1032277, 768969, 995910, 1266088, 1412358, 1510173, 1460723, 1198306, 1150103, 1152393, 789039, 1013959, 851711, 761068, 1124440, 934036, 779876, 841910, 851145, 691769, 761853, 871203, 788028, 946449, 1211929, 967627, 930509, 929632, 913490, 1098113, 991054, 854533, 754238, 1090588, 986648, 507600, 703887, 807386, 768388, 707126, 612103, 478267, 409709, 744121, 712053, 982243, 916035, 1110420, 1327663, 1251882, 1001588, 934690, 992969, 968207, 773983, 627249, 996503, 1082704, 809667, 738339, 925580, 892330, 801938, 888065, 1095159, 1108413, 973313, 947625, 1207481, 1119435, 890480, 758983, 883416, 967257, 806206, 839732, 938871, 551741, 593651, 755947, 794006, 895682]
2747H95682l20618k05252L3342J61192L2659p1721L53355P6086O530k45920P0595
2736G85930J41755j57795Q0796O9102m2438J25650o1054r0817K2322j32744O9249
2725H09956k43316J66660j02750n3823L09174l156j51546j9910K53047o4938q2109
2714H17289J44502l98785J1254J76867r4036j84700M7446m3753j73491J16352
2704D18945K09688L5502k55924o6990K02481O0464q8292K82221R5519j20268j88034
2693E85312j24452Q5386R0589R3694K17202k4078Q4647j86351j30977P1762K0915
2682G83649p9429l16990R3701K62318K06970k97682K0150J71744J31554Q2465
2672A058450n3622j53088q1856J1590N4805o990Q1298n9084j71805k6944J88643
$$ y = [895682, 575064, 369812, 403154, 564346, 597005, 525284, 878639, 954725, 961255, 715335, 785930, 927685, 769890, 850686, 919788, 877350, 1003000, 941946, 851129, 873451, 740707, 809956, 566640, 733300, 630550, 576727, 885901, 882745, 731199, 711289, 964336, 899398, 817289, 961791, 563006, 574260, 751127, 657091, 472391, 519837, 476084, 302593, 418945, 628633, 664135, 408211, 341221, 543702, 604166, 515874, 798095, 893614, 773346, 585312, 460860, 546246, 636835, 730529, 947731, 923653, 1008300, 821949, 690972, 762734, 783649, 704220, 387230, 480931, 743249, 950219, 652537, 672687, 844431, 975985, 1058450, 1004828, 851740, 769884, 781474, 836279, 829289, 910587, 851503, 679698, 652754, 841397]
2661H41397j34701j35736J30291Q1269k03833J49148J29755n16592Q0568J52736
2651E74302L16789o3134k77866p9415J31635o419J21931k9377m22307J38197L50258
2640G54594K56112k21654q9643k2495K03528l99267K14545j00448j49808J92437
2630F37901Q784o724j49260O8385j00722L66737J89330J1105n6500m6357m21244
2619E01435Q3178K40544j29849m0249J61065j89910N4097K27612J21478j59547
2609H69854J47326k82422N8682l37048J43696J79076J60704m8764l5430J76399
2599A032073j25582k41067r4852J74030o80J83569j59914M3419J81220n90J37814
2588A129440j33035k59940J75899N8459j58148L50548K31863j09480J30208M58284
$$ y = [841397, 706696, 570960, 701251, 782520, 578687, 727835, 857590, 340998, 421566, 574302, 891091, 827957, 550091, 470676, 602311, 595892, 717823, 688446, 266139, 404336, 754594, 1010706, 789052, 699409, 676914, 880442, 481175, 695720, 595272, 445464, 637901, 646685, 639961, 490701, 559086, 458364, 825101, 1014431, 1025536, 969036, 922679, 501435, 584613, 825157, 695308, 655059, 816124, 626214, 680311, 907923, 1029401, 869854, 1017180, 734758, 793440, 456392, 600088, 779164, 939868, 891104, 855674, 1032073, 906491, 665424, 570572, 744602, 743922, 927491, 767577, 810996, 992216, 991626, 1129440, 996405, 736465, 912364, 970823, 812675, 1163223, 1395086, 1285606, 1415814, 1874098]
2578A874098N18995L45233K60238j31409j04147m31662n92811k47488j35009j48902
2568A207136l83616r7926N5136j28453K3025Q4557p9459j90691M32694J19491
2558A041894l48234k5762J74561n0728m9983N4067m18562n3585Q3306p7678L00657
2547F29953j28360p669J59739J55901O2900j75379r0429j66299K7461J96541l9711
2536F24648K96526R756j43971j56713J04513j9859j2436L935P4384J00121O7422
2525I48326j16672P122j46442q7737j18964J8836K88991L4754j97476K39322r1916
2514G78144k282O0117P3942j66674J6844n3424L28947p5189k50706Q7447j00978
2503F96188J04265M7944j85868j94699J66082J38627J00797L8153j00190n09753
$$ y = [1874098, 2393093, 2738326, 2998564, 2867155, 2763008, 2331346, 1738535, 1491047, 1356038, 1207136, 823520, 725594, 780730, 652277, 675302, 759859, 680400, 489709, 922403, 1041894, 693660, 667898, 842459, 791731, 741748, 795815, 377253, 323668, 406974, 329296, 629953, 501593, 493924, 653663, 809564, 872464, 697085, 606656, 440357, 467818, 664359, 624648, 921174, 930930, 786959, 630246, 734759, 714900, 702464, 706399, 780783, 880904, 948326, 831654, 838776, 692334, 604597, 485633, 504469, 793460, 828214, 630738, 870060, 778144, 775862, 835979, 909921, 743247, 760091, 706667, 1035614, 960425, 709719, 797166, 696188, 800453, 848397, 662529, 467830, 633912, 772539, 873336, 911489, 811299, 301546]
2493C01546r6360K52829J50402k00511N6662K0131O5761P6838j07702R2691j31206
2482D81081j16005k51432K78078K22410n3029K09379l3049p0136j22829k3753
2472E20715p244K24511N7315R0775q9159l71084K093K00027P9765j706r101M3349
2460G40256K6149R1756J04470J77351j95316R3233k74818J82258l8719m0159J4590
2449H81051n9696J96237j71602J64144J07083n88564r6076M11408o7709m4686
2439G31590M51437R3467j11395N7936P4534j42207j6461J63370O8706l94971K56839
2428A232845J97449l30487L5920M62223j21788j95684m1747j8018K6759k48166
2418I99306j44949J95308L57151J75414J70377j62085J09858m5910m0316k86983
$$ y = [301546, 205186, 458015, 608417, 407906, 464568, 484699, 550460, 627298, 519596, 612287, 481081, 365076, 113644, 391722, 614132, 561103, 770482, 737433, 667297, 544468, 520715, 513471, 737982, 795297, 886072, 796913, 425829, 427922, 627949, 707714, 706008, 696907, 740256, 766405, 858161, 962631, 1139982, 944666, 1037899, 763081, 945339, 906620, 866461, 881051, 821355, 1017592, 845990, 1010134, 1117217, 528653, 432577, 843985, 776276, 731590, 1183027, 1276494, 1165099, 1223035, 1297569, 1155362, 1138901, 1302271, 1370977, 976006, 1232845, 1430294, 1099807, 1135727, 1597950, 1476162, 1280478, 1238731, 1220713, 1247472, 999306, 854357, 1049665, 1406816, 1582230, 1752607, 1590522, 1700380, 1654470, 1614154, 1327171]
2408A327171k7878L45040m1845K58694j23647j00861K89131J62057j87552j65145
2398A735165j4891j65395K20724J16158O133j28597p4701O8675K50193K00151
2388B213615J02667j35930J57849j81465n82548K18868K34226J43662K29725J93057
2378B593726M8427J75451M39940o5641M40630K50347r9175M19147j3327q8998
2368D100527K02667J86669M4260J54759n9913j34062j37165j05041j58495K35822
2358D330028N9893O9724Q3738L35855L51370K687L1883K07584J18849K12354L16031
2347F119996M81820L10539L84538N84044N53630M19427P57443N28864P22682N50232
2337A1413215N39583O08117K23530P44425R45939R35352J064922J688354K036248
$$ y = [1327171, 1299293, 1644333, 1602488, 1861182, 1737535, 1636674, 1925805, 2087862, 1900310, 1735165, 1720274, 1554879, 1775603, 1891761, 1897894, 1769297, 1694596, 1763271, 2013464, 2213615, 2316282, 2180352, 2338201, 2156736, 1574188, 1793056, 2027282, 2170944, 2400669, 2593726, 2642153, 2817604, 3257544, 3191903, 3632533, 3882880, 3783705, 4202852, 4189525, 4100527, 4303194, 4489863, 4534123, 4688882, 4628969, 4494907, 4357742, 4252701, 4094206, 4330028, 4389921, 4459645, 4543383, 4879238, 5230608, 5233295, 5265178, 5472762, 5591611, 5803965, 6119996, 6601816, 6912355, 7296893, 7880937, 8434567, 8853994, 9611437, 10140301, 10862983, 11413215, 11952798, 12560915, 12784445, 13528870, 14474809, 15410161, 16475083, 18163437, 20199685]
2328B0199685K913938M416444N316823N564968M032641K601758K283532K377425
2320D9707214L783366M428379P324359J0251035J5453347K3621050M0654635O5582650
2312B20806035R4902613J08374925Q7188128O536342o4037234q0025974p8378322
2305B95366513o5231468n0168335l9009976l0636703k3161718j7526051j0989810
2298E8642452o676934l247930j868445j671563k574426l128716l538977l440054
2290C2495407k876177k253829k165130j849796j918559j450419j428552j237752
2282A7315193j104575r41982j083009n32838o42879l34020o65093n80862l68151
2273A1061784l05271N0035k6439l16698l25187o11972k51001J537l24951l91660
$$ y = [20199685, 23113623, 27530067, 32846890, 38411858, 42444499, 45046257, 47329789, 49707214, 53490580, 57918959, 65243318, 75494353, 90947700, 114568750, 155223385, 220806035, 315708648, 424083573, 511271701, 517808043, 453770809, 373744835, 295366513, 230135045, 179966710, 140956734, 110320031, 87158313, 69632262, 58642452, 51965518, 48717588, 46849143, 45177580, 42603154, 39474438, 35935461, 32495407, 29619230, 27365401, 25200271, 23350475, 21431916, 19981497, 18552945, 17315193, 16210618, 15268636, 14185627, 13652789, 13009910, 12675890, 12010797, 11429935, 11061784, 10756513, 10806548, 10780109, 10463411, 10138224, 9526252, 9275251, 9276788, 8951837, 8560177]
2263H560177k6037n09336l42494J67685k68447p27936j91418l60978l17735m03665
2253E579816l98466K54245j91645k51406K684k72210j03947m8334K11901j69735
2243D612903q4192J47479R0669L3888j23239J80460L5965J5928J54115l13445
2233D750531j74703J45829l5078j27325p1536l37998l3721j7195n9756O913J7040
2222D063001J14027n67110N7586j33409j52192k37876j42732K38416J5953k73397
2212B982267J60401L2510J83280k0662K1320j47658j12203r6277O4421J33889
2202C201288j18235k43142j10069j86762j69763N591j04295O4697m6662L24907
2192B617555k10096j88467K32292r5453j4110l904q9797K070j51291j53529J05210
$$ y = [8560177, 8534140, 8024804, 7682310, 7849995, 7581548, 6853612, 6662194, 6301216, 5983481, 5579816, 5181350, 5435595, 5243950, 4992544, 4995228, 4723018, 4619071, 4570737, 4782638, 4612903, 4528711, 4676190, 4766859, 4800747, 4677508, 4857968, 4893933, 4909861, 5063976, 4750531, 4575828, 4721657, 4686579, 4559254, 4487718, 4149720, 4115999, 4098804, 4039048, 4045961, 4063001, 4177028, 3609918, 3667504, 3534095, 3381903, 3144027, 3001295, 3239711, 3255664, 2982267, 3142668, 3175178, 3358458, 3337796, 3359116, 3211458, 3099255, 3002978, 3067399, 3201288, 3083053, 2839911, 2729842, 2543080, 2373317, 2378908, 2274613, 2339310, 2292648, 2617555, 2407459, 2218992, 2451284, 2355831, 2341721, 2337817, 2248020, 2250090, 2098799, 1945270, 2050480]
2181B050480m4559M1858q6208K32125J22654j9479j90407k23279p9231j90670
2171A613284J16106K517J89822J3982l21883l75081p165M0321m7113j22958J58919
2160A260751K84260J07922k34766J57067n762L2996K76226K8883l10970k8925
2150A567682l4215k6554j51045K12573K2132j04107p3447q9520J45204j12800
2140A355903J40740j34722J85236k3412K07044j8945j8088l68743k0421J68948
2130A473540K14403J75051j3218J92338j47221j33119m8157k11676j96070K6427
2120A332298M6497l6153J24827j42061j10621J07715R823J30275K18141l81779
2110A298962l09056R5329K97408j32332j32557j81583L7811J33483J51168m4631
$$ y = [2050480, 2005921, 2047779, 1961571, 2193696, 2316350, 2296871, 2106464, 1883185, 1803954, 1613284, 1729390, 1731907, 1921729, 1935711, 1613828, 1238747, 1231582, 1271903, 1224790, 1101832, 1260751, 1545011, 1652933, 1418167, 1575234, 1569472, 1602468, 1878694, 1907577, 1596607, 1567682, 1533467, 1506913, 1355868, 1568441, 1590573, 1486466, 1413019, 1323499, 1468703, 1355903, 1496643, 1361921, 1547157, 1523745, 1730789, 1711844, 1693756, 1325013, 1304592, 1473540, 1687943, 1862994, 1849776, 2042114, 1894893, 1761774, 1713617, 1501941, 1305871, 1332298, 1378795, 1342642, 1467469, 1325408, 1214787, 1322502, 1332325, 1462600, 1680741, 1298962, 989906, 1085235, 1382643, 1250311, 1117754, 936171, 973982, 1107465, 1258633, 1214002]
2100A214002j49825l58015j53331O515J13531m1220K38072J99628l0775k10362
2090H28220o7788K58981j88153j27097J71067J99576N3600l539R0598k1992j34923
2079A058550J29153r7910j34356k5203L7362K868K97967j88072j3950J67012K0247
2068A253668j03991j6211p7178J44563j31857k15341J32013J05732k87517l3295
2058G70586J24825J6300L77524n3368j06023K46477j59967l7756k26837M29140
2048A380901J70555J24358O7995n9847J26274M38945L52571L35307J70212J94559
2038C301830j04450k40755m63757n89934l22436m03382k7852n6875L08261j45197
2028A255453l41094j52690P5116L6147p3446k84526r7736J95680j24199J72875
$$ y = [1214002, 1064177, 706162, 552831, 559346, 672877, 631657, 869729, 1069357, 1038582, 828220, 760432, 1019413, 831260, 704163, 875230, 1074806, 1128406, 1124867, 1215465, 1193473, 1058550, 1187703, 1089793, 955437, 930234, 967596, 970464, 1268431, 1080359, 1066409, 1233421, 1253668, 1149677, 1133466, 1056288, 1200851, 1068994, 853653, 985666, 1091398, 803881, 770586, 895411, 911711, 1289235, 1235867, 1129844, 1376321, 1216354, 1178598, 951761, 1380901, 1551456, 1675814, 1743809, 1683962, 1810236, 2249181, 2601752, 2937059, 3107271, 3301830, 3197380, 2956625, 2492868, 1902934, 1580498, 1177116, 1149264, 1092389, 1400650, 1255453, 914359, 761669, 836785, 872932, 799486, 514960, 417224, 612904, 488705, 661580]
2018F61580J98458j50294k16572K47318k2167L980K43o1493j65006j28180K74017
2007F41884j13212q5585M0200L46720l4338M2878j55939j45589K15252O798q8688
1996F70381L6429k06620q6179P7207j04515M1415J27859J90391o7535N6245R1894
1985H26972j52131j5126O7056K4239j52493j94042K27591K18286k67634N7963
1975F40681K35950j71035p5733N7335N3946K93678j39963K51979n0766n63041
1965E33031n9539j4761j36272J21553K13907q7773J58329K50256J6261L8024k28628
1954H04388j78626M61312k0368m46871L9364K02802n547m9533K78176Q1753m73145
1943F93705k51846o7590J05971K1239M5082M8514J33667J25661k12486J97105
$$ y = [661580, 860038, 709744, 493172, 740490, 718323, 722303, 722546, 661053, 496047, 367867, 641884, 528672, 443087, 483287, 830007, 795669, 838547, 682608, 537019, 752271, 759069, 670381, 706810, 500190, 414011, 491218, 386703, 428118, 555977, 746368, 678833, 735078, 826972, 674841, 659715, 726771, 751010, 598517, 404475, 632066, 850352, 582718, 640681, 876631, 705596, 629863, 687198, 741144, 1034822, 894859, 1146838, 1096072, 533031, 473492, 458731, 322459, 444012, 657919, 570146, 728475, 978731, 994992, 1033016, 804388, 625762, 1087074, 1066706, 619835, 659199, 862001, 856454, 806921, 1085097, 1166850, 693705, 441859, 374269, 480240, 501479, 546561, 595075, 728742, 854403, 641917, 839022]
1933H39022j61048j06713Q9824J88587k3405q3703o1564j75207K18935P3188n0361
1922G47555K1475j09876J5072j47617O572R2780J11995J9142j10740J11777J55137
1911I13272K94035j24940l47811m5658L5005O9671j27662Q8121j16755j68872
1901D68406J11079n364J06896k92923M1396J4788L50687m211r7774j39778K08744
1890G61946N1165j96284m1975l33350K54540J42624j3844j28065j6137K1196R6048
1879E97864L4039J10609j64977Q5259J24849r00P276r4045n7239K08644q0899
1868G70480J06727J3100k29990j42649j62269J68239J85945L2292L0652l2089
1858G40438j63724J45926J07557N6519J3420j76952j17312O9598J05566j54604
$$ y = [839022, 677974, 571261, 661085, 849672, 826267, 742564, 681000, 505793, 724728, 797916, 747555, 769030, 659154, 674226, 526609, 533181, 625961, 737956, 757098, 646358, 758135, 913272, 1207307, 1082367, 734556, 688898, 723903, 793574, 665912, 754033, 637278, 468406, 579485, 574121, 681017, 388094, 429490, 444278, 794965, 790754, 692980, 553202, 761946, 813111, 616827, 574852, 241502, 496042, 638666, 624822, 496757, 480620, 501816, 597864, 631903, 742512, 577535, 662794, 787643, 786743, 794019, 699974, 642735, 851379, 770480, 877207, 890307, 660317, 517668, 355399, 523638, 709583, 741875, 772527, 740438, 576714, 722640, 830197, 886716, 900136, 723184, 605872, 675470, 781036, 626432]
1848F26432P1913J10275p0192j00322K7134K69425l0859Q0217k83283k84173J33545
1837E50112J45104K1962j81871k2023J81617M54J14535r8394k05757J19594K25656
1826H50989n4274l1720J44526P6317l30785L9061J17462r2740k08664J6523K99074
1815H25769k9449j00152K20933m0230j95481j82003k5687K48713m0139r9112j54042
1804D29120R6275R8508j49592J79844J81083p5052k12485j08597k55312l4353
1794A49439K62338Q2099Q9229k1498j28324J42578J71971n08501K2849J64873
1784D27053j49072j26281J43498J29294L659L9626O9553J25790j72698j3101O0581
1773E37902J84394m7424j63568j2343j79262j1341K92501M6297j27891k06719
$$ y = [626432, 698345, 808620, 738428, 638106, 665240, 934665, 903806, 984023, 700740, 416567, 550112, 695216, 717178, 535307, 513284, 694901, 695355, 809890, 711496, 505739, 625333, 850989, 796715, 764995, 909521, 985838, 655053, 694114, 811576, 718836, 510172, 526695, 825769, 796320, 696168, 917101, 876871, 681390, 499387, 473700, 722413, 682274, 583162, 429120, 525395, 623903, 474311, 654155, 835238, 760186, 547701, 439104, 183792, 149439, 411777, 493876, 583105, 561607, 433283, 575861, 747832, 239331, 262180, 427053, 277981, 151700, 295198, 424492, 428151, 467777, 537330, 663120, 490422, 477321, 537902, 722296, 674872, 511304, 498961, 319699, 308358, 600859, 647156, 519265, 312546]
1763C12546j5222J77520l4304j4220J52054M2958r9294Q8311k94221J19017K6352
1752D61497o0962L04705J27120L2504K62266k44231j04505J3100l22521J09121
1742E78094j72201L767j4022P0147k1932n812K37242l1711P9066J02055j82265
1731F42428j46894K1664J11775l65744O2498K18050K44084L8772j13448m6415
1721F66770O028j68560o5031K59270J9769r2965N0463R4359k41286J39039j64038
1710E03818Q9843Q6756K3179m2753j15813r148J85007j66641k66319M8768R2416
1699D29113J46831J645J31610j80758J00684j45870O9908J24718Q288L0261m2881
1688F73549k38200j58658K11327l1077J11365R2963K17900j95991J63744J8327
$$ y = [312546, 297324, 474844, 440540, 426320, 578374, 621332, 522038, 610349, 316128, 435145, 461497, 400535, 705240, 832360, 864864, 1127130, 882899, 778394, 791494, 468973, 578094, 405893, 409660, 395638, 465785, 443853, 438041, 675283, 643572, 722638, 824693, 642428, 495534, 517198, 628973, 263229, 325727, 543777, 787861, 826633, 713185, 666770, 672798, 504238, 439207, 698477, 718246, 625281, 675744, 770103, 528817, 667856, 503818, 593661, 680417, 703596, 660843, 545030, 535882, 720889, 554248, 287929, 336697, 429113, 575944, 577589, 709199, 528441, 629125, 483255, 553163, 677881, 686169, 716430, 673549, 435349, 276691, 488018, 456941, 568306, 661269, 879169, 683178, 846922, 865249]
1678H65249p541n3139m7434j50363j60508L5144j10270o3814J0421K40694N1937
1667F10376j60791j0966k91591J18843K04692o0408j82909J27831J51627K31946
1657G38650K6700k44277K28958j20538k24991r7925J19579J46743j66035o408
1647D00456L8592M4899l3083k30144j3132k3724r5894L66454J51071m5943K3025
1636E82577o8692P8139o7076l1913j89948j9602M7121J24626Q1015R6933L8296
1625F71476Q3521m46806L31713K26911l41393m5583K0089M7538k0977K3825j83845
1614C66469r7059J82272J22968j98042o4595O4029J19994J11281j59671j48972
1604B98674R6064M00918j67485j79897J15580K0770m64035j65687N23033K32254
$$ y = [865249, 857708, 804569, 757135, 606772, 446264, 481408, 371138, 307324, 317745, 558439, 610376, 449585, 438619, 147028, 265871, 470563, 410155, 227246, 355077, 506704, 738650, 765350, 521073, 750031, 629493, 404502, 306577, 426156, 572899, 406864, 400456, 439048, 483947, 450864, 220720, 207588, 183864, 87970, 454424, 605495, 559552, 582577, 513885, 592024, 524948, 493035, 303087, 283485, 330606, 455232, 536247, 633180, 671476, 754997, 308191, 639904, 866815, 525422, 479839, 499928, 547466, 526489, 550314, 366469, 269410, 451682, 574650, 376608, 312013, 376042, 496036, 607317, 447646, 298674, 394738, 795656, 628171, 448274, 563854, 584624, 120589, -45098, 477935, 710189]
1594G10189O509k27473k4446q8925r3800K46493k05006k9097l0059M5738J85014
1583D95137r4392k5685J36912O0037j53709n0294R1304J11135j42079k27091Q1103
1572B82378N1333o4965k8791n1939L01183k6228k69877M06076K48945j06622P2551
1561H14044j34399k9282m2696N5876J24390J14034m10616J52489j25930o8381
1551D49529k8976k55375m9870O0159J62648o8693J34676K70921J38168m90083
1541C23104J10496J1171J21954J48020k24078k11747K23467j38901j99162J04416
1531B68740O5411k6972j03771J41340R2331r7973q3454Q8642k85687j15871J41273
1520H4009j05089K6148J62525K12653r2860n4005K02300l9631l3236J55254J40403
$$ y = [710189, 716698, 489225, 464779, 375854, 282054, 528547, 323541, 294444, 264385, 310123, 495137, 400745, 375060, 511972, 572009, 418300, 368006, 459310, 570445, 428366, 201275, 282378, 333711, 268746, 239955, 188016, 489199, 462971, 193094, 599170, 848115, 741493, 814044, 679645, 650363, 607667, 663543, 787933, 901967, 491351, 643840, 517910, 449529, 420553, 165178, 115308, 175467, 338115, 269422, 404098, 675019, 813187, 323104, 433600, 444771, 566725, 714745, 490667, 278920, 502387, 363486, 164324, 268740, 334151, 307179, 203408, 344748, 437079, 339106, 255652, 344294, 58607, -57264, 84009, -21080, 5068, 167593, 380246, 287386, 233381, 435681, 396050, 362814, 518068, 658471]
1509F58471j31178r3474j82735j04021J08471r0087J65173J48237m41962J10059
1499A46954J58994K29158K66614l3179l53691l35486R1977J23722R136o4334k2667
1488B17198J6540M2375J04534O4412j09845O6325K560j21743n4112J55650L62219
1477G46113k08123J5273K95598k80248l25399L01760m5041j58892k5495k92858
1467B2688P9516J6298J11448P8334N7735J41103j06371k20408n8116L16300O5389
1456E03916k10513N4570j08864L64184P8517k16181p0435p8981J37427J8376l3937
1445D38079M885J80847k00532k44209k12348Q5605r8228J70411K05818J95911
1435E26239J94104j998k80991k57300J94700R8177J06355K09981n8267m6823j46547
$$ y = [658471, 527293, 433819, 251084, 147063, 255534, 165447, 330620, 478857, 36895, 146954, 305948, 535106, 801720, 768541, 414850, 79364, 171341, 295063, 304199, 239865, 217198, 233738, 276113, 380647, 445059, 335214, 401539, 404099, 282356, 228244, 383894, 746113, 537990, 553263, 848861, 568613, 243214, 544974, 499933, 341041, 315546, 22688, 102204, 118502, 229950, 308284, 366019, 507122, 400751, 180343, 122227, 438527, 503916, 293403, 347973, 239109, 603293, 681810, 465629, 395194, 316213, 453640, 472016, 438079, 442964, 623811, 423279, 179070, -33278, 52327, -45901, 124510, 330328, 526239, 720343, 718345, 437354, 180054, 374754, 472931, 579286, 789267, 731000, 684177, 537630]
1424E37630k17785J12295O3054P1191k27699P3162J37374K8160J14739j80384
1414E11737k39009J60706L00942m70145k6663Q3884L02655L8623k59379j93540
1404B09811q252K32992Q030J2165M3318r7605K799K13202J02438j40142L4593
1393F13349J8072k36980K43377Q6901j81902j51812p1877k02620L66861J85479
1383F68848J1683j20081k10514r4294J58289J14914l041J16241k91947l85286
1373c5188M64780l7842J17195j73474N6896o5554r0906j22560j99628N05356K5764
1362D44839l16321J01211m3771j19633R6354K36337J02927M8907P0729j52427
1352D69152k21647m087K72437k02932J37898L0494p3943j8532L4450p1306j77186
$$ y = [537630, 319845, 432140, 495194, 566385, 338686, 411848, 549222, 577382, 692121, 511737, 272728, 433434, 734376, 264231, 237568, 321452, 624107, 662730, 403351, 209811, 201559, 434551, 442581, 454746, 498064, 400459, 403258, 616460, 718898, 578756, 613349, 631421, 394441, 637818, 724719, 542817, 391005, 319128, 116508, 483369, 668848, 680531, 560450, 349936, 255642, 413931, 528845, 525804, 642045, 350098, -35188, 429592, 391750, 508945, 335471, 392367, 326813, 235907, 113347, -86281, 419075, 444839, 128518, 229729, 185958, 66325, 162679, 399016, 501943, 550850, 621579, 469152, 247505, 243418, 515855, 312923, 450821, 481315, 407372, 388840, 423290, 351984, 174798]
$$ [...]
##END NTUPLES=NMR SPECTRUM
##END=
