##TITLE=1H_DE-80H_X3
 200.13MHz, d2o
 8 sc
 
 19ns.26.2.2025
##JCAMPDX= 6.0         $$ Bruker NMR JCAMP-DX V2.0
##DATA TYPE= NMR SPECTRUM
##DATA CLASS= NTUPLES
##ORIGIN= UXNMR, Bruker Analytische Messtechnik GmbH
##OWNER= pz
$$ XWIN-NMR		Version 3.5
$$ Mon Mar 23 10:10:34 2026 Russian Standard Time (UT+4h)  Yarkov@DPX200
##.OBSERVE FREQUENCY= 200.1313
##.OBSERVE NUCLEUS= ^1H
##.ACQUISITION MODE= SIMULTANEOUS
##.ACQUISITION SCHEME= undefined
##.AVERAGES= 8
##.DIGITISER RES= 18
##SPECTROMETER/DATA SYSTEM= spect
##.PULSE SEQUENCE= zg30
##.SOLVENT NAME= CDCl3
##.SHIFT REFERENCE= (INTERNAL, CDCl3, 0, 15.4461)
##AUDIT TRAIL= $$ (NUMBER, WHEN, WHO, WHERE, WHAT)
$$ ##TITLE= Audit trail, XWIN-NMR		Version 3.5
$$ ##JCAMPDX= 5.01
$$ ##ORIGIN= Bruker BioSpin GmbH
$$ ##OWNER= Yarkov
$$ C:/Bruker/XWIN-NMR/data/yarkov2/nmr/H-C/1/pdata/1/auditp.txt
$$ ##AUDIT TRAIL=  $$ (NUMBER, WHEN, WHO, WHERE, WHAT)
(   1,<2026-03-23 10:09:46.14 +0400>,<Yarkov>,<DPX200>,
      <created by zg, POWCHK disabled, PULCHK disabled
       configuration hash MD5:
       00 E9 B6 7A A2 85 ED C7 34 08 36 98 17 FE 4E 26
       data hash MD5: 16K
       A7 B1 31 B5 D2 1B 51 44 AC D0 F2 C7 95 88 8B 08>)
(   2,<2026-03-23 10:09:50.56 +0400>,<Yarkov>,<DPX200>,
      <Start of raw data processing
       efp BC_mod = 2 LB = 0.25 FT_mod = 6 PKNL = 1 PHC0 = -5299.148 PHC1 = 6.821927 SI = 16K 
       data hash MD5: 16K
       28 F5 47 D3 1A A2 1F FA E1 5C 98 3C CA 73 5B FC>)
(   3,<2026-03-23 10:09:55.89 +0400>,<Yarkov>,<DPX200>,
      <abs ABSG = 5 
       data hash MD5: 16K
       95 43 C3 01 8C 86 11 99 0E 05 70 E6 98 95 5F 0F>)
$$ ##END=
$$ 
$$ hash MD5
$$ DD 20 8D 8B CC 59 83 2A CF A0 76 21 6B 63 F3 4C
##$RELAX= 
##$RELAX= 
##$RELAX= 
##$RELAX= 
##$RELAX= 
##$RELAX= 
$$ Bruker specific parameters
$$ --------------------------
##$DU= <C:/Bruker/XWIN-NMR>
##$EXPNO= 1
##$NAME= <H-C>
##$PROCNO= 1
##$TYPE= <nmr>
##$USER= <yarkov2>
##$AMP= (0..31)
100 100 100 100 100 100 100 100 100 100 100 100 100 100 100 100 100 100 
100 100 100 100 100 100 100 100 100 100 100 100 100 100 
##$AQSEQ= 0
##$AQ_mod= 1
##$AUNM= <au_zg>
##$AUTOPOS= <>
##$BF1= 200.13
##$BF2= 200.13
##$BF3= 200.13
##$BF4= 200.13
##$BF5= 200.13
##$BF6= 200.13
##$BF7= 200.13
##$BF8= 200.13
##$BYTORDA= 1
##$CFDGTYP= 0
##$CFRGTYP= 5
##$CHEMSTR= <none>
##$CNST= (0..31)
1 1 145 1 1 1 1 1 1 1 1 1 1 1 1 1 1 1 1 1 1 1 1 1 1 1 1 1 1 1 1 1 
##$CPDPRG= <>
##$CPDPRG1= <>
##$CPDPRG2= <>
##$CPDPRG3= <>
##$CPDPRG4= <mlev>
##$CPDPRG5= <mlev>
##$CPDPRG6= <mlev>
##$CPDPRG7= <mlev>
##$CPDPRG8= <mlev>
##$CPDPRGB= <>
##$CPDPRGT= <>
##$D= (0..31)
0 0.7 0 0 0 0 0 0 0 0 0 0.03 0 0 0 0 0 0 0 0 0 0 0 0 0 0 0 0 0 0 0 0 
##$DATE= 1774246185
##$DBL= (0..7)
120 120 120 120 120 120 120 120 
##$DBP= (0..7)
150 150 150 150 150 150 150 150 
##$DBP07= 0
##$DBPNAM0= <>
##$DBPNAM1= <>
##$DBPNAM2= <>
##$DBPNAM3= <>
##$DBPNAM4= <>
##$DBPNAM5= <>
##$DBPNAM6= <>
##$DBPNAM7= <>
##$DBPOAL= (0..7)
0.5 0.5 0.5 0.5 0.5 0.5 0.5 0.5 
##$DBPOFFS= (0..7)
0 0 0 0 0 0 0 0 
##$DE= 6
$$ [...]
##$SUBNAM3= <"">
##$SUBNAM4= <"">
##$SUBNAM5= <"">
##$SUBNAM6= <"">
##$SUBNAM7= <"">
##$SUBNAM8= <"">
##$SUBNAM9= <"">
##$SW= 18.0517328524113
##$SWIBOX= (0..15)
0 0 2 0 0 0 0 0 0 0 0 0 0 0 0 0 
##$SW_h= 3612.71676300578
##$TD= 16384
##$TD0= 1
##$TE= 0
##$TE2= 300
##$TE3= 300
##$TEG= 300
##$TL= (0..7)
0 120 120 120 120 120 120 120 
##$TP= (0..7)
150 150 150 150 150 150 150 150 
##$TP07= 0
##$TPNAME0= <>
##$TPNAME1= <>
##$TPNAME2= <>
##$TPNAME3= <>
##$TPNAME4= <>
##$TPNAME5= <>
##$TPNAME6= <>
##$TPNAME7= <>
##$TPOAL= (0..7)
0.5 0.5 0.5 0.5 0.5 0.5 0.5 0.5 
##$TPOFFS= (0..7)
0 0 0 0 0 0 0 0 
##$TUNHIN= 0
##$TUNHOUT= 0
##$TUNXOUT= 0
##$USERA1= <user>
##$USERA2= <user>
##$USERA3= <user>
##$USERA4= <user>
##$USERA5= <user>
##$V9= 5
##$VALIST= <valist>
##$VCLIST= <CCCCCCCCCCCCCCC>
##$VD= 0
##$VDLIST= <DDDDDDDDDDDDDDD>
##$VPLIST= <PPPPPPPPPPPPPPP>
##$VTLIST= <TTTTTTTTTTTTTTT>
##$WBST= 1024
##$WBSW= 4
##$XGAIN= (0..3)
0 0 0 0 
##$XL= 0
##$YL= 0
##$YMAX_a= 442041
##$YMIN_a= -427267
##$ZGOPTNS= <>
##$ZL1= 120
##$ZL2= 120
##$ZL3= 120
##$ZL4= 120
##$ABSF1= 15.48907
##$ABSF2= -2.562779
##$ABSG= 5
##$ABSL= 3
##$ALPHA= 0
##$AQORDER= 0
##$ASSFAC= 0
##$ASSFACI= 0
##$ASSFACX= 0
##$ASSWID= 0
##$AUNMP= <proc_1d>
##$AZFE= 0.1
##$AZFW= 0.1
##$BCFW= 0
##$BC_mod= 2
##$BYTORDP= 0
##$COROFFS= 0
##$CY= -3
##$DATMOD= 1
##$DC= 0
##$DFILT= <>
##$DTYPP= 0
##$F1P= 0
##$F2P= 0
##$FCOR= 1
##$FTSIZE= 16384
##$FT_mod= 6
##$GAMMA= 0
##$GB= 0
##$INTBC= 1
##$INTSCL= 3.241238e-09
##$ISEN= 128
##$LB= 0.25
##$LEV0= 0
##$LPBIN= 0
##$MAXI= 10000
##$MC2= 0
##$MEAN= 0
##$ME_mod= 0
##$MI= 1.114404
##$NCOEF= 0
##$NC_proc= -7
##$NLEV= 6
##$NOISF1= 3.799351
##$NOISF2= 2.8
##$NSP= 0
##$NTH_PI= 0
##$NZP= 0
##$OFFSET= 15.4461
##$PC= 1
##$PHC0= -5299.148
##$PHC1= 6.821927
##$PH_mod= 1
##$PKNL= yes
##$PPARMOD= 0
##$PSCAL= 0
##$PSIGN= 0
##$REVERSE= no
##$SF= 200.130015131001
##$SI= 16384
##$SIGF1= 3
##$SIGF2= 2
##$SINO= 0.751879
##$SIOLD= 32768
##$SREGLST= <19F.Aceton>
##$SSB= 0
##$STSI= 16384
##$STSR= 0
##$SW_p= 3612.71676300578
##$SYMM= 0
##$S_DEV= 0
##$TDeff= 16384
##$TDoff= 0
##$TI= <>
##$TILT= no
##$TM1= 0
##$TM2= 0
##$TOPLEV= 0
##$USERP1= <user>
##$USERP2= <user>
##$USERP3= <user>
##$USERP4= <user>
##$USERP5= <user>
##$WDW= 1
##$XDIM= 16384
##$YMAX_p= 405889079
##$YMIN_p= -649869
$$ End of Bruker specific parameters
$$ ---------------------------------
##NTUPLES= NMR SPECTRUM
##VAR_NAME=  FREQUENCY,     SPECTRUM/REAL,   SPECTRUM/IMAG
##SYMBOL=    X,             R,               I
##VAR_TYPE=  INDEPENDENT,   DEPENDENT,       DEPENDENT
##VAR_FORM=  AFFN,          ASDF,            ASDF
##VAR_DIM=   16384,         16384,           16384
##UNITS=     HZ,            ARBITRARY UNITS, ARBITRARY UNITS
##FACTOR=    0.220516191357247, 1,           1
##FIRST=     3091.22827374258, 0,            0
##LAST=      -521.488489263204, 0,           0
##MIN=       -521.488489263204, -649869,     0
##MAX=       3091.22827374258, 405889079,    0
$$ Real data points
##PAGE= N=1
##DATA TABLE= (X++(R..R)), XYDATA
$$ [...]
8216 199552 253789 237932 203502 252773 183105 167700 -655 46246 248081 384953 543807
8205 543807 416184 175222 200933 228341 164858 179455 219279 249226 98748 266628 385177
8194 385177 237133 640586 683431 61844 -80326 -149750 -277827 -145380 -160757 -96762
8184 -96762 50037 3658 -84942 -123094 27241 77217 116886 57362 136659 -42941 -125058
8173 -125058 54000 262393 141900 105682 97284 5230 16707 116228 11365 -132461 -54568
8162 -54568 125911 120985 56468 53700 -44240 -53299 -27656 68497 -85526 -68963 -17180 -89141
8150 -89141 -121800 -6450 -137102 -166064 -190696 -160479 -80559 -22889 -49726 -111663 -73233
8139 -73233 -133387 -204428 -104175 -127918 -125980 -107599 -234540 -155215 -155198 -204449 -218736 -149287
8127 -149287 -101232 -104827 -16660 -100731 -95004 -16631 2778 -68358 -243183 -249654 -129219 -191734
8115 -191734 -119801 -162070 -237053 -182681 -320043 -276496 -347721 -270823 -151696 -170037 -178568
8104 -178568 -263448 -305047 -214254 -163264 -244895 -255254 -256172 -225050 -180127 -105174 -19710 -104485
8092 -104485 -40419 -166962 -140764 -181516 -161619 -222660 -283631 -287000 -230761 -177954 -114124 -199793
8080 -199793 -292415 -193540 -240433 -309695 -388152 -324132 -180681 -199395 -191440 -168995 -245943 -124824
8068 -124824 -224999 -226373 -79341 -54780 -160790 -258368 -200179 -237435 -181143 -7824 -44063
8057 -44063 -226305 -265477 -250850 -182030 -167810 -190335 -92493 -131528 -153854 -112750 -186306 -140610
8045 -140610 -183113 -285014 -174190 -133022 -60176 -63572 -9921 39187 -40815 -112986 -216260
8034 -216260 -122995 -59177 -174996 -231756 -64432 -48323 -251676 -255281 -271878 -106508 -182409
8023 -182409 -224322 -265618 -311747 -322528 -352915 -444988 -162992 -196384 -276760 -209228 -110837
8012 -110837 -186889 -326936 -157996 -93268 -44346 21772 -86998 -162457 -116779 -171778 -241407
8001 -241407 -253639 -55847 397 27314 12385 -15170 -127218 32605 116089 -16585 -187441
7990 -187441 -203560 -133739 -164598 -204331 -86296 -166308 -154379 -143991 -348950 -221647 -164152
7979 -164152 -206965 -131943 -209572 -216049 -189196 -248470 -193374 -191867 -185928 -70538 -218754 -321240
7967 -321240 -246420 -154001 -164119 -156778 -172151 -329330 -217373 -109592 -167959 -187153 -113511
7956 -113511 -219788 -209757 -168394 -216764 -249874 -202212 -146005 -220451 -126988 -130263 -258290
7945 -258290 -180476 -103275 -65341 -105134 -165040 -154320 -120122 -97657 -184100 -57767 -150594
7934 -150594 -270492 -143345 -97400 -96082 -144421 -185025 -51247 -36450 -98615 -246720 -256832
7923 -256832 -63290 -17424 -104128 -209378 -132798 -101141 -149721 -124563 -185461 -148864 -66453
7912 -66453 -96650 -209023 -295872 -248386 -162021 -230775 -240066 -151828 -118786 -66640 -19434 -68432
7900 -68432 -226075 -84256 -49025 -56743 -64628 -182794 -169221 -252268 -308855 -238067 -232822 -112499
7888 -112499 -102010 -179092 -109538 17932 -377 -43613 -11734 -49953 -54867 -70804 -63963 -61808
7876 -61808 -157241 -287294 -181092 -210248 -199379 -182564 -131017 4166 -6485 48709 -59572
7865 -59572 -217380 -202681 -165016 -247993 -119046 -28823 -132712 -179092 -147881 -147919 -196582 -200560
7853 -200560 -102346 -83372 -84627 -187976 -250790 -306552 -170863 -71074 -101644 -75970 -147550
7842 -147550 -131782 29623 -62753 -160624 -192738 -152899 -152036 -93748 -32012 -64458 -134823 -142025
7830 -142025 -155867 -138702 -84298 -195864 -139269 -178134 -192853 -144900 -198435 -123521 -36842
7819 -36842 -26521 16500 -143098 -86285 -58202 -134399 -162634 -145064 -208881 -113401 -61504 5132
7807 5132 -8015 -174808 -132449 -181245 -134053 -353706 -629388 -305948 -302652 -170750 -146229
7796 -146229 -47622 -89630 -90338 -35812 -120748 -41255 -65665 -95029 -177411 -194445 -277298 -160792
7784 -160792 -137796 -97018 -18999 93435 11383 -118072 -188645 -222719 -254287 -186040 -282460
7773 -282460 -373027 -191221 -252064 -336399 -42670 -17517 -79874 -140226 -184276 -173052 -174043 -88918
7761 -88918 -116887 -42786 -19056 -127642 -241668 -316413 -340977 -222261 -199311 -270702 -234471
7750 -234471 -281859 -55755 44160 -50405 -116784 -6057 33847 -62013 -43431 -141574 -9954
7739 -9954 -80063 -98045 -62290 -206350 -292556 -234504 -217946 -189758 -154303 -105272 -101558 -175566
7727 -175566 -186361 -195414 524 -94236 -41095 41331 -16805 -31995 -128448 -121909 -60661 24484
7715 24484 64848 -32562 -86135 -119051 -57440 218628 61954 36785 55759 96721 30523
7704 30523 -78891 -111317 -255586 -182288 -194427 -207203 -86277 -23932 -12813 -36367 52018
7693 52018 171565 85934 -56479 -62834 -97316 -30892 -48741 -99573 -95103 -62287 -99294 -67853
7681 -67853 -88323 -11869 -4870 -86680 -192493 -250453 -318205 -240661 -129943 -210011 -183469 5083
7669 5083 163104 -55380 -20242 -108539 5350 -21526 -118338 -155165 -115396 -25525 -113948
7658 -113948 -102542 13017 -68347 -204358 -162855 -150810 -136623 -82756 -133939 -63283 -63552 -76427
7646 -76427 -64215 -27533 -162217 -308902 -302936 -260741 -206995 -245355 -254389 -192542 -205110 -145248
7634 -145248 -103345 -74484 65298 127886 74006 -62178 -151916 -149536 -214635 -181167 -20435
7623 -20435 30587 27499 -61574 -90769 -86937 -72269 -114926 -207587 -230674 -61514 16162 17504
7611 17504 38743 -2005 -25190 -103918 -175002 -145093 -7829 -112842 -212362 -124896 -28289
7600 -28289 -45128 -160472 -145901 -76121 -3124 -60050 31081 13833 -72169 -122504 -95831 -123430
7588 -123430 -146322 -201149 -79643 -113010 -233175 -145610 -117533 -176002 -71302 -141936 -135990
7577 -135990 -153962 -164493 -64512 -192952 -105374 -67062 -56990 -28492 -85039 -239790 -169245
7566 -169245 -49623 -4152 -176003 -297802 -254404 -262575 -128657 -93924 -45101 -57834 -56170
7555 -56170 -49798 -105050 -128888 -76958 -128204 -170162 -164698 -113337 -86188 -90504 -30978 -53687
7543 -53687 -93122 -96819 -120594 -68562 -74171 -35622 -65632 -19728 -76865 -80297 -67988 -164718
7531 -164718 -205083 -162672 -45431 -206017 -299655 -277747 -227314 -235290 -258583 -218509 -152255
7520 -152255 -171463 -65289 -58576 -19163 11461 66580 -41995 -5830 -4775 86371 84590 -144065
7508 -144065 -129218 -58205 -245023 -120415 -21 21217 41211 -125299 -138299 -170026 -178866
7497 -178866 -134512 -112580 -222041 -196691 -153890 -109353 -96988 -114232 -115923 -125444 -141397 -160708
7485 -160708 -82255 -153869 -90310 -29434 -50626 164418 127255 104938 65003 -6729 -65887
7474 -65887 -32894 21192 -20018 -70750 -257142 -193002 -99948 -100389 35447 -60962 -144771 -56724
7462 -56724 11814 9917 -20996 -31414 66953 -6686 -25261 87260 62450 98235 172651 170894
7450 170894 107706 40260 -76659 -65880 -196875 -248768 -87782 -45455 -23640 58069 -54624
7439 -54624 -106527 -156709 -40677 10406 43737 -68717 -163433 -89496 35337 60513 -27238
7428 -27238 -19577 -152223 -139114 -7853 92436 -34054 -98953 -135773 -19242 119121 206032
7417 206032 95038 -3249 -8750 4653 -54016 -49351 -46243 -125514 -185153 -139346 -134770 -185407
7405 -185407 -113025 -91984 73643 -10964 101515 118402 -94843 -38928 -134636 -92483 67675
7394 67675 105535 159820 22581 -102912 29334 -100044 -165935 -239250 -172174 -47165 43468
7383 43468 199084 153957 97838 46975 -7028 29774 88525 146683 84267 -27317 7903
7372 7903 23637 -54459 23398 28448 -103163 -133894 25546 -52708 -102268 30159 131502
7361 131502 84911 -81992 -47612 45907 -56499 -189449 -170540 -308985 -247311 -147384 -81839
7350 -81839 -59032 31953 85446 -31757 -67120 41269 102491 118499 130801 95724 -18336
7339 -18336 -110351 -60558 5755 -66212 -29410 145126 128839 -2808 -43354 -90809 -27889
7328 -27889 -74662 -93600 -107087 -147369 -34934 -80514 22815 15918 -91643 -162138 -137741
7317 -137741 62095 2760 -49271 -158743 -112640 121944 102253 -68068 -23288 -43480 24965
7306 24965 -63729 -149621 46857 2239 -47702 -55713 97729 101811 71717 -75534 -189212
7295 -189212 -188168 -117395 -92875 -112894 -142077 -123492 -110756 -120066 -72827 -29630 96574 14479
7283 14479 -108241 -41389 85406 50687 2497 -32890 -91386 418 91611 -29988 -48532
7272 -48532 -2263 111474 59374 -65498 -246973 -174979 -61996 -33363 -20350 10508 80418
7261 80418 -45736 13350 -116350 -84894 19948 -135288 -133787 -118059 -118840 -170429 -67336
7250 -67336 40501 75382 -22503 45449 39270 -22348 -14007 -111082 -81637 -114052 -15687 -55446
7238 -55446 -145909 -156672 -94002 -107536 -130813 -140297 -80751 -26245 -13413 -256740 -160995 -59364
7226 -59364 -55003 53537 -46548 -82764 -100111 -37177 32023 35406 -20814 -185292 -110653 -12394
7214 -12394 78016 110100 44558 23282 -778 23725 -50485 -80522 -31818 2166 -127602 -198977
7202 -198977 -211781 -153118 -55407 -29203 87783 102928 4331 -102052 -44627 64696 232136
7191 232136 132371 104256 112521 46354 64692 46948 1714 -44566 -19937 -95354 65757 186541
7179 186541 129773 92573 -54986 -47769 103787 161802 33857 -100390 -171190 -217890 -60287
7168 -60287 29820 31407 58685 76660 25354 104613 115287 74748 152573 49287 71331 134779
7156 134779 97441 130914 113973 103949 1841 99826 72781 -22672 -77349 -86454 52513
7145 52513 146312 93596 124477 111210 170186 89527 -2537 2070 6422 132096 266412 142209
7133 142209 95892 82780 129059 89243 61422 208954 213718 68515 133717 144566 102514
7122 102514 24624 -100034 79030 89215 52402 -72956 -57504 -40508 59005 199822 122505
7111 122505 102838 -66856 -77602 38776 30346 102673 116460 37756 57122 54323 66861 50407
7099 50407 31685 185801 203854 130922 41323 -52643 -81551 -86475 49830 82033 124872 189191
7087 189191 55701 -192761 -196006 34722 118303 -33442 -139196 15295 -27458 98308
7077 98308 170281 92235 -58259 -92524 -139479 -179470 -92572 -88480 -108797 44897 75995 20261
7065 20261 -89741 1295 107106 31394 12747 -60599 -141447 -122149 -85943 -37990 -19278
7054 -19278 34803 46576 65900 99146 37383 -88468 89044 79759 -19380 -123395 -78939
7043 -78939 12630 131974 44630 -66593 35352 77414 137633 103720 38210 134859 176704
7032 176704 113280 88495 85528 94044 60108 102226 129289 89083 148730 157266 78146 645
7020 645 -24389 124352 30525 -28985 114886 99148 85993 -58807 126325 191279 40160
7009 40160 109993 17512 84762 131461 185173 220773 227419 82829 76598 153223 149445 126865
6997 126865 227138 213396 304293 258371 335905 347210 304069 107769 35169 164398 344622
6986 344622 206684 155332 162088 263790 240842 205856 151888 190728 221467 125369 202596
6975 202596 151511 204783 229979 270897 340474 119140 118443 158983 82224 22197 112451 216042
6963 216042 231172 242177 187973 211688 66930 29937 176084 185835 209572 135051 68491
6952 68491 85382 75824 188894 128997 10460 -136506 -70158 101094 177903 31523 24543
6941 24543 39958 176967 158825 208894 133203 66090 18904 -15807 31005 37130 82917 104275
6929 104275 127270 76804 123488 -34791 -41009 86225 205329 203305 153129 162667 71329 148155
6917 148155 34171 -35175 -24480 139367 180847 125097 186639 203051 217412 159964 188434
6906 188434 72165 47661 208028 256742 106396 70012 138457 157366 125876 53335 146058
6895 146058 122105 85973 100627 215869 227055 247832 207936 185522 235735 294230 140690
6884 140690 195319 212382 274002 229726 193365 222874 155862 257573 127910 144669 107652
6873 107652 85182 190672 325069 351629 303302 286308 245269 246306 144647 165715 28490
6862 28490 150097 212125 160810 204158 188552 193937 257472 351610 214560 166638 36408
6851 36408 128120 232029 123869 152565 351251 361665 278464 255039 255630 188986 255772 379318
6839 379318 463546 323330 176764 205339 201731 163088 249681 366573 416983 174304 60535
6828 60535 116699 217876 239782 264617 118738 203533 186860 125051 161074 196859 255402
6817 255402 258096 275630 269884 325822 291583 274995 291193 270092 322826 277570 237369 260108
6805 260108 231235 333948 215105 223168 292918 264050 176492 323829 396669 289761 257585
6794 257585 265610 251851 252479 63218 134073 270386 398135 349047 314306 260436 273261 237530
6782 237530 216920 271858 182723 259213 259075 288652 217371 295693 334225 337349 292441 378919
6770 378919 343394 218974 234087 299384 360620 361868 257823 217608 330226 443688 328319
6759 328319 195048 156441 270683 298040 151323 64446 243676 347685 355135 371746 260873
6748 260873 183822 322578 379169 282172 316501 238093 193555 283302 321601 155479 226204
6737 226204 292432 234090 307039 399395 309682 179764 285398 300623 263401 259158 221102
6726 221102 219344 258965 366382 259978 267184 194874 229413 252889 307623 430066 357070
6715 357070 437442 374534 413794 228842 330660 525171 468098 387595 334856 356728 325657
6704 325657 409983 358100 282975 322491 353916 463475 502899 484463 564126 456001 417758
6693 417758 414203 314220 269729 296840 415686 584343 394474 422282 479467 446704 517878
6682 517878 619700 389529 244839 389026 493183 504903 507039 406353 468164 471175 401475
6671 401475 274597 357109 359655 325872 365455 319600 329008 371135 368530 244047 383037 339896
6659 339896 445241 354661 445912 557455 443028 398117 369233 333478 313001 322408 438016
6648 438016 477618 489943 450737 430828 371356 467710 612372 504229 483237 505642 580290
6637 580290 494391 425868 472280 522366 533250 555137 494854 482759 636529 629993 538552 440433
6625 440433 419671 427400 503551 449581 405527 550814 613945 684123 561940 370739 423128
6614 423128 423018 397873 466228 503406 501915 572471 392017 404186 414034 410235 478857 444700
6602 444700 450518 612288 621361 568855 595691 588965 712741 619508 596722 534259 706486 712786
6590 712786 625823 566637 522427 648551 698076 724260 765405 750142 695820 771747 915210
6579 915210 918505 878565 1051470 1134012 1198501 1266993 1341349 1265740 1381252 1539116 1664446
6568 1664446 1673452 1622456 1535199 1611239 1572940 1606473 1655634 1528198 1455558 1409392 1390888
6557 1390888 1257478 1227099 1335863 1269794 1153365 1108644 1165762 1218363 1185033 1158852 1043837
6546 1043837 1177556 1249335 1252075 1173634 1141358 1026912 971005 863495 843579 775704 809668
6535 809668 762127 846784 1054708 1103542 944094 828783 788246 791306 850407 786014 799531
6524 799531 759598 812996 919761 892566 897714 901051 930217 888492 790747 578697 692073
6513 692073 665497 589536 625096 711944 824596 842414 819967 730473 700402 738641 694444
6502 694444 630583 606388 645661 756510 763755 811358 817973 828690 688664 652820 697605 693038
6490 693038 656725 698675 715760 663306 657347 790788 702212 642583 645303 708319 834560 865097
6478 865097 787878 731618 984725 935026 789898 750464 754797 823873 703009 727802 758087
6467 758087 798048 720788 677362 554609 779616 774773 786746 736208 645871 666695 636436
6456 636436 665752 699444 724551 599881 642951 715188 781123 838242 838161 803201 787035 874041
6444 874041 785907 818284 673623 664309 774480 800082 976576 1020534 892046 873481 789433
6433 789433 923419 914506 888042 975031 849967 810776 893332 790225 661858 761871 750798
6422 750798 792758 761412 894366 908715 1043934 944148 1006265 1053639 1030017 1109293 1085672
6411 1085672 1088533 1103863 1079047 985788 942649 912913 911698 928777 831976 1015186 872670
6400 872670 812431 938567 917472 931076 1128359 1156570 1152795 1145026 1127867 996104 958684
6389 958684 1047640 1005050 1079861 1085736 1110996 1151670 1047449 1051395 1125875 1168193 1150971 1174623
6377 1174623 1332800 1244820 1200033 1173891 1268403 1236520 1154535 1197074 1115199 1126069 1173467
6366 1173467 1097609 995637 1182908 1354150 1367697 1433997 1293036 1197252 1215962 1245425 1360205
6355 1360205 1415186 1542093 1485829 1514391 1464149 1474894 1490906 1540193 1596379 1565943 1418853
6344 1418853 1521976 1607552 1489332 1625587 1624367 1606746 1692608 1631910 1664563 1692728 1726799
6333 1726799 1753477 1725057 1837520 1892896 1933488 1945866 2032246 1991045 2081471 1943408 1982293
6322 1982293 2017633 2189140 2211814 2274967 2295454 2174726 2290173 2333935 2357286 2498213 2501485
6311 2501485 2551878 2753802 2823609 2769018 2818506 2801886 2816321 2995436 3093805 3200628 3402444
6300 3402444 3383024 3343535 3386016 3457421 3398165 3518870 3485764 3468503 3493617 3673867 3705292
6289 3705292 3597851 3602317 3613723 3576079 3579503 3597034 3512625 3450260 3333203 3347865 3335879
6278 3335879 3286427 3243777 3292878 3382944 3494809 3422297 3347961 3589543 3832500 3762589 3832751
6267 3832751 3738558 3886391 3855988 3825682 3922421 3845004 3753836 3741945 3731484 3734732 3578382
6256 3578382 3556760 3543896 3531530 3488277 3451332 3556014 3653331 3575594 3417970 3546744 3653589
6245 3653589 3678259 3675464 3834047 3828557 3925795 4112303 4152869 4126495 4242257 4428057 4415020
6234 4415020 4504232 4706305 4684701 4733181 4699669 4614344 4695676 4687392 4734264 4631813 4665994
6223 4665994 4796580 4669946 4696722 4822455 4782175 4635852 4673101 4796746 4546722 4559724
6213 4559724 4604884 4532179 4484465 4477543 4382846 4485213 4462506 4611975 4535691 4286106 4313148
6202 4313148 4240544 4309526 4358732 4342080 4168717 3994002 3970499 4025644 4134362 4142677 4062764
6191 4062764 4038620 3982842 4099092 4078993 4021229 3954050 4031701 3848790 3842438 4015636 3992956
6180 3992956 3930936 3896279 3913431 3917887 4012921 3881491 3987862 4049789 3945123 3849796 3804825
6169 3804825 3934462 4013905 4050033 4072609 4066829 4014909 3952544 3881427 3898883 3971498 3907598
6158 3907598 4000844 4095828 3961200 3830704 3903827 4126292 4168049 4069628 4110351 4106556 4022888
6147 4022888 4136508 4163507 4149067 4253540 4378608 4448609 4409124 4465487 4516819 4566754 4619681
6136 4619681 4735377 4946969 4962919 4884757 4723861 4876741 5113567 5169968 5156851 5202860
6126 5202860 5290605 5213513 5116459 5241476 5329728 5383084 5444154 5418873 5530114 5529116 5672838
6115 5672838 5787725 5692064 5773963 5935334 6071717 6211273 6304788 6337188 6567116 6516416
6105 6516416 6625654 6778043 6925560 6993879 7178076 7302892 7538379 7753180 7877799 8100269
6095 8100269 8290281 8560373 8777932 9080513 9193936 9470921 9787069 10074452 10457915 10844425
6085 10844425 11138888 11419607 11645145 11919579 12018097 12179355 12509425 12498186 12591662 12678449
6075 12678449 12811447 13081820 13118046 13002422 13016320 13321738 13536649 13820856 14025205 14298571
6065 14298571 14469637 14785974 15001271 15295243 15646830 15838186 16208283 16521501 16877555
6056 16877555 17076663 17285043 17696244 18163096 18713347 19090105 19589736 20339024 21217747
6047 21217747 22140011 23223083 24587947 26244266 28076777 30294882 32789634 35604624
6039 35604624 39027947 42683411 46644901 51023644 55789511 60946669 66554047 72455428
6031 72455428 78555678 84496998 90381416 95950999 100980216 105516011 109386578 112674358
6023 112674358 115473309 117557029 119141958 120282463 120959994 121474021 121968087 122382517 122840099
6014 122840099 123666388 124624105 125805895 127256816 129183685 131831253 134821282 138440483
6006 138440483 142507417 146282076 149642105 152721820 155011100 156435451 157205129 156853282
5998 156853282 155511302 153249486 150160833 146411085 142035924 136989528 131731183 126006790
5990 126006790 120167002 114240149 107888371 101467130 95105208 88971285 83289748 78054262
5982 78054262 72921468 67983629 63175568 58735747 54363246 50035866 45957092 42132307
5974 42132307 38687549 35461722 32544636 30106808 27813789 25853493 24087936 22524671
5966 22524671 21119492 20059446 19039499 18039413 17463265 16856462 16228301 15882096 15486015
5957 15486015 15174038 14758626 14340587 14063297 13744335 13393707 13018060 12768697 12434768
5948 12434768 12139893 11700380 11213252 10919408 10567803 10358018 10127111 10038644 9797662 9575593
5938 9575593 9478767 9318348 9258590 9013622 9166000 9079573 9112044 9291838 9238792 9214952 9260486
5927 9260486 9514882 9771408 9845817 9951428 10055079 10240665 10606334 11025092 11338830 11743680
5917 11743680 12215606 12679468 13098136 13503218 13931528 14524774 14816583 15198372 15541207
5908 15541207 15748085 16067779 16322097 16654869 16968753 17204288 17503066 17873645 18209486
5899 18209486 18657674 19137388 19853995 20460509 21045940 21826027 22616581 23486922 24489538
5890 24489538 25457780 26361815 27140617 27956684 28666432 29268770 29802814 30185492 30591236
5881 30591236 31107578 31701637 32078438 32445171 32942887 33434563 33948783 34367622 34954872
5872 34954872 35542204 36210406 36988704 37663059 38289321 39020414 39927757 40383945 40788077
5863 40788077 41205736 41634486 42072001 42469551 42736253 43043899 43461837 43812338 44199632
5854 44199632 44303218 44508633 44608787 44538474 44429007 44284244 44374885 44312686 44236195 44000192
5844 44000192 43605005 43315353 42950224 42683364 42497805 42137925 41876787 41707430 41525633
5835 41525633 41268185 40928716 40635398 40366065 40125746 39895126 39544257 38968481 38546040
5826 38546040 37874745 36976414 36043976 35249563 34411688 33479913 32576696 31609004 30494531
5817 30494531 29664185 28810335 27980262 27444267 26850481 26262997 25733421 25224583 24733771
5808 24733771 24385509 23816686 23236538 22831196 22252887 21440632 20675060 19949977 19273677
5799 19273677 18491724 17591454 16804853 16007799 15241431 14552457 13855335 13321411 12884932
5790 12884932 12271914 11800323 11485663 11081068 10700410 10384158 9947017 9631270 9250061
5781 9250061 9028960 8695689 8354372 8095569 7774581 7398542 7147086 6952268 6648219 6341571
5771 6341571 6103309 5808256 5585090 5450723 5167128 5071536 4961674 4704579 4667804 4459876
5761 4459876 4352222 4246215 4076664 4073677 3970054 3951402 4006020 3981271 3876257 3778197 3635744
5750 3635744 3652080 3547459 3569490 3507128 3477845 3363918 3441869 3449135 3504493 3550513 3567178
5739 3567178 3607909 3514629 3551472 3548543 3584566 3621312 3470352 3331073 3351171 3350442 3478399
5728 3478399 3527906 3448117 3389468 3415356 3571749 3494194 3478425 3568237 3677759 3778639 3800209
5717 3800209 3702532 3702617 3755738 3825044 3884837 3906911 3921199 3966696 3892044 3834360 3955365 3927575
5705 3927575 3904015 3877925 3859222 3665879 3704591 3887853 3784681 3783782 3731117 3781693 3779178
5694 3779178 3808443 3890645 3799195 3790165 3774011 3819739 3948960 3855566 3754032 3629390 3689117
5683 3689117 3656865 3526740 3654620 3649055 3663784 3682906 3672263 3628831 3560679 3495831 3542331
5672 3542331 3624176 3622467 3538440 3461443 3321980 3353402 3434922 3355293 3311542 3275359 3315052
5661 3315052 3360430 3393373 3340357 3306366 3249519 3239494 3385035 3427429 3361962 3358371 3290552
5650 3290552 3409404 3351761 3254162 3437854 3344437 3429881 3497227 3525269 3495900 3539113 3474144
5639 3474144 3327268 3350274 3321844 3375022 3346920 3315289 3383759 3416255 3251192 3103631 3226539
5628 3226539 3335538 3347108 3312128 3266215 3187528 3276091 3393661 3469582 3443672 3342415 3076990
5617 3076990 3151650 3147229 3217676 3236791 3245649 3387670 3429728 3204801 3185981 3414677 3467504
5606 3467504 3373072 3421734 3471983 3455362 3462238 3460897 3487184 3431680 3604101 3658849 3577997 3501127
5594 3501127 3600033 3550374 3526771 3367331 3418514 3644076 3666918 3535023 3538291 3531629 3672218
5583 3672218 3745726 3757950 3637295 3545306 3734615 3787740 3753771 3759295 3839394 3826541 3685360
5572 3685360 3683227 3697068 3688590 3828297 3844389 3861370 3864107 3712087 3701718 3908938 3847845
5561 3847845 3764822 3663067 3703832 3638865 3673407 3611848 3755374 3871862 3855181 3928727 3925417
5550 3925417 3876032 3882152 3930712 3902904 3834885 3967439 4172665 3961874 4002766 4038229 4087602
5539 4087602 4064748 4019265 4071306 3892954 3975607 4138676 4261512 4160537 4071652 4098831 4026655
5528 4026655 4016993 4239188 4243554 3961394 4094064 4096795 4061836 4033003 4141642 4093739 4091134
5517 4091134 4228063 4223295 4089334 4149779 4137502 4198044 4184197 4230179 4306079 4279774 4224634
5506 4224634 4264782 4223714 4267103 4338290 4305607 4359579 4271618 4258577 4163534 4188195 4264348
5495 4264348 4194861 4216365 4151468 4159155 4219405 4243894 4104049 4219898 4268526 4094231 4021947
5484 4021947 4062252 4043305 4154644 4031438 4015074 3887171 3856307 3861622 3855078 3890607 3824685
5473 3824685 3913223 3789443 3754983 3750723 3737514 3765778 3804275 3629028 3575655 3593928 3683603
5462 3683603 3627235 3716799 3692638 3735921 3646283 3685804 3819042 3716232 3714098 3807450 3667211
5451 3667211 3697969 3675665 3665137 3641348 3718406 3689718 3633288 3660834 3806432 3806988 3780887 3784837
5439 3784837 3685183 3694545 3665010 3656784 3721920 3681635 3640009 3627337 3580040 3616927 3569386 3630846
5427 3630846 3623906 3522862 3547619 3566875 3663981 3629107 3487509 3567743 3680312 3670512 3620413
5416 3620413 3640065 3508443 3441965 3492505 3400090 3551858 3608950 3573169 3616810 3660785 3683065
5405 3683065 3729426 3670500 3617481 3658415 3598388 3662164 3755795 3698668 3820036 3898039 3779447
5394 3779447 3738453 3666767 3818083 3911688 3933498 3813293 3809190 3691643 3701432 3739564 3664356
5383 3664356 3761155 3713163 3723724 3947588 3845074 3812064 3750563 3766959 3766723 3766779 3815407 3734863
5371 3734863 3901921 3953233 3687498 3487532 3549728 3612416 3603960 3504165 3619039 3666609 3622697
5360 3622697 3641243 3583948 3556299 3527460 3621590 3704282 3636101 3681859 3853255 3858971 3843102
5349 3843102 3786759 3735692 3857739 3992758 4081605 4115674 4025039 3935175 3936516 3955867 3986658
5338 3986658 4029623 4099870 4045677 4006451 4052388 3985953 3954204 4054591 4087885 3998992 4212167
5327 4212167 4338494 4233589 4107043 4194865 4314550 4122447 4161491 4153170 4197566 4278292 4402568
5316 4402568 4472795 4413806 4413088 4371302 4402235 4408868 4284071 4125618 4225493 4318948 4314930 4209827
5304 4209827 4286987 4321861 4140209 4270687 4131456 4104077 4171287 4154152 4343088 4351832 4353767
5293 4353767 4436279 4373720 4333999 4238435 4249182 4299290 4420597 4504945 4592853 4572093 4586478
5282 4586478 4737191 4618977 4589337 4650859 4539537 4708562 4858595 4801234 4800429 4745840 4658189
5271 4658189 4569513 4604100 4575461 4609201 4492013 4561462 4695503 4747713 4652672 4786881 4870165
5260 4870165 4912975 5018063 5056888 5190095 5113783 5014571 4955693 4977416 4981371 4905772 5024956
5249 5024956 5086218 5013866 4963641 5057787 5078738 5116076 5190850 5155205 5040872 4998649 4882194
5238 4882194 4894572 4822033 4689495 4690630 4827366 4898360 4839734 4759420 4706854 4837458 4842904
5227 4842904 4787785 4597245 4641325 4573686 4478702 4467851 4460173 4507275 4465123 4302092 4374038
5216 4374038 4289568 4230664 4197412 4179416 4301719 4367685 4296170 4277317 4296190 4212188 4224090
5205 4224090 4249701 4143476 4160257 4104502 3991595 4048442 3895171 3847162 3861761 3884712 3998566
5194 3998566 3950345 3928103 3851813 3884910 4024707 4093424 3963509 3925704 3940747 4009253 3947942
5183 3947942 3926528 3873637 3932101 3920097 3865587 3924418 3873411 3945878 3887160 3880952 3886834 4003172
5171 4003172 4087412 4065071 4169371 4219231 4098826 4066802 4075473 4229342 4241188 4351888 4351993
5160 4351993 4285127 4271755 4263547 4261152 4194652 4190016 4288241 4335110 4438823 4533749 4601052 4762578
5148 4762578 4552626 4407405 4551311 4649254 4656596 4731241 4789652 4726841 4769463 4726890 4730744
5137 4730744 4738942 5010076 4965314 4825183 4802449 4803211 4922442 4903577 4950173 5147990 5093079
5126 5093079 4943954 5016291 4926622 4716229 4821408 4860964 4878476 5048195 5038913 5261433 5256044
5115 5256044 5287876 5301601 5121657 5128292 5065654 5253463 5291815 5269293 5355777 5347093 5469675
5104 5469675 5474595 5537629 5607278 5629798 5535842 5509287 5466088 5495423 5535270 5643756 5746608
5093 5746608 5919776 5700570 5678791 5823600 5793720 5846970 6062473 5928265 5932755 6103907
5083 6103907 6098682 6042151 6016216 6250117 6305155 6234565 6375534 6490587 6489099 6525477 6489990
5072 6489990 6601904 6565704 6658080 6734218 6802705 6925574 6930138 6951732 7014601 6996985 7117297
5061 7117297 7075996 7010421 7080562 7086690 7044098 6972122 6962483 7146740 7211853 7137157 7149667 7171681
5049 7171681 7256820 7359215 7339590 7479198 7424998 7331035 7113030 7173918 7414341 7364208 7251143
5038 7251143 7369029 7441111 7526318 7606088 7689641 7679657 7554520 7567030 7677250 7832957 7950488
5027 7950488 8059207 8033024 8090487 8209954 8462211 8653593 9001638 9267689 9643963 9952069
5017 9952069 10445084 10925339 11404842 12016902 12622027 13458951 14242409 14944494 15734209 16561659
5007 16561659 17529384 18410694 19122863 19743931 20172620 20518129 20770509 20847355 20953903 21055987
4997 21055987 21243801 21282840 21085593 21028596 20885464 20917346 21141989 21370831 21586443 21919571
4987 21919571 22030983 21933775 21975369 21833326 21596738 21313276 20917382 20670571 20294460 19679606
4977 19679606 19242660 18803869 18251091 17890698 17504617 17344195 16946472 16644693 16762669
4968 16762669 16919958 16870387 16793345 17043419 17443129 17839469 18387908 19101196 19727267 20356835
4958 20356835 21306353 22166755 23256585 24566799 25764150 27107509 28406557 29585921
4950 29585921 30497444 31172664 31868597 32276475 32573165 32818479 32828782 33039827 32997102 32792433
4940 32792433 32610692 32531701 32337362 32163944 32227644 32324924 32472631 32723776 32965012 33169767
4930 33169767 33103004 32945624 32597077 32304978 32047294 31737086 31272647 30598555 29883394 29230124
4920 29230124 28399466 27584092 26938914 26682349 26091500 25657347 25431849 25139436 25012032
4911 25012032 24847956 24840976 24856978 25010979 24981811 25243325 25522796 25772311 26082106 26686041
4901 26686041 27237781 27957167 28821756 29726215 30752427 31900948 32997417 34338805 35831350
4892 35831350 37438091 38931706 40616783 42643319 44480563 46671364 48709442 50775208
4884 50775208 52797711 54884001 57210171 59581492 61812484 64047326 66222502 68528556
4876 68528556 70790088 72912580 75100080 77331507 79580185 81784768 83733995 85735101
4868 85735101 87928521 89980419 92075228 94352595 96691509 99083191 101568193 104118361
4860 104118361 106777051 109575029 112539803 115272850 118085270 120632224 123271666 125796137
4852 125796137 128061201 130226640 131823090 133399385 134675544 135510748 136021225 136352279
4844 136352279 136224695 135682346 134932472 133902169 132608421 131134948 129514161 127851664
4836 127851664 126269850 124759539 123222453 121735941 120427989 119112366 118031134 116985086
4828 116985086 116368349 115927708 115666271 115502369 115585950 115598086 115621361 115711257 115889736 116242015
4818 116242015 116458726 116624364 116940420 117405651 117706254 117981434 118182651 118137399 118206001 118119400
4808 118119400 118091937 118075446 117938409 117963158 117856689 117771159 117639540 117360997 117005757 117060179
4798 117060179 117329750 117728867 118412539 119269114 120326078 122120008 124206033 126673706 129700090
4789 129700090 133208134 137281643 141603221 146181260 150893768 155486978 160066370 164679520
4781 164679520 169043436 173182118 176987503 180490124 183330400 185332793 186718162 187373789
4773 187373789 187550948 187192095 186475335 185151731 183510502 181471399 178817291 175795534
4765 175795534 172579359 169027103 165500152 161865668 158255067 154888525 151408264 148155000
4757 148155000 144736465 141415327 138128693 135040187 132106307 129117155 126066648 122872992
4749 122872992 119637388 116243666 112689349 109156176 105548319 101803373 98160389 94542813
4741 94542813 90974087 87507440 84084951 80891360 77957363 75025783 72391042 70184686
4733 70184686 68324718 66706455 65219704 63776760 62291049 60855207 59359001 57789840
4725 57789840 56202240 54668696 53015517 51536751 49951135 48257454 46562828 44802239
4717 44802239 43244358 41403324 39836791 38434786 37007640 35666516 34515497 33371896
4709 33371896 32424711 31862667 31182736 30578776 30236882 30025557 29988769 30026365 30346563 30767555
4699 30767555 31346617 32271774 33064467 33950319 34899814 35688008 36214887 36666559 36883605
4690 36883605 37031403 37196543 37185868 37060801 36978901 36790032 36424724 35833231 35386752 34778027
4680 34778027 34128872 33641966 33144689 32674633 32255884 32137485 31891496 31690394 31590524 31520617
4670 31520617 31597331 31494710 31481242 31428441 31585657 31994067 32377583 32932213 33225274 33547658
4660 33547658 33502241 33352105 33113991 32756667 32451592 32181351 31892134 31213004 30539899 29824943
4650 29824943 29077625 28258696 27385179 26647564 25924329 25400926 24883271 24431411 24442012 24534237
4640 24534237 24656726 24789834 25084441 25369296 25512653 25924972 26507189 26983663 27426230
4631 27426230 28050275 28809108 29342935 29765145 30297278 30725024 30863015 30863155 30594423 30215565
4621 30215565 29683966 29247018 28547055 27853410 27071227 26319345 25535160 24480841 23702824
4612 23702824 22947352 22412652 21993552 21539888 21232483 21246411 21035758 20992422 20752251 20489561
4602 20489561 20181657 19942284 19634282 19187826 18794844 18274697 17778940 17163500 16551289
4593 16551289 15839561 15059581 14442862 13866508 13380335 12919930 12484323 12227047 12115520
4584 12115520 11960263 11810981 11898291 11934368 12044375 12306131 12514450 12849415 13286716 13799237
4574 13799237 14238668 14808900 15330475 15956412 16359777 16547801 16770164 16657468 16494410
4565 16494410 16393274 16084581 15797196 15489358 14805236 14366873 13723414 12923966 12208685
4556 12208685 11450772 10865178 10398287 9770820 9381168 8874485 8539681 8370324 8033113
4547 8033113 7700234 7735924 7590978 7354012 7226079 7045504 7128874 6953406 6758219 6650627
4537 6650627 6580353 6315644 6245882 6202379 6257137 6163895 6087078 6026750 5961958 5905338 5766171
4526 5766171 5665511 5416446 5448191 5346336 5300438 5114647 5141956 5131405 5192857 5084025
4516 5084025 4996851 5130218 5105929 5042249 4879156 4811321 4894410 4847999 4858357 4890041 4803895
4505 4803895 4765262 4819348 4859389 4866139 4836636 4753099 4713225 4618398 4773929 4805360 4847520
4494 4847520 4878649 4881966 4740341 4731238 4774563 4837158 4862135 4909273 4937370 4935190 4858595 4900427
4482 4900427 4963943 4903626 4977909 4892709 4770335 4769113 4773537 4664773 4754115 4923176 4890184
4471 4890184 4710704 4767857 4779588 4715232 4775597 4803809 4758997 4797718 4776482 4783151 4845636
4460 4845636 4742330 4701182 4735905 4619771 4595719 4699742 4624606 4668945 4604429 4575884 4566239
4449 4566239 4473473 4505920 4592505 4600225 4523787 4484756 4471797 4445221 4464390 4651650 4536243
4438 4536243 4415362 4418730 4506336 4653063 4635725 4652652 4671416 4595113 4597870 4539154 4682565
4427 4682565 4888618 4991868 5160053 5264124 5399941 5615874 5671929 5782655 6033034 6105051
4417 6105051 6349381 6523672 6872149 7114105 7272686 7398555 7440174 7513833 7461172 7470932
4407 7470932 7411940 7210343 6976683 6831027 6768449 6602978 6446015 6230887 6161126 6035100
4397 6035100 5902553 5793877 5669217 5471200 5521407 5597968 5601389 5446800 5363033 5397349 5458914
4386 5458914 5457002 5436619 5528100 5547515 5583565 5502869 5506296 5665076 5664935 5576023 5564715 5593952
4374 5593952 5599552 5502397 5484321 5599115 5689486 5756209 5875166 5954795 5977459 5878946 5818952
4363 5818952 5792473 5866473 5921504 6014193 6028744 5973216 6076434 6182975 6215449 6257584 6203388
4352 6203388 6191314 6244899 6345659 6315758 6299310 6425849 6577845 6597355 6575114 6658865 6600898
4341 6600898 6638300 6900663 6852423 6940319 6953890 6944128 7075708 7356971 7433946 7445657 7628638
4330 7628638 7740151 7877457 8234301 8537476 8754695 9024899 9076142 9298575 9670134 9993715
4320 9993715 10720527 11167531 11393564 11687823 11971004 12110715 12031938 11949355 11962535 12034220
4310 12034220 12089932 11909534 11862459 11711562 11331260 11153609 11123094 10989091 11004086 10964095
4300 10964095 10823176 10811391 10817353 10842645 10823061 10877959 10927728 11041606 11069138 11107276 11070617
4289 11070617 11099742 11192769 11157022 11075466 11178484 11188392 11316822 11427038 11624819 11664840 11790851
4278 11790851 11940625 12075131 12292189 12372579 12522320 12851530 13044613 13277143 13502792 13851991
4268 13851991 14261523 14873852 15551362 16112176 16740382 17554925 18635651 19764081 21176772
4259 21176772 22873592 24823557 27033089 29777368 32542375 35666891 39465762 43499965
4251 43499965 47844046 52655783 57573465 62733497 67992973 73165524 78270276 83081894
4243 83081894 87468127 91258609 94640619 97400515 99547267 100714808 101008047 100437462
4235 100437462 98931706 96674465 93544926 89664967 85313173 80689387 75807116 70637641
4227 70637641 65475873 60365267 55285371 50321855 45634012 41363696 37424368 33902090
4219 33902090 30797406 27998485 25770173 23577294 21591076 20146924 18941473 17866834
4211 17866834 16965090 16220238 15712390 15186525 14652177 14317126 13983561 13825899 13708483
4202 13708483 13560681 13430973 13373017 13295204 13284649 13224672 13268537 13188882 13171679 13375423 13345327
4191 13345327 13405760 13546578 13655277 13780678 13978506 14130675 14249044 14350561 14691055 14948473
4181 14948473 15267169 15712635 15978565 16546393 16975084 17395067 17946903 18549181 19187891
4172 19187891 19922067 20648227 21372110 22114334 22905357 23769090 24572469 25376754 26340840
4163 26340840 27222762 28004799 28877891 29797943 30529257 31406855 32377116 33331501 34333252
4154 34333252 35279778 36300679 37432951 38739029 39798122 41127448 42309425 43368028
4146 43368028 44557032 45590777 46919788 48032577 49364451 50755044 51872482 53118973
4138 53118973 54422311 55551430 56767312 58076144 59401835 60804647 62222157 63733194
4130 63733194 65313178 66864957 68340405 69963642 71690939 73694176 75559310 77395246
4122 77395246 79292958 81145441 82964679 84695583 86273860 87793330 89349855 90817804
4114 90817804 92159858 93479760 94662732 95670048 96810367 97838006 98785747 99770899
4106 99770899 100789965 102021694 103246583 104429132 105746838 107233485 108903139 110749317
4098 110749317 112875423 115398458 118037930 120738099 123629260 126697378 129764192 132783887
4090 132783887 135926148 139013491 142144216 145159952 147974545 150654381 153326519 155589144
4082 155589144 157656831 159503459 161127076 162369133 163506973 164450734 165360663 166073166
4074 166073166 166617211 167312625 168065979 168504053 168545166 168832632 168991263 169154788 169344324
4065 169344324 169445497 169773507 170002538 170080112 170246501 170282964 170346232 170476736 170423934 170290001
4055 170290001 169828938 169148735 168231716 167068065 165731497 164122371 162365766 160297633
4047 160297633 158160831 155635284 152766510 149760073 146710235 143448729 140375502 137260103
4039 137260103 134387638 131841685 129343855 127086380 124815473 122959784 121369003 120004648
4031 120004648 119074183 118174054 117578290 117036770 116304534 115521392 114848980 114206252 113602203
4022 113602203 112982667 112072298 111099065 109848159 108341525 106554987 104452843 102300435
4014 102300435 100055729 97736485 95442850 93219187 91016700 88583034 86134468 83803965
4006 83803965 81487295 79367882 77321260 75307866 73497178 71809766 70130148 68375436
3998 68375436 66853345 65527878 64018393 62511178 60912437 59255085 57593448 55824645
3990 55824645 54015892 52299587 50471148 48596490 46791456 45074160 43321661 41617868
3982 41617868 39980900 38361133 36625413 34862625 33386087 32234991 31064766 29847319
3974 29847319 28713787 27842849 26957960 25995382 25010798 24204276 23387179 22721420 22063145
3965 22063145 21204255 20648140 19995584 19402874 18941410 18325917 17767157 17336975 16870082
3956 16870082 16396970 16011287 15730296 15395296 15100040 14899821 14693155 14361062 14119582
3947 14119582 13942114 13799167 13700483 13582189 13456225 13120153 12949986 12933809 12930813 12821834
3937 12821834 12865536 12854542 12660489 12673832 12524188 12475604 12441260 12306178 12143941 12205452
3927 12205452 12224859 12129750 11945596 11900444 11902417 11809010 11707116 11693537 11537519 11343382 11400164
3916 11400164 11445467 11349673 11313830 11181129 11106764 11195917 11247606 11173152 11160446 11242222 11312255
3905 11312255 11232988 11043475 11107892 11310247 11413593 11323292 11321921 11434120 11514562 11511928 11721974
3894 11721974 11806069 11846220 11955997 12151702 12434914 12551342 12693562 12596198 12821650 12918591
3884 12918591 12900354 13037824 13253804 13568896 13746192 13802772 13963148 14173433 14409825 14757391
3874 14757391 15089853 15379993 15591082 15806107 16085869 16550395 16912916 17290070 17539459
3865 17539459 17902393 18499076 18785810 19132297 19582944 20077256 20462244 20880222 21419278
3856 21419278 22022612 22728192 23399967 24095312 24871517 25872686 26915075 27903509 29084955
3847 29084955 30455192 31990118 33567127 35240897 37034471 39057642 41008125 43267780
3839 43267780 45635851 48072376 50605823 52945133 55537182 58222829 60902145 63589777
3831 63589777 66530283 69282629 72062849 74765524 77445013 80075363 82543296 84964867
3823 84964867 87162956 89287950 91174089 92708346 94038432 94949990 95683260 96026957 96115842
3814 96115842 96044160 95588034 94912196 93983746 92883557 91387656 89707851 87899918 85787471
3805 85787471 83673531 81386345 79017945 76426746 73994243 71522721 69099950 66745398
3797 66745398 64347697 62043671 59948856 58082943 56162215 54448870 53019867 51790245
3789 51790245 50873054 50109545 49645708 49479617 49442442 49556649 49804380 50450867 51346636 52231324
3779 52231324 53315554 54378690 55506020 56786153 58076042 59421318 60695793 61868938
3771 61868938 62965173 63952776 64861690 65710528 66277653 66909397 67428102 67769861 67908580
3762 67908580 67815904 67599911 67165677 66714893 66026588 65289333 64363671 63373520 62339449
3753 62339449 61066881 59839046 58640887 57360011 55948506 54603206 53233292 51935156
3745 51935156 50716334 49616873 48550316 47631317 46606540 45737661 45112607 44572873 44041262
3736 44041262 43706550 43636258 43644773 43700209 43928848 44271622 44584588 44974411 45654520 46533547
3726 46533547 47265577 48122577 49058345 50002738 50864956 52035789 52913297 53846830 54876681
3717 54876681 55842763 56859283 57665342 58536023 59313174 59866800 60374449 60704590 60817844
3708 60817844 61073811 61161476 61124639 60917602 60496567 60009009 59352773 58544085 57782881 56734833
3698 56734833 55628369 54268111 53032351 51898322 50652620 49549706 48374347 46982070
3690 46982070 45754667 44675901 43526898 42515513 41764454 40977228 40364820 39992690 39853251
3681 39853251 39760232 39762559 39974750 40338730 40801018 41446750 42244764 43410878 44667688 46153229
3671 46153229 47810186 49370024 50984844 52808651 54565414 56144446 57940793 59702387
3663 59702387 61390837 63055425 64584551 65955794 67219806 68203484 69062711 69780360 70304855
3654 70304855 70708888 71022991 71002157 70992145 71056153 70949265 70588838 70253699 69803381 69315114
3644 69315114 68805523 68234163 67502480 66787309 65924661 65129600 64267050 63240754 62103605
3635 62103605 61049229 59770584 58587109 57480022 56373779 55460121 54581723 53764929 52965532
3626 52965532 52334059 51842979 51649584 51725103 51942078 52117919 52324945 52749477 53514315 54381609
3616 54381609 55253544 56172491 57297445 58492536 59657846 60537586 61307780 62114318 62851167
3607 62851167 63448312 63930824 64371521 64731788 65040771 65233692 65287806 65053895 64914204 64821377
3597 64821377 64727608 64815141 64899449 65053779 65409260 65768694 66294821 66912745 67271957 67844205
3587 67844205 68550234 69192020 69737059 70500193 71036168 71286763 71537469 71649220 71642813 71436460
3577 71436460 71028797 70398256 69585559 69086660 68580976 68031559 67539097 67133495 66656734
3568 66656734 66141092 65778940 65366592 65155549 64752767 64220653 63643832 62987230 62303740
3559 62303740 61471782 60569692 59826998 59027730 57922791 56735132 55634771 54685055 53756567
3550 53756567 52807946 51988030 51312563 50720730 50253324 50052188 50082281 50173900 50468589 50834958
3540 50834958 51455271 52366798 53376354 54506139 55777715 57109571 58887065 60862866
3532 60862866 62756644 65071129 67504554 70072288 72789558 75712723 78822578 82153877
3524 82153877 85558011 89190488 92841634 96596419 100320076 104057729 107607429 111017374
3516 111017374 114227883 116958363 119338349 121344186 122739882 123574730 124131509 124259556
3508 124259556 123763146 122829105 121244531 119232799 116862295 114008946 110761543 107145585
3500 107145585 103418351 99501371 95604521 91627414 87526261 83572169 79740847 75875875
3492 75875875 72065892 68345329 64950602 61607443 58596034 55779996 53079030 50818489
3484 50818489 48757001 46690265 44992078 43412874 42026032 40942286 39918595 39223569
3476 39223569 38732927 38200248 37748442 37334988 37141122 37071645 36953011 36840322 36827196 36847748
3466 36847748 36789959 36807069 36702185 36526773 36676849 36801748 36741620 36764106 36780942 37002413
3456 37002413 37118706 37348999 37707825 38087204 38467322 39021671 39636773 40088648 40585182
3447 40585182 41170962 41801199 42291273 42872022 43397106 43937001 44452272 44840430 45214172
3438 45214172 45573253 45931100 46207248 46305967 46254785 46337503 46229657 46108336 45848753 45653685
3428 45653685 45581380 45339454 45049471 44993091 45113559 45150795 45172881 45287873 45613095 45796155
3418 45796155 46184244 46585595 47096802 47782866 48605856 49342773 49958567 50478714 51092303
3409 51092303 51792013 52387587 52662981 53050083 53229551 53568587 53792251 54009469 54179625
3400 54179625 54195716 54308038 54164195 54052464 53834676 53660985 53125993 52486895 51782672 51154606
3390 51154606 50567831 50092440 49430518 48889732 48382073 47745153 47341748 47231905 47219198 47213808
3380 47213808 47257998 47438261 47694127 48151844 48719537 49414591 50325216 51098065 51993656 53047044
3370 53047044 53977425 54908768 56069256 57279496 58545083 60043296 61685912 63593463
3362 63593463 65681547 67947227 70354887 72530329 74669273 76976914 79180095 81492628
3354 81492628 83986352 86128278 88106950 89683670 90929781 91644178 91773787 91916695 91763835
3345 91763835 91424009 90763178 89876212 88658793 87090226 85597910 83867072 82196546 80686296
3336 80686296 79568729 78791871 78388407 78405851 78850561 80090365 81990870 84704846 88356373
3327 88356373 93045718 98808739 105697392 113408065 122020601 131509756 141855666 153376944
3319 153376944 166147823 180115344 194492343 208109133 219805971 229417399 236644483
3312 236644483 241747872 245442691 248004546 249313643 249579709 248588691 246303061 242466313
3304 242466313 237081282 230672453 223923079 217793614 213125222 210122798 208538750 208303374
3296 208303374 209013038 210753074 213809386 218234278 224226594 232054411 241097452 250695949
3288 250695949 259849676 267593871 273332382 276881713 278662469 279276173 279431155 279126545
3280 279126545 278253100 276778902 274292426 270654943 265613544 259810533 253350153 246998965
3272 246998965 241117903 235870683 231228645 227049466 223205103 220076058 217555889 215650289
3264 215650289 213813447 211939186 209968862 207999053 206340399 205283150 205174660 206349668
3256 206349668 208897234 212926311 218555721 225559750 234053288 244062282 255477637 268436331
3248 268436331 282879614 298711390 315900165 333488765 350796430 367034422 381364373
3241 381364373 393048119 401257371 405609095 405889079 402753966 396346242 386880228 374660169
3233 374660169 359792149 342694185 323270354 302307455 280127215 257479473 234931979
3226 234931979 213145016 192507464 173642578 156490185 141301497 127977434 116182649
3219 116182649 105810086 96872292 89315700 83031540 77717302 73221928 69562979 66628105
3211 66628105 64317721 62619334 61333488 60558918 60089826 60085670 60452120 61016381 61904357
3202 61904357 62904146 63901612 65002986 65971231 67137078 68260146 69136384 69964885 70759448
3193 70759448 71352315 71718121 71903090 72001621 71964742 71710593 71405206 70894734 70449099 70124956
3183 70124956 69786286 69531165 69211941 69188543 69285994 69756913 70186473 70798326 71823571 72986820
3173 72986820 74401285 76160910 78217267 80081513 81503651 82372536 82856242 82914512 82539900
3164 82539900 81767371 80870399 79656318 78179408 76673419 74848297 72725846 70211106
3156 70211106 67495983 65180347 63140047 61553260 60362684 59904397 59895288 60507246 61909830
3147 61909830 63921980 66795991 70064081 73952878 78498857 83608727 89155273 95137568
3139 95137568 101514469 107787998 113875971 119139735 123419231 126471242 128305036 128622334
3131 128622334 127902237 126329378 123673533 120017772 115670031 110359183 104392197 97488114
3123 97488114 90303819 83322892 76385939 69762661 63569533 57963648 52887604 48469713
3115 48469713 44723737 41465768 38689651 36314708 34418167 32832382 31560066 30532627
3107 30532627 29625964 28910800 28440470 28183657 27988255 27899876 28054980 28175010 28470347 28954058
3097 28954058 29602769 30413920 31390034 32420554 33817440 35492461 37451428 39811384 42644653
3088 42644653 46293290 50492303 55494632 61138383 67617421 74811731 82924082 91915902
3080 91915902 101823508 112667658 124577066 137174989 150430903 164083489 177195869
3073 177195869 189310464 200137745 209646777 217903468 225138561 231842753 237844906 243181901
3065 243181901 247610330 251169249 253205056 253093333 250916664 246527185 240268725 232663780
3057 232663780 223918731 214300193 204221383 193610382 182553729 170802798 158379075
3050 158379075 145522491 132353674 119123147 106544001 94877927 84283495 74875432
3043 74875432 66352443 58745387 52156408 46499719 41865790 37716782 34221401 31395919
3035 31395919 28676803 26421655 24422954 22603012 21014842 19725080 18501619 17444897
3027 17444897 16414251 15562973 14714370 13765398 12982070 12353709 11643442 11057506 10585980
3018 10585980 9979504 9523024 9096242 8545319 8248568 7989312 7828919 7497880 7133164
3009 7133164 7092347 7063708 6904256 6592095 6526151 6424161 6352923 6417748 6281338 6059303
2999 6059303 5900518 5905504 5881941 5668946 5561051 5419275 5258364 5190449 5062348 4954955
2989 4954955 4836120 4659555 4574825 4376390 4346261 4398943 4328047 4212429 4051984 3884754
2979 3884754 3793850 3714112 3676844 3580049 3384949 3268735 3264018 3200413 3145822 3106395 3102068
2968 3102068 3218867 3177469 3262667 3271890 3237462 3324208 3280644 3304631 3413872 3433114 3399774
2957 3399774 3438928 3652874 3612240 3586025 3586804 3494137 3422704 3273323 3264273 3172451 2931994
2946 2931994 2816991 2786282 2610087 2464278 2214197 2140336 2095580 1893849 1716302 1680477
2936 1680477 1641636 1577898 1550775 1446290 1433998 1256156 1161578 1145222 1003670 1044428 1142440
2925 1142440 1139147 1116133 887852 919757 900070 864649 859609 830404 1068231 1045961 998561
2914 998561 1056288 984363 921670 1047100 823536 804282 986499 941060 918513 872438 883509
2903 883509 857785 866150 887355 857084 880832 830249 624709 711633 848536 867714 751356
2892 751356 659593 590850 593667 590240 658337 631715 632146 723759 643603 714010 565215 344682
2880 344682 442742 539534 542094 506448 465869 418376 394282 415251 250114 322413 390972 353510
2868 353510 340494 508768 536787 514261 622350 518995 409077 453136 501600 470942 470477
2857 470477 541077 634252 762293 761426 787774 847083 831406 710202 761534 756620 814125 845898
2845 845898 887960 752132 725085 791741 789799 700897 524470 546564 503750 482234 489800 530565
2833 530565 417853 354268 207439 149258 248417 153023 103862 174649 151449 301465 319319
2822 319319 283675 248048 178311 158632 191234 214044 177142 87200 61298 -68774 -228164
2811 -228164 -217059 -239387 -54629 47722 52136 -2381 206469 307755 172343 178476 138792
2800 138792 175944 134329 198866 364800 569888 836395 779454 636621 774303 791078 863940
2789 863940 949183 915503 936884 1085649 1206074 1235151 1222065 1278432 1310837 1140315 1147184
2778 1147184 1306347 1190861 1098064 1264685 1162533 1067077 1106956 1008721 859433 834253
2768 834253 844435 706235 603343 562144 404169 350012 198967 81831 248369 167690
2758 167690 116530 13994 51092 110421 73453 72258 4353 18742 -45031 -59144 -83480 -122756
2746 -122756 30517 19809 42877 -31355 -101512 -104934 18042 -8952 -45002 -92090 -102595
2735 -102595 -151130 -119400 -30071 -129550 -178845 -269104 -133839 -34319 -70994 -79128 -245405
2724 -245405 -249419 -345739 -287101 -147053 -112256 -58440 -93635 42700 -57428 -133517 -199821
2713 -199821 -142655 -17886 -75429 -54144 -105343 -186025 -213711 -251380 -93643 -93641 -182074 -179426
2701 -179426 -290997 -218730 -103316 -176594 -145579 -100174 -108115 -46839 -28686 -226903 -399657
2690 -399657 -270374 -157589 -56174 19514 -5818 39297 -11847 -6474 -50509 8624 -35072
2679 -35072 -25539 -94339 -84003 -74111 -242307 -230347 -286329 -188339 -260414 -169834 -210288 -332426
2667 -332426 -241785 -189437 -77161 -157820 -86031 -121689 -132818 -102664 -140292 -225300 -159160
2656 -159160 -147031 -217307 -155330 -147681 -179683 -10971 39178 -33627 -127301 -86088 -64093 -61379
2644 -61379 -46036 2189 28499 10628 83654 97546 257705 326869 299942 466257 378500
2633 378500 268122 269671 267224 406051 425492 533247 383360 321992 318673 197324 160493
2622 160493 189537 91427 119035 179805 155480 74263 -56447 -7434 -79511 -64432 27949
2611 27949 -48291 -170566 -223541 -104222 -68621 -74772 -154591 -144100 37742 42061 -79025
2600 -79025 -133933 -161373 -303876 -149471 -177346 -160520 -108695 23479 66258 -70784 -32734
2589 -32734 -84928 -133399 -198002 -227669 -220278 -191565 -68442 -91855 -52573 -25212 -174892 -161905
2577 -161905 -161154 -107482 -103294 -195861 -208976 -27111 -85310 -157056 -62749 -153370 -211766 -186648
2565 -186648 -43716 12706 -47833 -87898 -76310 -67767 -115345 -229943 -82210 144319 92504
2554 92504 -12486 120153 53994 89183 153872 128236 70976 80233 147219 -33139 -102787
2543 -102787 -34897 76826 100623 87756 34098 151381 212624 183950 83693 -544 56344
2532 56344 149027 -53317 -20950 -2364 128404 -7718 127456 265984 56962 -59290
2522 -59290 23273 146228 170422 79305 -49508 -42410 73937 98094 -55526 5359 77208
2511 77208 21572 -93761 -93542 79189 106669 174536 188986 -28676 -44749 67961 161964
2500 161964 157784 115467 184971 282100 238525 249614 210985 119098 107387 217754 215035 150073
2488 150073 174143 259944 305421 265178 266677 242514 101965 189227 271687 274594 367201 326672
2476 326672 261708 301944 427310 316741 289954 230447 291684 265343 303961 406747 425130
2465 425130 397040 458693 501906 532439 521285 499567 617031 508272 541771 648832 729985
2454 729985 826381 844475 829787 725822 660008 679094 756026 1023558 937203 847148 957724
2443 957724 970123 943260 1066796 1057446 890686 901030 1046317 905144 953533 969933 1083924
2432 1083924 1197680 1210155 1347981 1494069 1691560 1669175 1555430 1818200 1773466 1756372
2422 1756372 1801597 1855480 1877416 1991946 2011127 1992035 2106181 2125658 2219624 2390990 2407215
2411 2407215 2484003 2504726 2550769 2594405 2803246 2966346 2994516 3150582 3327668 3460310
2401 3460310 3417273 3510620 3631652 3743664 3892856 4071145 4324810 4505013 4926310 5302214
2391 5302214 5687359 6038919 6632943 7199384 7858479 8991081 10182536 11587382 13059193
2382 13059193 14666482 16724414 19450691 23092737 27118842 31503683 36374240 41275103
2374 41275103 46481977 52666962 59879270 68874482 77567456 82857793 87181879 89734685
2366 89734685 90966652 91002410 90101220 88764931 86913849 84162120 80899634 76907305 71651709
2357 71651709 64650248 56355517 49183432 42244719 36103135 31002739 26290874 22255106
2349 22255106 18605506 15490286 12949867 10973535 9500304 8375820 7335362 6219870
2341 6219870 5335027 4613302 4045771 3648402 3361048 3061414 2566377 2399177 2396018 2101566
2331 2101566 1913294 1755939 1623752 1578462 1529765 1389694 1143973 1106731 1130732 1216989
2321 1216989 1134013 817519 748603 654050 623078 705210 677481 619318 504129 497243 297260
2310 297260 259444 326288 328555 410514 388137 410644 326212 211639 353536 247976 198585
2299 198585 235754 250168 169893 82336 63270 88382 6360 180445 231666 230208 109614
2288 109614 28281 82637 -3363 16233 101599 147034 3117 -41191 7623 29087 -60104
2277 -60104 -147852 -237824 -150618 37116 -162096 -196172 -99311 -202832 -252296 -307153 -242115
2266 -242115 -267385 -321338 -257519 -278264 -329342 -212528 -263286 -213281 -214305 -209274 -172338 -160778
2254 -160778 -267783 -242345 -208746 -234013 -211648 -98558 -57780 -279816 -360837 -439350 -371806
2243 -371806 -216925 -307987 -377247 -436302 -378190 -320532 -415328 -649869 -491425 -359510 -347074
2232 -347074 -427587 -459144 -485973 -534026 -513896 -465087 -527711 -510822 -444834 -402917 -470045 -527756
2220 -527756 -643647 -517655 -560925 -489101 -401621 -309735 -303864 -479089 -524103 -549972 -578957
2209 -578957 -467446 -534023 -546960 -392273 -389429 -428536 -385055 -477683 -400213 -268651 -330197
2198 -330197 -396214 -362288 -361084 -498774 -373538 -336570 -286865 -380049 -350840 -342302 -444798
2187 -444798 -519846 -500233 -508901 -492099 -562332 -553435 -488917 -414389 -450001 -384165 -367357 -410702
2175 -410702 -437802 -558739 -488374 -442844 -503413 -481074 -476521 -446793 -543487 -510003 -485244 -511149
2163 -511149 -616513 -613132 -607920 -466350 -367997 -346900 -285261 -198056 -278179 -530006 -588929
2152 -588929 -543601 -495411 -462759 -392340 -347303 -324683 -343204 -343905 -341162 -448433 -324351 -385563
2140 -385563 -464071 -381188 -360646 -425756 -390033 -469549 -433309 -374290 -558996 -551680 -580021 -540062
2128 -540062 -421934 -425803 -489382 -546454 -519545 -390871 -377338 -334985 -284225 -311599 -201375
2117 -201375 -240773 -395384 -352571 -367392 -379547 -398207 -409271 -412399 -350028 -275346 -257598 -268859
2105 -268859 -23174 -48922 -173545 34875 53950 96916 12321 37624 40135 106639 76888
2094 76888 116944 164597 78157 -104838 -182550 -115387 -40425 14253 -99528 -136063 -49139
2083 -49139 -64400 -225073 -272415 -222990 -292378 -287535 -228969 -277551 -219613 -221449 -282192 -338178
2071 -338178 -328070 -349332 -426115 -462121 -469398 -539229 -438217 -449830 -413488 -479636 -506663 -434061
2059 -434061 -427632 -450402 -437408 -380551 -314274 -307388 -359601 -292254 -316329 -275773 -348429 -475937
2047 -475937 -459438 -359256 -306341 -298264 -146970 -120937 -209889 -322681 -260875 -263857 -292957
2036 -292957 -413018 -465094 -468072 -477744 -332570 -264402 -408589 -406311 -174024 -304952 -386786
2025 -386786 -363658 -371221 -225154 -339947 -214196 -194009 -205564 -319280 -429129 -431089 -308808
2014 -308808 -305539 -296126 -242923 -227868 -251288 -379224 -367576 -285651 -237769 -236817 -275403 -427633
2002 -427633 -431749 -321497 -224631 -257465 -451895 -482010 -425741 -457131 -451864 -329117 -377865
1991 -377865 -361097 -217874 -343587 -342717 -288915 -299921 -385716 -460832 -431357 -314650 -379876
1980 -379876 -417117 -409998 -341719 -277003 -371679 -539780 -397825 -330105 -288791 -292385 -384246 -356582
1968 -356582 -479120 -326710 -249634 -283160 -320142 -555310 -478317 -411078 -361776 -455976 -476977
1957 -476977 -458755 -324706 -340911 -320084 -423819 -492868 -509885 -570410 -502831 -433672 -341771
1946 -341771 -281518 -152059 -278296 -339722 -528960 -503344 -376035 -388928 -264512 -308590 -278091
1935 -278091 -314848 -339780 -390029 -350531 -450594 -487724 -375663 -389769 -318458 -325817 -283097
1924 -283097 -241768 -271541 -341136 -333015 -294319 -279519 -377268 -350089 -330538 -394183 -382202 -392889
1912 -392889 -382089 -229830 -197775 -331509 -364714 -241568 -230618 -295718 -289791 -169949 -128451
1901 -128451 -131569 -283198 -359387 -227500 -316365 -298441 -332972 -372699 -365952 -317040 -350978 -440134
1889 -440134 -345649 -358462 -404478 -355275 -321616 -247012 -207690 -225520 -192484 -267175 -291978 -378094
1877 -378094 -363922 -465159 -541025 -419729 -243954 -337971 -281600 -373876 -388297 -277706 -226858
1866 -226858 -235762 -324726 -409355 -440995 -331523 -435395 -456244 -336213 -197679 -274657 -397213
1855 -397213 -518313 -437321 -381928 -401996 -361933 -226087 -277787 -205797 -223005 -240419 -327056
1844 -327056 -413473 -353439 -337637 -423947 -335534 -332517 -363484 -356942 -453002 -337518 -329891 -362990
1832 -362990 -393052 -381997 -382354 -324840 -330653 -250863 -235484 -368751 -395379 -273874 -302561 -318365
1820 -318365 -375979 -462130 -304504 -347443 -361295 -512292 -580441 -514883 -348184 -278038 -324532
1809 -324532 -278940 -336644 -325671 -281659 -377896 -297253 -262965 -367051 -323327 -152687 -199130
1798 -199130 -298692 -268858 -366538 -329790 -302244 -369041 -432668 -373298 -428118 -429159 -268273 -249053
1786 -249053 -332479 -295911 -265603 -285197 -275268 -265340 -302599 -282306 -276655 -283537 -352240 -299238
1774 -299238 -187434 -111778 -187530 -193142 -330471 -367586 -384041 -271198 -282037 -210459 -128586
1763 -128586 -65471 -170164 -223928 -276811 -282293 -214205 -199457 -261756 -298487 -246475 -329014 -259153
1751 -259153 -305638 -256536 -229410 -208751 -114072 -196788 -300045 -327442 -335305 -282963 -158985
1740 -158985 -143885 -162172 -167680 -287219 -297390 -302128 -209167 -283456 -318634 -367990 -383600 -497873
1728 -497873 -388192 -319672 -214250 -218231 -150970 -114611 -299329 -389807 -301718 -233706 -259603
1717 -259603 -200508 -194891 -300206 -305201 -265239 -310310 -332114 -237968 -185912 -266586 -287356 -261094
1705 -261094 -351896 -382914 -329328 -360132 -456374 -377337 -306852 -284487 -355413 -351140 -299730 -158895
1693 -158895 -193998 -131423 -106741 -288493 -332561 -292260 -237337 -250064 -324433 -393559 -283940
1682 -283940 -341566 -290217 -326709 -304178 -309565 -365552 -391191 -332566 -261652 -229635 -275053 -206106
1670 -206106 -155557 -121398 -127548 -256366 -156178 -164894 -41215 107587 -33141 -129121 -224558
1659 -224558 -361210 -337341 -201500 -297975 -162654 -205985 -134888 -72821 -172652 -317349 -278397
1648 -278397 -299863 -282825 -191628 -184678 33974 -125777 -274558 -269917 -85977 43238 -158331
1637 -158331 -244931 -66193 -168696 -286571 -271953 -195191 -276823 -290222 -205870 -290968 -252944
1626 -252944 -119847 -246742 -266605 -279313 -360759 -249602 -210607 -156948 -327393 -366671 -326700
1615 -326700 -84639 -33300 -52603 -106759 -249471 -208566 -202964 -54536 -83247 -218365 -158097
1604 -158097 -148190 -234535 -186682 -257524 -244722 -242008 -150899 -165178 -96493 -69104 -200362 -189028
1592 -189028 -179330 -174232 -258689 -243475 -231513 -253902 -264377 -327273 -295504 -265254 -324453 -227283
1580 -227283 -207193 -255899 -202850 -296608 -388015 -322217 -255456 -253083 -375507 -364206 -241728
1569 -241728 -169057 -280429 -372992 -296925 -222155 -212408 -281875 -275825 -239265 -186400 -240313 -166167
1557 -166167 -143480 -113337 -93316 -158712 -186072 -156539 -308435 -365930 -297982 -329472 -298683
1546 -298683 -176843 -130273 -174267 -193937 -157344 -69648 -138432 -223594 -262059 -355324 -379394
1535 -379394 -341057 -338091 -273826 -407286 -282658 -310148 -101431 -77688 -157864 -249786 -257264
1524 -257264 -200061 -116989 -46544 -133890 -158039 -232153 -178817 -120183 -283020 -233373 -142037
1513 -142037 -242713 -350906 -336147 -410201 -443645 -203151 -229184 -227964 -342098 -323817 -285894
1502 -285894 -350296 -325348 -269063 -237766 -166938 -273471 -264824 -178162 -189130 -236504 -199051 -236697
1490 -236697 -187544 -123480 -72068 -81611 -178894 -49110 37694 -59318 -65272 -108304 -200781 -212247
1478 -212247 -196154 -185133 -229486 -113242 16865 -57627 -192761 -289435 -131695 -93565 -88079
1467 -88079 -128553 -124431 -172068 -132229 -253205 -135285 -152147 -216613 -153146 -129943 -34826 -58886
1455 -58886 -47989 -76113 -92585 -104872 -154926 -224588 -318824 -214078 -178443 -168943 -111845 -89246
1443 -89246 -50474 -70282 -124157 20216 21010 -106229 -57004 -135259 -156573 -258864 -253999 -350392
1431 -350392 -182478 -293881 -189457 -156897 -89782 -93420 -147683 -139297 -82018 -230323 -232116
1420 -232116 -96314 -41328 -128609 -179100 -85186 -123131 -157776 -120466 -81566 -132936 -177635
1409 -177635 -222138 -228371 -227241 -138452 -207786 -75531 -146842 -207331 -227457 -267215 -253353 -178941
1397 -178941 -235927 -490539 -370442 -176296 -221590 -104423 89865 -32254 -38944 -90389 -153322
1386 -153322 -304951 -345124 -341728 -293120 -183873 -111626 -87348 -186145 -194423 -248717 -299690 -336743
1374 -336743 -210159 -128348 -36648 741 -79319 -112536 -109409 -154772 -156346 -210726 -177209 -171456
1362 -171456 -212633 -214544 -330317 -277699 -218613 -181959 -197935 -286540 -177281 -51444 -54317
1351 -54317 -154176 -62597 -84269 -97244 -84288 -109737 -127336 -169950 -270755 -151925 -92625
1340 -92625 -98321 -35785 -111404 -203835 -263157 -293261 -267361 -244931 -310808 -263038 -183092 -197807
1328 -197807 -265777 -206303 -209964 -214610 -159256 -238177 -182241 -212390 -36923 137385 20629
1317 20629 -16449 -17392 -84854 -71014 -30762 -173794 -155865 -226344 -182970 -183093 -147639 -212689
1305 -212689 -321886 -262529 -215358 -151262 6988 -114282 -68564 -84296 -59295 -113615 -171324
1294 -171324 -86876 -120909 1463 -35513 -115013 -87926 -146750 -134922 -80608 -86155 17083
1283 17083 -38603 -24798 -243974 -170811 -219504 -206607 -201486 -184569 -229084 -181808 -91550 -96953
1271 -96953 -93014 -102767 35947 127210 25627 -38205 31895 -97136 -73533 28570 -29273
1260 -29273 -46127 -87085 -26252 -14456 -134626 -176341 -239732 -199457 -138765 44807 96948
1249 96948 -108686 -126978 -69614 -53466 -116657 -270104 -128235 -109117 -62281 -52961 -9313
1238 -9313 7052 -60055 -153830 -174239 -32329 138144 120859 -66562 -76721 -112786 -192225
1227 -192225 -49834 -24762 -57646 -38476 -47092 62 12443 -9852 -58626 -75626 -126336 -169463
1215 -169463 -246138 -256204 -149871 -123537 -61796 -14376 8176 -72423 -24548 -52533 26920
1204 26920 -80282 -88290 -167208 -274554 -156947 -129678 -133078 -213209 -29460 29542 -48507
1193 -48507 -67917 -45202 -184814 -262827 -147581 -163377 -198892 -110367 -121832 -34940 -98856
1182 -98856 5035 -81527 -185220 -106189 -99673 -153282 -113086 -71859 -81413 -145691 -160077 -36494
1170 -36494 48724 190898 179873 136441 46415 9714 -13319 -60230 -110555 -54616 124738
1159 124738 3718 -6257 48417 -42916 -74384 -137806 -93373 -95616 -138009 -78944 -21798 -85970
1147 -85970 -70590 239 48030 73785 63625 113673 -1587 -145841 -167867 -96962 -22682
1136 -22682 -67777 -4522 -58573 27241 109785 156730 53221 93426 75802 53729 365 34748
1124 34748 66725 8612 -91159 -66399 63535 -27097 -107013 -88852 -18230 -160219 -146550
1113 -146550 -99207 -102798 -67529 -59163 -80101 -111422 -61427 -53816 -79495 -79719 12927 103820 10361
1100 10361 -83775 -111685 -150717 -101527 1597 -17283 -40069 -65070 9624 -109729 -33909
1089 -33909 -20531 -19122 -138462 -123924 12200 29356 67869 226735 101789 5763 44319
1078 44319 -58355 -137790 -25403 -39482 -127789 -140958 -100434 -117839 -178383 -194688 -168003
1067 -168003 48543 -34272 -15054 -62930 -195677 -107100 1277 -49262 -44817 -106556 -197105
1056 -197105 -231372 -213271 -83699 -51313 100046 77177 14006 -59214 -5504 44668 -5598
1045 -5598 -42494 60346 85455 75352 76912 130984 147409 71860 13095 -97807 -87596 -94568
1033 -94568 -65738 -24307 37237 -12548 42752 165036 146929 -37936 -41155 20249 179213
1022 179213 99059 99917 72190 -14584 5779 93395 24142 74639 26691 138004 40657 -59812
1010 -59812 -51481 -251367 -157864 16511 26944 174277 250074 113716 126766 95791 -25506
999 -25506 -44017 87157 154901 -59860 -135563 -27962 -61805 -14348 -121746 26553 65957
988 65957 5158 -35714 10208 23866 -43092 -97557 25743 112717 -29925 -202948 -170831
977 -170831 -8476 -27808 -35343 -124842 10646 134311 -8074 101826 80113 -20221 158102
966 158102 -10003 -138666 -121824 -133374 50358 89247 98552 129043 -3149 -33666 -30833
955 -30833 -29331 155724 64282 -24274 11635 6325 44660 83472 170209 141794 56763 94215
943 94215 79068 91585 41364 -77640 15172 14915 85221 123800 197118 205224 128185 45724
931 45724 93152 124597 2051 -59408 -27888 -19023 -83542 33935 45347 -9153 64122 60128
919 60128 142406 115306 34756 55256 9380 -39284 1437 -108371 -110400 -60876 -127382 -75749
907 -75749 -2629 -72508 -111031 10644 -56322 73826 155207 107588 -69957 -22313 6747
896 6747 -52969 26236 127879 130335 172107 25913 69580 104484 1095 11651 6312 28835
884 28835 131556 89728 170049 116509 125279 272542 88233 43961 136125 114426 68078 97841
872 97841 88536 21197 28507 15213 -49378 -45479 -11748 46051 36372 65707 22020 -24957 -122801
859 -122801 18382 64090 66469 211600 220454 103385 109468 12918 32277 -58684 -16461 -4865
847 -4865 -60787 -49252 -94216 -9155 21077 23637 87781 88796 -17583 180806 171381 98829
835 98829 12208 62843 88848 117433 31125 -75660 -124798 -188245 -19636 -7368 -12094 39767
823 39767 84281 119360 -85166 -4134 124644 41641 122888 35553 -15677 62027 132404 157457
811 157457 60284 50901 79181 71567 99254 24803 -23986 23491 79568 24110 -8238 25494
799 25494 -67067 62859 153254 7705 148822 102222 28590 235109 267953 169804 166954
788 166954 134071 76720 172098 297491 176155 222008 356124 348401 69219 74247 121271
777 121271 125634 14598 11108 33002 -26181 -60414 13342 111332 95372 36666 131153 155180
765 155180 130725 138862 246122 111802 -30376 141363 81125 1762 18726 12664 101288
754 101288 38015 75380 196138 241786 304201 246115 185558 93354 116298 61021 96015 16759
742 16759 -74801 -168443 -68182 37616 309749 211326 100018 68177 28037 -15857 -129150
731 -129150 -223611 -94230 85942 36896 -34488 23201 927 120764 11188 67712 106939
720 106939 -22173 81934 45673 63569 86399 70236 76338 68936 5464 129561 189886 39950
708 39950 145332 79709 -54396 52562 66778 79066 80354 4270 107557 209424 82190
697 82190 -73745 -91154 -22006 -15511 88653 78265 109813 44841 23778 -37348 -12069 -5860
685 -5860 -79978 -108757 -62268 41542 183280 163984 165671 195623 112257 165556 156678 186843
673 186843 99973 69502 163124 110681 135889 68395 192779 180733 114905 87462 232568
662 232568 195239 123841 146289 159315 139407 58634 116525 34346 46406 109694 80707 123506
650 123506 52372 -22362 76629 62824 -1239 46598 24053 32079 91930 94502 161568 143877
638 143877 111374 50524 174576 112300 105581 135627 49236 -52233 89260 174953 68196
627 68196 133025 99321 159728 251506 205067 257118 94888 195006 208659 160275 206225 207968
615 207968 215179 219994 195751 32515 139290 324651 124322 61595 49739 31384 32925 58871
603 58871 94765 -59339 86107 256077 324962 211919 101449 191805 284968 258566 165777
592 165777 69941 110092 163601 134083 90329 150825 95627 169126 214668 55480 111392 22538
580 22538 98482 199437 101643 179201 168434 120414 172937 82276 25659 -4553 56091 195005
568 195005 76926 139057 199182 151470 89999 152942 80875 95433 167583 210475 207256 187480
556 187480 212432 371624 432835 149030 133031 273201 314334 283004 268087 219025 168765
545 168765 126341 263485 239344 88401 199413 257847 140559 70243 163465 253918 162359
534 162359 101516 120592 132144 188278 166451 146294 35045 17859 95513 199124 186882
523 186882 37917 80204 171000 298971 340083 109545 157741 149164 25879 166814 193557
512 193557 182016 226697 224404 147062 120246 176625 215739 150098 282062 351368 329332 286747
500 286747 214266 247827 207752 229505 227679 423177 283701 173727 180293 131869 116743 100475
488 100475 150260 180628 163426 170204 185028 177811 205007 155958 160320 216303 138493 264106
476 264106 278205 151978 70940 135892 303171 145777 49365 63633 96357 9170 -14810
465 -14810 -91528 44313 308189 339959 274189 139499 121316 205220 233123 327370 254266
454 254266 137014 -60303 -122620 -35761 19671 72970 192723 155279 157508 156035 232575 213183
442 213183 131397 191516 153150 171941 211015 124889 190713 155964 91255 158695 300796 169806
430 169806 150117 152636 44488 159395 248617 288152 131104 35312 63563 66842 88699 110000
418 110000 206780 172944 149382 222703 182515 235483 131286 150233 20221 -6975 139506
407 139506 264951 282649 110343 149513 94467 73918 130826 135849 79086 155517 240018 303670
395 303670 287431 237355 267976 290472 259227 153438 59038 -55879 81904 327667 248751
384 248751 208539 142864 267722 254563 166814 225022 308812 357549 267762 312651 230356 238397
372 238397 267620 166365 164686 235835 121641 266292 216768 91036 139984 112975 208653
361 208653 363138 307820 252695 261773 280966 278161 254597 374966 275746 100182 66645 76661
349 76661 67761 114851 253600 113161 141995 227724 281375 206588 242434 350412 242759
338 242759 24190 32424 35327 61010 124673 294309 224306 337030 355298 250185 150380
327 150380 194693 323028 312530 242131 213565 261188 131572 115407 226813 177666 141013
316 141013 165151 174076 187937 -14660 -21077 43974 54677 75538 456 27973 107543 117496
304 117496 252377 236818 154837 106035 114844 90070 54528 109472 357037 303628 206934 201486
292 201486 186320 246772 152923 166315 210990 196293 254367 209669 243531 210461 271528 279670
280 279670 195087 175843 172521 302167 377592 283423 204939 181069 183371 339491 217130 25801
268 25801 45835 130941 265580 130869 110659 167755 260287 314433 334118 286489 185413
257 185413 125091 179224 115106 168611 310192 295249 327159 299499 202093 224026 268147 313342
245 313342 250694 280801 202515 241839 304704 243136 266327 282663 270020 317970 269697 279563
233 279563 184954 138602 121470 180820 102038 187263 257353 271010 311069 187933 194090 211219
221 211219 195720 188285 193910 134671 176966 211875 326327 258011 163661 121465 245558 233535
209 233535 296392 362892 378630 223415 178492 185986 300928 302442 198312 162484 137626 161487
197 161487 231758 341093 368619 207053 171756 151391 186293 116816 57124 79640 113567
186 113567 125479 178060 297879 370751 331392 360974 338758 352466 393841 352673 305325 179990
174 179990 165305 153082 110468 232024 308526 300025 312995 349605 319468 170861 217403 199475
162 199475 205793 217188 207300 130280 189285 202382 192318 166010 206366 278017 212510 225177
150 225177 364916 284020 320649 314310 177199 111615 162649 154283 80795 134849 116444 171675
138 171675 181936 194522 143251 200486 235148 128714 135085 81222 -26427 -18521 109909 159110
126 159110 160016 169711 144141 138999 91248 107787 142904 182465 223826 335386 388816 411784
114 411784 364256 260064 252690 218784 136883 156884 204299 180132 265737 320067 254251 276094
102 276094 267599 309800 383979 271268 225467 295082 187220 172690 225582 171272 131663 174643
90 174643 251296 325462 321644 290690 325913 168608 183749 233234 318060 393952 175040 159815
78 159815 207856 238401 241501 133778 148329 213033 235578 153907 223243 315495 239886 259843
66 259843 208064 269974 206269 102276 124409 209842 286193 274051 364579 223448 212039 289699
54 289699 289011 301826 233839 137794 209352 274285 363130 398868 322464 339034 317339 402232
42 402232 319167 330469 389816 233830 197615 194182 175430 145446 180838 255302 164805 188058
30 188058 296653 314284 247173 285225 199331 159623 304131 314101 235712 226130 192337 205324
18 205324 198529 250063 217307 160758 238298 172897 226506 243360 263544 287231 312006 275876
6 275876 213720 189944 258739 205595 146560 223755
0 223755
$$ Imaginary data points
##PAGE= N=2
##DATA TABLE= (X++(I..I)), XYDATA
16383 -4018092 -4045994 -3911971 -3856291 -3866637 -3748221 -3704527 -3629874 -3479459 -3492880 -3378257
16373 -3378257 -3317106 -3298666 -3338170 -3307912 -3242680 -3158736 -3068858 -3060199 -3012504 -2997179 -2919024
16362 -2919024 -2851366 -2814092 -2689672 -2622590 -2523972 -2524272 -2466725 -2415771 -2331285 -2339396 -2234969
16351 -2234969 -2237827 -2168588 -2134035 -2047836 -1940908 -1878689 -1848241 -1860891 -1816490 -1760114 -1697086
16340 -1697086 -1763007 -1663371 -1470261 -1414616 -1361054 -1387153 -1332783 -1277918 -1204379 -1149550 -1128082
16329 -1128082 -1137690 -968577 -832021 -810131 -840925 -829423 -732918 -641038 -657261 -593746 -456709
16318 -456709 -437917 -386788 -316661 -350828 -327367 -293340 -208804 -153291 -141473 40228 5255
16307 5255 34437 91232 135293 151598 110974 177077 251113 266528 261400 306859 443997 492897
16295 492897 527510 633703 646405 709302 830983 813066 859617 892604 968128 1002235 1000674
16284 1000674 1018785 1043016 1139192 1141326 1139201 1134006 1156013 1180433 1189733 1258815 1344815 1390459
16272 1390459 1327210 1370683 1490796 1564109 1693199 1727370 1640829 1744155 1701723 1708656 1822033
16261 1822033 1835488 1711365 1740726 1834548 1836376 1971369 2001096 2036523 2101200 2099236 2231019
16250 2231019 2342102 2305586 2285218 2316022 2241220 2259341 2429819 2505747 2521619 2554926 2531787
16239 2531787 2536491 2624293 2691146 2665114 2679393 2616981 2762393 2778972 2798986 2781641 2704659
16228 2704659 2773638 2876081 2863041 2972069 2992862 3035211 3013888 3035422 3144541 3113360 3181150
16217 3181150 3181295 3197340 3229857 3137771 3149459 3178696 3167993 3425955 3401290 3422452 3504499
16206 3504499 3465132 3509262 3551822 3491710 3404846 3349451 3371505 3439372 3365932 3514932 3660048
16195 3660048 3582026 3681178 3568087 3565059 3523472 3563001 3654997 3652826 3644832 3566400 3597055 3768993
16183 3768993 3782730 3728797 3803171 3752601 3798859 3824414 3924098 3906551 3741763 3785553 3907453
16172 3907453 3793072 3916357 3945143 3967203 3997689 4022788 4090674 4049685 4170907 4112407 4060253
16161 4060253 4115419 4149769 4152670 4222132 4093653 4033725 4142695 4282231 4229789 4302982 4272075
16150 4272075 4307154 4288913 4322455 4309292 4256048 4215133 4221418 4263087 4245877 4382063 4270742
16139 4270742 4268108 4451230 4548188 4427342 4412895 4431781 4480148 4484587 4472166 4490249 4422391
16128 4422391 4486080 4579919 4513125 4401394 4419380 4480186 4424583 4328023 4395174 4403056 4445958
16117 4445958 4391593 4418865 4392380 4378758 4392337 4463322 4459222 4509215 4418123 4525643 4711917
16106 4711917 4744642 4744682 4615984 4593337 4465199 4539436 4667611 4702487 4641269 4660936 4587160
16095 4587160 4603377 4594037 4464168 4350608 4339130 4666095 4622872 4518535 4637532 4662609
16085 4662609 4605047 4598312 4532214 4475837 4515318 4510327 4709080 4705445 4678731 4659375 4603709 4593667
16073 4593667 4525800 4684847 4833366 4772459 4700946 4740220 4806127 4698103 4628266 4601342 4543150
16062 4543150 4560637 4563937 4588716 4691660 4770562 4776680 4713839 4817544 4768660 4677681 4602745
16051 4602745 4657372 4660560 4701631 4623280 4600218 4597948 4554420 4494889 4707373 4638494 4632670 4636382
16039 4636382 4677916 4796737 4624370 4644415 4751755 4711926 4764592 4816379 4777814 4788893 4736259
16028 4736259 4680273 4691228 4835449 4830814 4891253 4840900 4880806 4811008 4805564 5048089 5087489
16017 5087489 4878673 4858439 4763390 4775412 4953046 4783828 4749979 4888800 4710175 4620843
16007 4620843 4717691 4812440 4628801 4664580 4885526 4959122 4926496 4876030 4805489 4749013 4849763
15996 4849763 4886626 4808535 4829491 4824252 4772815 4785361 4758011 4710355 4656546 4665014 4650459 4608658
15984 4608658 4672974 4714350 4628560 4750397 4794439 4743959 4673788 4730603 4777252 4864338 4763069
15973 4763069 4735931 4724475 4557628 4577335 4695626 4720352 4787721 4778154 4720644 4897486 4997119
15962 4997119 4830011 4695145 4728747 4713830 4689581 4698217 4710517 4739067 4870655 4834818 4753207
15951 4753207 4617571 4716594 4858152 4819341 4737216 4631189 4658288 4705186 4637663 4730508 4808680
15940 4808680 4821349 4819700 4699683 4587042 4675915 4759127 4729541 4687632 4762628 4971546 4945622
15929 4945622 4859642 4866164 4782611 4755929 4874779 4866952 4734888 4735649 4839828 4856193 4695730
15918 4695730 4746485 4797359 4842907 4927635 4921786 4785020 4843519 4897226 4816037 4838233 4728584
15907 4728584 4736418 4932520 4837642 4717416 4785311 4793718 4839367 4803178 4741963 4725494 4714929
15896 4714929 4902391 4952429 4888366 4975451 4957019 4990406 4816639 4770128 4780268 4754079 4787037
15885 4787037 4875828 4808553 4690198 4738004 4608342 4719971 4694961 4643801 4685931 4693649 4621089
15874 4621089 4805354 4930216 4900368 4828210 4828811 4814593 4740983 4736331 4797447 4995676 4961682
15863 4961682 4814775 4711047 4670388 4790869 4771340 4763281 4826652 4669965 4648742 4696609 4795225
15852 4795225 4877217 4906850 4964300 5014473 4851383 4753715 4813097 4789354 4730715 4759138 4693220
15841 4693220 4762168 4805712 4820377 4808517 4718075 4768095 4802164 4708998 4725946 4659804 4679319
15830 4679319 4743227 4707575 4778233 4684574 4623647 4720143 4649516 4729461 4737510 4708178 4724364
15819 4724364 4902440 4869217 4875169 4815879 4889525 4849528 4896789 4879337 4929531 4916103 4766240
15808 4766240 4973330 4978029 4889382 4882203 4921396 4807784 4878831 4634495 4658373 4809696 4785522
15797 4785522 4867650 4882928 5037105 4901732 4903072 5026407 4900810 4809850 4935320 4965706
15787 4965706 4880940 4824137 4843713 4798644 4792904 4786631 4686616 4811561 4917170 4874902 4850708
15776 4850708 4876830 4814526 4900680 4991084 4977675 4997946 5074663 5009952 4969417 4928880 4926553
15765 4926553 4844630 4900534 4930119 5007002 4881175 4906262 4932776 5032092 4934834 4840418 4786153
15754 4786153 4748976 4747639 4753812 4748995 4713444 4843716 4842378 4856090 4922787 4924396 4849363 4954056
15742 4954056 4928070 4836696 4851569 4880859 4880606 4782038 4799061 4945327 4857942 4803101 4702972
15731 4702972 4817460 4903674 4819135 4861660 4893847 4976234 5119833 5063950 4849287 4841085 4877731
15720 4877731 4948971 4836329 4820001 4801747 4783656 4741155 4833915 4930982 4925054 4943466 4916075
15709 4916075 4905826 4876340 4878339 4956691 4942796 5025429 5052965 4954576 4846171 4950865 5083378
15698 5083378 5152008 5145841 4973227 4882455 4930600 4976338 4835836 4846319 4814836 4807092 4821648
15687 4821648 4855493 4669382 4685930 4847856 4913958 4857164 4858492 4924307 4962766 4945457 4929119
15676 4929119 4781924 4741256 4837082 4933259 4923250 4878407 4866011 4913681 4942573 4888880 4898846
15665 4898846 4928076 4867820 4905030 4978358 4923587 4936386 4788122 4796847 4743115 4715233 4777282
15654 4777282 4879290 4910014 4818010 4911502 4958857 5000316 4974407 4905834 4974057 5019376 4939704
15643 4939704 4832168 4786993 4930778 5006912 4968931 4910661 4876057 4827307 4915656 4928129 5047808
15632 5047808 5037492 4980121 4982752 4991972 4951738 4906965 4978135 4962659 4957772 4943163 4896011 4919253
15620 4919253 4766055 4833673 4860790 5001980 4975717 4835089 4906643 4844204 4903979 4907897 4974116
15609 4974116 4960156 4906682 4906911 4901608 4896302 4821804 4665012 4857947 5049003 4954490 4836904
15598 4836904 4943948 4927956 4956376 4968296 4832806 4776062 4838864 4918402 4829989 4877475 5099601
15587 5099601 5101764 5064103 5119235 5173938 5068067 4969381 4951171 5050224 5010935 4998044 4944138
15576 4944138 4814390 4769485 4789233 4843644 4996747 5096767 5029017 4941051 4929266 4897114 4931037
15565 4931037 4886414 4907366 4861797 4901438 4986205 4952694 4844479 4846021 5028594 4910173 4923352
15554 4923352 4960559 4917272 5024480 5082068 4949370 4987506 5073109 5024588 5052979 5051004 4927790
15543 4927790 5015513 5023150 4975080 4954845 4935395 4894049 5036504 5190870 5050188 4806840 4845773
15532 4845773 4904492 4928271 4945256 4893185 4925918 4933026 4919409 4863036 4897412 4936983 4932488 4982592
15520 4982592 4998195 4985805 4978733 4866662 4773683 4873107 4976825 4898484 4995089 5006267 4923157
15509 4923157 4938101 5019740 5031603 5006066 4991916 4925910 4872314 5025218 5165986 5156070 4956291
15498 4956291 4904671 4958065 5070042 4920791 4995486 5080311 4964013 4920434 4939317 4924382 4959074
15487 4959074 5077350 5056004 5031209 4936977 5045444 5073341 5062675 4977739 4893126 4942741 4959966
15476 4959966 4965790 5064284 5031413 4990181 5013717 4918764 4819980 4872368 4836239 4897232 5072964
15465 5072964 5095960 4925953 4841315 4863545 4956260 4936266 4933739 4852927 5031245 5104370 5089370
15454 5089370 4893161 4954944 5034539 5066016 5036639 5042683 4974100 4924083 4948881 4996174 5083590
15443 5083590 4987365 5019897 5078733 5079284 5021471 4908949 4891045 5026868 5108815 5078247 4937743
15432 4937743 4783572 4877557 5047602 4984646 5050897 5057743 4992611 4947419 5088263 5113149 5058139
15421 5058139 4988895 5107250 5176625 5066329 4989625 5019649 5078229 4983154 5049147 5104350 5003322
15410 5003322 4983919 4967351 5189162 5301364 5128804 5107925 5254932 5051994 5137930 5045450
15400 5045450 5023530 5027683 5045612 5048576 5103298 5178546 5085497 5120285 5028593 5106558 5077240 5149486
15388 5149486 5119293 4996830 5136068 5178342 5070313 4991239 4967982 5056512 5109704 5048747 5018971
15377 5018971 5008478 4879196 4906451 4915079 4993498 5127134 5081188 5077373 5014504 4915481 4943300
15366 4943300 4986757 4933342 4811036 4939690 4870527 4859515 4897837 5098221 5193568 5108419 5095763
15355 5095763 4958918 4937988 5052146 5160417 4979020 4937388 4874698 4873453 4854886 4924523 4874014
15344 4874014 4869822 5100550 5039355 5069582 5098866 5103133 5152688 5024897 5024182 5020914 4994424 4935027
15332 4935027 4940179 5013385 4972492 4960482 4872164 4826579 4967345 4990954 4989566 5048674 5101975
15321 5101975 5106852 5135704 5006271 4969065 5076338 5237806 5131889 5025904 4965484 4969977 5058078
15310 5058078 5067946 4886792 4919147 4895654 4978927 5117563 5061890 5168359 5226883 5222810 5078385
15299 5078385 5027458 5017159 5115604 5091391 5054264 5055383 5201866 5294315 5298678 5198508 5192087
15288 5192087 5069336 5063616 5164417 5160411 5129134 5047498 5032831 5139007 5152941 5184075 5118206
15277 5118206 5085430 5100285 5119338 5212561 5316397 5221532 5195622 5154884 5162851 5137331 5082824
15266 5082824 5040032 4944953 4932399 5189748 5224879 5193107 5225765 5180207 5154081 5036413 5052660
15255 5052660 5179176 5159628 5074869 4982678 5036500 5000431 5006351 5007534 4950281 4972428 5046847
15244 5046847 5129947 5229901 5192456 5026114 4999716 4969696 4985045 4961418 5015910 5129439 4994388
15233 4994388 5047563 5111339 5013308 5060448 5151887 5063007 5061907 5104784 5088527 5114145 5086210
15222 5086210 5157077 5093059 5157804 5027657 5165192 5081631 5149332 5108337 5107629 5115420 5190182
15211 5190182 5111823 5113712 5108858 5259820 5292014 5227334 5165595 5179157 5197422 5212973 5308316
15200 5308316 5220391 5124942 5057193 5119821 5129171 5154459 5063576 5252100 5240483 5144014 5077173
15189 5077173 5156448 5147095 5244421 5206594 5166443 5237327 5129657 5161170 5260349 5135541 5143960
15178 5143960 5128471 5098150 5272215 5233746 5146201 5027693 5184435 5264789 5192664 5155373 5269571
15167 5269571 5303858 5262518 5078471 5076250 5255793 5304316 5267210 5205877 5215971 5087431 5024239
15156 5024239 5055279 5099029 5088089 5155925 5188278 5303048 5375262 5343119 5236151 5171411 5218203
15145 5218203 5114459 5036103 5024844 5073902 5060955 5105756 5214593 5188798 5273201 5194517 5243267
15134 5243267 5105613 5078498 5235446 5174232 5079796 5084848 5054681 5074249 5224319 5212305 5136380
15123 5136380 5170586 5168229 5234721 5240192 5246696 5272853 5263224 5368468 5258456 5156563 5062451
15112 5062451 5122739 5230185 5195348 5182968 5237914 5272457 5207679 5089801 5139217 5184073 5206345
15101 5206345 5331763 5195365 5162006 5167624 5224073 5202960 5091833 5174606 5277948 5254570 5092528
15090 5092528 5194153 5106384 5109734 5161197 5151109 5175262 5242216 5160452 5186712 5316232 5309753
15079 5309753 5416106 5202821 5089366 5050322 5075568 5178746 5207145 5342188 5474985 5293340
15069 5293340 5154474 5100774 5171247 5141058 5227841 5261402 5439746 5319921 5214404 5159045
15059 5159045 5186257 5403084 5331733 5243291 5224968 5401997 5303482 5319989 5295940 5233028 5170835
15048 5170835 5263737 5268204 5297006 5154222 5048981 5134800 5230042 5270346 5311885 5318348 5235267
15037 5235267 5247593 5225547 5176782 5076393 5247158 5163041 5145720 5060094 5170148 5319491
15027 5319491 5249582 5344183 5375853 5271570 5275951 5252763 5153473 5109139 5091496 5079578 5168289
15016 5168289 5245786 5284214 5304511 5333963 5367207 5173659 5201211 5250956 5352247 5302856 5334660
15005 5334660 5371073 5295066 5251505 5233902 5150913 5228177 5209823 5226332 5228281 5330403 5337828
14994 5337828 5309063 5237485 5245243 5374622 5388129 5256190 5300528 5404175 5297258 5417062
14984 5417062 5462976 5254362 5267651 5360952 5347881 5362088 5232795 5185530 5281503 5283991 5331920
14973 5331920 5322686 5266953 5242342 5410225 5417731 5348835 5504590 5584000 5344531 5229772 5238621
14962 5238621 5086968 5262943 5293452 5285697 5182222 5247123 5233584 5316297 5182286 5105035 5275176
14951 5275176 5168479 5237445 5315511 5375798 5299645 5218553 5194658 5162695 5229556 5222477 5239634
14940 5239634 5201882 5182600 5158922 5216465 5276087 5218952 5283927 5268139 5148703 5155649 5099693
14929 5099693 5087387 5039529 5033052 5171227 5184608 5264279 5291098 5324554 5265441 5292241 5356910
14918 5356910 5415089 5364131 5379801 5428378 5310193 5310233 5273423 5188801 5108453 5205465 5200798 5314764
14906 5314764 5334258 5332327 5419556 5399168 5246365 5273635 5255618 5267356 5294650 5210557 5256224
14895 5256224 5315621 5431290 5452968 5378110 5206949 5300190 5400328 5300917 5347899 5460677
14885 5460677 5403228 5366649 5392417 5410427 5507122 5487027 5346254 5291607 5433725 5433396 5292261
14874 5292261 5321283 5393799 5308147 5318669 5287155 5272112 5348649 5336466 5209671 5207184 5132116
14863 5132116 5098507 5213086 5193295 5336443 5245526 5177675 5291467 5188670 5199734 5280479
14853 5280479 5329383 5334684 5295401 5390936 5543290 5666262 5600271 5446660 5278864 5205363 5215802
14842 5215802 5223158 5266204 5252276 5170073 5343718 5276770 5215963 5294577 5183192 5316883 5306562
14831 5306562 5250700 5231893 5357673 5276251 5175038 5136481 5100245 5261616 5444842 5420879
14821 5420879 5240489 5206883 5228638 5350023 5400442 5250373 5199042 5399802 5475901 5474987 5443190
14810 5443190 5490365 5543835 5520945 5521488 5495098 5460493 5531883 5465266 5301971 5325868 5320110 5217982
14798 5217982 5335938 5390428 5496086 5462955 5298516 5194833 5348357 5306541 5322477 5433047
14788 5433047 5401146 5357737 5307086 5314367 5313567 5371231 5255872 5224102 5467636 5426728 5461506
14777 5461506 5539101 5535028 5520254 5301501 5321239 5331043 5273419 5373494 5423631 5295852 5341219
14766 5341219 5489813 5427293 5480887 5446666 5387009 5460731 5497717 5481206 5356044 5339532 5352003
14755 5352003 5501705 5533260 5483544 5469556 5278778 5303595 5510591 5586842 5448832 5334488
14745 5334488 5327573 5413884 5390065 5416949 5532047 5546309 5444595 5507383 5455899 5327359 5277440
14734 5277440 5208066 5238670 5226546 5361690 5386871 5355927 5243373 5341545 5470361 5437871 5376430
14723 5376430 5473277 5536090 5444868 5473315 5540436 5450942 5449981 5415698 5390630 5414824 5388378 5336963
14711 5336963 5304500 5361777 5354477 5260385 5311137 5406855 5387287 5353531 5497636 5497536 5504813 5534943
14699 5534943 5463742 5426936 5432382 5336967 5447326 5517731 5452740 5407323 5497697 5490317 5494851 5558074
14687 5558074 5599579 5575752 5435218 5360313 5457732 5347805 5359068 5511343 5616858 5551249
14677 5551249 5496981 5475580 5296417 5440687 5492392 5426016 5310429 5435532 5468864 5469107 5454326
14666 5454326 5500628 5502331 5456265 5353083 5385349 5479005 5449035 5457626 5414133 5324779 5310933
14655 5310933 5333435 5422895 5466907 5499604 5551065 5404084 5448162 5491976 5316924 5288124 5237277
14644 5237277 5202019 5416970 5458684 5425253 5387567 5458349 5388041 5397089 5450132 5441497 5467702
14633 5467702 5476464 5612836 5595028 5568743 5511665 5375541 5344627 5460236 5511649 5672343 5527419
14622 5527419 5405424 5373912 5401975 5421954 5328074 5458496 5492333 5498786 5439952 5497527 5508535
14611 5508535 5335174 5445941 5549940 5439206 5479228 5561037 5468405 5482948 5548835 5512957
14601 5512957 5484572 5376822 5467590 5548445 5377271 5495852 5509560 5598078 5485207 5437058
14591 5437058 5558359 5672012 5589529 5596093 5561588 5637060 5703366 5610935 5456166 5543076 5499746
14580 5499746 5452645 5389701 5423570 5595299 5482468 5376782 5369220 5478782 5469636 5373310 5404941
14569 5404941 5448232 5418492 5537449 5522820 5584111 5568547 5678375 5603296 5427422 5424055 5425819
14558 5425819 5370041 5523195 5652582 5625605 5465414 5329331 5351825 5375360 5342049 5502758
14548 5502758 5519310 5394827 5527571 5564688 5546835 5501667 5384037 5459254 5487436 5528001 5651137
14537 5651137 5634457 5509053 5529657 5465008 5510216 5509661 5526519 5552500 5512174 5455502 5462248 5488984
14525 5488984 5534552 5614280 5618469 5628229 5587470 5474431 5429435 5509653 5640476 5675628 5531547
14514 5531547 5479716 5494410 5415158 5528001 5563008 5494911 5487077 5581651 5629635 5494097 5444996
14503 5444996 5491739 5482675 5502083 5560335 5611232 5658268 5608007 5644717 5678080 5580897 5532193
14492 5532193 5510011 5498010 5527884 5573956 5533221 5608377 5595516 5430361 5524829 5480709 5572181
14481 5572181 5568283 5477241 5480300 5487892 5545797 5498041 5505863 5514849 5637870 5690585 5735936 5675701
14469 5675701 5597880 5491458 5624780 5651521 5531339 5512359 5540119 5661337 5747779 5559588
14459 5559588 5513869 5522633 5532392 5608646 5547256 5613682 5550149 5546605 5567322 5628874 5631726 5628846
14447 5628846 5571072 5616531 5652120 5581551 5606455 5619818 5568266 5598017 5471187 5499663 5555225
14436 5555225 5648248 5655441 5672669 5714431 5644093 5582321 5676915 5687236 5727074 5646980 5606376
14425 5606376 5578169 5508742 5427051 5472789 5590847 5690738 5611264 5433173 5360541 5492434 5415062
14414 5415062 5368343 5482256 5465507 5554220 5478238 5570813 5556473 5519959 5568717 5476531 5641159
14403 5641159 5672894 5723278 5682442 5589589 5568273 5476394 5597020 5495664 5479770 5566474 5753637
14392 5753637 5687482 5516766 5468649 5589279 5634953 5574151 5532117 5509162 5535748 5507925 5551244
14381 5551244 5560159 5503620 5417835 5623995 5648740 5616319 5615576 5552903 5586681 5628128 5685890 5652990
14369 5652990 5556811 5568656 5791273 5709704 5595160 5581490 5693148 5728852 5667114 5619053 5665540
14358 5665540 5685433 5600676 5519459 5470597 5472699 5707726 5743961 5590579 5520715 5645842 5693945
14347 5693945 5638934 5703705 5645316 5669590 5612189 5591984 5647986 5618648 5602966 5624247 5629376
14336 5629376 5647059 5585317 5452840 5520009 5594126 5554491 5549727 5597852 5688013 5821033 5791907
14325 5791907 5771994 5585584 5602011 5605673 5599367 5676139 5721132 5752870 5685779 5644380 5538380
14314 5538380 5622213 5625836 5514007 5596324 5688563 5695075 5564048 5640282 5852143 5792903 5648357
14303 5648357 5584470 5589220 5478047 5524019 5670093 5662641 5680604 5784804 5859792 5780841 5767442
$$ [...]
##END NTUPLES=NMR SPECTRUM
##END=
