##TITLE=1H_DE-80H_X3
 200.13MHz, d2o
 8 sc
 
 19ns.26.2.2025
##JCAMPDX= 6.0         $$ Bruker NMR JCAMP-DX V2.0
##DATA TYPE= NMR SPECTRUM
##DATA CLASS= NTUPLES
##ORIGIN= UXNMR, Bruker Analytische Messtechnik GmbH
##OWNER= pz
$$ XWIN-NMR		Version 3.5
$$ Wed Mar 25 12:02:28 2026 Russian Standard Time (UT+4h)  Yarkov@DPX200
##.OBSERVE FREQUENCY= 200.1313
##.OBSERVE NUCLEUS= ^1H
##.ACQUISITION MODE= SIMULTANEOUS
##.ACQUISITION SCHEME= undefined
##.AVERAGES= 8
##.DIGITISER RES= 18
##SPECTROMETER/DATA SYSTEM= spect
##.PULSE SEQUENCE= zg30
##.SOLVENT NAME= DMSO
##.SHIFT REFERENCE= (INTERNAL, DMSO, 0, 15.4935)
##AUDIT TRAIL= $$ (NUMBER, WHEN, WHO, WHERE, WHAT)
$$ ##TITLE= Audit trail, XWIN-NMR		Version 3.5
$$ ##JCAMPDX= 5.01
$$ ##ORIGIN= Bruker BioSpin GmbH
$$ ##OWNER= Yarkov
$$ C:/Bruker/XWIN-NMR/data/yarkov2/nmr/H-C/1/pdata/1/auditp.txt
$$ ##AUDIT TRAIL=  $$ (NUMBER, WHEN, WHO, WHERE, WHAT)
(   1,<2026-03-25 12:01:38.31 +0400>,<Yarkov>,<DPX200>,
      <created by zg, POWCHK disabled, PULCHK disabled
       configuration hash MD5:
       00 E9 B6 7A A2 85 ED C7 34 08 36 98 17 FE 4E 26
       data hash MD5: 16K
       54 3E 91 91 CC 68 27 C4 C2 2E 12 B5 71 2F C8 B7>)
(   2,<2026-03-25 12:01:45.79 +0400>,<Yarkov>,<DPX200>,
      <Start of raw data processing
       efp BC_mod = 2 LB = 0.25 FT_mod = 6 PKNL = 1 PHC0 = -5299.148 PHC1 = 6.821927 SI = 16K 
       data hash MD5: 16K
       0D A0 B3 78 28 AF 0C CA 95 85 F0 E9 6C 10 A7 15>)
$$ ##END=
$$ 
$$ hash MD5
$$ 0A E3 75 25 F1 F9 B6 33 41 90 12 2B 3A 77 B5 8C
##$RELAX= 
##$RELAX= 
##$RELAX= 
##$RELAX= 
##$RELAX= 
##$RELAX= 
$$ Bruker specific parameters
$$ --------------------------
##$DU= <C:/Bruker/XWIN-NMR>
##$EXPNO= 1
##$NAME= <H-C>
##$PROCNO= 1
##$TYPE= <nmr>
##$USER= <yarkov2>
##$AMP= (0..31)
100 100 100 100 100 100 100 100 100 100 100 100 100 100 100 100 100 100 
100 100 100 100 100 100 100 100 100 100 100 100 100 100 
##$AQSEQ= 0
##$AQ_mod= 1
##$AUNM= <au_zg>
##$AUTOPOS= <>
##$BF1= 200.13
##$BF2= 200.13
##$BF3= 200.13
##$BF4= 200.13
##$BF5= 200.13
##$BF6= 200.13
##$BF7= 200.13
##$BF8= 200.13
##$BYTORDA= 1
##$CFDGTYP= 0
##$CFRGTYP= 5
##$CHEMSTR= <none>
##$CNST= (0..31)
1 1 145 1 1 1 1 1 1 1 1 1 1 1 1 1 1 1 1 1 1 1 1 1 1 1 1 1 1 1 1 1 
##$CPDPRG= <>
##$CPDPRG1= <>
##$CPDPRG2= <>
##$CPDPRG3= <>
##$CPDPRG4= <mlev>
##$CPDPRG5= <mlev>
##$CPDPRG6= <mlev>
##$CPDPRG7= <mlev>
##$CPDPRG8= <mlev>
##$CPDPRGB= <>
##$CPDPRGT= <>
##$D= (0..31)
0 0.7 0 0 0 0 0 0 0 0 0 0.03 0 0 0 0 0 0 0 0 0 0 0 0 0 0 0 0 0 0 0 0 
##$DATE= 1774425697
##$DBL= (0..7)
120 120 120 120 120 120 120 120 
##$DBP= (0..7)
150 150 150 150 150 150 150 150 
##$DBP07= 0
##$DBPNAM0= <>
##$DBPNAM1= <>
##$DBPNAM2= <>
##$DBPNAM3= <>
##$DBPNAM4= <>
##$DBPNAM5= <>
##$DBPNAM6= <>
##$DBPNAM7= <>
##$DBPOAL= (0..7)
0.5 0.5 0.5 0.5 0.5 0.5 0.5 0.5 
##$DBPOFFS= (0..7)
0 0 0 0 0 0 0 0 
##$DE= 6
##$DECBNUC= <off>
##$DECIM= 32
##$DECNUC= <off>
##$DECSTAT= 4
##$DIGMOD= 1
##$DIGTYP= 9
##$DL= (0..7)
0 120 120 120 120 120 120 120 
##$DP= (0..7)
$$ [...]
##$SUBNAM2= <"">
##$SUBNAM3= <"">
##$SUBNAM4= <"">
##$SUBNAM5= <"">
##$SUBNAM6= <"">
##$SUBNAM7= <"">
##$SUBNAM8= <"">
##$SUBNAM9= <"">
##$SW= 18.0517328524113
##$SWIBOX= (0..15)
0 0 2 0 0 0 0 0 0 0 0 0 0 0 0 0 
##$SW_h= 3612.71676300578
##$TD= 16384
##$TD0= 1
##$TE= 0
##$TE2= 300
##$TE3= 300
##$TEG= 300
##$TL= (0..7)
0 120 120 120 120 120 120 120 
##$TP= (0..7)
150 150 150 150 150 150 150 150 
##$TP07= 0
##$TPNAME0= <>
##$TPNAME1= <>
##$TPNAME2= <>
##$TPNAME3= <>
##$TPNAME4= <>
##$TPNAME5= <>
##$TPNAME6= <>
##$TPNAME7= <>
##$TPOAL= (0..7)
0.5 0.5 0.5 0.5 0.5 0.5 0.5 0.5 
##$TPOFFS= (0..7)
0 0 0 0 0 0 0 0 
##$TUNHIN= 0
##$TUNHOUT= 0
##$TUNXOUT= 0
##$USERA1= <user>
##$USERA2= <user>
##$USERA3= <user>
##$USERA4= <user>
##$USERA5= <user>
##$V9= 5
##$VALIST= <valist>
##$VCLIST= <CCCCCCCCCCCCCCC>
##$VD= 0
##$VDLIST= <DDDDDDDDDDDDDDD>
##$VPLIST= <PPPPPPPPPPPPPPP>
##$VTLIST= <TTTTTTTTTTTTTTT>
##$WBST= 1024
##$WBSW= 4
##$XGAIN= (0..3)
0 0 0 0 
##$XL= 0
##$YL= 0
##$YMAX_a= 113418
##$YMIN_a= -101268
##$ZGOPTNS= <>
##$ZL1= 120
##$ZL2= 120
##$ZL3= 120
##$ZL4= 120
##$ABSF1= 0
##$ABSF2= 0
##$ABSG= 0
##$ABSL= 0
##$ALPHA= 0
##$AQORDER= 0
##$ASSFAC= 0
##$ASSFACI= 0
##$ASSFACX= 0
##$ASSWID= 0
##$AUNMP= <proc_1d>
##$AZFE= 0.1
##$AZFW= 0.1
##$BCFW= 0
##$BC_mod= 2
##$BYTORDP= 0
##$COROFFS= 0
##$CY= -3
##$DATMOD= 1
##$DC= 0
##$DFILT= <>
##$DTYPP= 0
##$F1P= 0
##$F2P= 0
##$FCOR= 1
##$FTSIZE= 16384
##$FT_mod= 6
##$GAMMA= 0
##$GB= 0
##$INTBC= 1
##$INTSCL= 3.241238e-09
##$ISEN= 128
##$LB= 0.25
##$LEV0= 0
##$LPBIN= 0
##$MAXI= 10000
##$MC2= 0
##$MEAN= 0
##$ME_mod= 0
##$MI= 1.114404
##$NCOEF= 0
##$NC_proc= -8
##$NLEV= 6
##$NOISF1= 3.799351
##$NOISF2= 2.8
##$NSP= 0
##$NTH_PI= 0
##$NZP= 0
##$OFFSET= 15.49348
##$PC= 1
##$PHC0= -5299.148
##$PHC1= 6.821927
##$PH_mod= 1
##$PKNL= yes
##$PPARMOD= 0
##$PSCAL= 0
##$PSIGN= 0
##$REVERSE= no
##$SF= 200.130005648396
##$SI= 16384
##$SIGF1= 3
##$SIGF2= 2
##$SINO= 0.751879
##$SIOLD= 32768
##$SREGLST= <19F.Aceton>
##$SSB= 0
##$STSI= 16384
##$STSR= 0
##$SW_p= 3612.71676300578
##$SYMM= 0
##$S_DEV= 0
##$TDeff= 16384
##$TDoff= 0
##$TI= <>
##$TILT= no
##$TM1= 0
##$TM2= 0
##$TOPLEV= 0
##$USERP1= <user>
##$USERP2= <user>
##$USERP3= <user>
##$USERP4= <user>
##$USERP5= <user>
##$WDW= 1
##$XDIM= 16384
##$YMAX_p= 479106741
##$YMIN_p= -1049182
$$ End of Bruker specific parameters
$$ ---------------------------------
##NTUPLES= NMR SPECTRUM
##VAR_NAME=  FREQUENCY,     SPECTRUM/REAL,   SPECTRUM/IMAG
##SYMBOL=    X,             R,               I
##VAR_TYPE=  INDEPENDENT,   DEPENDENT,       DEPENDENT
##VAR_FORM=  AFFN,          ASDF,            ASDF
##VAR_DIM=   16384,         16384,           16384
##UNITS=     HZ,            ARBITRARY UNITS, ARBITRARY UNITS
##FACTOR=    0.220516191357247, 1,           1
##FIRST=     3100.71018561779, 0,            0
##LAST=      -512.006577387994, 0,           0
##MIN=       -512.006577387994, -1049182,    0
##MAX=       3100.71018561779, 479106741,    0
$$ Real data points
##PAGE= N=1
##DATA TABLE= (X++(R..R)), XYDATA
$$ [...]
5139F0840006j171415r76628j055605j097776j010657j102482p87751r27636p00332
5130E2009724p93379j089910j105856n04023p69036j150867j003538p80483n71156
5121D4241476q54349q45966p91400o75339n58219q15289j008850l02347o51749
5112C7737968q22179o51957l96188q13679r31961n20238l58687n95185p27521
5103C1920373n07430n61194o91847o80016o67258m51730o26818k93129l83719
5094B7057232m86177m28976m92945o00983m02986k21585n02669n26273m54311
5085B2940327k79640k44827j95476n31685j92246m37972r6164m58275j85377m60125
5075A9858540n17985j79338j7391K3729l34274l9052k99601j28400L5812m10340
$$ y = [60840006, 59668591, 58691963, 57636358, 56538582, 55527925, 54425443, 53637692, 52710056, 52009724, 51216345, 50126435, 49020579, 48516556, 47747520, 46596653, 45593115, 44812632, 44241476, 43387127, 42541161, 41749761, 41074422, 40516203, 39700914, 38692064, 38389717, 37737968, 36915789, 36263832, 35867644, 35053965, 34122004, 33601766, 33243079, 32647894, 31920373, 31412943, 30851749, 30159902, 29479886, 28812628, 28360898, 27734080, 27440951, 27057232, 26571055, 26142079, 25649134, 25048151, 24645165, 24423580, 23920911, 23394638, 22940327, 22660687, 22415860, 22220384, 21688699, 21496453, 21058481, 20962317, 20504042, 20318665, 19858540, 19340555, 19161217, 19143826, 19167555, 18833281, 18794229, 18494628, 18366228, 18402040, 17991700]
5065A7991700j08068j62432l70129P0294L24193j88087o8706j5102k62303k50537
5055A6960823O9692K13147J21447j48752M5216j30504k02966J64769j21138l19886
5045A6651848J5572O8357K7531r4491l0705K22716j33109j8530k21298k76170
5035A6211721k20505q2449N9580j53542j34503m17222k08868J13420r5338r5365
5025A4976929l47352J27747l39406l57778k98542J08877r9769o6778l46210j03758
5015A3253960j02328j2420J75555K46441j94154j30568Q1909p1557j0258J18143
5005A3354723J90487J13928k38169K11588K10186L5903M12801K89972N6517N50110
4995A5188046M86765L13326N52236K22071n6880n32054l99114j12015K8675M3552
$$ y = [17991700, 17883632, 17721200, 17351071, 17421365, 17745558, 17557471, 17488765, 17473663, 17211360, 16960823, 17030515, 17243662, 17365109, 17216357, 17261573, 17131069, 16928103, 17092872, 16971734, 16651848, 16667420, 16735777, 16763308, 16668817, 16638112, 16860828, 16727719, 16709189, 16487891, 16211721, 15991216, 15908767, 15968347, 15814805, 15680302, 15263080, 15054212, 15167632, 15072294, 14976929, 14629577, 14757324, 14417918, 14060140, 13761598, 13870475, 13770706, 13703928, 13357718, 13253960, 13151632, 13139212, 13314767, 13561208, 13367054, 13236486, 13318395, 13246838, 13236580, 13354723, 13545210, 13659138, 13420969, 13632557, 13842743, 13878646, 14291447, 14581419, 14637936, 15188046, 15674811, 15988137, 16540373, 16762444, 16705564, 16173510, 15774396, 15662381, 15691056, 15734608]
4985A5734608k6538N4425P8513j33147L50533K50623N16443P6831O4619R5842
4975A7062752O53154L997P0864J92384o1058j9064M41625K42017L26285J72402
4965A9085358o8079K65999J76143K02120L40111M22174Q2058L50908L35954N88297
4955B1781043L00718M32040J63341L88331K14855L2648M17469K20433N2576j39485
4945B3863969J03663k05524n3178j01954j25837j60108o04446k59458r6549j51025
4935B2209553J29676j98994R794k62932Q2910N0298n16049K71894K17953J57782
4925B2151885O4575L9607O8618L9163J24974j45573J00744M43087K0351j50888
4915B2756543J96381K0346K26633k7733K99047N19152L64053K06854K38627M86350
$$ y = [15734608, 15708070, 15762495, 15841008, 15707861, 16058394, 16309017, 16825460, 16902291, 16966910, 17062752, 17715906, 17719903, 17790767, 17983151, 17922093, 17903029, 18344654, 18586671, 18912956, 19085358, 19017279, 19283278, 19459421, 19661541, 20001652, 20423826, 20505884, 20856792, 21192746, 21781043, 22081761, 22513801, 22677142, 23065473, 23280328, 23312976, 23730445, 23950878, 24003454, 23863969, 23967632, 23762108, 23708930, 23606976, 23481139, 23321031, 22716585, 22457127, 22360578, 22209553, 22339229, 22140235, 22150029, 21887097, 21970007, 22020305, 21504256, 21776150, 21994103, 22151885, 22216460, 22256067, 22324685, 22363848, 22488822, 22343249, 22443993, 22887080, 22907431, 22756543, 22952924, 22973270, 23199903, 23172170, 23471217, 23990369, 24354422, 24561276, 24799903, 25286253]
4905B5286253N9335N12958O42328K67712K80221L82100J83906K27487L00820j34684
4895B8008436J66451L03535J45565K0755p359j91550j0976M19672J30915J13678
4885B9099122J65324M79544J34814O31369O74139O25420O32675L86707M31231
4876C3260345P35260N98985M77347k3103k8722o7655j21260j6127o74977l92107
4866C3747986o59292m36711o23443o60979p06609n05966K7879M8965k70334J8711
4856B9980207L84303N30911O13895O91314J51134J54470j02520L2401q5894j69044
4846C2181177J71081L07913L97549j84317k877Q7749M46410M10970K94970K67911
4836C4378536O53741Q52725J387894K497066N002748Q891130J3816811J3848322
$$ y = [25286253, 25345588, 25858546, 26500874, 26768586, 27048807, 27430907, 27614813, 27842300, 28143120, 28008436, 28174887, 28478422, 28623987, 28644742, 28637383, 28445833, 28434857, 28854529, 28985444, 29099122, 29264446, 29743990, 29878804, 30510173, 31184312, 31809732, 32442407, 32829114, 33260345, 33995605, 34594590, 35071937, 35048834, 35020112, 34952457, 34831197, 34815070, 34140093, 33747986, 33088694, 32651983, 32028540, 31367561, 30660952, 30154986, 30182865, 30231830, 29961496, 29980207, 30364510, 30895421, 31509316, 32200630, 32351764, 32506234, 32403714, 32436115, 32350221, 32181177, 32352258, 32660171, 33057720, 32873403, 32870526, 32958275, 33404685, 33815655, 34110625, 34378536, 35032277, 35885002, 37272896, 39769962, 44772710, 53663840, 67480651, 81328973]
4828H1328973R781129L134467m519952j0390692j0905254q752681p533660n433057
4820D6709273l854044k609272k058571j623620j046145j107379r30726o83469
4812C2796047p23494q09200n21423n65318r46054o66751o85501o74446o42977
4803B6560883l96703p23928o47786l55751m55597o01341m24650j12310m66529
4794B2376288o07562l22976k84249l64169j80221m05990j14206m11607m48670
4785A9236638l77507l98129l51598k85905l67476o33554l71699l2329m25450m25084
4775A5567907m05919l37314j81640j30758j44712j50064l8641j46068J19057m93213
4765A3658635O38O8891j52964R4860J36589l3798j6933Q5852L38578K60428L67430
$$ y = [81328973, 91110102, 94244569, 89724617, 79333925, 68428671, 59675990, 52142330, 46709273, 42855229, 40245957, 38187386, 36563766, 35517621, 34410242, 33479516, 32796047, 32072553, 31263353, 30741930, 30176612, 29230558, 28563807, 27878306, 27203860, 26560883, 26164180, 25440252, 24792466, 24436715, 23981118, 23379777, 22955127, 22842817, 22376288, 21768726, 21445750, 21161501, 20797332, 20617111, 20211121, 20096915, 19685308, 19236638, 18859131, 18461002, 18109404, 17823499, 17456023, 16822469, 16450770, 16418441, 15992991, 15567907, 15161988, 14824674, 14643034, 14512276, 14367564, 14217500, 14178859, 14032791, 14151848, 13658635, 13659273, 13728164, 13575200, 13670060, 13806649, 13772851, 13755918, 13841770, 14180348, 14440776, 14808206]
4754A4808206q8163K61914L19962M14632L31297K83650J24267L47879M35896N74789
4744A7814329K32225N09890N26406K90220O09895M12462P30947Q16993J018900
4735B2962267Q09316J026311N66823P65378J115489R90000R09072J087225J482261
4726C1714142J005095R11498J021549P30476P52577Q33738P25588L69398N59119
4717C8623180J07767M54617M68664O44357N35331M93479O47847P63987Q83640
4708D3622869Q96691J323314J447112J591830J401850J694312J732700J648990
4700E5359668J711199J403794J383548J309565P68205L04553l5099j19511o35481
4691F1450441p44995j406515j661778j272012j271409j434272j582548j506028
$$ y = [14808206, 14720043, 14981957, 15301919, 15716551, 16047848, 16331498, 16455765, 16803644, 17239540, 17814329, 18046554, 18556444, 19082850, 19373070, 19982965, 20395427, 21126374, 21943367, 22962267, 23771583, 24797894, 25364717, 26130095, 27245584, 28235584, 29144656, 30231881, 31714142, 32719237, 33630735, 34652284, 35382760, 36135337, 36969075, 37694663, 38064061, 38623180, 38730947, 39185564, 39654228, 40298585, 40833916, 41327395, 41975242, 42739229, 43622869, 44519560, 45842874, 47289986, 48881816, 50283666, 51977978, 53710678, 55359668, 57070867, 58474661, 59858209, 61167774, 61935979, 62240532, 62205433, 62085922, 61450441, 60705446, 59298931, 57637153, 56365141, 55093732, 53659460, 52076912, 50570884]
4683E0570884j459243j262739p77254q80586j037553r38367q99539m87415n69579
4674D2258609p23613m63229p88696q86114r35077p75595j052062j231942j219456
4665C4182825j435602j432709j581937j652397j371892j371101j541125j206130
4657B2589932j314296r27685q49865r62290r51153r46783n56981q12048q09256
4648A4459575m87611n45556l62292m77553j94199r3688o44014j84671j25766j02670
4638A1241555J09805q2941n4808K35710K23982N14170M56443P40350J662753L208539
4628A8255558L713604L163834J741398M2365j809582l079468k529314k062199
4620A7436196j680062j338674p73833m36540J27278L15765N46945J053392J512532
$$ y = [50570884, 49111641, 47848902, 47071648, 46191062, 45153509, 44215142, 43315603, 42828188, 42258609, 41534996, 41071767, 40283071, 39396957, 38461880, 37686285, 36634223, 35402281, 34182825, 32747223, 31314514, 29732577, 28080180, 26708288, 25337187, 23796062, 22589932, 21275636, 20347951, 19498086, 18535796, 17584643, 16637860, 16080879, 15268831, 14459575, 13971964, 13426408, 13064116, 12586563, 12392364, 12298676, 11654662, 11469991, 11344225, 11241555, 11351360, 11268419, 11213611, 11449321, 11673303, 12187473, 12643916, 13384266, 15047019, 18255558, 21969162, 25132996, 26874394, 26916759, 25107177, 22027709, 19498395, 17436196, 15756134, 14417460, 13643627, 13207087, 13334365, 13650130, 14197075, 15250467, 16762999]
4611A6762999J806697J834624J865012J328776O89083P77768J207340J907611
4603B8179910K571493L073387K972961K199056P34584R2709N6633R19408J712548
4594D2512689K785097K950821J675226L65385j559052k595073k297666j389589
4586D2447838m56795k68515k36256j050762j943741k740563k964853k708133k121843
4577B7956377j375034j219896j202088j041258k004300k355358k127854j536972
4569A5093617j682556j333336j217127q28632o43480n36286o21667m73495m34411
4560G322627k25370j14895m2973j30026m22310J01472k22626k13107l48132j72898
4550E531762j78015m9144l06962k37178J33448J78324j43358m79881N941J07425
$$ y = [16762999, 18569696, 20404320, 22269332, 23598108, 24287191, 25064959, 26272299, 28179910, 30751403, 33824790, 36797751, 38996807, 39731391, 39824100, 39880733, 40800141, 42512689, 45297786, 48248607, 49923833, 50289218, 48730166, 46135093, 43837427, 42447838, 41991043, 41722528, 41486272, 40435510, 38491769, 35751206, 32786353, 30078220, 27956377, 26581343, 25361447, 24159359, 23118101, 21113801, 18758443, 16630589, 15093617, 13411061, 12077725, 10860598, 10031966, 9388486, 8852200, 8230533, 7757038, 7322627, 7097257, 6982362, 6939389, 6809363, 6387053, 6488525, 6265899, 6052792, 5704660, 5531762, 5353747, 5304603, 4997641, 4760463, 4893911, 5072235, 4928877, 4448996, 4454937, 4562362]
4540D562362j54667m5719n50330j04599K32802o1890j95969j10184r7637l998
4530C470171n8987j02102p8628O3966n2388K31665R6701K6205k3394k6913j75445
4519C370851l8245m6411J67632J22588m3346k03219k64128K63212l94836k12563
4509B721535n2429j37335M8795o6832p2680k1692j33789j2204J17377m8824m03756
4498A938166j1227k4663L655L6393J34276L12699l82508K74873k11759J61534
4488B231439k6946n2397k52343j85701q332K38621j16772p9540J12350J11650
4478A972029M215m0117l22899J03214j0786O1276r7489j64724L79144p2503k49949
4467A561411J20078M7765j66013Q5840j03572K56753L09760J7018j84149L2212
$$ y = [4562362, 4407695, 4361976, 3811646, 3707047, 3939849, 3877959, 3681990, 3571806, 3474169, 3470171, 3411184, 3309082, 3230454, 3294420, 3242032, 3473697, 3570398, 3596603, 3573209, 3546296, 3370851, 3332606, 3286195, 3453827, 3576415, 3533069, 3329850, 3065722, 3328934, 2934098, 2721535, 2669106, 2531771, 2580566, 2513734, 2441054, 2419362, 2285573, 2273369, 2390746, 2341922, 1938166, 1926939, 1902276, 1905931, 1942324, 2076600, 2389299, 2006791, 2281664, 2069905, 2231439, 2204493, 2152096, 1899753, 1714052, 1705720, 1944341, 1827569, 1748029, 1860379, 1972029, 1976244, 1936127, 1613228, 1716442, 1705656, 1766932, 1669443, 1504719, 1883863, 1811360, 1561411, 1681489, 1729254, 1563241, 1649081, 1545509, 1802262, 2112022, 2129040, 1944891, 1977103]
4457A977103j97723j30302l4291q5350J83932j75377j60947M8499L4567J09649
4447A569760P7796m8459j14131M43089j55074j66233j75375L00047j22647j56567
4437A452206p0009J2780L5706R4106j68152j49298L26977K18446j19688Q648j6733
4426A624989j00882j00870J14592j47513k2596J47896K25081q9900k89868J42912
4416A503841k6208j38344K8463o1438K74565o1540J5560J14968K31493l92131
4406A489229j07039K72271k70865J17002o4382K05413K95362j9571J17444J50046
4396B184910j53479n07420K49895K66475K5748J76528o7723k31993Q3010l3879
4386A992072j09416J7795l316P4271j33913J11545r9209R4608J13568M7000j73580
$$ y = [1977103, 1779380, 1649078, 1614787, 1529437, 1713369, 1537992, 1377045, 1425544, 1460111, 1569760, 1647556, 1599097, 1484966, 1928055, 1772981, 1606748, 1431373, 1731420, 1608773, 1452206, 1382197, 1394977, 1430683, 1524789, 1356637, 1207339, 1534316, 1752762, 1633074, 1641722, 1624989, 1524107, 1423237, 1537829, 1390316, 1367720, 1515616, 1740697, 1650797, 1360929, 1503841, 1477633, 1339289, 1367752, 1306314, 1580879, 1519339, 1534899, 1649867, 1881360, 1489229, 1382190, 1654461, 1383596, 1500598, 1436216, 1641629, 1936991, 1917420, 2034864, 2184910, 2031431, 1524011, 1773906, 2040381, 2066129, 2242657, 2174934, 1942941, 2025951, 1992072, 1882656, 1900451, 1897135, 1971406, 1837493, 1949038, 1849829, 1944437, 2058005, 2105005, 1931425]
4375A931425J70008j28388J40963J03632M870k40778M5089j24318q4415K32974
4365B051062n8914P6262k1297j46728J83100O5924P2217m1810j03990k45267P9480
4354A910039Q7075j38907J09261L9149J24933m8879J43143p4404N0686J35103
4344B337199K41108N8305K16105o2059k12799j01853q2972j34016J00066M14792
4334B773876L33068q980j50912q0048J65331J23144J31348N2378o4108j43631
4324C131466m7822J84202O7691M1544q7594L23725N06285K88839Q9727J92037
4314D690100K83713p8481L3267R1605K51883L28997m6799J95320l897J09818J35578
4303E991104L48519R8546K75983j16547m404J04556K48741L13693j0783J66999
$$ y = [1931425, 2101433, 1973045, 2114008, 2217640, 2222510, 1981732, 2026821, 1902503, 1818088, 2051062, 1992148, 2068410, 2047113, 1900385, 2083485, 2149409, 2221626, 2179816, 2075826, 1830559, 1910039, 1997114, 1858207, 1967468, 2006617, 2131550, 2082671, 2225814, 2151410, 2202096, 2337199, 2578307, 2636612, 2852717, 2790658, 2577859, 2476006, 2393034, 2259018, 2359084, 2773876, 3106944, 3097964, 2947052, 2867004, 3032335, 3155479, 3286827, 3339205, 3275097, 3131466, 3083644, 3267846, 3335537, 3377081, 3289487, 3613212, 4119497, 4408336, 4498063, 4690100, 4973813, 4895332, 4928599, 5020204, 5272087, 5601084, 5554285, 5749605, 5745708, 5855526, 5991104, 6339623, 6438169, 6714152, 6597605, 6593201, 6697757, 6946498, 7260191, 7249408, 7416407]
4293G416407P6421N78705P4149l0264M03051M94370q8829O7818K11863N1536Q0173
4282I335400J8112M00090L38821K27774J35621J20654J52015K44959k72332K29799
4272A0930913L56205J65886M3863J3029j48692M1503K66260j54386R4471Q8064
4262A1697116M05219K94629j57756J76099O01566q6031K73671L58717L13316R2950
4252A3969496J27559L84350J00530L00679L72461M57389O01271L46129N44547
4243A7204411P12889M61813M18281L66033N24641P48193J170221J403851J992197
4234B5002530L545131O173812J1091100J5938531J5033911R926868K144180o798527
4226H2057536j2376144j1823575r651993p779322n612710m072936k736884j856831
$$ y = [7416407, 7492828, 8071533, 8145682, 8115418, 8518469, 9012839, 8924010, 8991828, 9203691, 9255227, 9335400, 9353512, 9753602, 10092423, 10320197, 10455818, 10576472, 10728487, 10973446, 10701114, 10930913, 11287118, 11453004, 11496867, 11509896, 11361204, 11402707, 11668967, 11514581, 11609052, 11697116, 12102335, 12396964, 12239208, 12415307, 13016873, 12930842, 13204513, 13563230, 13876546, 13969496, 14097055, 14481405, 14581935, 14882614, 15255075, 15712464, 16313735, 16659864, 17204411, 17917300, 18379113, 18797394, 19163427, 19688068, 20436261, 21606482, 23010333, 25002530, 28547661, 34721473, 45812573, 61751104, 76785015, 86711883, 88856063, 82057536, 69681392, 57857817, 48205824, 40426502, 34813792, 30740856, 28003972, 26147141]
4218B6147141j185099j007391l67605o83112o26188o83773o09890l92363k70501
4209B0321219k47736l52605l6048j84064k75049k26858l54808l65758l85577l3399
4199A7859317k07150n58137k32129l85870p6717k22020k62109j71908k80003k83264
4189A5180010k7663j50342Q904m09496q3255K5949j20309j25084k15628m8003
4179A4035083K1244l59726q4629j72044j23774J06177j87230P1803J66888J61947
4169A3635739l91948j87543K37197l63789j9473r2269k23368R5044j56781j75629
4159A2357180j05873J12332n5510k61143j48509O305r8826N3667j04220j97617
4149A1557786l36951l44296J95882K1129l41539n3484j32121l3149p5282R8581
$$ y = [26147141, 24962042, 23954651, 23587046, 22903934, 22277746, 21593973, 20984083, 20591720, 20321219, 20073483, 19720878, 19684830, 19500766, 19225717, 18998859, 18644051, 18278293, 17892716, 17859317, 17652167, 17094030, 16861901, 16476031, 16399314, 16177294, 15915185, 15743277, 15463274, 15180010, 15152347, 15002005, 15010909, 14601413, 14518158, 14544107, 14423798, 14298714, 14083086, 14035083, 14056327, 13696601, 13611972, 13439928, 13316154, 13422331, 13235101, 13306904, 13473792, 13635739, 13243791, 13056248, 13293445, 12929656, 12910183, 12817914, 12594546, 12689590, 12532809, 12357180, 12251307, 12363639, 12308129, 12046986, 11898477, 11904782, 11805956, 11859623, 11755403, 11557786, 11220835, 10876539, 11072421, 11093550, 10752011, 10698527, 10566406, 10533257, 10457975, 10556556]
4139A0556556k83370j86771N1430J27881m20941o1119k04867Q4566k67092N147
4129I401420N91751M53414k43345j2675K71926J95305L73624K94818K26841K34641
4119A1787720Q3221J55687M34929N06797K20968K46212N57344Q13987J4720L2831
4109A4854416M46188O40810K63116K76592Q72899M41018O32217N66056L53688
4100A9347000L00951L28991P09069N59055M23147N01542O56118N98235K74736
4091B3698844O41818L21869R19683O93606N52123L39528O16960M80080R91578
4082B9256089R38160Q38109R74124P11990R29306R87074N78773L97249N64353
4073C6175227Q09522P94601N60697O05491M12860K49152K37249L60271L55039
$$ y = [10556556, 10273186, 10086415, 10137845, 10265726, 9844785, 9783666, 9578799, 9663365, 9396273, 9401420, 9993171, 10446585, 10203240, 10190565, 10462491, 10657796, 11031420, 11326238, 11553079, 11787720, 11870941, 12026628, 12461557, 12968354, 13189322, 13435534, 13992878, 14806865, 14821585, 14854416, 15300604, 15941414, 16204530, 16481122, 17354021, 17795039, 18427256, 18993312, 19347000, 19647951, 19976942, 20686011, 21245066, 21668213, 22169755, 22825873, 23424108, 23698844, 24340662, 24662531, 25582214, 26275820, 26827943, 27167471, 27784431, 28264511, 29256089, 30194249, 31032358, 32006482, 32718472, 33647778, 34634852, 35213625, 35610874, 36175227, 36984749, 37779350, 38340047, 38945538, 39358398, 39607550, 39844799, 40205070, 40560109]
4064D0560109K14593L94870N15191Q14507J214338J630482K309745K778684L202188
4055E3634707K255169J012871J15311o74742m91076o08386k82027k60620J50554
4046E4851761R76890R49832M82768O83497N50185O68684K50415J40610L55740
4037E9910382J99779L54214P32862L53428J23465R4813K98070J42774L86268K18922
4027F2814977K87274N46132K81703J81970M84865L01676J65385j31967j62362
4018F4769653k95849l19528p7002l14515j59318r3336j75320J05504m81459o94435
4008F2264395o9520j66987N3400M9056j96254k53404q9729k18038j66212l77588
3998F0829119m96091o60463m46976r46917p01422j192202j034499q80711j123966
$$ y = [40560109, 40774702, 41169572, 41684763, 42499270, 43713608, 45344090, 47653835, 50432519, 53634707, 55889876, 56902747, 57018058, 56343316, 55852240, 55243854, 54961827, 54701207, 54851761, 55828651, 56778483, 57261251, 57944748, 58494933, 59163617, 59414032, 59554642, 59910382, 60110161, 60464375, 61197237, 61550665, 61674130, 61768943, 62067013, 62209787, 62596055, 62814977, 63102251, 63648383, 63930086, 64112056, 64596921, 64898597, 65063982, 64932015, 64769653, 64473804, 64154276, 64077274, 63762759, 63603441, 63510105, 63334785, 63440289, 62958830, 62264395, 62194875, 62027888, 62081288, 62130344, 61934090, 61680686, 61590957, 61372919, 61206707, 60829119, 60333028, 59672565, 59225589, 58278672, 57577250, 56385048, 55350549, 54469838, 53345872]
3989E3345872p45686m84873o54035o40197k89473q11834l65583p9968k85713j17245
3979D8871265k46622j6854K49098M61819M82396K22452N10607Q25672K59289K93636
3969E1912758K85560n1511j22517q3359j05245Q3763j90061l57557p2741R8525
3959E1397615L27753O22636Q19094J472345J783664K728547L025540K588961J389913
3950F6156068j53730j453173k109120j813495j985421j604078j191141j051275
3942E4794635n80451l63854j76392O7917L25425L73530M72343O16086J26047J82815
3932E5838101M38974l33690l71876o34954q87197q02594q50750m34649L42444
3923E2303809P78509J345472P98474M13205o59873k063921k555463k425539k436636
$$ y = [53345872, 52600186, 52115313, 51461278, 50821081, 50531608, 49719774, 49354191, 49274223, 48988510, 48871265, 48624643, 48607789, 48856887, 49318706, 49801102, 50023554, 50534161, 51359833, 51619122, 51912758, 52198318, 52146807, 52024290, 51940931, 51835686, 51919449, 51729388, 51371831, 51299090, 51397615, 51725368, 52348004, 53167098, 54639443, 56423107, 59151654, 62177194, 64766155, 66156068, 66002338, 64549165, 62440045, 60626550, 58641129, 57037051, 55845910, 54794635, 54214184, 53850330, 53673938, 53741855, 54067280, 54440810, 54913153, 55529239, 55655286, 55838101, 56277075, 55943385, 55571509, 54936555, 54049358, 53246764, 52396014, 51961365, 52303809, 53082318, 54427790, 55226264, 55639469, 54979596, 52915675, 50360212, 47934673, 45498037]
3914D5498037j844384j733236j993339j423753j155111j610905j361180n68225
3906C3807904j041777r67468p23924o84036l89217k46248j92579n8110j44787
3897B9359758K97688O18444M34491K35330N62531O77538Q11248P73677O33800
3888C4404505P11670P98594M35410N75351O3457J41219K55061k31005j38584n5716
3878C6959962l79717n47053p35327p14008o53644k50021m96114n56169n00373
3869C2127536k83948J79972K41035j14384M87573L18286n789K93342J60820N703
3859C3410146J69396J12842k37968k00264j86651j29175J65650j49905p3230K06718
3849C3087559J76056q4133j55930p4346J50637p2158k56111j42980q69382j58041
$$ y = [45498037, 43653653, 41920417, 39927078, 38503325, 37348214, 35737309, 34376129, 33807904, 32766127, 31798659, 31074735, 30390699, 30001482, 29755234, 29562655, 29504545, 29359758, 29657446, 30275890, 30710381, 30945711, 31508242, 32185780, 32997028, 33770705, 34404505, 35116175, 35914769, 36350179, 36925530, 36988987, 37130206, 37385267, 37154262, 37015678, 36959962, 36580245, 36033192, 35297865, 34583857, 33930213, 33680192, 33184078, 32627909, 32127536, 31843588, 32023560, 32264595, 32150211, 32637784, 32956070, 32950281, 33243623, 33404443, 33410146, 33579542, 33692384, 33454416, 33254152, 33067501, 32938326, 33103976, 32954071, 32880841, 33087559, 33263615, 33179482, 33023552, 32949206, 33099843, 33027685, 32771574, 32628594, 31759212, 31601171]
3839C1601171j39043p8728k40573j43362K28996R5130r6525N76342q6039Q471
3829C1725840M88724J09601J66344j05472M835j10181L09577m00166n42004m92539
3819C1154559m49094n89252o43118r34504j019436o93502q70107r60685q87628
3810B4107233q49260q93960m81438n44519o16811l21387l76797j93081k06061
3801A9623919K0657k03300k3969J33180J68387J19309K87037L60537K16423O11142
3791B1313322J36566Q2603M51934L34321L62963J34038j97831j73269m6985k43061
3781B2154601j29003m34734J7507K30469m38937m12863o39242l02639k49151j96943
3771A9599065j92470n18070k67910m23964j16562m46939l06468o0813k24984j42350
$$ y = [31601171, 31462128, 31383400, 31142827, 30999465, 31228461, 31323591, 31227066, 31803408, 31717369, 31725840, 32214564, 32324165, 32490509, 32385037, 32389872, 32279691, 32589268, 32189102, 31647098, 31154559, 30705465, 30116213, 29473095, 28538591, 27519155, 26825653, 25955546, 24994861, 24107233, 23257973, 22364013, 21882575, 21338056, 20721245, 20399858, 20023061, 19829980, 19623919, 19644576, 19441276, 19417307, 19550487, 19718874, 19838183, 20125220, 20485757, 20702180, 21313322, 21449888, 21532491, 21984425, 22318746, 22681709, 22815747, 22617916, 22444647, 22397662, 22154601, 22025598, 21590864, 21608371, 21838840, 21399903, 20987040, 20347798, 20045159, 19796008, 19599065, 19406595, 18888525, 18620615, 18196651, 18080089, 17633150, 17326682, 17265869, 17040885, 16898535]
3761A6898535m39048k42281m24302j9601M7836j34274r787j47289l62844J21896
3751A5288841l4660J65695k79666P4624M31803L09661Q8508M43033J80476j01220
3741A6567095K56779J47735J84933O8509L7504K32416P5202M22445L02514J37004
3731A8432136O85887N40325L73190j4378L19126L48169k27923k20935r2462j22633
3721B0020502m53533j88378j46996l22759j95827l81232l09429j82624q3156p9993
3711A7676575j91369K0794j07521m44758j19033j97967p27132m91545k28813k03432
3701A4985799p02428k23311k81153k19799m56521o79N4703o7920P4346l28474
3691A2834563j7642k35573k47753l81811j57294j39364n31301j37714k01297l46132
$$ y = [16898535, 16459487, 16217206, 15792904, 15773303, 15821139, 15686865, 15677078, 15529789, 15166945, 15288841, 15254181, 15419876, 15140210, 15214834, 15646637, 15956298, 16044806, 16487839, 16668315, 16567095, 16823874, 16971609, 17156542, 17225051, 17262555, 17494971, 17570173, 17992618, 18295132, 18432136, 19118023, 19658348, 20031538, 20017160, 20336286, 20684455, 20456532, 20235597, 20143135, 20020502, 19566969, 19378591, 19231595, 18908836, 18713009, 18331777, 18022348, 17839724, 17756568, 17676575, 17485206, 17506000, 17398479, 16953721, 16834688, 16636721, 15909589, 15418044, 15189231, 14985799, 14283371, 14060060, 13778907, 13559108, 13102587, 13101908, 13156611, 13088691, 13163037, 12834563, 12816921, 12581348, 12333595, 11951784, 11794490, 11655126, 11123825, 10986111, 10784814, 10438682]
3681A0438682m17355l43963K56606j52334m32062m9199K17282q7820j56612l40023
3671H933202j49191J79190m64438j40558N7171m91321k0458o2198m82876r5642
3661G262881N8253j39006K28969j57103l58850j26290Q2889J59899Q4929m4071
3651G052500n7565R9935l5591j87236k5133P964j68943Q8061j8056r5216R4068
3640F754788l30940j83878k84693L5966K63720J16931j77045M3616j03799r5305
3630F039361j00645Q4692J15368m0372j84022q6875k02048j67254r3661l42666
3620E021878j28930J06665p1641q5981j00416l6015j68675q3598P001l9726m9455
3609D371107Q4992P5489J9205j54135m0646K48055k04807k61689Q6147N86893
$$ y = [10438682, 10021327, 9677364, 9933970, 9781636, 9349574, 9300375, 9517657, 9429837, 9273225, 8933202, 8784011, 8963201, 8498763, 8358205, 8415376, 7924055, 7903597, 7841399, 7358523, 7262881, 7321134, 7182128, 7411097, 7253994, 6895144, 6768854, 6851743, 7011642, 7096571, 7052500, 6994935, 7094870, 7059279, 6872043, 6846910, 6854874, 6685931, 6773992, 6755936, 6660720, 6754788, 6423848, 6239970, 5955277, 5991243, 6254963, 6371894, 6194849, 6238465, 6134666, 6039361, 5938716, 6023408, 6138776, 6098404, 5914382, 5827507, 5625459, 5458205, 5364544, 5021878, 4892948, 4999613, 4927972, 4841991, 4741575, 4705560, 4536885, 4453287, 4460288, 4420562, 4371107, 4456099, 4531588, 4550793, 4396658, 4356012, 4604067, 4399260, 4137571, 4223718, 4810611]
3599D810611j05200n06894L44270P02K0959L47040L34931q9264j9042J68338K8244
3588E334695o0045J83100j16407n6461K03216k22034r3093j10829L08149J86770
3578E557061J42833J01550l2642j68984J0472O418J02980j75238q9303K15031
3568E670178J8677j21653J92473m7561p0155P560j34033k19073j04468K5290L37024
3557E554259J26537m70378j03926K26622M7465j31032o6154Q8302j92797J31020
3547E209918k3387j34163J79804j07932m1622p3715n5477k7878p3397k33018J75173
3536D794306K2117q9660O7754k38853O8780j60336P2792m2125J29462L13943p8082
3525D860098l11642P5134K11995J69152P1201J68791J31516j17556K80095k2270
$$ y = [4810611, 4705411, 4198517, 4542787, 4543489, 4564448, 4911488, 5246419, 5157155, 5138113, 5306451, 5334695, 5274650, 5457750, 5341343, 5284882, 5488098, 5266064, 5172971, 5062142, 5370291, 5557061, 5699894, 5801444, 5768802, 5599818, 5610290, 5616708, 5719688, 5544450, 5455147, 5670178, 5688855, 5567202, 5759675, 5712114, 5641959, 5649519, 5515486, 5296413, 5191945, 5217235, 5554259, 5680796, 5210418, 5106492, 5333114, 5380579, 5249547, 5183393, 5271695, 5078898, 5209918, 5186531, 5052368, 5232172, 5124240, 5082618, 5008903, 4953426, 4925548, 4852151, 4619133, 4794306, 4816423, 4726763, 4794517, 4555664, 4624444, 4464108, 4536900, 4494775, 4624237, 4938180, 4860098, 4548456, 4623590, 4835585, 5004737, 5075938, 5244729, 5376245, 5258689, 5538784, 5516514]
3515E516514j85148L8349K50779k34730m791M28236j6720L6177K0713k9040J40929
3504E961268J36175j8250J3551J35329J63003J40816J11215k15676j18429M01875
3494F710877K48207J57868n971j35415M5067J05386M0573j71709M473K18593J77179
3483G395128k65394M5904K09191N1905J34629J06613L18785M19301L25036J85259
3473H926357J16900P8609L67151M29494K60208n9079J18755O4350J18093L09530
3463A0730368J53971L67611k67890N24890K77665p4050K53006L52012J51843J77612
3453A2647038M60640L75344N66536N07394L49290N82882L72444R9859K90152K04607
3443A6456186K82189K43281O9506r2799M67994M45326k7327J36015N56940K27368
$$ y = [5516514, 5331366, 5369715, 5620494, 5385764, 5380973, 5809209, 5792489, 5828666, 5849379, 5820339, 5961268, 6097443, 6079193, 6092744, 6228073, 6391076, 6531892, 6643107, 6427431, 6309002, 6710877, 6959084, 7116952, 7110981, 6975566, 7020633, 7126019, 7166592, 6994883, 6999356, 7217949, 7395128, 7129734, 7175638, 7384829, 7436734, 7571363, 7677976, 7996761, 8416062, 8741098, 8926357, 9043257, 9121866, 9489017, 9918511, 10178719, 10119640, 10238395, 10302745, 10420838, 10730368, 10884339, 11251950, 10984060, 11508950, 11786615, 11712565, 11965571, 12317583, 12469426, 12647038, 13107678, 13483022, 14049558, 14556952, 14906242, 15489124, 15861568, 15961427, 16251579, 16456186, 16738375, 16981656, 17051162, 16958363, 17426357, 17871683, 17844356, 17980371, 18537311, 18764679]
3433A8764679J45748L07814J36083L0496J01511P8178M18714K46068K58900r9558
3423B0388633L59731L48480J87224K11468Q2068j11185l4822J69345L4910N0524
3413B1686376L68519K68620J68090J73696L74496K64135M9787K21332L73622L71703
3403B4320376M74604N20771P26930P47739M42903Q25698P16583P08396R63642
3394C0447642J196701J192558R33681J046679Q71254Q58499R53813O82034o6242
3385C8116619K6735m38472m85576l02458o60197o14182n99880l51651j67184l90210
3375C4133544j53909P39274N97389K29683N92074Q55519Q85432Q58268P60693
3366C9497967L95984R8973l6363q8643o01281r98908m90737r23455p85680q31903
$$ y = [18764679, 18910427, 19218241, 19354324, 19384820, 19486331, 19564509, 19983223, 20229291, 20488191, 20388633, 20748364, 21096844, 21284068, 21495536, 21577604, 21466419, 21431597, 21600942, 21635852, 21686376, 22054895, 22323515, 22491605, 22665301, 23039797, 23303932, 23353719, 23575051, 23948673, 24320376, 24794980, 25315751, 26042681, 26790420, 27233323, 28059021, 28775604, 29484000, 30447642, 31644343, 32836901, 33770582, 34817261, 35688515, 36547014, 37500827, 38182861, 38116619, 38143354, 37704882, 37219306, 36916848, 36256651, 35642469, 35042589, 34690938, 34523754, 34133544, 33979635, 34718909, 35316298, 35545981, 36138055, 36993574, 37879006, 38737274, 39497967, 39893951, 39992924, 39956561, 39867918, 39266637, 38267729, 37776992, 36853537, 36067857, 35235954]
3356C5235954m53473o99947p90570m95656o33038l90381k80811n361K15525K0595
3346C1722837j64786J78176q6717M19424L60914k0220K33832n5814K03522K41120
3336C3032288K68279J84508P8995J95613N1462k19222M01019Q64434R27734P43032
3326C6528142R96153R41838J326650J516452J774104K134238K356065L149515
3318E0723157L455479L981771N259276O524578P689853R482046J1260675J2118756
3310A10495591J1929085J0378043P711072M093129k9764k453750l242753k970616
3302A35910037j366187P81036L172178N677088O074669M305927J018962l601394
3294A51972316p810108j0867270j2353364j2385177j1571868j0312434q739228
$$ y = [35235954, 34782481, 34082534, 33291964, 32796308, 32163270, 31772889, 31492078, 31486717, 31702242, 31722837, 31558051, 31736227, 31649510, 32068934, 32429848, 32409628, 32643460, 32587646, 32791168, 33032288, 33300567, 33485075, 33564070, 33759683, 33811145, 33591923, 33992942, 34857376, 35785110, 36528142, 37524295, 38466133, 39792783, 41309235, 43083339, 45217577, 47573642, 50723157, 54178636, 58160407, 63419683, 69944261, 77634114, 87116160, 98376835, 110495591, 122424676, 132802719, 140513791, 144606920, 144577156, 142123406, 138880653, 135910037, 134543850, 135324886, 138497064, 144174152, 150248821, 154554748, 155573710, 151972316, 144162208, 133294938, 120941574, 108556397, 96984529, 86672095, 77932867]
3287G7932867q106235o916634n721560m666061l820363l485645l068406k813606
3279C9334357k060370j856945j513009j383402j422189j011847j067722r97134
3271B8021739n77720n78863p89660l47653k31932l78958p5020j25349K8105J09048
3261B5053737R6650O7451L01484J014442P64913Q26585M06482N97716M8080o23681
3251B8553859o02928p64283p35810p36441p64939l11236q9536j86296Q2937K25631
3241B4670958K58286N9994L45693M20275O38730O45166R94192J339924J375291
3232C0748509J312174J915748J943297K312151K939600K901326L654654M514024
3224E2241483M906989O431476P333956Q497624J0795887J3039832J5526398J8145620
$$ y = [77932867, 69826632, 62909998, 57188438, 52522377, 48702014, 45216369, 42147963, 39334357, 37273987, 35417042, 33904033, 32520631, 31098442, 30086595, 29018873, 28021739, 27444019, 26865156, 26075496, 25727843, 25495911, 25116953, 25041933, 24916584, 24944689, 25053737, 25150387, 25217838, 25519322, 26533764, 27298677, 28125262, 28531744, 29129460, 29177540, 28553859, 27950931, 27186648, 26450838, 25714397, 24949458, 24638222, 24548686, 24362390, 24445327, 24670958, 24929244, 24989238, 25334931, 25755206, 26393936, 27039102, 28033294, 29373218, 30748509, 32060683, 33976431, 35919728, 38231879, 41171479, 44072805, 47727459, 52241483, 57148472, 63579948, 70913904, 79411528, 90207415, 103247247, 118773645, 136919265]
3216A36919265J9789687K0899852K0500872J7820928J2685717O046623j943141
3209B32719803r644088j5258313j8771810k0096222j9634674j8371436j6000045
3202A14943215j3993931j2062084j0123659q782791o938406n953420n363406m373968
3194D7351550l833875l248812k869608k213996k122335j809473j213507j301132
3186B8738812j619275r65179r72538q44365p60880j036997o60053l63210m85084
3177B1031231r73423n18489k90204n47388m23381k12021m51182j93518l62123
3168A7059502l30364m01590m17471k85995k76165k80731r155j27112n47339l61314
3158A4022266K03607J40253j282j60873j58194l07303M05726O1473R6209J68488
$$ y = [136919265, 156708952, 177608804, 198109676, 215930604, 228616321, 234662944, 232719803, 223075715, 207817402, 189045592, 168949370, 149314696, 130943260, 114943215, 100949284, 88887200, 78763541, 69980750, 63042344, 57088924, 51725518, 47351550, 43517675, 40268863, 37399255, 35185259, 33062924, 31253451, 30039944, 28738812, 27119537, 26154358, 25181820, 24337455, 23576575, 22539578, 21879525, 21516315, 21031231, 20057808, 19539319, 19249115, 18701727, 18278346, 18066325, 17615143, 17421625, 17059502, 16729138, 16327548, 15910077, 15624082, 15347917, 15067186, 15058031, 14930919, 14383580, 14022266, 14225873, 14366126, 14364844, 14203971, 14045777, 13738474, 14144200, 14205673, 14301882, 14470370]
3148A4470370J5475k14511j525Q5954L13070K7834J03315K8230L37802M97355
3138A5663369m54288O7174M92566K10928k5312L80107M14892L09130N49208M94201
3128A8101975R88416P54257M27832P11765O13723J034599J165611J297157R46466
3119B6041801J249016J904392K286819K553746K970784L016561L018368K724754
3111D5766241L039148K354638J951115J646831J723356K372556L096608L703711
3103F5654204M595109O260791P502246R235452J0854470J2540243J2909248J2110170
3095A41661933J1055647Q140359M762508K306902M08867m00360J68424J488446
3087A69592726K255126J873595K65814k171231n702595q672757j1303399j3231373
$$ y = [14470370, 14485845, 14271334, 14269809, 14355763, 14668833, 14696667, 14799982, 14828212, 15166014, 15663369, 15209081, 15276255, 15768821, 15979749, 15954437, 16334544, 16749436, 17058566, 17607774, 18101975, 19090391, 19844648, 20272480, 20984245, 21597968, 22632567, 23798178, 25095335, 26041801, 27290817, 29195209, 31482028, 34035774, 37006558, 40023119, 43041487, 45766241, 48805389, 51160027, 53111142, 54757973, 56481329, 58853885, 61950493, 65654204, 70249313, 76510104, 84012350, 93247802, 104102272, 116642515, 129551763, 141661933, 152717580, 160857939, 165620447, 167927349, 168336216, 167935856, 168104280, 169592726, 171847852, 173721447, 173987261, 171816030, 166113435, 157440678, 146137279, 132905906]
3079A32905906j3398224j2792039j2076384j0935677r459835q067624o788913
3072E9387210n811600n011729m254698l920379l249036k572507k138937j898635
3064C0529689j887910j855691j612140j035596r80338j138435o88108o88475q66943
3055A9776053p76295q12660p90231n28613m08958o02257m49189m12081n51366
3046A4444403m30940o70180n20135k42461l70656l75784l34418k44650j99809
3037A1055370k67388k11304l11028l00033k69123r2738K54302k99787m6036j49626
3027I362609m65765k43984J91676Q1993l36707l27137n3958r9987j26409j72713
3017G809618J66049j47584k41735o786k59984n8958l34089l8456n5006k51617
$$ y = [132905906, 119507682, 106715643, 94639259, 83703582, 74243747, 66176123, 59387210, 53575610, 48563881, 44309183, 40388804, 37139768, 34567261, 32428324, 30529689, 28641779, 26786088, 25173948, 24138352, 23158014, 22019579, 21331471, 20642996, 19776053, 18999758, 18187098, 17396867, 16868254, 16459296, 15857039, 15407850, 14995769, 14444403, 14013463, 13343283, 12823148, 12580687, 12210031, 11834247, 11499829, 11255179, 11055370, 10787982, 10576678, 10265650, 9965617, 9696494, 9603756, 9858058, 9558271, 9512235, 9362609, 8896844, 8652860, 8844536, 8926529, 8589822, 8262685, 8208727, 8108740, 7982331, 7809618, 7975667, 7828083, 7586348, 7579562, 7319578, 7260620, 6926531, 6888075, 6833069, 6581452]
3007F581452k63701L3301J6951k08958M0609j97404j08038l04068k4720j4403
2997E551021R2356j81309k20059K5774j28890j90293j41208q5010Q9230L5956
2987D847568j93626j09027j02818m20797J43108K8798j38675J2636Q3962N6048
2977D207177n00481j47772K37664j8552m53985K04106J5698P5015J86887J4997
2967C820754j82272j61197j45361q6300j10551J27273K47946j20288P1876m6300
2957C415580l48332k9046J54679J20649j63552l76775k36931L54919J58995k42311
2947B807875j09195J89498q391J054K54737K42417j58924j88142J60570j03620
2937C087879j66599J99682r1356o0086O0661K31347J42385j70424L08106K67322
$$ y = [6581452, 6317751, 6351052, 6368003, 6159045, 6199654, 6002250, 5894212, 5590144, 5565424, 5551021, 5643377, 5462068, 5242009, 5267783, 5138893, 4948600, 4807392, 4722382, 4811612, 4847568, 4653942, 4544915, 4442097, 4021300, 4164408, 4193206, 4054531, 4067167, 4151129, 4207177, 3706696, 3558924, 3796588, 3778036, 3324051, 3528157, 3543855, 3618870, 3805757, 3820754, 3638482, 3477285, 3331924, 3245624, 3135073, 3262346, 3510292, 3390004, 3461880, 3415580, 3067248, 3038202, 3192881, 3313530, 3149978, 2773203, 2536272, 2891191, 3050186, 2807875, 2698680, 2888178, 2879787, 2880841, 3135578, 3377995, 3219071, 3030929, 3191499, 3087879, 2921280, 3120962, 3029606, 2969520, 3030181, 3261528, 3403913, 3233489, 3541595, 3808917]
2927C808917J0584k34825k44568k73082O891L2323p5455k07174j23645K80459
2917B980425l17894k09070l3240J71105j80821l04732o0193J61751K25273k17835
2907B214769j64711Q788R7430K6172p2784j8188J80140Q958j51516J98722l3908
2896B293872o1088j2455k87438j10246M8127Q1451j18615j01566K5204K54916
2886B012162j59548j65406J10538O0146p0823J21597q927m245m9667j60691j13319
2875A571817K71005j05009j43506O8834k99682K41531j15840J13994K49931j62178
2865A690897l25735K04184J77306k0897J8272j57458P5414M3121r9401R0430J15753
2854A811886p1159J70495K5306j33215l42025K26320J85950q704j91058L5887
$$ y = [3808917, 3819501, 3584676, 3340108, 3067026, 3073917, 3106240, 3030785, 2823611, 2699966, 2980425, 2662531, 2453461, 2420221, 2591326, 2410505, 2105773, 2045580, 2207331, 2432604, 2214769, 2050058, 2058846, 2156276, 2182448, 2109664, 2091476, 2271616, 2280574, 2129058, 2327780, 2293872, 2232784, 2220329, 1932891, 1822645, 1870772, 1952223, 1833608, 1732042, 1757246, 2012162, 1852614, 1687208, 1797746, 1857892, 1787069, 1908666, 1899739, 1895494, 1845827, 1685136, 1571817, 1842822, 1737813, 1594307, 1663141, 1363459, 1604990, 1489150, 1603144, 1853075, 1690897, 1365162, 1569346, 1746652, 1725755, 1744027, 1586569, 1661983, 1705104, 1605703, 1696133, 1811886, 1740727, 1911222, 1936528, 1803313, 1461288, 1687608, 1873558, 1864854, 1673796, 1709683]
2844A709683j46611l331j1256J98574j23954K02782j2419m43837N5037K49380
2834A674048k0644n5694j31804J30823j35617Q2938P6529j50549J77558k50964
2824A396624k0474L70845J56189j20718Q3962K68982j13967j01536n3502O8514
2814A934919J97355K97441r4782k54953L6087q2455J70156k4743K90698J21733
2804B591456J7863m22401l65639J82820J56661M5162R4839k03749P1989l97495
2794A771506k66294J66971R6463j35639L9670j97208r7034j08130J8138J27841
2784A416284n4754j40599M1611L7520M58691q887k79909K34369l9207j85803n3896
2773A425420k1820m5292k9717N4703j82760j19236J19570K40099j16278j57823
$$ y = [1709683, 1563072, 1559741, 1548485, 1747059, 1623105, 1825887, 1813468, 1369631, 1424668, 1674048, 1653404, 1597710, 1465906, 1596729, 1461112, 1544050, 1620579, 1470030, 1647588, 1396624, 1376150, 1746995, 1903184, 1782466, 1866428, 2135410, 2021443, 1919907, 1866405, 1934919, 2132274, 2429715, 2334933, 2079980, 2116067, 2033612, 2203768, 2179025, 2469723, 2591456, 2609319, 2186918, 1821279, 2004099, 2160760, 2205922, 2300761, 2097012, 2169001, 1771506, 1505212, 1672183, 1768646, 1633007, 1672677, 1475469, 1378435, 1270305, 1288443, 1416284, 1361530, 1220931, 1262542, 1300062, 1758753, 1749866, 1469957, 1704326, 1665119, 1479316, 1425420, 1403600, 1358308, 1328591, 1383294, 1200534, 1081298, 1200868, 1440967, 1324689, 1166866]
2763A166866r7995K8796j05272M48526q2592j75621K60314Q9802j30389k09554
2753A192881N4958j25431K03101m6957J7775j71519n302L80468l7602j05703j7474
2742A339195j42134J92783p3072j60803N3799K19629k56091k6753J8307j9607
2732A145253O431j55067K9558J1880q683j21711J40669k2274L05453R2184l20544
2721A103149N4721J19464j77100j93298J52384J97502J7050k10901k5505J77924
2711A215390P0376m39345m7265K5872K01645p5380R4900Q4220l56262k8832Q099
2700G53418m840J29611p5005J2592l0162n5796J25343O0465l48915K12031J91498
2689I70240N6104r5744j1901j68575K39244p9515k15769K95491j73027l44179
$$ y = [1166866, 1068871, 1097667, 992395, 1440921, 1358329, 1182708, 1443022, 1532824, 1402435, 1192881, 1247839, 1122408, 1325509, 1278552, 1296327, 1124808, 1119506, 1499974, 1462372, 1356669, 1339195, 1197061, 1389844, 1316772, 1155969, 1209768, 1429397, 1173306, 1146553, 1164860, 1145253, 1151684, 996617, 1026175, 1038055, 1029372, 907661, 1048330, 1026056, 1331509, 1423693, 1103149, 1157870, 1277334, 1100234, 906936, 1059320, 1256822, 1273872, 1062971, 1037466, 1215390, 1285766, 846421, 799156, 825028, 1026673, 951293, 1046193, 1130413, 774151, 745319, 753418, 748578, 878189, 803184, 815776, 785614, 729818, 855161, 915626, 566711, 778742, 970240, 1026344, 930600, 918699, 750124, 989368, 909853, 694084, 989575, 816548, 472369]
2679D72369J29500K23999O0855M8663k06338M0345O509K11374R2627K8342j59499
2668I48746m6800J29637J2423m578M0015M2126M879l9625K3696j36628o1888k4203
2656H87800j7582l0905J5800Q0343q0405J87426m7744r3316j7188Q3052J63954
2645A131235l41232j51447O3361K67503Q6138k26453R358Q5931j81736m0478L3703
2634G35883K36786k9582k5374p5592K20884m1823j57512k6058P7110M9929k42988
2623G21663j90691P1515L39292j40912L05009j18486l09488J46440J63496K1116
2613A008954m8981k49459j09J85900o3542p2656Q6563l1496J83573n5056n143
2602I38548L13767O4321l3873R1191j44504M781Q1133K51796l8288R1834P26404
$$ y = [472369, 601869, 825868, 886723, 935386, 729048, 769393, 775902, 987276, 1079903, 1108245, 948746, 901946, 1031583, 1044006, 1039428, 1079443, 1121569, 1126448, 1086823, 1110519, 973891, 912003, 887800, 870218, 839313, 855113, 935456, 855051, 1042477, 994733, 901417, 884229, 967281, 1131235, 790003, 638556, 701917, 969420, 1055558, 829105, 838463, 924394, 742658, 702180, 735883, 972669, 943087, 917713, 842121, 1063005, 1021182, 863670, 837612, 914722, 964651, 721663, 530972, 602487, 941779, 800867, 1105876, 987390, 677902, 824342, 987838, 1008954, 959973, 710514, 710405, 896305, 832763, 760107, 846670, 815174, 998747, 943691, 938548, 1252315, 1316636, 1282763, 1373954, 1229450, 1234231, 1315364, 1567160, 1528872, 1620706, 2347110]
2591B347110K62642L36649K05696l5473l84223p8608l67168l80327k18771l12036
2581A375491j65438j17824p5149L93568j23459j0515j68274O6075K428j99976
2571I76927J43788k18384j20434J21627K86453L4103k54299j34597j56012J71199
2561H50371J39373L2828m2354m9745R2417k16936j32462J54627J57639J69312
2551A155070j12267j31819p1890k78286J11946M0736J19007L8009k5593M0439
2541H85352p6518n0899j05903J33555j21276J44351J1323l36165L8578L72127
2531H94525P3902j63034J60668l421K63275j43174j53173L08538l6032j97913
2521A004161j6187n1619J88692j0945j15879m64788k45563K08253K38315o0435
$$ y = [2347110, 2609752, 2946401, 3152097, 3116624, 2732401, 2653793, 2286625, 1906298, 1687527, 1375491, 1210053, 1092229, 1017080, 1410648, 1287189, 1276674, 1108400, 1174475, 1176903, 976927, 1120715, 902331, 781897, 903524, 1189977, 1224080, 969781, 835184, 679172, 850371, 989744, 1022572, 980218, 930473, 1022890, 805954, 673492, 828119, 985758, 1155070, 1042803, 910984, 839094, 560808, 672754, 713490, 832497, 870506, 844913, 885352, 808834, 757935, 652032, 785587, 664311, 808662, 819985, 483820, 522398, 894525, 968427, 805393, 966061, 962640, 1225915, 1082741, 929568, 1238106, 1202074, 1004161, 987974, 936355, 1125047, 1114102, 998223, 533435, 287872, 496125, 734440, 674005]
2511F74005R4505j49202Q919K90983Q7222q4685k84253j53658J26222R0322l1619
2500F68761K78647P9297r8181J81855L80K9429J91253J53123q7235k36716k88946
2489H71667j78207J02624J57766N1630j35814P5667j6049r5177o4411J26083J21956
2478A017735J01902O9407o9833r5355J45539K49500l749N4648q0353j22588K37837
2467A504690R9411k39113l27855K7785N4430n0821J35042p738P2021r3393M8311
2456A222770K57356L60280m92944R4518M44751k4819j99784K9367K05547l98125
2446A498917N442L6821M9409r0111J18820J37057j59339N8523Q2521l258P7489
2435A812291j26519L6650Q8009o1536J67568j59496j14743j02200q3093M05265
$$ y = [674005, 768510, 619308, 628227, 919210, 1006432, 921747, 637494, 483836, 610058, 700380, 668761, 947408, 1026705, 928524, 1110379, 1110759, 1140188, 1331441, 1484564, 1397329, 1160613, 871667, 693460, 796084, 953850, 1005480, 869666, 945333, 929284, 834107, 769696, 895779, 1017735, 1119637, 1189044, 1119211, 1023856, 1169395, 1418895, 1415146, 1469794, 1389441, 1266853, 1504690, 1604101, 1364988, 1037133, 1064918, 1119348, 1068527, 1203569, 1195831, 1267852, 1174459, 1222770, 1480126, 1840406, 1347462, 1441980, 1886731, 1861912, 1662128, 1691495, 1897042, 1498917, 1504359, 1541180, 1590589, 1500478, 1619298, 1756355, 1597016, 1655539, 1738060, 1734802, 1812291, 1685772, 1722422, 1810431, 1748895, 1916463, 1756967, 1642224, 1540024, 1456931, 1862196]
2425A862196R7094O0795R8493j20157K25513J15699q0221j3732m30795j43099
2415A671786k62895K03967k5961J20102P8719j12268L23578J64702N559O6432
2405B233721j18979J78409k5493j61626K67696p8068j57868j30182N8210M77365
2395B543185R9556k34644r7189K84940M1855m40698Q2505K5747M07504J99084
2385B911845J18249j9494P4558O8816O622J66264p5836M09369J07295J39007K77260
2374D183955M22174P0343j05836L54475K19345j763j56081J74470j56242J16201
2364E121041K36058L1516j01858K83406J94715k02618L99736M58343M95166L58552
2354G274057M21732M54960K48121R5409J45310K00741N52547P04181R51361J187213
$$ y = [1862196, 1959290, 2020085, 2118578, 1998421, 2223934, 2339633, 2259412, 2245680, 1814885, 1671786, 1408891, 1612858, 1586897, 1706999, 1785718, 1673450, 1997028, 2161730, 2167289, 2233721, 2114742, 2293151, 2267658, 2106032, 2373728, 2295660, 2137792, 2007610, 2065820, 2543185, 2642741, 2408097, 2310908, 2595848, 2637703, 2197005, 2279510, 2305257, 2712761, 2911845, 3030094, 3010600, 3085158, 3153974, 3160596, 3326860, 3251024, 3660393, 3767688, 3906695, 4183955, 4606129, 4676472, 4570636, 4925111, 5144456, 5142693, 4986612, 5161082, 5004840, 5121041, 5357099, 5388615, 5286757, 5570163, 5764878, 5562260, 5961996, 6420339, 6915505, 7274057, 7695789, 8150749, 8398870, 8494279, 8639589, 8840330, 9392877, 10097058, 11048419, 12235632]
2344A2235632J141569J750459K639755L548083M126606M621237L651751J974748
2336C5689840L46492M83723J388023K400152L599038O225459R251529J4045626
2328G3429882K1767108M1816472P5685200J04264039J00565511O1578529l118194
2321D75988547o3693518p5384741o9422375o2117034m8283557l5780879k5098177
2314I6208266j7893548j2184353q846754n029544k633426k203840k294792l003736
2306D2118273l533393l263483k975618k667745k463345j780146j544419j313460
2298B2576664j024220r48340j122067q61831r42808j165446p21266l79751k91634
2289A5119301l28446m31264n72834n25721l29994m08840n62576l86943k19374
$$ y = [12235632, 13377201, 15127660, 17767415, 21315498, 25442104, 30063341, 33715092, 35689840, 36036332, 36520055, 37908078, 40308230, 43907268, 50132727, 59384256, 73429882, 95196990, 137013462, 212698662, 316962701, 417528212, 479106741, 475988547, 412295029, 336910288, 267487913, 205370879, 157087322, 121306443, 96208266, 78314718, 66130365, 57283611, 52254067, 49620641, 47416801, 45122009, 42118273, 38584880, 35321397, 32345779, 29678034, 27214689, 25434543, 23890124, 22576664, 21552444, 20604104, 19482037, 18620206, 17677398, 16511952, 15790686, 15410935, 15119301, 14790855, 14359591, 13786757, 13261036, 12931042, 12522202, 11959626, 11572683, 11353309]
2280A1353309n45320n0585l31454m04628n24223p04500j27197k44923L6234k13862
2270H242851j86176m23731l54810R9019K53360j42749p43680q2598O6117N0594
2260F778197m22216o9273M1503l08846J44082j73729j16282l86748j04973k9977
2250E351738p8416m923k37844j6580j02436j81117L7147k02144J35813m8844m64464
2239D187930j08824p1029k29970J47906N166K34507j0365n9233j89194j53265
2229C753629l49987O8696k62693l718J78067k20675k112r0712j10445j13631P3877
2218B920296j77718j33221L7913O5877q7467J25800k1959n4175k91228L9390j07835
2207B315673j82695J26206L52244j35853J45214j81782k21651m9930n9914N5600
$$ y = [11353309, 10807989, 10757404, 10425950, 10021322, 9497099, 8792599, 8665402, 8420479, 8456713, 8242851, 8056675, 7632944, 7278134, 7377153, 7630513, 7487764, 6744084, 6661486, 6727603, 6778197, 6355981, 6286708, 6328211, 6019365, 6163447, 5989718, 5873436, 5486688, 5381715, 5351738, 5273322, 5268399, 5030555, 5013975, 4911539, 4730422, 4767569, 4565425, 4701238, 4652394, 4187930, 4079106, 4008077, 3778107, 3926013, 3931179, 4165686, 4155321, 4096088, 3906894, 3753629, 3403642, 3472338, 3209645, 3205927, 3383994, 3163319, 3161207, 3070495, 2960050, 2846419, 2920296, 2742578, 2609357, 2647270, 2713147, 2625680, 2751480, 2729521, 2675346, 2384118, 2423508, 2315673, 2132978, 2259184, 2611428, 2475575, 2620789, 2439007, 2217356, 2167426, 2107512, 2163112]
2197B163112N206p5777j6900l7619l3534j85715j41308J13991k8432j23069m3238
2186A596717M20551J26288M8843J46815r9782k17512k19958j6266j11640J21411
2176A795467k55100l44275L05809K5172K561k79381J14311l0292j4175K88065
2166A608162j46434k65516m2652K84261K49569J01090R3702J29190k89475k05654
2156A516243N7570k56157j37533R9523k6966K66280j96457p5872r0626J9578J49979
2145A325562N6947K1321j47397J39406l2300r4771j89618j4640K90839M5935n7183
2134A344101P5980j40313l1378N5972j37915k61884O3422K25673j41148J25925
2124A178435k03216k3005J12289j51007K5456O4669K9525k11578K49772N2253
$$ y = [2163112, 2168318, 2092541, 2075641, 2038022, 2004488, 1818773, 1677465, 1791456, 1763024, 1639955, 1596717, 2017268, 2143556, 2192399, 2339214, 2239432, 2021920, 1801962, 1785696, 1674056, 1795467, 1540367, 1196092, 1501901, 1527073, 1529634, 1250253, 1364564, 1334272, 1320097, 1608162, 1461728, 1196212, 1153560, 1437821, 1687390, 1788480, 1882182, 2011372, 1721897, 1516243, 1573813, 1317656, 1180123, 1279646, 1252680, 1518960, 1322503, 1246631, 1156005, 1175583, 1325562, 1382509, 1403830, 1256433, 1395839, 1363539, 1268768, 1079150, 1064510, 1355349, 1401284, 1344101, 1420081, 1279768, 1248390, 1304362, 1166447, 904563, 967985, 1193658, 1052510, 1178435, 975219, 952214, 1064503, 913496, 938952, 1003621, 1033146, 821568, 1071340, 1123593]
2114A123593J16695R780q5274L4533j78329Q2591K23474j61922J88658J30046
2104A483845j38559n1936p0658L3396m9753j48952R1954J72240l4338J17150P2655
2093A477044k10141O9640j693q8276n9990j40348J95911l9612k29942m2798J96757
2082A126552k20268m8977Q7969L0939J59393J6794J45580j42353j68614j19072
2072H67943K40524J12125o7762p2100j87570p7629L83776L3540q4577k9075J20354
2061A239549K58837P4188k09805k42610M87312P56094M15671O9193Q024j53702
2051B702751j35744J3565p7617m11545l69340j03281j63722k1772k30334j36964
2041A065997K9016j40706P5011k6915m4566K77487J52239m44331j62277Q1099
$$ y = [1123593, 1240288, 1250068, 1164794, 1199327, 1020998, 1103589, 1327063, 1165141, 1353799, 1483845, 1345286, 1293350, 1222692, 1256088, 1206335, 1057383, 1149337, 1321577, 1287239, 1404389, 1477044, 1266903, 1336543, 1334850, 1246574, 1186584, 1046236, 1242147, 1202535, 972593, 929795, 1126552, 906284, 857307, 945276, 976215, 1135608, 1152402, 1297982, 1155629, 987015, 867943, 1108467, 1220592, 1152830, 1080730, 893160, 815531, 1199307, 1232847, 1148270, 1119195, 1239549, 1498386, 1572574, 1362769, 1120159, 1607471, 2363565, 2779236, 2848429, 2856453, 2702751, 2567007, 2580572, 2502955, 2091410, 1722070, 1618789, 1455067, 1433295, 1202961, 1065997, 1095013, 954307, 1029318, 1002403, 957837, 1235324, 1387563, 943232, 780955, 862054]
2031H62054K79262l49584r3152R2209l87714J40602K45619J90153j6010j57930
2021H05509M60659J13979l25678k14792o6778Q3810l792P683M013K29946l30529
2010G64030J42353K8451q2771L92947o1881m69259N7513K13137p1180M1259r5873
1999H58726k58876J92240J30026l23666K49174Q6322j72177l3059k7350l66782
1989C34578L18758k7139K54011j41342k70713L21894R3437n5690j23027R0670
1979G95437j53362r9764P2540j44475R1209R1185j11071k1048j89944K6966J34867
1968D92540K41194j81378k03768O8375J21602Q3529j14918J50527p3532R6337
1958F80508Q3598J12810j9707k72378O2659j1329J34613l3242k6101J55533J33161
$$ y = [862054, 1141316, 791732, 698580, 790789, 403075, 543677, 789296, 979449, 963439, 805509, 1266168, 1380147, 1054469, 839677, 772899, 856709, 852917, 860600, 864613, 1094559, 764030, 906383, 934834, 852063, 1245010, 1183129, 713870, 771383, 984520, 913340, 954599, 858726, 599850, 792090, 922116, 598450, 847624, 933946, 761769, 728710, 701360, 334578, 653336, 626197, 880208, 738866, 468153, 790047, 883484, 827794, 704767, 795437, 642075, 542311, 614851, 470376, 561585, 652770, 541699, 520651, 330707, 357673, 492540, 733734, 552356, 348588, 416963, 538565, 622094, 507176, 657703, 584171, 680508, 764106, 876916, 857209, 584831, 647490, 636161, 770774, 737532, 711431, 866964, 1000125]
1947A000125j66214R4000o7489k38479n9299K908m8661J33425K93287j51889P1375
1936H63089n5706N6914l8276k0312L8826m3337n980j01308P2665j47705j8499
1925F00371J6724J81491R878l22532j5209J82344K1485N3774j0188O0132j43795
1914F34475j02807J04745O3545o893q5274l5753N5761m4817O4655O1794J21180
1903H30611o5354r5141J39336k10711k80486K74280j33660N0689j81150q5997
1893B42417R4339J69610k6885k3029Q184K7458J5446m607J45316j13653J39636
1882F74232r1459j6948K05638P0134k01014k14116k7599K24945n0410J70878J69080
1871I13361j94045k08134l7349J28769j96848k36334L18517m6035K35156j44824
$$ y = [1000125, 833911, 927911, 860422, 621943, 562644, 565552, 516891, 650316, 943603, 791714, 863089, 807383, 864297, 826021, 805709, 844535, 801198, 795218, 693910, 766575, 618870, 600371, 617095, 798586, 808464, 485932, 470723, 653067, 674552, 728326, 718138, 778270, 634475, 531668, 636413, 699958, 693065, 607791, 572038, 627799, 582982, 647637, 709431, 830611, 765257, 670116, 809452, 598741, 318255, 592535, 458875, 509564, 328414, 242417, 336756, 506366, 479481, 456452, 464636, 492094, 507540, 502933, 648249, 534596, 674232, 582773, 565825, 771463, 841597, 640583, 426467, 398868, 623813, 573403, 744281, 913361, 719316, 511182, 473833, 602602, 405754, 169420, 487937, 441902, 677058, 532234]
1861E32234k13277J73210r0790J71298J19961j61307K11211R7447j80697Q1119
1851G40409l8288j64256J07129j85067J55002l36401R8415L99309K49059j70171
1841H55140l36491N9107J70924j07263l43289K78364K79691j22060l02159j59009
1831B72955J47048k6032k19833J90891J72731j18102l2236J91937N5565J479J08362
1820G44765n0397j18415J1128j52476j34323J10398K36220K09866M9085m52498
1810D53353l6509K57555j37888j14642r6027J43892J95203l6855M5509J44675
1800H18266l2976m0008j29343k61319M4440J25487K33786k92805k0628K83931
1790G28831K4596m87066J44334L12989j89698l18591O7263r1899J8888J18897
$$ y = [532234, 318957, 492167, 401377, 572675, 692636, 531329, 742540, 839987, 659290, 740409, 702121, 537865, 644994, 459927, 614929, 278528, 376943, 776252, 1025311, 855140, 518649, 577756, 748680, 641417, 298128, 576492, 856183, 734123, 431964, 272955, 420003, 393971, 174138, 365029, 537760, 419658, 387422, 579359, 634924, 636403, 744765, 694368, 575953, 587081, 434605, 300282, 410680, 646900, 856766, 905851, 453353, 416844, 674399, 536511, 421869, 325842, 469734, 664937, 628082, 673591, 818266, 785290, 745282, 615939, 354620, 399060, 524547, 758333, 465528, 444900, 728831, 753427, 266361, 410695, 723684, 533986, 215395, 282658, 190759, 209647, 328544]
1780C28544K25557J6889r4302Q5633j72536J21016k4005j45391N2685J80511k53141
1769C21460m8943J44839j09159O7538J3289n908J23424P4904l9225J02192L5293
1758F79704l596p2258k77224j45294J0784O7247J74529j4039J5642k10624K07846
1747D32717k5150k5455J02371N9077l64289J03260k13467K9883P5162K42921K31670
1736F48700k29569p5946P9247K48478j93810j25631m9344L33593j73227J13830
1726E76321J46473J65292k83989J4928r5137j83750J58415N4274j52295q1589
1716C18943K94861k7879l85801K44004J95000L1132k24107K6233K0420J59114
1706F51920j66294j65442J944K39402o4637P8858K38480k42710l88817P2398K32056
$$ y = [328544, 554101, 570990, 476688, 562321, 389785, 510801, 486796, 341405, 394090, 574601, 321460, 272517, 417356, 308197, 375735, 389024, 383116, 506540, 581444, 542219, 644411, 679704, 676108, 603850, 326626, 181332, 192116, 259363, 433892, 419853, 435495, 224871, 432717, 407567, 382112, 484483, 543560, 179271, 282531, 69064, 98947, 174109, 417030, 648700, 419131, 343185, 422432, 670910, 477100, 351469, 302125, 635718, 462491, 576321, 722794, 888086, 604097, 619025, 523888, 340138, 498553, 552827, 400532, 318943, 613804, 585925, 200124, 444128, 639128, 670260, 446153, 472386, 492806, 651920, 485626, 320184, 322128, 561530, 496893, 575751, 814231, 571521, 182704, 255102, 487158]
1695D87158j17921o7405K70921j40213j9358J74733J64950P3183r5445j31695
1685E98908k00752K3459J35805J07406l11158R9756j5170J21494L01819j03181
1675G58386j53606J73908k29672m28765M2353J52122L70245k46195j64745p6564
1665A97467L37101q2903j38658m584j48384J68998L21808m0648l41604M47j10884
1654A58156j5244k2799Q9430M986L17403K15010j85633k234K62605r1194j55023
1643E75463N0312j61328J0855J28409Q8335l22059q6993J84079O1351M5176j83391
1632C90209P9751j32645n9550m2339L04650J75956j93629N1531K7640k41900M67179
1621H26853k72897l19542J45466J41801l04381L5506K36992J04M6889k51032o9552
$$ y = [487158, 369237, 301832, 572753, 432540, 413182, 587915, 752865, 826048, 730603, 598908, 398156, 421615, 557420, 664826, 353668, 453424, 438254, 559748, 861567, 758386, 604780, 778688, 549016, 120251, 162604, 314726, 684971, 438776, 274031, 197467, 534568, 451665, 313007, 308423, 160039, 329037, 650845, 610197, 268593, 269040, 158156, 142912, 120113, 209543, 214529, 531932, 746942, 561309, 559075, 821680, 730486, 575463, 625775, 464447, 475302, 603711, 692046, 369987, 282994, 467073, 528424, 573600, 390209, 469960, 337315, 277765, 235426, 540076, 716032, 522403, 573934, 601574, 359674, 826853, 553956, 234414, 379880, 521681, 217300, 252806, 489798, 489902, 536791, 285759, 216207]
1610B16207K70165O7748J90623j34724K6775r5090k62656j26076R92P5666J87495
1599D17125r2185n9486j28556q3479N88904L4044j01783M7073N6396k12015N9730
1588E25768J42482j14217k34525q4297j2207j75841J16660j34066J712L03622
1578C35091J45073q7214l1808J74599L1510Q6536K18012k09736r4365M8172k7457
1567E88413k04487l2326Q8131O2450k04567K70031R7599l30235j48046J75416
1557C62379K59847J81914J20000J2856j87428k75388K65804R4020k14867j68356
1547D50781J43352J1367j62897n2425Q4151M2517j39503J50077J17002k90304
1537C54118K84558l0462N4757L4356K49657k55910j30670N2979j96954K8113n6819
$$ y = [216207, 486372, 554120, 744743, 610019, 636794, 541704, 279048, 152972, 153964, 229630, 417125, 324940, 265454, 136898, 53419, 642323, 676367, 574584, 621657, 678053, 466038, 525768, 668250, 554033, 319508, 235211, 223004, 47163, 163823, 29757, 31469, 335091, 480164, 392950, 361142, 535741, 567251, 653787, 871799, 662063, 567698, 615870, 588413, 383926, 351600, 439731, 502181, 297614, 567645, 665244, 335009, 186963, 362379, 622226, 804140, 924140, 936996, 749568, 474180, 739984, 834004, 619137, 450781, 594133, 605500, 442603, 390178, 474329, 516846, 377343, 527420, 644422, 354118, 638676, 608214, 662971, 697327, 946984, 691074, 560404, 613383, 416429, 444542, 387723]
1526C87723k81027R3438k8230L59915J13266j94470L0744j07661K9290K61037
1516F64025n3159K0450j3513P7579j95450k12893l3039K00483K3337P1042O2557
1505F11419J8J22505o7316j74396O1868j4559M2797J20595k8253k90202j14821
1494B69655R149j02990J17998o5125J80767K47297K43253l07730o4128J72692
1484G00838K9462j68049j78466M0296Q4776j33390k19772K54108J41384m3597
1474E07590k7013O1313j30471j51158L5971J58794j5240Q7046k25705L6777K75950
1463F13854j01278r1036j19686L3620l3890o0645Q8503K41815p7357J47674k87486
1452C54088J24389L2626k94429l2057L04015M6604K29771o7994j47640l32427
$$ y = [387723, 106696, 200134, 171904, 531819, 645085, 450615, 481359, 373698, 402988, 664025, 610866, 631316, 617803, 695382, 499932, 287039, 254000, 454483, 477820, 548862, 611419, 611437, 733942, 666626, 492230, 554098, 539539, 582336, 702931, 674678, 384476, 269655, 278804, 175814, 293812, 228687, 409454, 656751, 900004, 592274, 528146, 700838, 730300, 562251, 383785, 424081, 508857, 375467, 155695, 409803, 551187, 507590, 480577, 541890, 411419, 260261, 296232, 455026, 439786, 526832, 301127, 337904, 613854, 512576, 421540, 301854, 335474, 301584, 240939, 329442, 571257, 493900, 641574, 354088, 478477, 511103, 216674, 184617, 488632, 535236, 765007, 697013, 549373, 216946]
1442B16946K29157J12762o9002m7674l38768Q0400Q9393K01980l10515j96009
1432c1330K4057L00463J28224J54530j43634r0209L40928p8505Q3064j25731j86719
1421C75138L60274l37014j01189N1422m3851J64531K5669Q8288j26485m2069q2052
1410C32662K99794j15182r3443J5079r2634r9762J6821L8193J86246J17153l2168
1399E72759J67655j57985m5270J1741j55423o0777n8766J54771O7431m5390o0235
1388C90511l1291j27002n5782L44142K0023l376P3488K6924j68978j87123q6177
1377A95359K73293J20153k1951p159M3032l19317k4269Q2629q3897K87595o568
1366E38900j07698n7042K48106m3458j78517k53352J72055k33937j93635J42752
$$ y = [216946, 446103, 558865, 489863, 442189, 103421, 183821, 273214, 475194, 164679, -31330, -7273, 293190, 421414, 575944, 432310, 342101, 683029, 604524, 687588, 561857, 375138, 735412, 398398, 297209, 348631, 304780, 469311, 494980, 583268, 456783, 414714, 332662, 632456, 517274, 423831, 438910, 346276, 246514, 263335, 301528, 487774, 604927, 572759, 740414, 582429, 537159, 548900, 393477, 332700, 273934, 428705, 496136, 450746, 390511, 359220, 232218, 176436, 520578, 540601, 537225, 610713, 637637, 468659, 281536, 195359, 468652, 588805, 566854, 559695, 602727, 283410, 259141, 341770, 257873, 545468, 538900, 431202, 374160, 622266, 578808, 400291, 146939, 318994, 85057, -108578, 34174]
1356C4174J75558R7422L5203n5239k37334P9331J43052J46990K28343k35715j845
1345D09940q8660k47924J13866J89353p3512M8573K01527p8331j46970j47957
1335A79905K55985J42123L6556O0106j95867o9779q5217p7637r0427J67786O8179
1324C91713k5041J35642q6153j11705j01713K59787l38311K62411J32580p5587
1314D43623k48103J01871L66264k8j03683m037l61682K52474K13581k58659j50619
1303B51002J78821J01932k27983R7479J6766J87291L0080q4575j14763r6055N7422
1292C97417J06233J49178k85161K93418K18567j15191j41963m32372j03895J85334
1282B71565O0777J61935K9749j71508p2738k03966Q7802l7929J32669j31753O812
$$ y = [34174, 209732, 307154, 342357, 287118, 49784, 129115, 272167, 419157, 647500, 411785, 409940, 321280, 73356, 187222, 376575, 303063, 351636, 553163, 474832, 327862, 179905, 435890, 578013, 614569, 674675, 478808, 409029, 323812, 246175, 155748, 323534, 391713, 366672, 502314, 416161, 304456, 202743, 462530, 124219, 386630, 519210, 443623, 195520, 297391, 663655, 663627, 559944, 555907, 194225, 446699, 660280, 401621, 251002, 429823, 531755, 303772, 401251, 418017, 605308, 635388, 550813, 436050, 339995, 397417, 503650, 652828, 367667, 661085, 879652, 764461, 622498, 190126, 86231, 271565, 332342, 494277, 524026, 352518, 279780, 75814, 163616, 125687, 258356, 126603, 133415]
1271A33415J21911r8854R6016j30244l0669J12722M1934M1919N064K34573L8975
1260E66762l9452o2784j30525R8781P048j19014O0917K47615L35760l03151m06279
1249B55678J67295q4488R3048K67399j66770j26719j0199K6750Q1981J86000j30458
1238E59517j07843q4416k2194j5704j16905N9829n7900K43598j37592M0689J5102
1227C76181J11723K0761K9106n8643P1753r4210n45397L31638K49894m7170J5745
1216D61381Q8665j17408J68585m8842k40962p8174k4775J43129j0787p5504o6817
1205A98491R3107N0091J39706j66884k4528K75629K51365l2494k92903j83996
1195C07584O0082N5359J13109N3004j77002j18671J22670R3200m19896J34470
$$ y = [133415, 255326, 156472, 252488, 122244, 91575, 204297, 246231, 288150, 293214, 527787, 566762, 527310, 464526, 334001, 432782, 439830, 320816, 381733, 629348, 965108, 661957, 255678, 422973, 338485, 431533, 698932, 532162, 405443, 395244, 421994, 503975, 689975, 559517, 451674, 367258, 345064, 329360, 212455, 272284, 214384, 457982, 320390, 361079, 376181, 487904, 508665, 537771, 479128, 550881, 456671, -88726, 242912, 492806, 445636, 461381, 550046, 432638, 601223, 552381, 311419, 233245, 208470, 351599, 340812, 265308, 198491, 291598, 341689, 481395, 314511, 289983, 565612, 816977, 784483, 491580, 307584, 367666, 423025, 536134, 589138, 412136, 293465, 416135, 509335, 89439, 223909]
1185B23909J00122N7466n7554M1002K27365k32265k07454j34072O56J82459k42031
1174d0397J46885K01784O9962l4207j09196r4672J4795q3846L82998l94991J70892
1163B30007J69120j6531K46024J22081j9254k53042L1306N5468M4986P4900k71879
1152D13186j26808J42011o3054J85682K5181j94587r1451K10625l37361P6620
1142B40044L18199j50672j62416n3346j11338J47318j13778Q5029K68653K31983
1132F99676j88272l23025J44100M1494j11589M221J89874n1790k51295m9137O1510
1121A65767K42658k8999L9598R2977k69043N6785l88155R5282K47228J13560K92082
1110F59740l76729J79332j28604j82642K60792M9712M6945j85087K8176l2048
$$ y = [223909, 324031, 381497, 323943, 364945, 592310, 360045, 152591, 18519, 19175, 201634, -40397, 106488, 308272, 378234, 344027, 234831, 140159, 154954, 71108, 454106, 59115, 230007, 399127, 382596, 628620, 750701, 731447, 478405, 509711, 565179, 610165, 685065, 413186, 286378, 428389, 365335, 551017, 576198, 381611, 290160, 500785, 163424, 240044, 558243, 407571, 245155, 191809, 80471, 227789, 114011, 199040, 467693, 699676, 511404, 188379, 332479, 373973, 262384, 266605, 456479, 404689, 153394, 104257, 165767, 408425, 379426, 419024, 512001, 242958, 299743, -88412, 6870, 254098, 367658, 659740, 283011, 462343, 333739, 151097, 411889, 461601, 508546, 323459, 351635, 319587]
1100C19587K8344m2540k1563J87148J32440O0114p5539n6667j80040m3877N9174
1089C66581J57519q9321l0869J06837L49829j83735O8525o1395j82006P336k60190
1078B49111l09818o2184M47093M28947j70926k54424J33348l22266l5984R0454
1068A93351j29107j31054m0624K33428M362Q0123l751J58394p8471j97819J99230
1057B88062J24603n8097l9883j6858n0120K38521O8770l76627m5159J49930Q1362
1046C64504j57767j58521J43433J61684j0620p4481q0118m7072R2477M6934K75942
1035E56395j333n1656r1076r8991P3669j71266O3372j618n468J04530J58060j15984
1023D18634J61889K2404r5556k49473j48502L1309J29985m1750K23049J55553
$$ y = [319587, 347931, 305391, 283828, 470976, 603416, 663530, 587991, 531324, 351284, 307407, 366581, 524100, 434779, 403910, 510747, 860576, 676841, 745366, 683971, 501965, 509301, 249111, -60707, -122891, 324202, 753149, 582223, 327799, 461147, 138881, 102897, 193351, 64244, -66810, -107434, 125994, 130356, 210479, 206728, 365122, 286651, 88832, 288062, 412665, 354568, 314685, 297827, 247707, 486228, 554998, 178371, 133212, 283142, 364504, 206737, 48216, 191649, 353333, 342713, 268232, 188114, 141042, 233519, 280453, 556395, 555062, 503406, 412330, 313339, 387008, 215742, 279114, 277496, 272028, 376558, 534618, 418634, 580523, 602927, 507371, 257898, 109396, 140705, 270690, 228940, 451989, 607542]
1013F07542k28182M1753l6472J89908j09640p3168j96418m5127j02181k8960J79501
1002A98556K26232m02305l5267K63406O2659j29759j31600J06936M5888J47099
992C51845L8381j48099j85678K02913j20340r8980L09883m875J58792O9273j28946
981D44169L2846M8466k08949j57384Q5105J10994j49704j50656P6990J70022J24351
970D26250P6844j22997j47864N0109o8131M2816J48812j19839q2376L13143K09825
959G26592n05415R4403J37713m78325Q2677J41484N7627l7524J09846r0969n1219
948A86890J85502p7856J94123K69822k47401P647k22276l04469p7065M11630K10933
937E37480J33921L8960l39388J39971k53231K26055r8028p1944J09870k5457o1811
$$ y = [607542, 379360, 421113, 384641, 574549, 464909, 391741, 195323, 150196, 48015, 19055, 198556, 424788, 22483, -12784, 250622, 313281, 183522, 51922, 158858, 204746, 351845, 390226, 242127, 56449, 259362, 139022, 40042, 349925, 345050, 503842, 573115, 444169, 477015, 525481, 316532, 159148, 244253, 355247, 205543, 54887, 131877, 301899, 426250, 503094, 380097, 232233, 282342, 214211, 257027, 405839, 286000, 203624, 516767, 726592, 221177, 315580, 453293, -25032, 57645, 199129, 256756, 219232, 329078, 238109, 186890, 372392, 294536, 488659, 758481, 511080, 518727, 296451, -8018, -85083, 326547, 537480, 671401, 710361, 370973, 510944, 257713, 483768, 385740, 313796, 423666, 398209, 336398]
926C36398k20198j24049N84635j16912j00763m5196p6957j3939k3915J804K02761
915D03669k49216k80910J80955O4229J12799R9228l08504k7590J26478R799K706
904A33643K74440J34064q6312O287k65178k5539L2015K4460J0412K6105k54243
893A0154J50534Q9936N7949m4919J24605K310J27071k37468q4402J78772j05961
882B68581l74110M5382K81254N9019l58061K96143J82835j7823l18605J5306K55370
871C35291r4369J350n3633j18725n431j8829J25022J57854J94072J90141k97917
860D14826k61319R2958N7205k13248J34118J69497j32623q7212Q3192q8960L98844
849E67278j63878j97384j40985k19743J79148J50535L37144r6426k02618r1206
$$ y = [336398, 116200, -7849, 576786, 459874, 359111, 313915, 236958, 223019, 199104, 200908, 403669, 154453, -126457, 54498, 118727, 231526, 330754, 22250, -5340, 121138, 130937, 133643, 408083, 542147, 455835, 462122, 196944, 171405, 203420, 227880, 238292, 264397, 10154, 160688, 250624, 308573, 263654, 388259, 390569, 517640, 280172, 195770, 374542, 268581, -105529, -60147, 221107, 280126, -77935, 218208, 401043, 383220, 64615, 79921, 335291, 240922, 242272, 188639, 69914, 64483, 45654, 170676, 328530, 522602, 712743, 414826, 153507, 246465, 303670, 90422, 224540, 394037, 261414, 174202, 257394, 168434, 567278, 403400, 206016, 65031, -154712, 24436, 174971, 512115, 415689, 213071, 121865]
839A21865k82462L41633K16843j89546J66038J42310M9531J1981m3553N6706j01399
828D89947l21943J41560K21892N7242j95072J9336J60253l43416J53351J0511
818C93661l75628N05015l4268l53146j49291M75679k60342k10756K68492J55487
808D14903n5855J1160Q8731l01610r1557K67129J15137j83889m5552M9229j3511
797B54315o5872J28045Q1275k4604J0153K27972l30282l45168K55235K86485n8299
786D19255j87525l9823K18438J96n8253q6017K24331l00714l23014K36681K37662
775C41217j34781M0971J41118J4781l9132K26633j56469j33031J48595j85081
765B64821r9063o6216J42349j76923O2819q7676j33785K47516J71477l1202J33700
$$ y = [121865, -160597, 181036, 397879, 208333, 374371, 516681, 566212, 578193, 534640, 591346, 489947, 168004, 309564, 531456, 588698, 393626, 412962, 573215, 229799, 383150, 393661, 18033, 523048, 488780, 135634, -13657, 462022, 201680, -9076, 259416, 414903, 359048, 370208, 458939, 157329, 65772, 332901, 448038, 264149, 218597, 267826, 254315, 188443, 316488, 397763, 373159, 383312, 611284, 281002, -64166, 191069, 477554, 419255, 231730, 191907, 410345, 410541, 352288, 266271, 490602, 189888, -133126, 103555, 341217, 206436, 247407, 388525, 403306, 364174, 590807, 434338, 301307, 449902, 264821, 165758, 99542, 241891, 64968, 127787, 40111, -93674, 153842, 325319, 294117, 427817]
754D27817N8852m5230J5830r9995j36797j52420P1567O3992Q16K31438j33942
743C01928k91246r3378k57670N3264L47723l4093k17620K30364J30138m7064q9020
732C3326J63676J04032J76325J05607m41440l98046K5316J50747L38801K12000
722D70344n2016O0825j71930k16800R8498j17713m5474j0542J87758K95l1085
711A72160n1253Q5979J35509L5651l74824J82538Q0015J0303p98O8589Q0527r3135
699C31261J9248Q5546J21959o342j24995k00592j50089J27603j25652R9889J65591
688C43427q3390P5599J82067K624m09192J46941l7829k56227l1528J61702K3912
677A18106J83413j19014J80171n0271L5052K53874l17868J19165R3693p3031K3479
$$ y = [427817, 486669, 441439, 457269, 357274, 220477, 68057, 139624, 203616, 204432, 435870, 301928, 10682, -82696, -340366, -287102, 60621, 26528, -191092, 39272, 169410, 122346, 33326, 197002, 301034, 477359, 582966, 141526, -256520, -231204, -80457, 258344, 470344, 418328, 479153, 307223, 90423, 188921, 71208, 25734, 15192, 202950, 203245, 172160, 120907, 206886, 342395, 378046, 3222, 185760, 265775, 276078, 275280, 343869, 424396, 331261, 350509, 436055, 558014, 551672, 426677, 226085, 75996, 203599, 77947, 177836, 343427, 260037, 335636, 517703, 520327, 111135, 258076, 220247, -35980, -67508, 94194, 118106, 301519, 182505, 362676, 312405, 347457, 601331, 283463, 402628, 496321, 423290, 446769]
666D46769r8892j28261r5542J24412J50130j15718o0709p8572M4265Q8442K1835
655B98159q0444k89510R1559O9245K3175k08095J27184J07967P8182k23951J21008
644A14479K22326j57452O489O1244J07953J6753j32111L9407k62081N8174J14017
633A89198K41830r2514r9053m4561k3704J32565j22140J64832n8220k07165R9854
622A80922l8857J31958J15447J25554j93651k40040M12515J17725j92795j49318
612B69460J118o8087r5303m5922J12634K67875l7657j94461j7871l4692l9282
601A17812J39460n9034J89016k9026j64448Q0223M6063K30341k20453l48274J20804
590A02484N9304n5535m9693j21673j36270K3054J28073K38838j54878P4555j01119
$$ y = [446769, 347877, 219616, 124074, 248486, 398616, 282898, 222189, 143617, 187882, 276324, 298159, 217715, -71795, 19764, 89009, 112184, -95911, 31273, 139240, 217422, -6529, 114479, 336805, 179353, 185842, 247086, 355039, 371792, 239681, 279088, 17007, 75181, 189198, 431028, 338514, 239461, 194900, 171196, 303761, 181621, 346453, 288233, 81068, 180922, 142065, 274023, 389470, 515024, 321373, 81333, 493848, 611573, 418778, 269460, 270578, 202491, 107188, 61266, 173900, 441775, 404118, 209657, 191786, 157094, 117812, 257272, 198238, 387254, 358228, 193780, 274003, 320066, 550407, 329954, -18320, 102484, 161788, 106253, 56560, -65113, -201383, -178329, -50256, 188582, 33704, 108259, 7140]
579G140j51676P0402M09102K35327r5560j59274j48159m976j6454r7084L6633
568H5421J20649k60089J43085K5891J66718m611L20376r6969n16256l13342J60953
557a68174K27642m1245j39456J63903J14983P2749r1548M7482N0346K19339k87195
546A68826K77184Q3138j11561m4194J04353K3412o8836p1363O3176k9675j24982
535B69478J12002q4915j22540R454J28091j23665j37655n3263K00237o9267j42
524A27815o9171p5135m7339K15617J76730J54905k62007K30946J39168k76575
514C14954j94052K4692R2018Q4129j67803J50361K3636K02875j08753k82388J29357
503B69026P6762m9685k12073K24013j19171Q2183l7956j7303o3757J79739k74456
$$ y = [7140, -144536, -74134, 334968, 570295, 474735, 315461, 167302, 162326, 145872, 48788, 85421, 206070, -54019, 89066, 114957, 281675, 277064, 597440, 500471, -15785, -329127, -168174, 59468, 18223, -121233, 42670, 157653, 230402, 138854, 186336, 236682, 456021, 168826, 446010, 529148, 417587, 373393, 477746, 501158, 432322, 360959, 424135, 394460, 269478, 381480, 296565, 174025, 183479, 311570, 187905, 50250, -3013, 197224, 127957, 127815, 58644, -16491, -63830, 151787, 328517, 483422, 221415, 452361, 591529, 314954, 120902, 145594, 237612, 321741, 153938, 304299, 327935, 530810, 422057, 139669, 269026, 345788, 296103, 84030, 308043, 188872, 271055, 233099, 215796, 152039, 331778, 57322]
492E7322l3402R8036K8762p8770l8901P8225l334K0164J18678k7998l3865L09648
480D94565K9223j27656j18023q5200J53293n0981k03021J62197Q1159m6321K02436
469D91671l3231L2854q0348J18223l3442k06787r9530J40359K07863l22800p918
458B06914o4123K5939m0196m4747J78834J3358l02929Q5461K239J08960m8404
447A21306j88422M1541J54900K68190j63488j50341M1276K42295P5447j46674
437B96030o0911o6027r124l8643N7445n9148p8562j52045M8994K38393L38863
426E15265R8657j22844j52709j54591j54932J87885j14578k2576q9847J3421k127
415A024J74450Q314n027j5837J23154J63997j70861K12732q3170J54092j17545
$$ y = [57322, 23920, 121956, 150718, 71948, 33047, 111272, 107938, 128102, 246780, 218782, 184917, 494565, 523788, 396132, 278109, 192909, 346202, 295221, 92200, 254397, 335556, 289235, 491671, 458440, 491294, 410946, 529169, 495727, 288940, 189410, 329769, 537632, 214832, 206914, 142791, 168730, 128534, 83787, 262621, 275979, -26950, 58511, 60750, 169710, 121306, -67116, -25575, 129325, 397515, 234027, 83686, 124962, 367257, 442704, 296030, 235119, 169092, 159968, 121325, 178770, 119622, 41060, -110985, -61991, 176402, 515265, 613922, 491078, 338369, 183778, 28846, 216731, 102153, 79577, -10270, 3151, 1024, 175474, 183788, 178761, 162924, 286078, 450075, 279214, 491946, 408776, 562868, 445323]
404D45323j94511J88397J42337m6787j26677L8242k9440l7944l02460K77253J3231
393C66964M4710q782j25412j01042J05868J7732j44567M9560Q3488o1269j82175
382D5075l9029N5536L55891K18057k09363r9727j04855K00444P7786k30877K2153
371B91091j57130P0963K29545K9599l43587j9655J13223J68426k93200o7570M08326
360D30031l4354j46107R3099r5560M4289j08144K2219N6503m8382P6518j71789
349A18323K04154k14278j9519J20920o5690L27210R9063j59603j94005P1575k43408
338D4742M7340J16377q2107q9487K6249K27938Q2760j55566j68184o1073K00472
327A89461J47286J83080p5698j4047j53051N0091o8806Q3279j02236l9183J66707
$$ y = [445323, 250812, 439209, 581546, 534759, 408082, 446324, 416884, 378940, 76480, 353733, 366964, 411674, 402892, 277480, 176438, 282306, 300038, 155471, 205031, 288519, 227250, 45075, 6046, 61582, 417473, 635530, 426167, 326440, 221585, 422029, 499815, 268938, 291091, 133961, 204924, 434469, 464068, 120481, 100826, 214049, 382475, 89275, 21705, 430031, 395677, 249570, 342669, 247109, 291398, 183254, 205473, 261976, 213594, 290112, 118323, 322477, 108199, 88680, 209600, 143910, 471120, 570183, 410580, 216575, 288150, 44742, 92082, 208459, 126352, 36865, 63114, 291052, 373812, 218246, 50062, -11011, 189461, 336747, 519827, 444129, 430082, 277031, 327122, 258316, 341595, 239359, 200176, 366883]
316C66883K2173j10695q2201K4504l4169p8705J07926p437j41858r9455J47774
305A14740r0408J111J52951K7626j80559j56934J47478J34556J64505K19899J35991
294F70956k61603k43096l5850Q9887j1016j5636p9698J96399l3367Q8752j39928
283B25800j05028L03946J01264m71969K6497J32922l0313j27469l2539R0314K28883
272C42308j28341r8281K37699j34180O8296k1507L1391J23521j56356K62121k8698
261D97973k17607P4148j98782m6438J27524k23510o4077Q1709r5376L98038L5061
250C68663j7105o5294j28179J5848P1468J98575K61832l27059l09820q705J1139
239G1363l4925o8932q7949N3332K26435M4379Q4386P6103j69148r7283q7650j46951
$$ y = [366883, 389056, 278361, 196160, 220664, 186495, 107790, 215716, 208279, 66421, -33034, 114740, 24332, 25443, 178394, 206020, 25461, -131473, 16005, 150561, 315066, 534965, 670956, 409353, 166257, 130407, 220294, 209278, 193642, 113944, 310343, 276976, 365728, 225800, 120772, 424718, 525982, 54013, 80510, 213432, 183119, 55650, 23111, 113425, 342308, 213967, 115686, 353385, 219205, 287501, 265994, 297385, 420906, 264550, 526671, 497973, 280366, 354514, 155732, 109294, 236818, 13308, -50769, 30940, -64436, 333602, 368663, 351558, 286264, 158085, 173933, 245401, 443976, 705808, 378749, 68929, 60224, 71363, 36438, -32494, -120443, -67111, 159324, 203703, 288089, 364192, 195044, 97761, 10111, -136840]
227a36840J44707J90726j70036j34199J44692K14543K26459k42390J31852k77888
217I1626J6227p687J72351k2602J0980M687j80589r3082J47944J16030J02075
206C57960j2572j29586r2984M1169K08969j57110J74694k10669m8224K10749j55810
195A86586j88309O8350J19948L14065P2088m05819j88711j6243Q2292J27180M0613
184B12040l06565o8418K22732K74356j41370k58778J66582l3858k12363J49678
174D036K11427j48906L6625J6698K24865j43755J15244j1953j21383j45499n9498
163b2099R1848N8478J34078k92572k32272K27795J47143j33470K02326J00239
153B81494m804O7184p7674j08875j77951j8694K2508J7040j15781J18956J80842
$$ y = [-136840, 7867, 198593, 28557, -105642, 39050, 253593, 480052, 237662, 369514, 91626, 107853, 100166, 272517, 249915, 260895, 265582, 84993, -8089, 139855, 255885, 357960, 345388, 215802, 122818, 163987, 372956, 215846, 390540, 179871, 131647, 342396, 186586, -1723, 66627, 186575, 500640, 572728, 166909, -21802, -38045, 44247, 171427, 212040, -94525, -162943, 59789, 334145, 192775, -66003, 100579, 66721, -145642, 4036, 215463, 66557, 103182, 119880, 344745, 200990, 316234, 304281, 182898, 37399, -22099, 69749, 128227, 262305, -30267, -262539, -34744, 112399, -21071, 181255, 281494, 276690, 343874, 266200, 157325, -20626, -39320, -16812, 228, -115553, 3403, 184245]
142A84245j08432J95655J0897j93542n8795m1620M1358J78254q2108o4058j6065
131D5789n7306j3857j45447p4214Q9435J51988q9476K1332m3135j4077j9106p3764
119b21838J29061O9814J77906J32728m9097q329j46984p221J11249n9672j66082
108c8465K1401O2414j74535K26305j9338n62014J42717L43629k53701K86930K13876
97B49219n7686j05978j91075M7106O2015J18111r4966k19260L32597k5100j65144
86e0161P8693L0507m7962K00254M9953n7480j05057j0445K6368k89229J60264
75a4295j22721R8963J36103j00533q9679J12227R1408R6683J57638j12643j18409
64A34742k60589L9588J5117J11091J51789r0671L6577p4930j71907p4408j44228
$$ y = [184245, 75813, 271468, 282365, 88823, 30028, -11592, 29766, 208020, 125912, 61854, 45789, -11517, -25374, -170821, -245035, -155600, -3612, -93088, -71756, -114891, -128968, -148074, -221838, -92777, -22963, 154943, 287671, 238574, 230245, 83261, 76040, 187289, 127617, -38465, -17064, 45350, -129185, 97120, 77782, -484232, -341515, 2114, -251587, 35343, 249219, 191533, 85555, -105520, -58414, 3601, 121712, 26746, -192514, 140083, 114983, -50161, 28532, 59039, 11077, 211331, 261284, 203804, 98747, 88302, 114670, -174559, -14295, -137016, -38053, 98050, -2483, -92162, 20065, 111473, 208156, 365794, 253151, 134742, -125847, -86259, -71142, 39949, 191738, 101067, 137644, 62714, -109193, -183601, -327829]
53c27829J14667J76841j84927P1830m9022j3766J52885J44101j58529m4549j35237
42b53535K68821j13189j76437K13867K5567j4305N7272o6363l16301M0192J32097
31b02314L7486n3202O105M1376J0682J10742k98662k77773K38905P6565Q8442
20b21648K54158r3409k62740l0972K33694K8494j98683J40910L6891q6770j54583
9c54658q9737J1437N7129J41550n6329m9403R4346L1747L9138
0a74780
$$ y = [-327829, -213162, -36321, -221248, -149418, -198440, -212206, -59321, 84780, -73749, -118298, -253535, 15286, -97903, -274340, -60473, -34906, -49211, 8061, -58302, -374603, -334411, -202314, -164828, -218030, -211925, -170549, -159867, -49125, -347787, -625560, -386655, -310090, -221648, 32510, -60899, -323639, -354611, -120917, -92423, -291106, -150196, -113305, -200075, -354658, -444395, -432958, -375829, -234279, -290608, -340011, -245665, -213918, -174780]
$$ Imaginary data points
##PAGE= N=2
##DATA TABLE= (X++(I..I)), XYDATA
16383b331642J1288m3295J59558p5910J08621O8189N772J13717n5303L8765Q6675
16372a913565J06463Q673P677J2841P4623N4603J26461J50121N542l620j1189
16361a381370J30195j1297k9781R3071j14687k5222m8900J33721R6720j08166
16351a265716J11024J50454J08404j0036k46596j24611J11115J24182P4939R366
16341i57475J01555M3145J1992J54809O3187J11623n5914k14956r9468K24925
16331f16577L8846l5098k5544Q8091J17908K4427J32605l3896L6106j28169m1474
16320d42775O5441L2700k0710O2434N7401q7698N2378J08491n4247r7678j18984
16309d43247J85157m7459K01049J69210N8389l5238l0782K08382J17065l7433
$$ y = [-2331642, -2320354, -2363649, -2204091, -2280001, -2171380, -2103191, -2097419, -1983702, -2039005, -2000240, -1913565, -1807102, -1798429, -1790752, -1777911, -1703288, -1648685, -1522224, -1372103, -1366561, -1370181, -1381370, -1251175, -1262472, -1292253, -1199182, -1313869, -1339091, -1387991, -1254270, -1157550, -1265716, -1154692, -1004238, -895834, -905870, -1152466, -1277077, -1165962, -1041780, -966841, -957475, -855920, -812775, -800783, -645974, -582787, -471164, -527078, -742034, -841502, -616577, -577731, -612829, -638373, -550282, -432374, -407947, -275342, -309238, -273132, -401301, -442775, -377334, -344634, -365344, -302910, -245509, -333207, -280829, -172338, -226585, -324263, -443247, -258090, -305549, -104500, 64710, 123099, 87861, 57079, 265461, 382526, 345093]
16299C45093k50222O3393j2671K18532j24919J14949M772o18J29288M1175P2474
16288F01246j89668O4593J68100K34412p8689k4116j25119J19870M7172r4590
16278G23211J22891Q1763J06275j26596j39098L1359q1220N6708J77596q0602
16268H72287K7325J73761o6283N7909r1445J05162n3661l2300L8866k9309k64441
16257G37871L50163L07978k21694r3623J44551p0397j9900R9024l8062J58032
16247A353943J5201K65814n8739k26437J01062l8800J13701n24J25025k4221j32282
16236A493743J22440j30284j08499O1373J20426k29579j7451K9729j65190Q0887
16226A257595L2652L32456J71712k34224J70206K37617O5316J24656q7974l00825
$$ y = [345093, 94871, 158264, 145593, 364125, 239206, 354155, 358927, 358309, 487597, 528772, 601246, 411578, 476171, 644271, 878683, 799994, 775878, 650759, 770629, 817801, 723211, 846102, 927865, 1034140, 907544, 768446, 799805, 718585, 775293, 952889, 872287, 899612, 1073373, 1007090, 1064999, 973554, 1078716, 1025055, 992755, 1031621, 1002312, 737871, 1088034, 1396012, 1174318, 1080695, 1225246, 1154849, 1134949, 1233973, 1195911, 1353943, 1369144, 1634958, 1576219, 1349782, 1450844, 1412044, 1525745, 1525221, 1650246, 1626025, 1493743, 1616183, 1485899, 1377400, 1438773, 1559199, 1329620, 1312169, 1341898, 1176708, 1257595, 1290247, 1622703, 1794415, 1560191, 1730397, 1968014, 2033330, 2157986, 2070012, 1769187]
16216A769187L32584j1720j11275k33230k35872L10842Q8739R9718j40436K8047
16206A896584k0694j39951M5876L67220j56499l24529L89751J89568l4180j11771
16196B101375J04534J3279K07995K1372j74134l24510j15489K15237k3693j32484
16186A893482P6127j3386J92802o926J27653k41286j50487L35694J44291j78265
16176B179699l5668j70461j75544J43470J88779R9800l05112M1026M5751j05884
16166A905856J48267K54454m8431r0085q5862M1496j14437m439r7546L36199J23426
16155B368898j59109J80306k5177P4261p8242L7465k07563J36964K06339q1023
16145B453119l0942L5743n6139j16421J90414Q5648j09242K562J15981o1585J24789
$$ y = [1769187, 2101771, 2090051, 1978776, 1745546, 1509674, 1820516, 1909255, 2008973, 1868537, 1896584, 1875890, 1735939, 1781815, 2149035, 1992536, 1668007, 2057758, 2247326, 2213146, 2101375, 2205909, 2219188, 2427183, 2448555, 2274421, 1949911, 1834422, 2049659, 2025966, 1893482, 1969609, 1956223, 2149025, 2142099, 2269752, 2028466, 1877979, 2213673, 2357964, 2179699, 2144031, 1973570, 1798026, 1941496, 2130275, 2230075, 1924963, 1965989, 2011740, 1905856, 2054123, 2308577, 2260146, 2170061, 2084199, 2125695, 2011258, 2006819, 1909273, 2245472, 2368898, 2209789, 2390095, 2364918, 2439179, 2360937, 2398402, 2190839, 2327803, 2534142, 2453119, 2422177, 2457920, 2401781, 2285360, 2475774, 2561422, 2452180, 2454742, 2570723, 2509138, 2633927]
16134B633927L19230l24295R8007N6400m901l40562j60526j3556j16670J51318
16124B298372L52385M911k09714j52385K40065l6044q037J11174j75280J09891
16114B535338K26925K58776l84552K14054r0114q2995p2725l46j33629O3817N4412
16103B588961K6419p404J5763n604Q63j68012J7197P8179K46091K06235l26619
16092B672069k83934J33428j43682l1871M470J83011k6505J37071J26616j40589
16082B630084J14857R7358r7822l10643K01369j56132L4536J25112n5642J580
16072B584657P119l0476J23962J12003n0020o4651M6553J33782J1431j73539p4968
16061B625853n5632j56982k13291K83000L44275k80626J08124J48826k02515J11803
$$ y = [2633927, 2953157, 2628862, 2726869, 2783269, 2778368, 2437806, 2277280, 2263724, 2147054, 2298372, 2650757, 2655668, 2445954, 2293569, 2533634, 2497590, 2489553, 2600727, 2425447, 2535338, 2762263, 3021039, 2636487, 2850541, 2760427, 2677432, 2604707, 2604361, 2470732, 2534549, 2588961, 2615380, 2607976, 2623739, 2618135, 2618998, 2450986, 2468183, 2546362, 2792453, 2998688, 2672069, 2388135, 2521563, 2377881, 2346010, 2350480, 2533491, 2506986, 2644057, 2770673, 2630084, 2744941, 2842299, 2744477, 2433834, 2635203, 2479071, 2513607, 2638719, 2583077, 2584657, 2591776, 2561300, 2685262, 2797265, 2747245, 2682594, 2729147, 2862929, 2874360, 2700821, 2625853, 2570221, 2413239, 2199948, 2482948, 2827223, 2546597, 2654721, 2803547, 2601032, 2712835]
16051B712835k06311r5179J75068J43077P0878J07978j77209j08872Q7040J98198
16041B907503j01943k02434l1101J30527M8336J33633j0249q3118J08841k73971
16031B626024j0332L67942j18227o7965J77568j26537L41058j61815l49556j63696
16021B514464P6790N3430M4156j9106J11208L3598J16578j36752j78440J91057
16011B806983j49872Q9141K64176k26059j95480L12947j91510p0912J00534k64592
16001B475356Q1701j80029J70474M5677o6845K89874J62279l1557j63939j73942
15991B609049r5927J50551k8245J88595k02987L1389K35389k20976l9591n2051
15981B575196K63346K41890l61495k98528K89549j51876r2903J76341R5880L2492
$$ y = [2712835, 2506524, 2411345, 2586413, 2729490, 2800368, 2908346, 2731137, 2622265, 2709305, 2907503, 2805560, 2603126, 2572025, 2702552, 2750888, 2884521, 2874272, 2791154, 2899995, 2626024, 2615692, 2983634, 2865407, 2797442, 2975010, 2848473, 3189531, 3027716, 2678160, 2514464, 2591254, 2644684, 2688840, 2669734, 2780942, 2814540, 2931118, 2794366, 2615926, 2806983, 2657111, 2746252, 3010428, 2784369, 2588889, 2901836, 2710326, 2639414, 2739948, 2475356, 2557057, 2377028, 2547502, 2593179, 2526334, 2816208, 2978487, 2946930, 2782991, 2609049, 2513122, 2663673, 2635428, 2824023, 2621036, 2652425, 2887814, 2666838, 2627247, 2575196, 2838542, 3080432, 2718937, 2420409, 2709958, 2558082, 2465179, 2641520, 2737400, 2769892]
15971B769892p7018J38809l1874q6809m13967K9812L19571J16838k89955P8192
15961B553491Q4363m5298O2010j05326m31407J94445J98812K56808J1604j62847
15951B616655K71898l17209j40083M86683j87605j83422l0334M3088j19427J39789
15941B580033k13825o9948O81056j61580r13k06725M1674n8735K3812J14953j6197
15930B713605J27491k95347j47309J83187L6268r6756p9300J00512P8859J12967
15920B734177L1838j36984P5727K774J06971J95538n5101n121l09606j56582K9791
15909B513422m503j04211j35718Q6207L86653J07093l4670p6459J04763j0996
15899B831581j44353K4286L0655q6646j07580P1178n1699l2583L5036p6069N6899
$$ y = [2769892, 2692874, 2831683, 2799809, 2713000, 2299033, 2328845, 2648416, 2765254, 2475299, 2553491, 2637854, 2592556, 2654566, 2549240, 2117833, 2312278, 2511090, 2767898, 2779502, 2616655, 2888553, 2571344, 2431261, 2917944, 2730339, 2546917, 2516583, 2559671, 2440244, 2580033, 2366208, 2296260, 2977316, 2815736, 2814823, 2608098, 2649772, 2591037, 2614849, 2729802, 2713605, 2841096, 2545749, 2398440, 2581627, 2617895, 2521139, 2441839, 2542351, 2621210, 2734177, 2766015, 2629031, 2704758, 2707532, 2814503, 3010041, 2954940, 2949819, 2640213, 2483631, 2513422, 2508919, 2404708, 2268990, 2355197, 2741850, 2848943, 2814273, 2737814, 2842577, 2831581, 2687228, 2711514, 2742169, 2655523, 2547943, 2619121, 2567422, 2534839, 2569875, 2493806, 2550705]
15888B550705n9274K39071r9931j41455Q7225M21196j1647k34434L9721m14944
15878B376233K83601L62971Q2421q2659n8934J2011l66345o9664K46022L3492
15868B819149L7718j69704j244K61986N1437l28616K91353k44008j29451J04884
15858B693504j96775J37305l3453K47324N0110j66161J00394k30393j94461K39063
15848B646457J29355j66578K06710r5494j38875K62397p4185q5781j68824M5197
15838B560379K00076R9098k2708j7068K9837Q4884J60777j71032j27672k43560
15828B553011K61322K77159k96294j12071m8469J37277o5885R6423R0378j80191
15818B712660k38976K33113J49568j60249j79246q5373K57746M0474k72503p989
$$ y = [2550705, 2491431, 2730502, 2630571, 2489116, 2576341, 2997537, 2985890, 2751456, 2791177, 2376233, 2659834, 3022805, 3105226, 3022567, 2963633, 2975644, 2609299, 2539635, 2785657, 2819149, 2856867, 2687163, 2685919, 2947905, 2999342, 2670726, 2962079, 2718071, 2588620, 2693504, 2496729, 2634034, 2600581, 2847905, 2898015, 2731854, 2832248, 2601855, 2407394, 2646457, 2775812, 2609234, 2815944, 2720450, 2581575, 2843972, 2769787, 2684006, 2515182, 2560379, 2760455, 2859553, 2836845, 2819777, 2849614, 2934498, 3095275, 2924243, 2796571, 2553011, 2814333, 3091492, 2795198, 2683127, 2634658, 2771935, 2706050, 2802473, 2892851, 2712660, 2473684, 2706797, 2856365, 2696116, 2516870, 2431497, 2689243, 2729717, 2457214, 2449225]
15808B449225N23184L6270j38537p8039J15480p1800j41876p478J75614r3719
15798B768324P0688K64495j4442n7457q042R8501l38741l14140j31425K49432
15788B587193J39747L3379l5270J91936k96346L7410L9065J03170Q4344r1384
15778B793244n5851O5593J35842k4518N1100j47199j6693j00318k9533K03612
15768B875279o102n1787j51805o6223J55660k75602K46894j56043r2500L61602
15758B839373j25907o8783N3099J37787o0722J19692P8225m8337k3296O154q3281
15747B824004J50899r9024o5026l417J79686j70885j11459n536K92123O7597k86940
15736B772022J41475j98369k44339L66926K26165j27244Q9337k04941L20624j31549
$$ y = [2449225, 2972409, 3008679, 2870142, 2792103, 2907583, 2835783, 2693907, 2686429, 2862043, 2768324, 2839012, 3103507, 3089065, 3031608, 3023566, 3122067, 2783326, 2469186, 2337761, 2587193, 2726940, 2760319, 2725049, 2916985, 2620639, 2658049, 2697114, 2800284, 2884628, 2793244, 2737393, 2802986, 2938828, 2914310, 2965410, 2818211, 2801518, 2701200, 2671667, 2875279, 2869177, 2817390, 2665585, 2599362, 2755022, 2479420, 2726314, 2570271, 2477771, 2839373, 2713466, 2644683, 2697782, 2835569, 2774847, 2894539, 2972764, 2924427, 2901131, 2907285, 2824004, 2974903, 2875879, 2810853, 2807436, 2987122, 2816237, 2704778, 2699242, 2991365, 3058962, 2772022, 2913497, 2715128, 2470789, 2837715, 3063880, 2936636, 3025973, 2821032, 3141656, 3010107]
15726C010107k70608R385J43617l04736J65693K7556k2742k02365q3517J75600
15716B647990R4083J15998j7315r5096k60189l826L01944K0972J64619j0827o6252
15705B892101L09129J24625K097j03300o4603j8915l1463m37094j02858J47269
15695B716988P3553r7895j41198J8284J22489j3870J01998Q2769K21377q5691
15685B998804L2219k49261j82512K83594n6356n6709J04068j82885M5334J40799
15675B877095k6440K38399j40502K8461k04377r635j64954K5720L13573P6195
$$ y = [3010107, 2739499, 2748884, 2892501, 2587765, 2753458, 2781014, 2758272, 2555907, 2472390, 2647990, 2742073, 2858071, 2840756, 2745660, 2485471, 2481645, 2783589, 2804561, 2969180, 2958353, 2892101, 3201230, 3325855, 3327952, 3224652, 3160049, 3141134, 3109671, 2672577, 2569719, 2716988, 2790541, 2692646, 2551448, 2569732, 2692221, 2678351, 2780349, 2863118, 3084495, 2998804, 3031023, 2781762, 2599250, 2882844, 2826488, 2769779, 2873847, 2690962, 2736296, 2877095, 2850655, 3089054, 2948552, 2977013, 2772636, 2763001, 2598047, 2623767, 2937340, 3013535]
$$ [...]
##END NTUPLES=NMR SPECTRUM
##END=
