##TITLE=1H_DE-80H_X3
 200.13MHz, d2o
 8 sc
 
 19ns.26.2.2025
##JCAMPDX= 6.0         $$ Bruker NMR JCAMP-DX V2.0
##DATA TYPE= NMR SPECTRUM
##DATA CLASS= NTUPLES
##ORIGIN= UXNMR, Bruker Analytische Messtechnik GmbH
##OWNER= pz
$$ XWIN-NMR		Version 3.5
$$ Mon Mar 23 09:57:35 2026 Russian Standard Time (UT+4h)  Yarkov@DPX200
##.OBSERVE FREQUENCY= 200.1313
##.OBSERVE NUCLEUS= ^1H
##.ACQUISITION MODE= SIMULTANEOUS
##.ACQUISITION SCHEME= undefined
##.AVERAGES= 8
##.DIGITISER RES= 18
##SPECTROMETER/DATA SYSTEM= spect
##.PULSE SEQUENCE= zg30
##.SOLVENT NAME= DMSO
##.SHIFT REFERENCE= (INTERNAL, DMSO, 0, 15.4891)
##AUDIT TRAIL= $$ (NUMBER, WHEN, WHO, WHERE, WHAT)
$$ ##TITLE= Audit trail, XWIN-NMR		Version 3.5
$$ ##JCAMPDX= 5.01
$$ ##ORIGIN= Bruker BioSpin GmbH
$$ ##OWNER= Yarkov
$$ C:/Bruker/XWIN-NMR/data/yarkov2/nmr/H-C/1/pdata/1/auditp.txt
$$ ##AUDIT TRAIL=  $$ (NUMBER, WHEN, WHO, WHERE, WHAT)
(   1,<2026-03-23 09:56:04.01 +0400>,<Yarkov>,<DPX200>,
      <created by zg, POWCHK disabled, PULCHK disabled
       configuration hash MD5:
       00 E9 B6 7A A2 85 ED C7 34 08 36 98 17 FE 4E 26
       data hash MD5: 16K
       63 59 B5 2E DA 4F 4F F8 10 5B 31 91 E0 3F 37 8A>)
(   2,<2026-03-23 09:56:34.09 +0400>,<Yarkov>,<DPX200>,
      <Start of raw data processing
       efp BC_mod = 2 LB = 0.25 FT_mod = 6 PKNL = 1 PHC0 = -5299.148 PHC1 = 6.821927 SI = 16K 
       data hash MD5: 16K
       1F 8B BF 87 2E 5B 91 3B 11 A7 E4 7D CC F6 A0 6C>)
(   3,<2026-03-23 09:56:45.39 +0400>,<Yarkov>,<DPX200>,
      <abs ABSG = 5 
       data hash MD5: 16K
       40 79 A2 1D 96 62 70 05 23 D3 50 51 26 43 40 89>)
$$ ##END=
$$ 
$$ hash MD5
$$ AF 67 4C CF F8 78 44 AF CE 9A F8 AD 23 9D 6F B7
##$RELAX= 
##$RELAX= 
##$RELAX= 
##$RELAX= 
##$RELAX= 
##$RELAX= 
$$ Bruker specific parameters
$$ --------------------------
##$DU= <C:/Bruker/XWIN-NMR>
##$EXPNO= 1
##$NAME= <H-C>
##$PROCNO= 1
##$TYPE= <nmr>
##$USER= <yarkov2>
##$AMP= (0..31)
100 100 100 100 100 100 100 100 100 100 100 100 100 100 100 100 100 100 
100 100 100 100 100 100 100 100 100 100 100 100 100 100 
##$AQSEQ= 0
##$AQ_mod= 1
##$AUNM= <au_zg>
##$AUTOPOS= <>
##$BF1= 200.13
##$BF2= 200.13
##$BF3= 200.13
##$BF4= 200.13
##$BF5= 200.13
##$BF6= 200.13
##$BF7= 200.13
##$BF8= 200.13
##$BYTORDA= 1
##$CFDGTYP= 0
##$CFRGTYP= 5
##$CHEMSTR= <none>
##$CNST= (0..31)
1 1 145 1 1 1 1 1 1 1 1 1 1 1 1 1 1 1 1 1 1 1 1 1 1 1 1 1 1 1 1 1 
##$CPDPRG= <>
##$CPDPRG1= <>
##$CPDPRG2= <>
##$CPDPRG3= <>
##$CPDPRG4= <mlev>
##$CPDPRG5= <mlev>
##$CPDPRG6= <mlev>
##$CPDPRG7= <mlev>
##$CPDPRG8= <mlev>
##$CPDPRGB= <>
##$CPDPRGT= <>
##$D= (0..31)
0 0.7 0 0 0 0 0 0 0 0 0 0.03 0 0 0 0 0 0 0 0 0 0 0 0 0 0 0 0 0 0 0 0 
##$DATE= 1774245363
##$DBL= (0..7)
120 120 120 120 120 120 120 120 
##$DBP= (0..7)
150 150 150 150 150 150 150 150 
##$DBP07= 0
##$DBPNAM0= <>
##$DBPNAM1= <>
##$DBPNAM2= <>
##$DBPNAM3= <>
##$DBPNAM4= <>
##$DBPNAM5= <>
##$DBPNAM6= <>
##$DBPNAM7= <>
##$DBPOAL= (0..7)
0.5 0.5 0.5 0.5 0.5 0.5 0.5 0.5 
##$DBPOFFS= (0..7)
0 0 0 0 0 0 0 0 
##$DE= 6
$$ [...]
##$SUBNAM3= <"">
##$SUBNAM4= <"">
##$SUBNAM5= <"">
##$SUBNAM6= <"">
##$SUBNAM7= <"">
##$SUBNAM8= <"">
##$SUBNAM9= <"">
##$SW= 18.0517328524113
##$SWIBOX= (0..15)
0 0 2 0 0 0 0 0 0 0 0 0 0 0 0 0 
##$SW_h= 3612.71676300578
##$TD= 16384
##$TD0= 1
##$TE= 0
##$TE2= 300
##$TE3= 300
##$TEG= 300
##$TL= (0..7)
0 120 120 120 120 120 120 120 
##$TP= (0..7)
150 150 150 150 150 150 150 150 
##$TP07= 0
##$TPNAME0= <>
##$TPNAME1= <>
##$TPNAME2= <>
##$TPNAME3= <>
##$TPNAME4= <>
##$TPNAME5= <>
##$TPNAME6= <>
##$TPNAME7= <>
##$TPOAL= (0..7)
0.5 0.5 0.5 0.5 0.5 0.5 0.5 0.5 
##$TPOFFS= (0..7)
0 0 0 0 0 0 0 0 
##$TUNHIN= 0
##$TUNHOUT= 0
##$TUNXOUT= 0
##$USERA1= <user>
##$USERA2= <user>
##$USERA3= <user>
##$USERA4= <user>
##$USERA5= <user>
##$V9= 5
##$VALIST= <valist>
##$VCLIST= <CCCCCCCCCCCCCCC>
##$VD= 0
##$VDLIST= <DDDDDDDDDDDDDDD>
##$VPLIST= <PPPPPPPPPPPPPPP>
##$VTLIST= <TTTTTTTTTTTTTTT>
##$WBST= 1024
##$WBSW= 4
##$XGAIN= (0..3)
0 0 0 0 
##$XL= 0
##$YL= 0
##$YMAX_a= 111171
##$YMIN_a= -101507
##$ZGOPTNS= <>
##$ZL1= 120
##$ZL2= 120
##$ZL3= 120
##$ZL4= 120
##$ABSF1= 15.48907
##$ABSF2= -2.562779
##$ABSG= 5
##$ABSL= 3
##$ALPHA= 0
##$AQORDER= 0
##$ASSFAC= 0
##$ASSFACI= 0
##$ASSFACX= 0
##$ASSWID= 0
##$AUNMP= <proc_1d>
##$AZFE= 0.1
##$AZFW= 0.1
##$BCFW= 0
##$BC_mod= 2
##$BYTORDP= 0
##$COROFFS= 0
##$CY= -3
##$DATMOD= 1
##$DC= 0
##$DFILT= <>
##$DTYPP= 0
##$F1P= 0
##$F2P= 0
##$FCOR= 1
##$FTSIZE= 16384
##$FT_mod= 6
##$GAMMA= 0
##$GB= 0
##$INTBC= 1
##$INTSCL= 3.241238e-09
##$ISEN= 128
##$LB= 0.25
##$LEV0= 0
##$LPBIN= 0
##$MAXI= 10000
##$MC2= 0
##$MEAN= 0
##$ME_mod= 0
##$MI= 1.114404
##$NCOEF= 0
##$NC_proc= -9
##$NLEV= 6
##$NOISF1= 3.799351
##$NOISF2= 2.8
##$NSP= 0
##$NTH_PI= 0
##$NZP= 0
##$OFFSET= 15.48907
##$PC= 1
##$PHC0= -5299.148
##$PHC1= 6.821927
##$PH_mod= 1
##$PKNL= yes
##$PPARMOD= 0
##$PSCAL= 0
##$PSIGN= 0
##$REVERSE= no
##$SF= 200.130006531235
##$SI= 16384
##$SIGF1= 3
##$SIGF2= 2
##$SINO= 0.751879
##$SIOLD= 32768
##$SREGLST= <19F.Aceton>
##$SSB= 0
##$STSI= 16384
##$STSR= 0
##$SW_p= 3612.71676300578
##$SYMM= 0
##$S_DEV= 0
##$TDeff= 16384
##$TDoff= 0
##$TI= <>
##$TILT= no
##$TM1= 0
##$TM2= 0
##$TOPLEV= 0
##$USERP1= <user>
##$USERP2= <user>
##$USERP3= <user>
##$USERP4= <user>
##$USERP5= <user>
##$WDW= 1
##$XDIM= 16384
##$YMAX_p= 478882547
##$YMIN_p= -1864736
$$ End of Bruker specific parameters
$$ ---------------------------------
##NTUPLES= NMR SPECTRUM
##VAR_NAME=  FREQUENCY,     SPECTRUM/REAL,   SPECTRUM/IMAG
##SYMBOL=    X,             R,               I
##VAR_TYPE=  INDEPENDENT,   DEPENDENT,       DEPENDENT
##VAR_FORM=  AFFN,          ASDF,            ASDF
##VAR_DIM=   16384,         16384,           16384
##UNITS=     HZ,            ARBITRARY UNITS, ARBITRARY UNITS
##FACTOR=    0.220516191357247, 1,           1
##FIRST=     3099.82766798672, 0,            0
##LAST=      -512.889095019065, 0,           0
##MIN=       -512.889095019065, -1864736,    0
##MAX=       3099.82766798672, 478882547,    0
$$ Real data points
##PAGE= N=1
##DATA TABLE= (X++(R..R)), XYDATA
$$ [...]
7172 -52135 -164811 142978 411371 593430 -56891 -812056 -150742 -51477 660913 377473
7162 377473 -142966 -281591 182406 513597 -493202 -284080 453538 700858 42200 -529303
7152 -529303 -1040618 -490417 -185835 -618085 -381672 -370260 -144861 -354007 576364 1035835
7142 1035835 888583 698684 189459 327803 368501 281275 -108768 -144948 -180978 -161811
7132 -161811 -387784 -198976 74531 -30314 23182 -85971 -77408 156604 223703 -221123
7122 -221123 -318755 -39091 -184207 400859 522182 -469739 -18376 -67010 -161285 -43420
7112 -43420 461946 1018870 636756 48945 324627 285122 -517451 -480622 -143464 21005
7102 21005 86596 -254443 -416832 -436889 -906616 -1025637 -1000480 -677358 66259 494513
7092 494513 7353 34 -335383 55487 310854 239298 331632 18825 2601 -1350 150384
7081 150384 442585 344143 313538 215739 244570 700296 1162010 323896 -89995 -457096
7071 -457096 -10368 23790 52533 454436 459616 464782 -39875 119020 206966 402483 663978
7060 663978 352039 441330 -195454 -532648 -736164 -218001 -211345 156550 490494 450585
7050 450585 255902 349832 745732 436041 724821 558443 173524 -178668 114474 322482
7040 322482 411530 250193 -81301 -499618 -351271 -68323 -156120 -60727 -83351 -421158
7030 -421158 10934 366090 748124 -116185 -633566 -424632 50248 -94344 605788 706244
7020 706244 368265 343677 508959 270951 -307848 -466974 222910 39662 -213696 -271987
7010 -271987 -347409 98662 142832 377187 176713 87966 25475 -348762 -435721 -422017 -254442
6999 -254442 70451 471255 450098 140779 14504 -540438 -411730 55760 112088 25124
6989 25124 -81828 39670 820670 330488 -261087 -267951 -221662 -36351 192413 431778
6979 431778 -177703 -348882 16025 3098 -24793 -96210 -346936 -20996 -233686 -197502
6969 -197502 94406 171119 -228243 353446 160657 -176933 -265030 38528 61499 -199427
6959 -199427 338622 472734 145557 -296769 -310090 -758347 -821681 -179952 108105 -112985
6949 -112985 34749 309668 409666 595869 961209 93141 -129015 34357 -536837 -607991
6939 -607991 -141121 27246 244611 -162352 -214752 61938 -208871 -139022 216129 12284
6929 12284 271456 391803 261359 -858182 -722539 -285356 569804 374473 -100869 -211686
6919 -211686 -145007 74985 128941 223826 214044 -48247 -603183 -385070 -11958 -44473 -376585
6908 -376585 -226915 -450762 -591934 -491780 248826 421728 295986 94640 -134859 -278334
6898 -278334 -187013 117297 105004 325698 204549 97925 -269770 -18302 253773 -6767
6888 -6767 -275698 -77793 -8725 -535497 -738314 -446033 126010 455605 425205 246526
6878 246526 -178040 -191828 213105 78444 -79158 -506646 -755956 -254444 -54537 -163598
6868 -163598 -26187 169101 377942 -29026 -286978 -454909 -539833 -271734 216608 114785
6858 114785 -289168 -345118 -316959 -691608 -901507 -821600 -123471 -837429 -759150 -627895
6848 -627895 -730834 -20970 28554 265989 -102465 -6686 652694 327619 101688 255773
6838 255773 101210 -242477 -420881 -544083 -652494 -501929 -39454 -306338 -487396 -598711
6828 -598711 -846933 -615811 -86228 123342 356974 180269 -126715 295201 636059 488250
6818 488250 219767 136724 343746 454919 718950 501849 16241 38351 27892 -195711
6808 -195711 -262544 320766 445826 396416 -35064 -118761 -363943 -243614 -290655 -38978
6798 -38978 339931 235474 531157 53783 193285 -170568 -582111 -489881 -350593 -439952
6788 -439952 -100361 449900 271727 -150258 -82600 -422419 -56611 484856 -263487 -300186
6778 -300186 -147540 -330226 -507653 -15028 -395897 -764604 -537319 -811627 -481085 207320
6768 207320 385388 8033 -464315 111053 -179467 -208643 85760 186610 58407 50034
6758 50034 -393488 57648 128785 64244 172989 197429 -82073 -443700 -229101 -137180 -274121
6747 -274121 -226190 -135191 -190196 234948 -181981 -44276 43543 -67969 87026 -344410
6737 -344410 179236 197253 116416 -519325 -424154 -285716 -506707 -494527 -189003 30391
6727 30391 -469540 -322396 -91840 445750 -90133 -329242 -390845 -477385 125737 348664
6717 348664 86415 -40768 -87742 -238999 -706292 -772275 -765436 -458014 -608181 -339443
6707 -339443 -165649 -321929 -497481 337528 481871 201344 177788 173220 -269912 -155363
6697 -155363 -218207 -179238 -597173 -195780 455510 61583 -265121 -135426 711007 517248
6687 517248 325188 310987 316292 18835 166372 -229475 -164057 764634 102123 -378256
6677 -378256 315213 608092 48807 -350259 362276 372193 66903 84399 -148599 -287036
6667 -287036 -3026 686253 531899 514217 575886 92690 -224751 -215197 -170252 357281 584096
6656 584096 321520 -6773 198929 597730 -92612 305935 321469 30885 -268124 -382012
6646 -382012 210472 113752 578823 867884 138985 189660 211854 -44760 -17203 75853 -75304
6635 -75304 -13076 48735 399236 392273 229977 741323 759006 305621 -38087 -64862 717362
6624 717362 -10378 106878 471702 755155 274312 -190707 280495 -158036 -190539 527231
6614 527231 430004 388796 682073 617322 62414 -430787 -215070 -178865 -259321 -484879 132085
6603 132085 373420 440975 497002 445513 581757 878661 563661 451648 164123 270026
6593 270026 424556 303578 161827 432936 693878 931325 1035742 627175 596937 544408
6583 544408 966129 1108735 369062 178125 533460 735628 914263 755365 526783 210013
6573 210013 -118956 140452 421650 746990 728897 816501 883570 469999 139981 -119813
6563 -119813 147377 440384 249181 482234 244912 703100 717968 648009 639209 751245
6553 751245 1271354 647336 549830 720934 888945 872154 605509 539623 75754 124026
6543 124026 533340 330315 492976 278375 673858 753044 470663 694751 1178990 801098
6533 801098 358266 604585 927797 1104797 821278 309626 146806 123198 443565 278579
6523 278579 317861 438014 66997 665665 1265747 1097137 444864 -101978 -292225 288289
6513 288289 461848 739371 793612 646413 164015 -150971 418791 721192 855139 481506
6503 481506 454138 -159518 88991 40759 156135 750992 409323 505459 610550 651398
6493 651398 503515 760937 640505 369834 483544 660267 715216 1004805 648779 337320
6483 337320 397781 356840 284228 719083 734979 686730 555759 1194457 1230687 1489243 1160575
6472 1160575 672547 1045999 812556 798511 298967 758551 1691187 1280402 841251 952759
6462 952759 493904 709625 658736 677238 1246947 1177091 1272566 946273 764893 318866
6452 318866 385137 1013775 858960 1234938 1117478 845703 1141558 698121 437350 1111028
6442 1111028 1099331 1179021 1305789 1066149 1587361 1640907 1233187 1327440 1251231 852836
6432 852836 916457 1460436 1242171 1282924 1709879 2317753 2061505 1621696 1132591 1323791
6422 1323791 1893694 1746443 1928400 2122529 2082698 1629717 1929415 2578045 2758958 2587315
6412 2587315 1922054 1955570 2170118 1437326 1616408 1956240 1733622 1958192 1970333 1950497
6402 1950497 1416486 1411848 1807381 1711342 1738160 2382661 2714168 2498060 2017183 2425265
6392 2425265 2361110 1937619 2115347 2210889 2123639 2930944 3241509 2816136 2226231 2294080
6382 2294080 2328920 2247725 3151306 2818179 2593435 3487485 3691597 3423933 3528392 4394608
6372 4394608 4100852 3945277 4056681 3896456 4151067 4673347 4952414 4617260 4758312 4894772
6362 4894772 5466030 5313740 6093829 6125041 6964852 7074980 7162734 7231095 7514377 7456348
6352 7456348 8049336 8399807 8324868 8401744 8346385 8800628 9242259 9814055 10248012 10248733 10694151
6341 10694151 10942628 10810849 11382047 11767081 12288045 12400755 13306437 13579719 14142076
6332 14142076 14412838 14595650 14734705 15881575 16307554 16013761 16634558 16998463 17253409
6323 17253409 18656661 19460664 20022606 20625195 21175444 21764599 22229792 22479517 22890435
6314 22890435 23385894 23764302 23897535 24420432 25027665 25495314 26198129 26775348 27437220
6305 27437220 26894918 26993904 26758110 27520661 28479361 29099222 29451081 28775371 29373606 29988542
6295 29988542 30585242 31848411 31817130 31877847 31983711 31832667 32355454 32677950 33524342 33976694
6285 33976694 34304891 34156011 33900868 33898896 33925263 34084045 34666561 35676858 35381981 34964267
6275 34964267 35350052 35391192 34854335 34428677 34584032 34181547 33519589 33935003 33590118 33692040
6265 33692040 33659395 33758966 33535810 32530431 31881567 31586055 31549586 31097655 30778989 30832057
6255 30832057 30552959 30252450 29810482 29445231 28833146 28750229 28771423 28903059 28537910 28243677
6245 28243677 27574451 27182834 26786258 26267506 26019009 25726770 25461425 24897219 24272432
6236 24272432 23393648 22553143 22468199 22388419 21303862 21138096 20471437 19900038 19283325 18539892
6226 18539892 17844510 17227024 16904805 16036451 15379086 15049975 14471738 14742019 14839976 14574667
6216 14574667 14164787 13434776 12442874 12616500 11622131 11996298 11903381 11130983 11103170 11334549
6206 11334549 10994778 10336401 10066837 9242156 8966721 9393825 8992517 8555042 8124797
6197 8124797 7542409 7504470 7240579 6785974 6822445 6264280 5265620 5088854 5443003 5524021
6187 5524021 4873371 4859650 4890924 4918988 4577006 4164489 4126140 4351489 3951546 3933848
6177 3933848 3829298 3369795 3233562 3457392 3730029 3176415 2755279 2819248 2702853 3223372
6167 3223372 3355062 3477524 3089425 2827325 3165364 3797502 3759845 3327053 3235547 3420544
6157 3420544 3261650 3520667 3772481 3699271 3290125 3030860 2993694 3002785 2892693 3191394
6147 3191394 3360012 3021279 3617405 3867377 3805127 3793007 2821466 2586164 3164218 3663576
6137 3663576 3394878 3801025 4417304 4090568 3886302 3847845 3808350 3866295 4038185 4466638
6127 4466638 4008601 3532730 4072962 4269504 4141719 3937355 4117939 4586516 4610643 4338778
6117 4338778 4270926 4147627 4461216 4736270 4774605 4765960 4802500 5220166 5415260 5543751
6107 5543751 5397533 5848154 6617972 6056203 6187730 6857494 7108298 6393509 7198932 7180697
6097 7180697 7388905 7604147 8092607 8254672 8449997 8817825 9128123 9635714 9608560 10210116
6087 10210116 10554461 10956207 11323487 11352842 11678572 11974397 11920394 12067911 12685795 12757460
6077 12757460 12476338 12668022 13253269 13824932 14397635 14686928 14993018 15066942 15011981 15547293
6067 15547293 15445482 15888164 16779166 17068261 17000534 16873239 17207096 17363250 17191232 17379952
6057 17379952 17668692 17624878 17642853 18249934 18188429 18122139 18405956 18616307 18935874 19476118
6047 19476118 19784448 20939467 21172428 21788465 22447383 23158524 23741746 24602362 25540466
6038 25540466 26818641 27906318 28836993 29963249 31084388 32758004 34102546 36135114
6030 36135114 38132758 39444427 41614419 44207685 46343541 48884852 51166449 53206167
6022 53206167 54751003 57439080 59631967 61742361 64155587 66282062 68073841 69939944
6014 69939944 71626694 73508115 74524604 75829084 77661355 78716505 79399928 79966133
6006 79966133 80456553 81343723 81600186 81964487 82258884 82305452 81754948 81496462 82193376 81661453
5996 81661453 81052430 80437815 80242116 79846094 79440358 78812800 78676440 78615298 78329682 77699078
5986 77699078 77783064 77276613 77480257 76642146 75575841 75175533 74993987 73781105 72467728
5977 72467728 71233236 70006940 68642851 67032895 65278846 63367468 61179801 58399545
5969 58399545 56552755 54058199 51358359 49043383 46692935 44622314 43047719 41456444
5961 41456444 39549187 37486315 36523803 36077945 34777997 34137644 33800164 33426672 33345061
5952 33345061 32994165 32693140 32200808 32101525 31881958 30865745 31234266 31512880 30802465
5943 30802465 30257924 29907951 29737933 28903694 28621857 27485269 26783624 25938004 25439670
5934 25439670 24846838 23441771 22280015 21635733 20574336 19808272 19816354 19048171 17812434
5925 17812434 17042494 16043160 15863408 15843220 15628742 15407334 15417400 15198936 14939791 14805678
5915 14805678 14441527 14180570 14138109 13304175 13080376 13220673 12968310 13037879 12803491 12382732
5905 12382732 12196081 11867387 11839711 11522951 11097204 10647234 10206362 9492507 8923749 8676707
5895 8676707 8509518 8571554 8139193 8098107 7979381 7709002 7746106 7232359 6981328 7343215
5885 7343215 7758460 8170406 7929912 8271771 8082820 8069098 8171659 8313252 8238266 7363025
5875 7363025 7120719 7283991 7364592 6925414 6576456 6272087 6621790 6667519 6324757 6455964
5865 6455964 6067780 5112627 4862868 4860714 4870466 5111941 5122166 5332742 4774680 4192925
5855 4192925 4026210 4268987 4710461 4745015 4012517 3845705 3627892 4323804 4196160 3866587
5845 3866587 3225055 3139597 3495330 3903675 3286381 3097917 3128865 3417809 3862811 3479249
5835 3479249 3618413 3489891 3538188 3489918 3836519 3401459 3603149 3235591 3299263 4161383
5825 4161383 4306188 3542862 3423796 3344537 3395281 3549045 3401380 3807680 4138828 3944972
5815 3944972 4382355 4244799 3864133 3893656 4053536 4546563 3883402 3896807 4291044 4412939
5805 4412939 4624484 4831079 4949608 5087524 4730736 5224578 5256217 5253549 5805214 6226395
5795 6226395 5913779 6411696 6442712 6617759 7069801 6971722 7256353 7951999 8871069 9334628
5785 9334628 9488680 10250981 11306982 12363693 13463979 14799859 16818709 18458709 19901823
5776 19901823 22196582 25059106 28005379 31829341 36383754 41098865 47688455 55003611
5768 55003611 62747363 70679193 77471436 83854023 88633394 91710459 92849120 94062506
5760 94062506 93904355 92522058 90582117 88778818 84696329 77532976 69234504 61280466
5752 61280466 53908618 46677270 40267555 34640007 30325123 25910191 21881194 18833931
5744 18833931 15941720 12992922 10529726 8359548 7247339 6255310 6250566 6787654 5897854
5735 5897854 5486127 5074952 4758642 4411857 3844359 4256476 4794440 4363135 3554239 3560483
5725 3560483 3967867 3604803 3588147 3332560 3855866 3852178 3492184 3043997 2675366 2870018
5715 2870018 3285127 3141525 3353891 3681184 3543808 3400567 3454084 3587050 3515688 3173733
5705 3173733 3231746 3211756 3144410 3074775 3126689 3336852 3294392 3120149 3196124 3225288 3303663
5694 3303663 3269578 3325883 3538556 3309201 3405817 2984568 2853822 3110542 2937035 2518810
5684 2518810 3010917 3394305 3543249 2854950 2708677 2764528 2986200 3288783 3414798 3905878
5674 3905878 3709987 3613292 3861151 3681495 3591308 3214981 2638063 3083478 3231603 3234437
5664 3234437 2878316 3216481 3226723 3363579 3302994 3481895 3473187 3072720 3020208 3020394 2724936
5653 2724936 2780928 2710756 2594525 2728178 3261149 3718937 3399069 3439530 3043340 3020049
5643 3020049 2551845 2507401 2620255 2945013 3005123 2663382 2971897 3173348 2966262 3128955
5633 3128955 3737323 3849607 3379916 3576195 3755912 3592692 3667021 3562240 3346089 3887836
5623 3887836 3982508 4283697 3970585 3748490 3076884 3200373 3225922 3729824 4176257 3492207
5613 3492207 3175173 3293765 3799891 4327782 4292551 4263232 4247760 4119454 3902418 3567241
5603 3567241 3422860 3707418 3692855 3697162 3662778 3972112 3776536 3771194 3893979 3917880 3836772
5592 3836772 3861715 3977167 3965963 4281966 4466946 4333108 3610134 3831303 4681656 5265424
5582 5265424 4617672 4005136 3426061 3569313 4365606 4056672 4608409 4873530 3987902 4237584
5572 4237584 4541617 4559527 4582210 4720802 4922521 4666750 4254607 4802724 4955666 4924705
5562 4924705 4525829 4105180 4629532 4467940 4517735 4868620 4668832 4364800 4340699 4247251
5552 4247251 4393268 4812118 4827818 5145268 5074059 4885616 5036309 5016850 4826833 4482953
5542 4482953 4270810 4595867 4542487 4891496 5353383 5258504 5281555 5498465 5252859 5371782
5532 5371782 5379445 5791060 5654599 5449489 5020569 5178655 5157404 5195124 5160153 5590289
5522 5590289 5788517 5963278 5669287 5851293 5873550 6085194 6150876 6133675 6745977 6808236
5512 6808236 6472825 7006618 6728280 6525397 6441310 6564821 6673843 6546493 6861451 6474069
5502 6474069 7042339 6974102 6593068 6644835 6587569 7006783 7117777 6930219 6950091 7151724
5492 7151724 6892361 6684364 6992249 7248354 7333016 7383606 7380333 6836507 7512055 7810683
5482 7810683 7651556 7379754 7747814 8329894 8194686 7400090 7702883 7794015 8084308 8250248
5472 8250248 8430917 8073803 8070900 8355759 9082468 9237403 9019889 9009104 9053021 8906272
5462 8906272 9068759 9199726 9510112 9241526 9827538 10257262 10368273 9774874 9259745 9049555
5452 9049555 9135155 9752609 9783285 10520347 10877744 10696236 10426461 10529205 10625044 10896186
5442 10896186 10989456 10691147 11119351 11514411 11364419 11863535 12033179 11630697 11899686 11973162
5432 11973162 11722928 11977885 11491632 11966684 12727469 12317207 12513519 12706668 12648531 13156989
5422 13156989 13200355 13112127 12871529 13281932 13231865 13510670 13834236 13982922 14224723 14665791
5412 14665791 14348135 14477047 14950919 15125790 15021720 14968473 15088432 14915452 15136128 15434494
5402 15434494 15960261 15466427 15750538 16122918 16286911 16753336 17314449 16880257 16886572 17236919
5392 17236919 17802165 18491097 18579662 18504955 18444844 18128387 18584068 18915762 19286519 19562094
5382 19562094 19831707 20076088 19724566 19885962 20034406 20813037 21151331 20766308 21094059
5373 21094059 22091423 22372287 22310519 22104728 22754830 23039371 23363007 23430071 24017992 24047456
5363 24047456 24075100 24507647 24516721 24766249 25589755 26005092 26237445 26410216 26467954 26843324
5353 26843324 27211539 27766484 28384679 28190921 28266547 28833786 29487948 29919275 30248194 30956553
5343 30956553 31352427 31257517 31407539 31949379 32084710 32110007 33267745 33697871 34116465 35229885
5333 35229885 35657148 36112205 36294003 36838670 37227542 37874823 38102471 38538263 38828544
5324 38828544 38985663 39991154 40681058 41764493 42112182 42670284 43378058 43487082 44378207
5315 44378207 45021201 45676624 45984890 46841175 47602913 47918934 48990951 50019034 50425933
5306 50425933 51051157 51694571 52505888 53355904 53908339 54962591 55681396 55619737 56573273
5297 56573273 57821725 58823029 60097264 60701026 61381640 62213529 63266875 64458670 65691716
5288 65691716 66065082 66778216 67719768 68992339 70168608 70927203 72012042 72509812 74239225
5279 74239225 75519054 76853975 78009030 79176714 80026860 80766122 82261848 83485992
5271 83485992 84437424 85537673 86797589 88368656 89366577 90666566 91883614 93329436
5263 93329436 94401569 95308996 97389671 98565419 98656082 100493958 101644372 102727878 103880698
5254 103880698 104947803 106380717 107511246 108786291 109769514 110298699 111122285 112211999
5246 112211999 112862119 113866186 114141293 115186428 115382585 115797704 116742436 116982621 116738855
5237 116738855 117125490 117217095 116278254 116111223 116377505 116122996 115929312 114967355 114591416
5228 114591416 114274968 113806143 112766966 111595448 110602769 110257469 109542342 107714908 106753003
5219 106753003 105770941 104246826 103048467 101995620 100752324 99258578 98238160 97232084
5211 97232084 96438482 94673445 93558230 92809111 91988829 90389805 88927942 88424648 87578994
5202 87578994 86496359 85514763 84954804 84395792 82947728 81940367 82070810 81489886 81041434
5193 81041434 80579548 80272736 79356971 79211386 78826927 78189570 77742622 77575291 76518786
5184 76518786 76760818 76563817 76836153 76849353 76736849 76820264 76643255 76538777 76031350 76188987
5174 76188987 76808864 76453955 76859236 77065865 76608020 76814962 75933000 75947313 75750283 75895649
5164 75895649 75895223 75852145 75699302 74978720 74619156 74867470 74945443 74451482 74058927 73568736
5154 73568736 72992262 72444164 71572256 71618864 71714664 70400261 69416725 68985011 68299005 67667727
5144 67667727 67553026 67489613 66126496 65031646 63992026 63669801 63888975 63735998 62712077
5135 62712077 61468508 60607429 60121942 59635779 59680845 59453998 58221216 57351136 57093783
5126 57093783 56859389 56253018 55445062 54186190 53539219 52152807 51862212 51373799 50168415
5117 50168415 50064572 49632321 49033303 47999189 47442904 46966493 46178175 45172717 44019607
5108 44019607 43253117 42941961 42655122 41896518 41138578 40571834 40425788 39996642 39030862
5099 39030862 38176236 37780674 37323504 37140335 36584833 35995072 35505800 34457535 33360511
5090 33360511 33122984 32756905 32176195 31302692 30959812 30995212 30198972 30147942 30071715 29773183
5080 29773183 29722972 29675239 28923918 28622297 28776218 28405625 28142937 27567098 27157451 27792449
5070 27792449 27559916 27747215 28018183 27821387 28091640 27374167 27109689 27355861 27199534
5061 27199534 26972110 26994869 27246538 27297171 26985120 27231252 27785652 27228283 26946436 27071759
5051 27071759 27614314 27372834 27024233 27646722 27895238 28064061 27559651 27666744 27581272 27554180
5041 27554180 27378210 27109107 26988499 26750539 27027177 27055057 26620687 26118848 26376389 26084283
5031 26084283 26523242 26694949 26526666 26398351 25597982 25280189 25315816 25128010 24877935 25264852
5021 25264852 25168268 24601431 24372652 23455579 23312733 24276413 24096019 24388576 24905893 24822895
5011 24822895 24462920 24006867 24565601 24750474 25180166 25323304 25173008 25543123 25267493
5002 25267493 26159297 26770420 27436049 28021018 28362752 28312485 28211168 28672558 28583112 28890995
4992 28890995 29696820 30163055 29985594 30517590 30898258 30656261 30926714 30934603 31440625 31989542
4982 31989542 31838042 31995152 31971300 32566504 32898682 33303172 33452392 33279028 33659392 34504791
4972 34504791 35358080 35722404 36375065 36462298 36724435 37286619 37738692 38460306 39313792 39908999
4962 39908999 40346159 40593141 41063431 41770038 42455956 42979778 43686183 44343356 44519952
4953 44519952 45239628 45427075 45422756 46101094 46509170 46928391 47413920 47329501 47508708 47433785
4943 47433785 46689888 46977032 47280588 46568245 46274981 46091254 45972039 45738016 45151240
4934 45151240 44815530 44841257 45130230 45245621 44973944 44741916 44519629 44230834 44749739 45133822
4924 45133822 45282451 45284594 45508678 45681880 46514484 46936369 47226288 47952429 47978319 48511617
4914 48511617 48685004 48794923 49508652 49615387 50156695 51103381 51479064 52330930 52411838 52722293
4904 52722293 53351547 54268394 54753201 55477565 55389674 55853893 56495655 57131771 57841820 58405080
4894 58405080 58783034 58809015 58794199 58497425 58966857 59939544 61164026 61605811 61770872 62426514
4884 62426514 63099785 63317085 63212349 63935713 65419273 65665247 66552278 67456408 67676950
4875 67676950 68082199 68544206 68828654 68588491 68621023 68473570 68031785 67482586 67212075 67272530
4865 67272530 66561685 65751253 65742193 65387216 64539798 63777188 63752379 63828171 63473266 64005792
4855 64005792 64443110 64968732 64978852 64941892 65573903 66153912 66178859 66929255 67829674 68638667
4845 68638667 69448228 70322475 71371668 73257517 74417270 76001831 77728719 80127158
4837 80127158 83807562 87747829 92129667 97464048 103061696 108199396 112871123 117217298
4829 117217298 119630836 120572603 120990480 121341563 121048672 119568941 117703225 115682178 111894750
4820 111894750 105703248 99386606 93265758 88093542 83205313 78773244 75212946 72074374
4812 72074374 68359841 65019588 62385884 59909806 57036870 55135837 53121614 51690040
4804 51690040 50495997 48946523 48575020 47634024 47170181 46470463 44853568 43541636 42791352
4795 42791352 42122866 41358235 40907516 40163570 39867787 39043169 38242035 38004420 37517444
4786 37517444 36212272 35916629 34862905 34188328 34377384 33927259 32976745 32428109 31930518
4777 31930518 31139978 31175383 30405079 29550749 29243248 29183996 28915411 28809107 29044149 28548452
4767 28548452 27948483 27840701 27348237 27476106 27857908 27468662 27727977 28200651 28394146
4758 28394146 28452407 28822308 29424002 30358933 30673954 30572097 31154237 32394518 32752788
4749 32752788 33313336 33958428 35492175 36294059 36935065 38249934 39531415 40771085 41899023
4740 41899023 43387626 44670334 45979357 47777226 49270601 50503579 51889959 53492015
4732 53492015 55994971 57600893 59622400 61665454 63342747 65143672 67452185 69101996
4724 69101996 70765411 72519874 74353245 76445464 77740833 79231373 80820273 82210791
4716 82210791 84245848 85462510 86890337 88723176 90465356 92524556 94304702 95749058
4708 95749058 97231551 99521553 101411981 103575164 106211822 108097511 110143085 112324271
4700 112324271 114174444 115600891 117077555 118347595 118876608 119370918 119594713 119975342 119624025
4691 119624025 118602348 117691234 116236904 114583365 112664798 110694934 108816711 106579764
4683 106579764 103411298 101402918 99183182 96365006 94247625 92122515 89432776 87766073
4675 87766073 85935501 83357803 81129473 78905700 76444061 74015528 71835519 69489564
4667 69489564 66871547 64549098 61808535 59479236 57957174 55585280 52633283 49577762
4659 49577762 47395755 45540672 43537645 41075320 38323265 36297886 34582834 32958970
4651 32958970 31645155 30166454 28917451 27878999 27083033 25578252 23937847 22967497
4643 22967497 22614997 23171947 22721048 22707583 23067617 22780637 22956490 24263718 24809438
4634 24809438 25552902 27144486 28590703 30204765 31645600 32839491 34273348 35167013
4626 35167013 35354354 35832448 36427887 36769345 36855751 37023457 37087416 36482187 36270670 35927213
4616 35927213 36074013 37253253 38424002 39789294 41080975 42944899 44925777 47456610
4608 47456610 50145011 52589192 55524856 58667139 61584799 64288883 67109719 70149947
4600 70149947 72917393 75759047 78485487 80817053 82582269 84282984 85296824 86013261
4592 86013261 86414390 85919864 84985735 84103032 83187972 82144793 80705439 78070357 75087564
4583 75087564 72303774 68634912 65553380 62007377 58904145 55340022 52320745 48785875
4575 48785875 44627127 40787994 37228873 33927589 30641167 27861785 25095071 22771959
4567 22771959 20442187 18221931 15461525 14037942 12620031 11401784 10579160 9214308
4559 9214308 8502701 7269722 6817076 6197881 5782080 5572567 5130944 5388841 5308121 5194473
4549 5194473 4852895 4300409 3858061 4855356 4834702 4456061 4729056 5396980 5144827 4408058
4539 4408058 4418298 4258185 3830936 3478703 4037885 4131826 4567161 4373450 4281270 4043113
4529 4043113 3766935 4476922 4760485 4702639 4906384 5250216 4996537 4399704 4948212 5228609
4519 5228609 4907728 4960795 4350605 4185607 4202976 3902343 3656708 4081690 4707168 4927495
4509 4927495 4705823 4041914 3852909 3701459 3777900 3145068 2654220 2954042 2561566 2656187
4499 2656187 2992318 2722535 3116930 2930705 2685824 2563659 2998862 3120951 2976500 2691255
4489 2691255 2309544 2611236 2487075 2714699 2851503 2925006 2288943 2364938 2137953 2634482
4479 2634482 2776839 2108490 2271971 2493552 1965650 1494638 1598200 1939284 2128650 2482697
4469 2482697 2327309 2034082 2284717 2541775 2177072 2119590 1609538 1353090 1791907 2405994
4459 2405994 2858298 2698314 2735056 3225490 2795675 2686437 2385602 2816444 3387163 2655738
4449 2655738 2593737 2632096 2701545 2647841 2459757 2031197 2245339 2271804 2516352 2736195
4439 2736195 2941299 2731189 2765747 2540747 2323475 2228518 2161782 2409144 2817840 2938401
4429 2938401 3062312 3435339 2647380 2998152 3135820 3042785 3299551 3341836 3586888 3451897
4419 3451897 3658912 3755846 3572375 3314587 3029309 2848554 2993414 3731550 3352852 3427383
4409 3427383 3234060 3355314 3759779 3485801 3590586 3585865 3629344 3844278 3761638 3538815
4399 3538815 3321614 3566215 3522112 3633269 3578421 3147805 3439887 3126605 3245618 3530942
4389 3530942 3696074 3775669 3866956 3917648 3863213 3776299 3955445 3567447 3685116 3713302 3839843
4378 3839843 4575600 4543492 4256758 4775052 4534867 4230935 4290262 4611195 4513815 4446915
4368 4446915 4509524 4584612 4259865 4277955 4618886 4705516 4681780 5283719 5495883 5551777 5880553
4357 5880553 5964602 5783665 6036466 6250240 5780108 5980787 6447366 6929069 6551946 6402296
4347 6402296 6981346 6961659 6951284 7340897 6968690 6705280 6994028 6822056 6793321 6860972
4337 6860972 7214580 7770762 7663386 7485332 8211705 7924591 8417007 8685206 8534927 8845089
4327 8845089 9127752 9499405 9686276 9669874 9935077 9884695 9809001 11006446 11318927 11625459
4317 11625459 11946270 12560608 12901122 13295389 13471792 13617106 13678635 13736826 14778149 15110777
4307 15110777 15079469 15919447 16471575 16369422 16766157 17914102 18062578 18513634 18679129
4298 18679129 18513275 18922112 19281918 19666710 19713990 20064386 20825859 21064341 21537770 22172825
4288 22172825 22462591 22812178 23407173 23511625 24172063 24567283 25697636 26136845 26024167
4279 26024167 26086892 26232172 26635271 27204603 27212123 28295289 28947136 29146387 29515925 29282735
4269 29282735 29747071 30570131 31318322 31287216 31662675 32456135 33048573 33811787 34722551 35269204
4259 35269204 36477289 37796422 38965157 40042184 41465799 43775585 45709933 48199858
4251 48199858 50393875 53075341 56214307 59381977 63496086 67616553 72459964 78820913
4243 78820913 85190930 91794639 100254632 109608316 120784211 134662670 151108265 170091496
4235 170091496 191243778 211017663 231214220 250065276 264655325 271496050 274331523
4228 274331523 276459853 276383462 272839428 267204012 259178925 247707986 229863204 208225803
4220 208225803 187807931 167472981 148607534 132344401 118429377 106648031 95679267
4213 95679267 86234915 77362428 68816813 61666220 55169320 50049889 46360074 44332264
4205 44332264 42236209 40916136 39481105 38440903 37750630 36950336 35722197 34813453 33787444
4196 33787444 33200850 32941456 32533717 31569216 30852050 30337921 30308087 30091225 30147634 29816382
4186 29816382 29337965 29269357 28993150 27998060 28069995 28140108 28052913 27767961 27415799 27344392
4176 27344392 27592399 28204798 27779177 28108704 27779476 27176800 27168883 27126335 26459081 26053112
4166 26053112 26153455 25831835 25980694 26079675 25309553 25382836 25132586 24719374 24267924 23834316
4156 23834316 23384586 23395938 22946750 22957875 23201655 23041593 22466764 21946020 21075679 20919836
4146 20919836 21523969 21455048 21073337 20959248 20752441 20785826 20938521 20538791 20418058 20367439
4136 20367439 20443753 20986693 20984778 21146010 20832338 20742886 21163727 21268496 21881272 21873028
4126 21873028 22303892 22808791 22498034 23458364 24669056 25301748 25248467 25977766 26595514
4117 26595514 27230208 27751820 28475997 29505451 29977679 30785708 31456541 33030993 33781215
4108 33781215 34414875 35201450 36552630 37442109 38825285 39768264 40538980 41467529 42269266
4099 42269266 43647945 45114082 46338763 47220348 48664428 49525157 50742002 52052384
4091 52052384 53451327 54526473 55466712 57221563 58968871 60401641 61568326 62616649
4083 62616649 63951279 65673879 67169345 68713694 70266300 71766516 72955352 74678829
4075 74678829 75578725 76816882 78187478 80266831 81883857 83054183 84010246 85559916
4067 85559916 86386797 87725727 89168879 90400654 92064651 93853539 96835813 99179908
4059 99179908 101170108 103500186 105811017 106670324 107852240 109812746 111386984 112843455
4051 112843455 114112810 115181325 116721510 117884429 118583295 119796827 120493562 120937919
4043 120937919 121965583 122303368 122924208 124266574 124676372 124544944 125305359 125360727 126071246
4034 126071246 126433237 127097892 127655933 127911672 128237265 128537364 129115659 129657452 130020727
4025 130020727 130304633 130426308 130864134 130889701 131044345 131250545 131426698 131674539 131395824
4016 131395824 131720876 131916919 131160781 130849458 130443855 130654237 129768720 128795796 128436265
4007 128436265 127839895 127192612 126586727 126034718 125082653 123644077 122637134 122559046 121604285
3998 121604285 120501030 118705325 117556940 116804093 115437905 114315633 113250689 111600848
3990 111600848 109635051 108375970 107001506 105707079 105120848 104270517 103567526 102567981 101130974
3981 101130974 100496291 100060759 99972673 100425451 100330436 99923714 100527461 101161933 101626652 102555881
3971 102555881 102683652 103057020 103581911 104251275 104545357 105510196 105482197 106116222 107110550
3962 107110550 108101644 109270854 109854740 110780097 111891840 113654170 115572824 116980793
3954 116980793 118284250 119103301 119634847 120489683 120878159 120832518 120649797 121396452 120922632
3945 120922632 119786984 118878145 117879755 117126561 115750744 114503292 113591786 112892823 112232867
3936 112232867 112116511 111707580 111472243 111158784 110435371 109863638 109175768 108549091 107482818
3927 107482818 106653798 106465614 105765400 104932897 103255614 102742329 100966277 98690481 96566284
3918 96566284 94479557 92936217 90887431 88126692 85305931 82979531 79633558 77132293
3910 77132293 74307587 71545266 69194835 67355375 65671158 64258853 62542751 61127060
3902 61127060 60327521 59035971 58511163 58398832 58154666 58216171 58598812 59548242 60402301
3893 60402301 61639432 62119123 62262406 63393223 64809184 65726103 66641416 67523609 67958325
3884 67958325 68541982 68360676 69011852 69376873 69109207 68871112 68245431 67478569 66680578
3875 66680578 66060124 65348762 64671804 63685841 62801869 62646618 62522590 61780088 61774018 61544939
3865 61544939 60939588 60381643 60591444 60229245 60185525 60139711 60120193 60152853 59549689 59235394
3855 59235394 59525126 59470091 59663570 59341917 59360788 59286361 59497053 59820155 60030340 59914274
3845 59914274 59652531 59309386 59261004 59081451 58076407 58419494 59235512 58828497 58063212
3836 58063212 58397896 58302734 58201275 58112992 57507215 57556447 58131358 58184269 58714762 59029617
3826 59029617 58581297 58531287 58518718 57848514 57037507 56405259 55828800 54673181 53852501 53097279
3816 53097279 52158585 50974126 49888091 48659258 47175568 45779973 44970213 43737837
3808 43737837 42255205 41122430 40659409 39571093 38835643 38219429 38059512 37290790 36981114
3799 36981114 37211497 36693992 36919418 37097813 37531490 38280444 38250727 38035300 38403572 38456396
3789 38456396 38917179 38870622 39141429 40098962 40397924 40421888 40315688 40100540 39288579 39084700
3779 39084700 39293952 38835079 38275468 37970481 37709254 37294705 37241342 36100369 35167304
3770 35167304 34514725 34126619 33303014 32271308 31519014 31548856 31487274 31387181 30231471
3761 30231471 29628161 29737712 29328105 28873203 28624776 28694089 28511396 28510544 28096628 28247562
3751 28247562 28744871 28815404 28466870 28849404 28989548 28908894 29807354 30351191 30467636 30868199
3741 30868199 30916196 31230600 31755889 32721112 33093560 33162696 33564969 34196156 34669962 35494755
3731 35494755 35348436 35735055 35950916 35933800 36570617 37268349 37362934 37177813 36502093 35888958
3721 35888958 36145612 35671663 35379645 35431134 34958160 34363039 33758106 33524882 33574776 32498724
3711 32498724 31513425 31329845 31341296 30888611 29874902 28885082 28760194 28050962 27485151
3702 27485151 27235826 27064823 26040329 25119000 24987204 24263987 23779499 23482510 22199662
3693 22199662 21826914 21857030 21285726 21043269 20318776 19986646 19473831 19258455 18674682 18293580
3683 18293580 18102577 17329867 17144609 16959012 16416207 16376202 15921928 15772130 15505280 14654117
3673 14654117 14405405 14165115 13763438 14284520 13894248 13410568 13174732 12786100 12838704 12924153
3663 12924153 12729604 11750898 11436010 11284228 11126710 10947511 10560979 10643832 10564746 10266243
3653 10266243 10317332 10486120 10725906 10570429 10285916 10339991 10133815 9909893 9834362 9457679
3643 9457679 9166864 9242143 9238964 9135724 9327177 9605326 9595383 9238722 9467885 9235686
3633 9235686 9259009 8981781 8425587 8934835 9082667 8472597 7838287 7630482 7517808 7167115
3623 7167115 7150356 7021937 7559391 7065623 6744801 6510530 6497725 6662615 6905727 6429977
3613 6429977 6084792 5874671 5964484 6135810 6299794 6663042 6297056 5948526 6485559 6465283
3603 6465283 5962353 5633200 5478856 5772614 6110385 5967227 6245778 6348901 6690272 6512223
3593 6512223 6281414 6330691 6614890 6897594 6341112 6890786 7166006 6680163 6952327 6801208
3583 6801208 6253600 6852661 7167999 7358097 7588927 7397102 7147358 7563007 7172754 7024152
3573 7024152 6864597 6906325 6986355 6844289 6597199 6925380 6192837 6197874 6801169 7136229
3563 7136229 6861190 6290811 6386618 6297730 6629665 6718455 6282368 6492387 6852797 6383200
3553 6383200 6032948 6476711 6363881 6872187 6811493 6598713 6451985 6135425 6640135 6466663
3543 6466663 7017001 7100910 6208456 6583601 7061599 6393394 6208781 6350337 6405107 6543848
3533 6543848 6809791 7320554 6881721 6992407 7335963 7466705 7150502 7320354 7493743 7325191
3523 7325191 7834303 8041597 7949877 8025899 8489077 8702477 8474357 8535880 8711445 9024885
3513 9024885 8746351 9187294 9407197 9502893 9634971 9155911 9503613 9876133 10235739 10787989
3503 10787989 11043066 11301797 10930986 10914417 11033248 11640400 12253352 12296635 12257757 12760160
3493 12760160 13323233 13199397 13692174 13042887 13648400 13768072 13925201 14606872 14944841
3484 14944841 15274453 15554454 16011688 16493154 16779408 16694900 17391271 17813011 18036441 18146213
3474 18146213 18923825 19929335 20310096 20941423 20971696 21240077 21160057 21632924 22753317
3465 22753317 23127618 23226047 23272363 23551421 23996779 24430675 24554680 24924513 25410374 25686550
3455 25686550 25951348 26723778 27205438 27605297 27957256 28880279 29651986 30186870 30891641
3446 30891641 31489799 32169818 32513377 32935200 33819310 34623661 35059072 35989058 36929635
3437 36929635 37522335 38106887 38590193 39422841 39934544 39715908 40239433 40584835 41286726
3428 41286726 41888302 42783528 42541652 42808019 43779126 44403542 44792767 44578441 44699528
3419 44699528 45535486 45697989 45867873 46486703 47150055 47544389 47984226 48622264 49135881
3410 49135881 50069152 50264738 51058827 51950570 52600350 54282247 55090982 56013841 57892097
3401 57892097 59395760 60561495 62309968 63140776 64291238 66548720 68264611 69610426
3393 69610426 71143982 72106581 72912923 73972102 75393294 76608734 76970176 77888908 78280261
3384 78280261 78149851 78736463 78744070 78309759 78069029 78175879 78739570 78593265 77874779 78024148
3374 78024148 78315921 78277577 78539393 78653422 79552179 79871311 79537677 79332847 79726824 79935147
3364 79935147 79474153 79307440 78942165 78778565 78302744 77643065 76717688 76343674 75221754
3355 75221754 74198144 73643892 72372706 71676325 70995350 70927785 71222077 70702075 70110681
3346 70110681 70192541 70705297 71102020 71231547 72113961 72578195 73399898 73721001 74361352 75893167
3336 75893167 77206664 78191147 80498237 82270483 85126063 87707427 89647389 92689203
3328 92689203 96432448 100173368 104772275 109428681 114910760 121504603 128189397 136277747
3320 136277747 145090024 154770055 164772382 175536909 187156124 198677417 210831110
3313 210831110 221303568 230812698 239982295 248949487 256934744 263697657 270604863 275992828
3305 275992828 281834236 286567987 289403329 290392512 289966047 287392019 283130141 277035113
3297 277035113 269727505 261650457 251936917 241384174 230318704 218589694 205433481
3290 205433481 192034005 178086101 164314725 150982435 138084377 126155997 115110892
3283 115110892 104647928 95176140 86712069 79087549 72254491 66372850 60667754 56685847
3275 56685847 52874114 49640835 47284011 44283966 42458531 40964822 39812772 38612665
3267 38612665 37562986 36535853 36458410 35725165 35415747 35486159 35714286 35999077 36633902
3258 36633902 36798712 37280369 37513736 37755387 37741765 37801884 38407211 38785158 40075770 41046720
3248 41046720 41975870 42458257 42753912 43543975 45251276 46711021 48603264 50598321 53042860
3239 53042860 55208293 58142067 61222559 64687814 68691694 73870234 79229385 84822337
3231 84822337 91439288 98970812 108275545 117518634 127695371 138707644 151638874 165917422
3223 165917422 181174219 198039280 216022969 235233592 254816157 273875780 292704047
3216 292704047 309376145 323335425 334128011 342042439 345984715 346900474 344229467 338662677
3208 338662677 329808557 318816192 304799922 288115226 269968423 250216327 230255850
3201 230255850 209290554 189348874 170963219 153706558 137816476 122851004 109249981
3194 109249981 96884003 86333720 77576194 68633859 61837484 55727839 50321065 46716199
3186 46716199 42736468 39187738 36502563 34713748 32802843 30830037 29328318 28053540
3178 28053540 27043717 26247300 25269345 24769408 24263232 24070867 23810526 23577038 23379031
3169 23379031 23109391 22556950 22150406 22641003 21997634 22189181 22292815 21965482 22378346
3160 22378346 22164626 21813283 21236974 21672694 21756747 21861330 22549712 22098812 22056624 22087751
3150 22087751 22512354 22521146 22630216 22602843 22936375 22648128 23056298 23698095 23899565 24053858
3140 24053858 24689543 25346377 25602340 26656219 27021664 27473339 28194147 29173236 30138953
3131 30138953 30937027 32224057 33387604 34484494 36163150 37618637 39087238 40664326
3123 40664326 42610673 44711831 47635842 50444963 52948277 55744643 59007480 62716664
3115 62716664 66956841 71739190 76303222 81342798 86963171 93658338 100482195 108040819
3107 108040819 116780795 126922898 137010725 147637382 159213861 171901887 185733538
3100 185733538 199896809 213619344 227311914 241278487 253664624 265484950 276378779
3093 276378779 286123825 294258319 301755290 306477043 309585384 311007676 309099247 304857180
3085 304857180 298704159 290860535 281407782 270091089 256647552 243585067 229433727
3078 229433727 214063435 198436657 182157034 166217645 150688662 135947439 122737455
3071 122737455 109799277 98238935 87731195 78635815 70407546 62973956 56326419 50256529
3063 50256529 45787294 41324318 36776778 33080667 30411898 28184905 25495908 23521283
3055 23521283 21900346 20590506 19286028 18385637 16835917 15753016 15748010 15067452 14429833
3046 14429833 14124939 13376589 12705076 11969177 11692268 11302849 10358767 10065272 9653706
3037 9653706 9264659 9048836 8829017 8493383 8477170 8758526 8560066 8115724 7394029 6638465
3027 6638465 6814943 6665632 6933409 7333684 6697784 6779254 6481555 6455632 6498660 5957024
3017 5957024 5914087 5737922 6129992 6291203 5536089 4911733 5081720 4756357 4932247 5098719
3007 5098719 5050957 4451296 3955076 3903725 3700961 3099330 3803765 4005193 3108328 3221116
2997 3221116 3086631 2836073 2537066 2793007 2261080 2198533 2040081 1754324 1873925 1503336
2987 1503336 1508088 1439635 1573700 1802484 1720931 1687639 1374001 1099677 1619863 1693519 2079323
2976 2079323 2069530 1881235 1300475 889614 1094319 1252303 1410763 1154601 655632 1067511
2966 1067511 1560739 1713904 1891810 2246544 1611102 1481843 1344189 1173874 1256505 996822
2956 996822 866381 1128326 1007434 1087809 1941417 1578400 1471418 1441984 646871 642252
2946 642252 1342806 1724670 1648026 1915305 1397966 891981 708612 1116158 1679701 2195936
2936 2195936 2339657 2395688 2557278 2301353 2753883 2903256 2290283 1928716 2087766 1872784
2926 1872784 1820906 2176710 2198759 2064118 2128039 1977453 1614495 1327858 1252027 1759009
2916 1759009 1515755 1589891 1729310 1159617 1204948 1241389 1143122 851894 629828 147912
2906 147912 172047 155857 60601 383016 447596 441066 634199 272894 448793 178899 -401867
2895 -401867 108375 369001 104673 354929 500453 865088 479718 270678 133487 228443
2885 228443 515878 373659 -176994 -37698 -158485 -315823 -271781 214716 -26840 -130677
2875 -130677 62161 290703 414957 441485 893641 541007 597570 528243 -184224 172713
2865 172713 543451 407020 -1608 -146132 -146987 -605966 -369200 -76806 -192525 2090
2855 2090 207526 -192746 -404672 166263 125401 -126911 -279317 -149437 -128583 55058
2845 55058 203480 515058 319059 -71454 -26922 240448 -97288 -97830 182914 386179 742952
2834 742952 167922 -498777 66762 440526 343771 528203 802519 475968 -371875 182256
2824 182256 557566 130581 129319 834207 927937 692402 818554 997232 988247 1093376 971603
2813 971603 1122235 1628556 1657420 1429242 1519065 1256355 1586495 1591226 1943513 1661432
2803 1661432 1796158 1267503 1143208 945452 1257645 1336225 1171357 1387115 1141553 479011
2793 479011 450112 15586 2414 372933 443950 594535 386057 324119 709793 577578
2783 577578 63463 167500 156906 381687 792595 842617 413860 -223854 -172689 373722
2773 373722 -127817 -6658 271707 531778 550630 462649 213849 -79097 -119067 -12719
2763 -12719 233660 369028 581667 471236 138657 -146021 -98664 2338 62750 147811
2753 147811 99582 117896 422890 114256 279392 719198 764167 408446 273401 546266
2743 546266 419766 360969 200789 399952 432618 373833 -271405 -203930 339103 651057
2733 651057 131537 -160181 -343204 -666972 -939958 -1216561 -558973 -24264 718242 284444
2723 284444 92668 416689 334905 453887 -131641 27503 -45642 62606 811437 637543
2713 637543 291173 -26172 76261 459354 244030 139381 92191 -203257 -209223 74346
2703 74346 20315 -305755 -713647 -708744 -686316 -188204 -358419 -451033 -357574 -659600 -612687
2692 -612687 -606009 -456723 -398276 -181538 -520291 -862577 -373068 -655711 -944350 -803887
2682 -803887 -320076 165628 198481 368917 494037 428458 431835 -62375 -146545 -227283 -205234
2671 -205234 -350928 -452648 -287925 -244423 -539280 -254919 -140899 149390 -18504 -329523
2661 -329523 130144 -5771 78031 -73572 202585 429077 292793 -53444 -177489 -114092
2651 -114092 -33849 242058 131606 398279 901537 364808 354753 136200 -5917 343609
2641 343609 361545 716192 746203 406445 69191 169830 240159 491332 428821 171944
2631 171944 212767 11502 -328760 27671 295566 28879 -55967 344876 38689 -445438
2621 -445438 -635016 -509528 196041 266033 409581 237998 530533 279202 97170 -40208
2611 -40208 225604 344709 905624 570007 847978 998452 480918 547137 656465 188762
2601 188762 741342 1130713 677354 1170147 1696874 1593231 1681734 1944461 2165006 2618184
2591 2618184 2569341 2408566 2419976 2892108 2722382 2395887 2877705 3434936 3372835 2975245
2581 2975245 2692952 2623296 2267781 1953337 1456962 877094 1181244 1497194 1410041 1316195
2571 1316195 575902 153937 220441 830359 863404 717588 497617 808703 621009 752982
2561 752982 728355 592851 786033 754538 792920 816740 618595 512044 41950 198882
2551 198882 487650 431623 -34086 179630 860516 528535 753851 954293 596610 406127
2541 406127 117648 366238 659837 415476 496949 295442 53277 344593 612876 543638
2531 543638 742044 702312 406289 174547 215147 336823 585687 731527 641259 621677
2521 621677 865901 492364 -93773 90927 505060 707528 987064 1189797 802097 1000087
2511 1000087 695370 735275 1080098 330023 123135 278099 262699 23783 277534 192617
2501 192617 565706 646949 138980 250841 948852 947629 791184 1316864 802602 554671
2491 554671 361914 289355 782215 1131040 1186934 863316 1064751 1220908 969086 1145467
2481 1145467 967453 434908 441991 827615 1097926 1591324 1814051 992325 926956 1127664
2471 1127664 1382410 1500718 1581292 1797978 1723846 1258105 1112401 1557622 1686828 1701849
2461 1701849 1942756 1818557 1805797 1290162 1709776 2203029 2380890 2667672 3127607 2620142
2451 2620142 2599373 2419581 2658548 2698476 2819481 2807627 3101933 2792891 2908790 3413052
2441 3413052 3414989 3221478 3253472 3404376 3645513 4023968 3418302 3822438 3175673 3294627
2431 3294627 3668691 3460572 3470397 4028820 3364991 3080620 3298315 3364278 3533116 3836509
2421 3836509 3651260 4198879 3450818 3454692 4018975 4152174 4170052 4587984 5010986 5141332
2411 5141332 5433322 5623916 5825043 6141052 5969272 5891484 5493544 5526242 5700407 6056230
2401 6056230 6545859 6665460 6637345 7485756 7358919 7781458 8338499 7391569 7867219 8312502
2391 8312502 8453727 8102306 7929963 7907888 8019384 8375687 9318602 9250926 9134493 9510888
2381 9510888 9405263 9343960 9878504 10132642 10337056 10484612 10736673 11058611 11370193 11662172
2371 11662172 12012707 12446933 12747535 13379664 14029350 14847996 15362143 15811018 16086728
2362 16086728 16792174 18005025 19175947 20626444 21711492 21993481 23066218 24302076
2354 24302076 25685183 27660943 29564739 31315545 32986144 35312435 37817493 41531077
2346 41531077 46836847 52188518 57153356 63169380 70544843 78799479 87014076 96510284
2338 96510284 107569486 119914468 132676143 147589921 164746203 186205250 210691669
2331 210691669 240367076 274867197 315618082 360259470 402368583 436910822 456581012
2324 456581012 467299209 473857794 477775656 478882547 474762542 464526678 451153192 432658106
2316 432658106 403949768 365038772 323277223 284209810 246497919 213486975 185477250
2309 185477250 160090050 137684149 117359520 99868410 83843580 69400669 56823391
2302 56823391 46594396 38973136 32893310 28566822 25503694 22459264 19578994 17690096
2294 17690096 16308820 14647609 13495727 12583470 11338506 9963714 8869597 7977305
2286 7977305 7442525 7044548 6649730 6759007 6711054 6174632 5854414 5364492 4975582 4654139
2276 4654139 4564774 4402265 4332945 4640132 4083181 3767263 3680706 3502481 3244843 3531649
2266 3531649 3431205 2933388 2914012 3194129 3146923 3200369 2796828 3157747 3237247 2793483
2256 2793483 2636998 2271852 1990120 1875724 2056183 1542361 1325571 1088808 1138145 1155124
2246 1155124 773383 1340766 1318861 754036 828890 557979 139186 51223 41852 -370708
2236 -370708 -28237 461889 521454 624423 436731 672892 731680 823958 489051 288552
2226 288552 792496 492552 444725 882739 906804 461669 380192 384229 -23382 349974 329198
2215 329198 -183346 198584 573456 394141 299404 215391 249272 67660 -239579 -50032
2205 -50032 -42942 -279410 -333573 -68620 33372 -293229 -689221 63485 403544 410490 -130490
2194 -130490 -415194 -179234 -528858 -182313 337994 538513 214786 186134 698438 511448
2184 511448 169858 329525 514440 342847 230645 67105 178796 193632 -6464 155115
2174 155115 -130847 -269648 -240208 153020 249303 511910 690415 582976 566070 289860
2164 289860 425172 464103 573608 863075 599676 546639 105916 574785 772663 292411
2154 292411 357213 364631 -53928 -11966 147764 -4636 133396 5786 255652 -64923
2144 -64923 -235879 -126563 62032 -83357 -516853 -488377 -342177 36209 195067 -341978
2134 -341978 -375132 -177320 -35172 -558778 -185070 -362754 -361375 -227490 -222649 -103115 -136
2123 -136 -32410 -272322 98135 400341 34930 -52503 255724 103335 -211166 -44221 -128424
2112 -128424 167713 -185418 -301734 165524 206955 -282925 -433124 -257538 -791342 -553059
2102 -553059 -313118 -105223 -334155 -448410 -155819 134488 467555 707693 160870 -73504
2092 -73504 -209304 -527217 -655236 -445407 68491 516888 326904 -285247 -200171 -427765
2082 -427765 -318042 57068 -73345 73898 -200261 -259369 7391 443239 686437 676109
2072 676109 289793 -69329 -69048 77114 -164370 654736 662618 837037 624136 818630 1015683
2061 1015683 1244478 1212621 1405963 1929549 1003222 1103201 1824404 1842730 2077424 2353145
2051 2353145 2233497 1741325 1611487 2011346 1716353 2097404 1408866 1200330 1149681 783057
2041 783057 878782 764978 337916 75071 -257941 -481526 -232001 -349181 -195527 -425590
2031 -425590 -423743 -431382 -262111 -485307 -734108 -580488 -554209 -802026 -874916 -858856 -817438
2020 -817438 -530350 -669906 -1056728 -1134928 -771493 -861763 -775985 -312377 -182023 -747412
2010 -747412 -537940 -235775 -619446 -1130207 -802936 -583459 -1031196 -470442 -663162 -451432
2000 -451432 -243872 -292239 -599985 -401784 -444263 -234003 -250157 -261193 -324047 -177237 -115755
1989 -115755 -468819 -176210 -1277667 -949910 -150841 -4114 -450467 -839711 -318175 -443501
1979 -443501 -668176 -340957 -422559 -442952 -377445 -708937 -595811 -635358 -799491 -767225 -957853
1968 -957853 -584583 -925478 -500455 -958446 -1018705 -807586 -671771 -537922 -819721 -649277
1958 -649277 -463007 -346120 -578940 -329950 -506830 -793697 -237778 -262461 -323238 -352152
1948 -352152 -226083 142086 -67257 -344793 49019 -99030 -618771 -321192 219390 163802
1938 163802 -415500 -155770 -47256 -99610 360206 634416 567066 -159574 -503928 56057
1928 56057 371241 247962 415807 502660 384162 49478 368384 125726 91736 -259836
1918 -259836 -338236 -220245 -443595 -521749 -436971 -291586 -672778 -742969 -862166 -622513
1908 -622513 -229552 -54593 -301776 -684217 -712352 -782607 -229407 -19014 -363473 -13247
1898 -13247 136620 -309908 -370726 -381736 -275707 62184 -273170 42963 284289 120602
1888 120602 -212610 -283021 -87313 -75727 -512586 -954303 -721085 -145754 -312136 -155688
1878 -155688 -98098 -196178 -602322 -348989 -158675 -129566 -372486 -183271 136619 -224079
1868 -224079 -178816 -425135 -378438 100623 202321 -159085 -190963 -402233 -310679 -432628
1858 -432628 -652779 -39266 -168507 -305103 -463283 -347148 -165481 -7092 -127679 -214875
1848 -214875 -62244 -218405 33787 144239 -240738 107187 -85138 -320402 -333483 295651
1838 295651 239303 488611 363334 -467297 -322926 -766539 -208699 -39885 -66259 73043
1828 73043 191174 286702 -279618 -194409 -263990 -405674 -137633 8799 133684 -3080
1818 -3080 247567 -168236 -258414 -501965 -501354 -675396 -574470 44023 -65392 -88125 -511550
1807 -511550 -385559 -510533 -50696 -377447 -137101 97163 283161 231199 -312006 -538618
1797 -538618 -936255 -381005 12319 15222 -383158 -193936 -380684 -356317 -156241 -271716
1787 -271716 157320 97963 -37558 -234530 350997 88644 -262051 -150139 -543236 -796294
1777 -796294 -1058986 -334108 -376819 -312560 -261219 179356 79706 -137418 -53262 342114 151278
1766 151278 382892 301972 -763116 -760823 -591332 -432277 -102914 -22517 136871 -54257
1756 -54257 -396544 -496995 -1165785 -792934 -674135 -534930 50848 -111496 -522044 -344370
1746 -344370 41448 -90875 383517 26349 184874 37122 -407899 -590433 -666721 -659925
1736 -659925 -540810 -267699 -640780 -254664 86824 9332 -3450 -567018 -409974 -282118
1726 -282118 82560 143169 322986 -88970 -318674 -32117 330770 596196 -217923 -483621
1716 -483621 297945 201276 36049 75015 354894 880336 453101 4137 -27158 178132
1706 178132 -162469 -703194 -66026 165459 379967 303703 248936 527888 -149959 -173723
1696 -173723 85074 221002 311546 148635 -245014 -175179 -491439 -300258 11505 141704
1686 141704 68992 299622 -119623 -49190 20464 394034 117072 -227675 -686187 -444349
1676 -444349 17707 291890 432803 155177 133875 62816 -226712 -240555 -305512 77241
1666 77241 -470066 -566307 -245462 -114442 -348739 9772 -144993 -73941 58705 176444
1656 176444 793769 214797 156194 -52109 -300092 -374485 -270062 -561280 -554360 -551619 -424820
1645 -424820 -518761 -542934 -884879 -574843 -755527 -185390 377655 -85398 -244154 -180824
1635 -180824 -72693 -183728 -578749 -228758 31382 -213632 -221264 82534 -129463 284207
1625 284207 390575 -207967 -371356 -569813 -192504 21987 -417932 245299 -27522 -480874
1615 -480874 -498716 -395024 551358 609892 279442 67539 39607 269037 -57702 -86347
1605 -86347 -82117 -74605 127125 98170 147629 130806 455705 29880 -396625 189397 320040
1594 320040 179556 338870 97948 -205247 -103118 -329743 -522894 130005 -78471 -13115
1584 -13115 -208201 42141 -175084 -286752 -294167 -276537 345085 267347 -148156 -99109 149413
1573 149413 251455 470462 513182 622172 129957 -299529 226609 313852 32252 295438
1563 295438 323241 170049 -323089 -265076 -209931 418919 392509 -312030 -591075 -378741
1553 -378741 -132203 -223126 -148631 6464 -227468 -121579 307269 -217543 -70527 -218054
1543 -218054 -189461 352275 360735 -376947 -328779 23857 -32271 -285326 -807267 -429688 -156197
1532 -156197 -287297 -178340 -141376 19585 34071 47676 -306426 192247 445509 449004 -164672
1521 -164672 -610939 -385535 402578 513916 157423 -117254 -436716 -441415 -573492 -212987
1511 -212987 -528581 304179 -103525 -299419 -478182 -472373 -174716 -64899 51009 -484639
1501 -484639 -579662 33212 -357358 122497 70812 117188 428463 -25779 -243583 -177081
1491 -177081 26279 -319512 -201974 7739 147974 -211436 -478130 -62542 -109889 -506567
1481 -506567 -747497 -514376 -8583 -285990 41136 -131586 -34124 -235140 -171575 138007
1471 138007 -317233 -48897 -163119 -555077 -280557 74297 142886 175996 -176413 -522866
1461 -522866 -416256 -732177 -113879 -384116 -829281 -466957 -34011 504214 434410 294811
1451 294811 138014 188325 256453 510568 391150 60453 504765 233165 369617 342966
1441 342966 625369 686426 134894 -1300 -430272 -96884 121102 171309 517186 794523
1431 794523 479857 159120 66507 -116807 471201 814572 410541 370351 355840 3285
1421 3285 -432687 -493885 -249315 -206137 -118662 -72477 -82529 13723 229878 -67600 10546
1410 10546 -19460 -356132 -23899 33226 -399412 -807589 -781270 -444082 -342573 -507957
1400 -507957 -368312 -454893 -291905 -623456 -741344 -212647 160499 -147870 -110318 -426374
1390 -426374 -417765 -72402 364726 -258484 -334502 -286197 -232676 -8662 401774 119632 116289
1379 116289 352058 471555 493063 678074 325125 128038 286233 -311308 193637 225026
1369 225026 487725 508399 227896 131161 438969 -247868 -86968 -208854 -279333 -208440
1359 -208440 103332 -298866 -553965 -284777 -176157 32101 254906 47351 -77516 484161
1349 484161 174177 180047 89686 143056 -298411 -189029 -44054 123183 181361 -280836 -240283
1338 -240283 -94370 32032 -62464 193613 -203748 -337753 -548015 -917134 -282022 371133
1328 371133 274659 117164 274666 441144 100012 188065 419531 648142 459372 585334
1318 585334 525116 329019 407843 463222 542846 -326735 -234773 -10800 -164088 404092 677374
1307 677374 644264 480589 452941 199064 -299854 137321 -2480 77878 -138437 22575
1297 22575 180953 -441695 -297625 -296779 492409 605923 64611 93308 78456 -373336 -623287
1286 -623287 -371504 -418369 -157156 98427 -145333 -319644 -275858 78514 -616525 -377708
1276 -377708 -690260 -908937 227535 430781 72465 120424 211673 -218771 -283434 93909
1266 93909 -81490 -72868 -272026 -168915 422398 521264 347840 -26977 -306810 53454
1256 53454 296151 584230 514392 -38971 -402036 -158481 110012 -486217 -551103 -274377
1246 -274377 200750 107278 -152800 26373 372335 360733 164431 -510993 -388497 -62015
1236 -62015 -29929 26241 -95816 209728 162679 -168123 86316 -21988 -55089 -350754 48757
1225 48757 -178862 -354541 -14294 -42259 -101726 79194 -146953 -126343 87671 -8448 -409781
1214 -409781 -424736 -835968 -969580 -625570 -187071 -101261 14350 160300 253775 352171
1204 352171 798659 523761 144546 -511524 -317798 -14777 -207208 -117950 -322511 133454
1194 133454 107201 -40997 293022 252983 83190 -16414 187313 -274932 -382030 27640
1184 27640 -127761 -89773 -231789 -275960 -564711 -566970 -411329 28051 635941 -3323 -79808
1173 -79808 215769 -159718 -89661 -184103 601514 209407 175953 330301 -22065 -466658
1163 -466658 -22832 -142300 -190720 -389297 -131329 605243 614290 163776 191014 -608462
1153 -608462 -482344 10464 -91553 -121605 97266 73067 225121 554592 179238 331215
1143 331215 387974 25359 530578 569138 279969 427776 343194 403404 470011 -145650 -1015536
1132 -1015536 -383937 -240651 -99408 57826 254682 -278172 -438880 355449 230330 215563
1122 215563 225644 494296 998174 555954 -234336 -331446 -365923 118219 412396 695676
1112 695676 644814 331565 325249 169796 219312 136292 273181 457822 119667 -50962 -207487
1101 -207487 63112 566736 321444 3410 -410851 -97951 -176105 -493109 44642 426920
1091 426920 -104406 -229709 -520180 -37197 723596 263353 72261 -93817 243347 203696
1081 203696 493490 191763 -345561 -566977 -333094 -10122 117567 297793 -680480 -217824
1071 -217824 313214 -112543 -171926 -505883 -452901 -223091 -126060 -180521 -50892 194417
1061 194417 181894 417517 389396 330568 224954 719412 495354 321228 129564 603378
1051 603378 510993 244529 -110869 462880 424625 210660 163529 321546 337278 80523
1041 80523 208897 -297588 372039 572983 746231 -120270 -483777 525231 485182 -125933
1031 -125933 -362784 -158604 294901 57507 -210648 -326248 -161423 -659559 -224933 153479
1021 153479 223182 105739 308573 379802 346540 266426 405900 45865 396552 574132
1011 574132 179232 480719 367781 297137 -383442 127487 621484 6609 -815217 -571155
1001 -571155 -45208 197101 327391 232338 127908 -303184 -957928 -75738 116262 99501
991 99501 -265970 181615 226773 -34143 61698 -87487 -8942 -112545 15045 214001 367881
980 367881 570485 125482 29510 -46036 18908 63034 -161614 -209280 14003 126574 121434
969 121434 -121379 -545816 -782656 -555427 -131165 -105787 280786 34366 96637 75238
959 75238 -357306 -381129 -511062 -607714 -110842 -194641 247063 241994 11257 19614 616547
948 616547 521239 467096 501401 418744 243316 112247 167171 164839 7733 -250483 -179161
937 -179161 -380551 100515 -105198 -282372 -231182 -167184 -133119 -246270 51785 518288
927 518288 347555 392111 604767 565623 118884 256460 344149 142780 -70524 208209
917 208209 441067 607856 500542 388465 60562 -205165 188219 -1572 -208683 -338084
907 -338084 -399509 -517595 -674540 -368097 361414 -115673 -194366 -269906 -256537 -261854 -338901
896 -338901 -447742 344938 76499 10951 -300362 -104570 198955 75672 -577637 22522
886 22522 255168 -291065 -338471 -153950 -198609 -223995 -52684 169239 55883 228482 154416
875 154416 108946 501528 139365 255277 90714 -349883 -74367 441637 251310 92843
865 92843 -289282 -275572 -467801 -577754 75448 549080 444693 356542 -396835 -516652
855 -516652 -353403 2693 -342524 -194788 50910 -26749 708073 805221 317240 33049
845 33049 -9205 -253708 -82554 144694 304959 107398 -222354 146264 26687 -163570
835 -163570 -425645 -245372 -92455 250357 611850 329071 -352968 367061 530518 380045
825 380045 184693 113651 -453141 -145430 572253 108661 101878 283744 264438 -179582 335645
814 335645 454166 192156 -87180 -402261 -268827 -313833 -418355 18453 187833 149712
804 149712 -190479 -445025 -116956 138722 445216 794846 704931 110361 306590 118332
794 118332 163409 206613 347687 453910 594980 573829 330565 -90802 230666 716764
784 716764 813747 458710 -97595 -102548 -140623 -76189 -238027 -716161 -287052 472776 1016351
773 1016351 263356 -143343 -59834 -274656 -49835 -258231 -89757 -43029 -63709 285789
763 285789 246023 558743 545127 237068 -180815 -589533 -687672 -308899 -315800 -180606 516898
752 516898 174046 119197 -480407 -107978 166137 215629 245163 -248711 -49025 466088
742 466088 96133 -284228 -163979 62998 -226012 298901 185273 -196562 -149720 -212808
732 -212808 -400550 -620385 -191473 208388 -65955 -401558 -164517 -273478 -475871 -403470
722 -403470 9141 -705 -42140 -152591 -1050163 -550508 -328338 26896 -333011 -227898
712 -227898 -137088 219078 740081 410124 280886 -126548 -253567 -149524 -334925 358899
702 358899 111920 -107333 -288564 -84858 349209 723269 911425 1067956 414180 272846
692 272846 342439 253188 479863 206573 200261 358436 1191981 433879 199877 -225697 85646
681 85646 472359 169529 361556 521591 233016 306557 -302308 54294 752075 505512
671 505512 -15002 -226750 -446606 -998296 -907444 -302583 -80632 153519 106834 114173 456598
660 456598 850919 648130 594713 545623 321404 193289 158778 -51406 -402535 -44049
650 -44049 459112 229500 67233 -66843 -115849 477683 300112 175039 322431 576314
640 576314 621792 60594 491362 212740 -113889 -363171 -264663 -211205 -127333 68104 -52623
629 -52623 -393791 -435100 -228096 -128476 -247551 -282606 -296504 -517891 -25663 387472 135055
618 135055 -233184 301534 146509 314808 111871 -321555 -282578 -358026 -303726 -344485 -730832
607 -730832 -454172 -639542 -466730 -38803 -464708 -260153 140666 465065 128198 252722
597 252722 18936 132799 246256 22892 369748 600682 15341 -549818 -493456 -114353
587 -114353 237090 -252550 6616 -94260 367417 491446 334994 685721 751295 364253
577 364253 216022 52739 -508828 -349693 91019 -489824 -883503 -865614 -746129 -638138
567 -638138 -208363 -353515 -554761 -765259 -156367 -615567 -406854 25189 34850 207615
557 207615 127163 -70314 -139675 222993 -654442 56193 622732 416520 -261015 68595
547 68595 -37140 224872 -325692 -552606 8204 -243584 -143968 -377692 -376415 114442 150521
536 150521 130450 -88287 -140053 -172908 -364303 114694 -114244 -179462 251461 218724 83616
525 83616 352451 178823 -243726 -85497 247927 398691 -44705 197299 316071 -61837
515 -61837 52618 -206784 -157371 -248011 -133064 -294560 -908086 -492874 -106726 -151223 -220617
504 -220617 111555 168600 66168 -11939 26184 318862 344324 -136360 -17722 -127732 -373103
493 -373103 121942 -20555 -314550 -115898 237288 293814 147519 175262 93737 -402830
483 -402830 -405948 152747 156928 34299 85718 314203 326494 248811 -33321 -70052 19756
472 19756 -192040 -564823 -185370 -308174 273660 516304 315297 185279 46723 358356
462 358356 -45096 68873 281268 510923 794299 616443 -191780 -15027 12725 261853
452 261853 88516 -169939 -804134 -740130 -483645 -330847 107364 368007 -269084 -465282
442 -465282 -215072 -119255 -356586 -870049 214603 527121 316065 504268 560019 437275
432 437275 589741 446420 335131 339559 290117 620465 742561 814525 -86295 71819 365221
421 365221 604819 464760 305352 152048 158336 172861 -102189 -559543 -992378 -449574
411 -449574 10323 -32753 -334790 102408 -33892 -542289 -585529 -314048 -171856 267176
401 267176 -124609 39672 137983 136094 188427 -144637 -361876 -259509 -139742 -263966 -226993
390 -226993 -112811 -119722 -336948 -338895 106842 -50918 -98616 688256 260151 -329655 -447256
379 -447256 -598293 -920150 -444610 -235124 -232141 -543144 -514785 30006 -244384 -521143
369 -521143 138262 396523 465784 355712 350427 -221257 -352041 75365 37964 -18035 -43187
358 -43187 -125240 -446030 -259514 -28487 -406106 -424487 -342883 -903909 -698176 -903247 -200697
347 -200697 320349 503449 -145876 -598047 -171609 39741 -399245 -615052 -524266 -237263
337 -237263 214566 -79479 350040 67216 -364552 25273 -38471 -139212 -684206 -222453
327 -222453 85063 163337 223141 -30737 -101251 -287945 -244746 34344 97145 216945 -256999
316 -256999 -536287 -583905 -487650 -667514 -364879 -234790 -175587 294634 -143606 -312557
306 -312557 57186 -107904 96314 15268 389656 -447969 -602419 -518002 -121177 -599917
296 -599917 -552733 426884 22663 740347 459700 -11733 -172188 217864 -305821 -378335
286 -378335 -144151 -112088 -203508 43339 -675910 -809466 -506934 -73664 -168071 -207110 -358570
275 -358570 -390398 -352733 -458896 -208133 -116402 -322432 56063 43773 126001 383998 26729
264 26729 -450254 -148505 -360281 -123917 -24165 -651751 -677216 -154508 -132472 -198302 -592617
253 -592617 -114681 260533 -24680 -489765 -213133 -364889 -461880 -426921 -266553 275104
243 275104 -180739 58461 -78221 284512 -132146 207911 -264905 -348735 33562 -548390
233 -548390 -503168 -204562 -435765 -83794 -332521 -297316 -560893 -912993 -914787 -859969 -253307
222 -253307 -310774 -198144 -136951 -257939 267749 527558 650081 472154 -353712 224227
212 224227 435914 457306 384803 -310482 357026 -88477 -101008 198748 920120 1000130 215982
201 215982 131146 804114 13553 -132043 -253741 -614562 49280 247197 62833 -94139
191 -94139 8971 -60904 212941 23209 47963 -34849 -15695 167794 501851 235908 345705
180 345705 165088 -369542 -650005 -684885 -308209 -655426 -756784 -514812 -530677 -217424
170 -217424 -424449 -14884 -220433 -296115 -619963 -616108 -408719 91216 98000 -69364 -207311
159 -207311 -725080 -751198 -448151 -539996 -336485 -559741 -334584 -116511 -303641 -345933
149 -345933 -173625 279860 -497539 -542691 -233966 13029 -24697 108871 -95763 -265409
139 -265409 -324407 -291661 -788539 -949583 -473006 -255898 -37045 -184589 -399933 -459244
129 -459244 -482411 68968 -121591 -259452 -124335 -278873 -345500 93830 129212 -201239
119 -201239 -294339 -229898 -155865 -639443 -396584 -252595 -415989 -425667 -568442 -273905 -182592
108 -182592 -280240 -178586 -60965 -66810 -319828 -97755 -82065 -340025 -266164 -500080 39481
97 39481 739558 380037 324987 287127 114643 -601240 -527953 -28999 -212889 -133946 69325
86 69325 36260 87750 -60991 -131461 -67424 -201714 -363572 -330879 -386629 -480497 -664160
75 -664160 -452928 -370186 -294476 186206 422444 297169 82162 367102 -50661 -429824
65 -429824 -138537 226254 46756 -173902 -241364 -160382 -15137 -15634 -194755 -240998 -243300
54 -243300 -24700 274159 387307 349206 222171 38060 -19518 -259513 -338554 -34042 273887
43 273887 208559 -29866 -316289 -184443 -251653 -421806 -489216 -476460 -278767 -69856 -352152
32 -352152 -428251 -211805 -179271 -286785 -333382 -258915 -85308 -156437 -243412 -120067 -409397
21 -409397 -470164 -205825 -202863 -141027 -518295 -770516 -547243 -542096 -166765 -102008 -21069
10 -21069 -19208 126611 33928 -97051 -47326 -28629 -134822 -150082 -203740 -296471
0 -296471
$$ Imaginary data points
##PAGE= N=2
##DATA TABLE= (X++(I..I)), XYDATA
16383 -4370259 -4236586 -4520426 -4221667 -3969704 -3979384 -3709741 -3801242 -3674050 -3893089 -3892313
16373 -3892313 -3812736 -3879590 -3765775 -4006322 -3929537 -3778964 -3946489 -3925319 -3652986 -3175507
16363 -3175507 -2578886 -2561236 -2851994 -2790679 -3121422 -2847289 -2547617 -2755635 -2705971 -2591847
16353 -2591847 -2745647 -2741138 -2705285 -2338132 -1892303 -1460056 -1444255 -1648516 -2096868 -2250472
16343 -2250472 -2147671 -2191717 -2010001 -1980675 -1841551 -1726766 -1918920 -1836602 -1420326 -1031735
16333 -1031735 -1131955 -1327739 -1059649 -1106516 -1327846 -1454901 -1036095 -453853 -646060 -739067
16323 -739067 -479556 -748279 -429210 -760718 -1267900 -1140910 -889669 -460487 -37885 -172549
16313 -172549 -375155 172543 -73451 -351866 -368281 -390250 204417 306785 -196736 144149
16303 144149 195367 191265 -160225 -246206 258779 505030 805112 770991 346679 423822 500937
16292 500937 772035 1052587 585131 663663 622053 572335 714596 1001108 1051452 1227272
16282 1227272 1349259 1717846 1601442 1191861 1512009 1239120 1090332 1254756 1458154
16273 1458154 1931029 2269303 2095340 1316200 1334190 1317654 1682267 1638708 1472038 1776467
16263 1776467 2302460 1750950 1731247 1731991 1615101 1897164 2164980 2087048 2058292 2136521 2338251
16252 2338251 2726461 3123966 2849999 2735809 2756123 2822044 2636418 2985589 2996028 3217509
16242 3217509 3233966 3104837 3387005 2817815 2686949 2771791 2878702 2887219 3133842 3284985
16232 3284985 3228634 3375866 3152800 3357455 3439004 3318166 3460910 3388346 3080635 3135050
16222 3135050 3482303 3247604 3592679 3280043 3277604 3576790 3842443 3688755 3865016 3798551
16212 3798551 3588147 3483556 3987343 3845477 3777182 4235203 4077033 3676183 4220014 3779248
16202 3779248 3753741 3862222 4080113 4288574 4330894 4250686 4448171 4199752 3793274 3880643
16192 3880643 3675575 4085441 3753190 3856280 4001627 3805005 4218334 4505671 4772462
16183 4772462 5087860 4392232 4085553 4102050 4007935 3506691 4121704 4788673 4307921 4334420
16173 4334420 4846438 5176502 4684311 4473960 4648963 4661580 4655418 4444837 4471244 4451843
16163 4451843 4379793 4971111 4519288 4194406 4305461 4212561 4190952 4607249 4904306 4696740
16153 4696740 4740362 4450574 4555147 4538362 5129156 4833599 4805245 5306609 4978757 4804104
16143 4804104 4583060 5152738 4657834 4442608 4641679 4970725 4876142 4944191 4561345 4531430
16133 4531430 4900296 4986796 4941493 5693395 5971114 5593590 5706223 5989156 5620725 5517447
16123 5517447 5057634 4685389 4708269 5056932 5037416 4833579 5483805 5121026 5053848 4971760
16113 4971760 5506403 5255507 4924244 5502815 5923315 5207467 5327385 4931616 4837856 4940858
16103 4940858 4994629 4792888 4775250 4933582 5017083 5263066 5466987 5026645 4252503 4257651
16093 4257651 4767142 4942367 4677777 4580158 4562050 5179178 5375478 5283279 5535804 5678293
16083 5678293 5517924 6339039 6098210 5532182 5507039 4793093 5323084 5714356 5698164 5611962
16073 5611962 5162352 5323793 5717660 5865323 5964838 5971923 6086127 5768772 6002541 5692739
16063 5692739 6030123 6307434 5909293 5631120 5223541 5604791 5442387 5907620 5749686
16054 5749686 5386654 5554230 5782180 6117597 6059162 5596883 5106492 5753039 6133310 6130945
16044 6130945 6070906 5760795 5733327 5574494 5067895 4872017 4863497 5042777 5532937 5105879
16034 5105879 5371126 5464447 4846756 5385777 4952471 5014121 5181586 5005025 5307430 6083115
16024 6083115 5495781 5311293 5444566 5734694 5493266 5360312 5485431 5588438 5535964 4985662
16014 4985662 4869036 4825994 5334244 5393180 5512112 5783396 5941973 5437034 5379342 5803399
16004 5803399 5607812 5055634 5038034 4959005 5250248 5412805 5451312 5380826 5499422 5073962
15994 5073962 4836655 5045110 5696892 5569222 5059798 5523540 4996448 5009926 5608713 5224792
15984 5224792 4923954 5003813 5440795 5635744 5739891 5397056 5013598 5151114 6352360
15975 6352360 6441696 5876139 5328794 4995382 4389114 5123516 5650552 4982196 5098104 5397945
15965 5397945 5568777 5253429 5222947 5398427 6020661 5622215 5485007 5664902 5546260 5101872
15955 5101872 5248178 5983258 5652572 5199905 4923521 5488483 6017025 5347540 5230393
15946 5230393 5690389 5304009 5313674 5889051 5774382 5775599 5659602 5110498 4828949 5089383
15936 5089383 5014944 5405438 5507979 5298500 4854725 4693598 5084926 5531227 5402461 5431837
15926 5431837 5515866 5519401 5046534 5018032 5363472 5255129 5568799 5386557 5668605 5296492
15916 5296492 5449535 5755191 5830492 5244653 5290959 5496386 5440554 5232514 4711963 4387367
15906 4387367 4275712 4559035 5517765 5581642 5381309 5663023 5743962 5493548 5577010 5533499
15896 5533499 5594216 6262595 5995436 5457232 5471484 5432690 5306182 5769317 5636713 5468504
15886 5468504 5640267 5965267 6751516 6085730 5698536 5492304 5337311 5630391 5382340
15877 5382340 5158095 5314330 5435498 5250578 6016493 6035405 5936745 6041783 5884434 5758051
15867 5758051 5128999 5281822 5534259 5638687 5696052 5131548 5243496 5082012 5218987 5335514
15857 5335514 5557754 6013497 5997968 6402496 5432210 4956773 5216575 4807371 5348054 5438907
15847 5438907 5366125 5602657 5767236 5754271 5552399 5457227 5271614 5203019 6002012 6073412
15837 6073412 5660314 5417203 5634993 5601178 5610067 5593663 5941981 6041221 6159929 6039728
15827 6039728 5968834 5691965 5891621 5863257 5878101 5776193 5509499 5101089 4782962 4805633
15817 4805633 5175806 5410666 5499638 5300789 4696556 5232641 5917435 5584619 5022405 5508485
15807 5508485 5899910 5422847 5634375 6359761 6168619 5688892 5489365 5779313 6054238
15798 6054238 5781336 5278771 5613259 5769460 5505449 4914802 5561898 6216898 4988216
15789 4988216 5351585 5644473 5284102 5177485 5521374 5706816 6022097 5522052 5634123
15780 5634123 5791872 5877361 5804569 5613450 5992908 5562536 5075272 4857523 5515249 5527705
15770 5527705 5920900 6030199 5666311 5151523 5418004 5808904 5213946 5204249 5440284 5585623
15760 5585623 5494425 5499860 5872338 6230872 6432356 5933918 5443319 4730978 4812229 5021842
15750 5021842 5160329 5045478 5383590 4803955 4611035 4852611 5010242 5240676 5882983
15741 5882983 5530780 5186254 5458560 5587836 5258237 5111475 5094924 5227182 5765919 5506898
15731 5506898 5248948 5130620 5362356 5722258 5477501 5532552 5591679 5484053 5745938 5867066
15721 5867066 5710767 6013730 6180063 5693501 5912269 5796202 5575865 5534881 5545875 5954434
15711 5954434 5877875 5884233 5587176 5715737 5965690 6001973 5231470 4829352 5337694 5842058
15701 5842058 5556909 5318029 5276617 5273191 5320383 5212900 5401726 5350063 5964582 5948274
15691 5948274 5691721 5270613 5037898 5254145 5070001 5004149 5422912 5555264 5813992 5426648
15681 5426648 5503091 5420023 5483404 6024340 5742230 5890540 5994263 5718953 5582678 5536135
15671 5536135 5583049 6080934 6441698 6481352 6011988 5545900 5781289 5795940 5525843 5512981
15661 5512981 5143500 5537404 5761867 5519289 5640555 6359813 6207571 5536261 5828990
15652 5828990 5819121 5388045 6010988 5915762 5831959 6101592 5859067 5608366 5119341 5492704
15642 5492704 5221824 5377224 5566863 5731626 5919154 5995676 5828136 5947243 6110312 5970350
15632 5970350 5718795 5398618 5651959 5870093 5956982 6164750 6137060 6466487 6485265 6420363
15622 6420363 6135418 6061853 6057107 5678602 5827440 6454085 6669702 6682801 6093262 5639371
15612 5639371 6147584 6505515 6050921 6226630 6188845 6088011 5739306 5625461 5790646 5867752
15602 5867752 5989498 5430723 5192793 5241017 5018617 5382188 5167017 5591813 5708738 5745442
15592 5745442 5720828 5532821 5402132 5601447 5661406 5671055 5776245 5821104 5679072 5191281
15582 5191281 5445463 5465932 5658079 5675641 5239269 5439012 5706349 5984682 6162720 6620174
15572 6620174 6347413 6163813 6118520 5806000 6032637 5589306 5673242 5999178 6236631 5657153
15562 5657153 5655347 5660555 5841210 5466297 5461583 6161027 5941911 5929291 5862535 5937796 6176857
15551 6176857 6542055 6528332 6585699 6379850 6122655 6124751 5441191 5487690 5593433 4892435
15541 4892435 5164764 5008697 5041445 5557501 5668688 6108016 5667285 5619992 5172920 5695669
15531 5695669 5993310 6406248 6022818 5943607 5576733 5049551 5222611 5541982 5829642 5428759
15521 5428759 5815280 5692381 5889425 6172044 5767762 5751683 6062422 5872633 5560019 5228589
15511 5228589 5138212 5649892 5916009 5829152 5579121 6201689 6350888 6089216 5655708 5579351
15501 5579351 6026703 6093610 6139059 5829126 5928534 5690537 5435660 5636705 4784555 5015759
15491 5015759 5656635 5876079 5940413 5197144 4906095 5636433 5471851 5122906 5238069 5719081
15481 5719081 5597548 5877998 5934005 6013400 5964384 5989914 6091401 5644093 5465515 5521477
15471 5521477 5241442 5697586 5559682 5527542 5770980 5865697 5859979 5947060 5719463 5989622
15461 5989622 6398323 5716077 5855203 5563275 5776744 6032620 5623246 5607943 5667716 6081931
15451 6081931 6061657 5757723 5702946 5508155 5900619 5874302 6104760 6060794 5875116 6182471
15441 6182471 6055249 5295223 5999295 5801130 5366833 5208830 5397664 5682019 6097911
15432 6097911 6166891 5745821 5375855 5419007 5174884 5592536 5817428 6068420 6389372 5968604
15422 5968604 5958631 5955120 5542971 6037712 6208672 5955157 5645183 5714820 5193961 4715667
15412 4715667 5084429 5603549 5698437 5520755 5168012 5542783 5609493 5176662 5103381 5363860
15402 5363860 5648983 5527119 5661859 5636637 5217611 5418718 6105783 6279619 5991049 5860990
15392 5860990 5494256 5780239 5719931 5840829 6022618 5850390 5889847 5702045 6007680 5630527
15382 5630527 5479309 6062427 6354482 5635218 5155456 5300967 5653704 5872049 5750747
15373 5750747 5639643 6080972 6105538 6413273 6532671 6420938 5919356 5480211 6088814 5857897
15363 5857897 5762705 5660072 5549757 5752692 5699307 5594391 5606476 5865704 5871105 5674139
15353 5674139 5823578 5897418 5693231 5730881 5398620 5263947 5503445 5641326 5410456 5423358
15343 5423358 5343011 5618298 6181477 5927814 5494247 5807624 5884241 6066546 6148297 5955887
15333 5955887 5771201 5701163 5443752 5496988 5943744 6361693 6355650 6142028 5681849 5410397
15323 5410397 5398624 5869504 6163255 6047108 5819748 5896106 5955581 5650443 5952798 6168723
15313 6168723 6150270 5956668 5829276 5702038 5270830 5372223 6094999 6207251 5741712 5686031
15303 5686031 5777802 5941312 5699639 5900982 6573825 6487334 6363983 5743467 5116509 5384036
15293 5384036 5860304 6319355 5683582 6060202 6292759 6127878 5894662 5979872 5854050 5394153
15283 5394153 5279063 5420358 5790581 5822524 5755302 5521237 4816720 5182156 6245250 6596656
15273 6596656 6195371 5758696 6346054 6715242 5774454 5666678 5857529 6043446 6317144
15264 6317144 5963828 6016597 5523828 5653205 5996129 5961195 5818890 5916213 6337202 6229872
15254 6229872 6051664 5843673 5131371 5753475 6104750 6285378 7072707 7063949 6810065 6160792
15244 6160792 5534054 5688092 5310907 5543055 6207325 5637920 5546646 6078442 5994145 6055621
15234 6055621 5768422 5963333 6089627 6108230 6027674 6529549 6528896 5961412 6200374 6784574
15224 6784574 6590634 6572563 6816377 6226419 6345401 6382679 5790237 5842251 6057046 6221002
15214 6221002 6391915 6000267 5561035 5829306 5899832 5894310 5983561 5631841 5338225 5986194
15204 5986194 6417359 5718439 5608226 5793580 5719471 6210210 6486505 5930303 5719913 5695544
15194 5695544 6086681 6175555 6052172 6531983 6580076 6339247 6305323 6195127 6027161 5868654
15184 5868654 5584617 5682002 6021183 5411304 5469153 5774405 6051874 6090517 5904519 5854572
15174 5854572 5889094 6072257 5991359 5843559 5615952 5756877 5638383 5890627 6393522 6339217
15164 6339217 6470831 6745229 6350715 6497865 6759810 6404023 6148056 5945645 5814413
15155 5814413 5818715 5813810 5562671 5481558 5966353 6260093 6169478 6390425 6382368 6435826 6040364
15144 6040364 5971732 5771565 5617739 6180652 5817810 5498223 5307894 5702140 5979359 5941170
15134 5941170 5413473 5834850 6574209 6361582 6446381 5912648 5119369 5295858 6168872 6044651
15124 6044651 6491741 6766885 6703537 6180565 5860194 6044955 6010307 5550626 5465638 6343485
15114 6343485 6212429 5528127 5758487 6354619 5397337 5572048 5618635 5131190 5828722 6434295
15104 6434295 6042967 5462902 5280785 5512228 5497455 5725305 5672850 6130247 6374152 5959822
15094 5959822 6056753 6748861 6383881 5659917 6017942 6416375 6257218 6196357 5867336 6105656
15084 6105656 5734732 5565449 5303709 5493722 6061221 5769832 6397096 6234354 6020150
15075 6020150 5687071 6106139 6112397 5934530 5814567 5836337 5936593 5936953 5997179 6502716 6826249
15064 6826249 7116488 6763384 6664987 6728070 6414867 6569954 6218041 6130938 5680628 6069160
15054 6069160 6576335 6420237 6261322 5748723 6217744 5836255 6326932 6698963 6215845
15045 6215845 6120435 5976943 5814359 6185145 6089035 6127561 6171536 6079373 6103137 6536335
15035 6536335 6106781 5863628 5499241 5852007 6093918 6023754 5827833 5737504 5824572 5370315
15025 5370315 5795964 5827139 5788091 5763697 6335026 6229768 5744142 6043008 6163511 6490138
15015 6490138 5785801 5531052 6187711 6446392 6414967 6263173 6108905 5944405 5594917 5667421
15005 5667421 5479834 5728732 5721622 5697276 5864307 5486863 6356872 6355876 6061286 5516446
14995 5516446 6137471 6108578 5821256 5611369 5972874 6586927 6593943 6106479 5836197 5673643
14985 5673643 5814527 6434206 6618789 6205985 6094129 6051818 5564213 5156166 5320374 5381860
14975 5381860 5398508 5806853 6049506 6379959 6346159 6012329 6037640 6663782 6859300 7107943
14965 7107943 6977022 6551459 6384782 6141759 5911972 5964211 6260190 6506746 6437249 5967890
14955 5967890 6149601 6220493 5869500 5818190 6033341 5996945 6315142 6011639 5932704 6241363
14945 6241363 6882558 6889727 6681755 6065728 5606746 5724374 5705126 5797614 5749399 5888800
14935 5888800 5996638 6246510 5966519 5681393 5639033 5765525 6187901 6594332 6761529 6222286
14925 6222286 5996888 5862561 5953762 6163030 5812266 6109479 5991400 6043029 6885587 6353280
14915 6353280 5907639 5830736 5834284 6090818 6331739 6574725 6219256 6181459 5871274 5881010
14905 5881010 5498921 5550453 5622828 5323778 5334561 5201934 5741878 5936297 6168016 6174723
14895 6174723 6504961 6713141 6207588 6131861 5759133 5808805 6113595 6634316 6162754 6158740
14885 6158740 6398642 6470712 6150544 6176475 6951484 6731405 6722231 6446423 5691408 5190846
14875 5190846 5612979 5760018 5668880 5432052 6091400 6467075 6069292 5755560 5987239 6779096
14865 6779096 6740701 6377195 6512559 6945278 6416091 6438382 6269738 6308280 6840876 6601638
14855 6601638 6124852 6322632 6944544 6600006 5576953 5733333 5812544 5683409 5827508
14846 5827508 6148110 6303307 5962184 5846741 5796611 5967508 6062093 6774914 6720165 6266725
14836 6266725 6704993 6723935 6812452 6210235 5777783 5994957 6532386 6006672 5471170 6231079
14826 6231079 5949894 5845546 5893373 5840356 5935635 5885411 6388463 6925412 6873751 6704524
14816 6704524 6755588 6329001 5887633 5991477 5994566 6142986 6373290 5918638 6026323 6304941
14806 6304941 6292484 6058309 6214094 6407763 6636663 6447690 6040583 5869521 5976366 6372307
14796 6372307 6732250 6134609 5955002 6294676 6178870 6669172 6499740 6228612 6007395
14787 6007395 5862928 5622009 6086960 6028611 6218352 6213282 6533810 6486658 6361962 6858237
14777 6858237 6453694 6067751 6575703 6158220 6139682 6621620 6005329 6126673 6332227 6167810
14767 6167810 5311904 5780291 6642739 6534953 5908928 5690339 5939244 5736109 5533924
14758 5533924 5602363 5714888 5720805 6456472 6666919 5637503 5820629 6280379 6208886 6266234
14748 6266234 6376140 6075845 6067670 6364842 5981252 5577142 5460575 5458816 5964290 6712817
14738 6712817 6838984 6467207 6424049 6385990 6611891 6630011 6620164 7154003 7145586 6709955 6188186
14727 6188186 6216686 6919314 6542635 6591890 6151514 6478097 6636514 6137661 6154495 6066474
14717 6066474 6197965 6321751 6824471 6605718 6095044 5323698 5421173 5854148 6566410 6532589
14707 6532589 6498988 6265008 6027527 6239391 6565909 6063259 6109247 6292211 5692365 5678382
14697 5678382 6018650 6214931 6763620 7025308 6713151 6357905 6392655 6369033 6072014 6466877
14687 6466877 6602406 6117473 5346612 5504381 5971305 6204854 6369901 6255501 6334615 5917508
14677 5917508 5798872 6559221 6464270 6243162 6957540 6726702 6793000 6996647 6976227 7102158
14667 7102158 6793215 6255830 6489379 6562426 6600364 6660024 6501856 6273879 5858450 5770375
14657 5770375 5968501 6353492 6586452 6322204 6030286 5992525 6876190 7302290 6715712 6490445
14647 6490445 6873181 6672686 6292206 6073874 6000103 5932932 6192832 6370648 6380846 6441407
14637 6441407 6398300 6809205 6442659 6296053 6554312 6346846 6388344 6877663 6382819 6521715
14627 6521715 6725225 6726125 6739035 7134010 6974913 6944160 7394740 7658119 6649961 6347664
14617 6347664 6459676 6614006 6738771 6692946 7007578 7087000 6677485 6525391 6739673 6512217
14607 6512217 6331822 6423022 6341547 6434567 7121041 6753492 6264009 6187833 6166622 5645404
14597 5645404 6191998 6894452 6953222 6837295 6758425 6757547 6585577 6303680 5711510 6242358
14587 6242358 6401627 5780672 5937449 7077154 7067470 6537758 6513908 6076516 5900815 6256411
14577 6256411 6423753 6320721 6580091 6433607 6238909 6444226 6416985 5874064 5382309 5851299
14567 5851299 6094902 5888178 6118625 5896514 6093866 6145707 6379171 6529043 6543816 6537283
14557 6537283 6263467 6766846 6291221 6548901 6613833 6577104 6436663 6086163 6333013 6543987
14547 6543987 6278254 6842690 7250656 7407073 7328882 6958845 7055870 6370781 6445795 6375452
14537 6375452 6049318 6798504 6916556 6316190 6389022 6456350 6598080 6896219 6971885 7457287
14527 7457287 6821356 6731961 6146866 6201918 6477435 6302472 6439658 6409648 6271180 6438714
14517 6438714 6265848 5917947 6528775 6658881 6063098 5515256 6034904 6319182 6614833
14508 6614833 6305319 6940434 6887378 6406364 6704787 6846593 6443838 6807290 7245850 6681336
14498 6681336 6581508 6427789 6865877 6749924 6906551 6830680 6021896 6373891 6392845 6709465
14488 6709465 6749136 6375945 6200225 6401164 6290482 6298966 6098971 6337856 6493067 6398829
14478 6398829 6730595 6745350 6142316 6146794 6568464 6995639 6647639 6523515 6459334 6982966
14468 6982966 7294367 6275524 5942156 6311790 6032736 6299628 6345241 6154168 5822176
14459 5822176 5956803 5796973 5811079 6021413 6377156 6445430 6724013 7116222 6760589 6765444
14449 6765444 6704087 6706373 6287826 6113592 6519004 6773300 6467704 6348623 6574347 6749028
14439 6749028 6062235 6150633 6395034 6772370 6341523 5857273 6755815 6981973 6924172 7265603
14429 7265603 7167932 6892119 6761268 6945344 6989719 6991042 7099684 7185641 6795137 6456645
14419 6456645 6603732 6040123 5611706 6039583 6624689 7066252 6610708 6432468 6413435 6332236
14409 6332236 6481898 6715601 6491603 6560353 6673282 6651359 6721585 6698733 6905241 6771278
14399 6771278 6650624 6317380 6749956 6942647 6349994 6560294 6203830 5893407 6032700
14390 6032700 6546606 6670708 6287333 6316218 6405595 6424615 6367400 6461586 6740040 6881931
14380 6881931 6756380 6910492 6795164 6884449 7353950 7201976 7073058 7105173 6584267 6564264
14370 6564264 7042841 6600244 6307688 6326273 6732016 6477570 6588042 6527524 6609858 6897853
14360 6897853 6657688 6477104 6440041 6439244 5952109 6140019 5928798 5861857 6421009 6380279
14350 6380279 6685613 6594661 6194733 6016092 6610399 6585280 6496466 6630902 6897727 6306640
14340 6306640 6215967 6648042 6308214 6384467 6621069 6899690 6640368 6542843 7016998 7138762
14330 7138762 6786183 6656052 6439971 6531738 6372689 6050356 6607191 7012421 7062934 7284683
14320 7284683 7310883 7021334 6885957 6453363 6506898 6225363 6116360 6520929 6473045 6509174
14310 6509174 6407636 6335041 6100005 6045165 6035389 6292821 6005467 6390328 6936429 6399718
14300 6399718 6609176 6496224 6743711 6694123 6807896 6913114 6745031 6790404 6175738 6019468
14290 6019468 6110684 6677008 7326181 7145519 6730415 6251949 6134606 7034909 7022255 6852785
14280 6852785 6900744 7209985 7334742 7462698 7263338 7286106 7105095 6651456 6318206 6239762
14270 6239762 6626026 7131047 6662442 6307555 6310263 7187217 6591081 6105901 6476011 6741887
14260 6741887 6799382 7047929 6636986 6601430 6824425 6802588 6454180 6565690 6668138 6827343
14250 6827343 7204952 6535059 6208340 6808973 7343453 6971149 7239625 6916172 6697604
14241 6697604 6588365 6965560 7171708 7078262 6740192 7002219 7100708 6885467 6160411 5986689
14231 5986689 6785799 6738009 6226058 6391303 6392546 5837887 6052291 6375416 6454535 6699595
14221 6699595 6798443 6721042 6517681 6712142 6959657 7204008 7519384 7335560 7526050 7403527
14211 7403527 7187714 6883147 6672875 6695395 7079506 7123479 7024903 6979329 6899759 6996399
14201 6996399 6757748 6962355 7467033 7697259 6889695 6437972 6546183 6642477 6595904 6742097
14191 6742097 6518132 6048576 6065604 6669936 6782753 6776257 6967727 6453947 7310790 7241910
14181 7241910 6683255 6371280 6053826 6028076 6329085 7006776 7201342 6925445 7060388 7188037
14171 7188037 6533597 6538344 6856185 6542432 6499987 6601738 6601126 6975662 7421810 6955416
14161 6955416 6719406 6632077 6209665 6709262 6461576 6465401 6544233 6459563 6961179 6600191
14151 6600191 5980250 6313589 6330006 6499117 6873564 6605839 6535293 6492577 6248829 6460120
14141 6460120 6828762 7530132 6521172 6592392 6411687 5989427 6389554 6653661 6301947
14132 6301947 6335366 6198503 6317202 6698891 6779345 6800147 6386641 6346900 6610908 6731074
14122 6731074 6354617 6289555 6516332 6019410 5901005 6461782 6648847 6969098 6881339 6630463
14112 6630463 6590902 5958425 6378486 7079384 6830380 7006946 6685069 6327837 6498361 6304406
14102 6304406 6420642 6837400 7043785 6893909 6389105 6179475 6285585 6844574 6788931 6208492
14092 6208492 6418754 6568764 6465461 6680902 6391618 6464411 6752401 6797461 6356494 6206568
14082 6206568 6276572 6572917 7015214 7003441 7011728 6906809 6613715 6942735 6989031 7221859
14072 7221859 7047665 7153935 7501043 7249468 6757529 6855235 7013004 6841165 6992167 7062687
14062 7062687 7086672 7150636 6844839 7024606 7049765 6884980 6883391 6717670 6523926 6965953
14052 6965953 7218855 6482037 6648746 7032581 7104931 7223452 7032875 6843771 6741241 6814940
14042 6814940 7156811 7390045 7265182 6986049 7169679 7118110 7090063 7142976 7051412 7175809
14032 7175809 7414735 7374292 6989491 6950144 7112452 6989634 7280379 7038339 6725912 6780592
14022 6780592 6714314 6825959 7156236 7295135 6861638 7459637 7479170 7266714 6817131 6711708
14012 6711708 6708371 6669987 6450329 6476378 6751347 7037817 7056580 7521951 7470472 6964549
14002 6964549 7368263 7389992 7263783 7369684 7251915 6935252 7047810 7456907 7078921 6741225
13992 6741225 6703832 6735820 6741897 6636563 7155208 7060327 7491954 6785715 6328818 6583980
13982 6583980 7022825 7087403 6989034 7358941 7085170 7232866 7209672 7312368 7391629 6415683
13972 6415683 6246200 6266195 6472566 6733517 6527359 5989197 6680397 6988279 6636062 6955004
13962 6955004 7017265 7046867 6745920 6855031 7357619 7164175 6930701 6885282 6391919 6854760
13952 6854760 6491509 7353134 7697705 7295867 7176073 6958826 7056316 6886687 7012471 6940060
13942 6940060 6758491 6852785 6957376 6924041 6779129 7067953 6568446 6495743 6715256 6524447
13932 6524447 7196426 7287894 6845668 6482022 6260878 6876153 6909766 6909707 6664319 6741755 7069858
13921 7069858 6846341 7029185 7142613 7269890 7035685 6582445 6176271 6440688 6477690 6916172
13911 6916172 6375829 6612834 7097385 7056737 6629521 6930273 7036314 6728608 7384252 7696420
13901 7696420 7255500 6853618 6528124 6702413 6629642 7038766 7153159 6992747 7093814 7323011
13891 7323011 7590584 7154229 6485678 6543104 6641790 6752603 7017394 7072228 6822151 6608745
13881 6608745 6492779 7377799 7478758 7062056 6947722 7071625 7194104 6911671 6453254
13872 6453254 7063727 7321895 7151652 7359449 7256376 7254044 7301584 6665820 6469992 6978683
13862 6978683 6762639 6790040 6749792 7157933 7031815 7011934 6967790 7165289 6936240 6964051
13852 6964051 7332630 6906268 7146940 7452658 7028236 6681134 6378961 6945203 7279633
13843 7279633 6986100 6774316 6711994 6328472 6353992 6867188 7286556 7464915 6987585 6890524
13833 6890524 7322747 7397903 6814816 6586827 6537877 6934820 7491669 7352190 7582984 7130061
13823 7130061 6845811 6998366 6685811 7015467 6870719 6782137 7126714 6318209 6779293 6846137
13813 6846137 6674911 6501863 6436470 6793942 7130022 7111493 7127896 7442418 7259110 7334864
13803 7334864 7285450 7044315 7107104 7037544 7605431 7850419 7803713 7802783 7364312 7287797 7824310
13792 7824310 7217477 7103190 7233025 6765419 6958787 6999701 7461947 7915413 7672205 7876276
13782 7876276 7682592 7269985 7123839 7133776 7602779 7369807 7056291 7274879 7467564 7379619
13772 7379619 7185497 7196930 6672949 7162364 7394849 7224990 7019786 7304672 7478847 7344702
13762 7344702 7312500 7079123 6758195 6873968 6684955 6895279 7164575 6703650 6716460 6724024
13752 6724024 6927864 6894424 7186532 7092150 7577227 7387351 7184667 7244639 6896835 7338942
13742 7338942 7310219 6945222 6800780 6774313 7016427 6655883 6749178 7312719 8124668 8166819
13732 8166819 7691195 7329135 7053020 7036212 7419259 7991686 7588901 6781280 6880700 7098701
13722 7098701 6906657 7070436 7265496 6998487 6850837 6813893 7000416 6681147 6962798 7649291
13712 7649291 7642500 7018533 7262220 7601351 7437598 7216604 7445706 7128189 6836740 6840120
13702 6840120 6625122 6344162 6376157 6902242 7082982 7616020 7630103 7905820 7235131 6782954
13692 6782954 7055212 7124414 7183854 7160017 7298743 7156020 7347276 7276384 6726158 6666802
13682 6666802 6751199 7350176 7257483 7453897 8155093 8465418 8186403 7809215 8270370 7402864
13672 7402864 7279910 7351505 7726450 7054683 6523804 6814646 7520133 7354015 7361746 7314462
13662 7314462 7661085 7637337 7414559 7554432 7255894 7408476 7252869 7213335 7251002 7676889
13652 7676889 7626684 7078926 7079752 6896772 6804678 7419996 7616209 7137700 7225045 6707206
13642 6707206 6826001 7523358 7233547 7148314 7243787 7650404 7818607 7600656 7478454 7744015
13632 7744015 8042368 7931999 7555476 7574609 7809048 7485148 7061279 7012031 7095878 6809944
13622 6809944 6403964 6901354 6887977 7020549 7344471 7180006 7308796 7144610 7562646 7547138
13612 7547138 7701841 8211685 7707791 7182082 7192114 7287546 7275924 7493300 7089486 7374618
13602 7374618 7770303 7921047 7518332 7489367 7177073 7680893 7226835 7184244 6849584 7293510
13592 7293510 7356521 7392280 7417820 7242029 7026604 6687999 7062211 6786035 6849452 6917781
$$ [...]
##END NTUPLES=NMR SPECTRUM
##END=
