##TITLE=1H_DE-80H_X3
 200.13MHz, d2o
 8 sc
 
 19ns.26.2.2025
##JCAMPDX= 6.0         $$ Bruker NMR JCAMP-DX V2.0
##DATA TYPE= NMR SPECTRUM
##DATA CLASS= NTUPLES
##ORIGIN= UXNMR, Bruker Analytische Messtechnik GmbH
##OWNER= pz
$$ XWIN-NMR		Version 3.5
$$ Fri Mar 20 10:46:05 2026 Russian Standard Time (UT+4h)  Yarkov@DPX200
##.OBSERVE FREQUENCY= 200.1313
##.OBSERVE NUCLEUS= ^1H
##.ACQUISITION MODE= SIMULTANEOUS
##.ACQUISITION SCHEME= undefined
##.AVERAGES= 8
##.DIGITISER RES= 18
##SPECTROMETER/DATA SYSTEM= spect
##.PULSE SEQUENCE= zg30
##.SOLVENT NAME= CDCl3
##.SHIFT REFERENCE= (INTERNAL, CDCl3, 0, 15.4637)
##AUDIT TRAIL= $$ (NUMBER, WHEN, WHO, WHERE, WHAT)
$$ ##TITLE= Audit trail, XWIN-NMR		Version 3.5
$$ ##JCAMPDX= 5.01
$$ ##ORIGIN= Bruker BioSpin GmbH
$$ ##OWNER= Yarkov
$$ C:/Bruker/XWIN-NMR/data/yarkov2/nmr/H-C/1/pdata/1/auditp.txt
$$ ##AUDIT TRAIL=  $$ (NUMBER, WHEN, WHO, WHERE, WHAT)
(   1,<2026-03-20 10:44:59.25 +0400>,<Yarkov>,<DPX200>,
      <created by zg, POWCHK disabled, PULCHK disabled
       configuration hash MD5:
       00 E9 B6 7A A2 85 ED C7 34 08 36 98 17 FE 4E 26
       data hash MD5: 16K
       FC 37 1A 12 B3 BE F3 60 E8 91 79 23 2E C8 EE 37>)
(   2,<2026-03-20 10:45:16.01 +0400>,<Yarkov>,<DPX200>,
      <Start of raw data processing
       efp BC_mod = 2 LB = 0.25 FT_mod = 6 PKNL = 1 PHC0 = -5299.148 PHC1 = 6.821927 SI = 16K 
       data hash MD5: 16K
       12 C9 F6 8E FE 94 3A C0 88 A3 93 7D 9E D3 61 8C>)
$$ ##END=
$$ 
$$ hash MD5
$$ 0E D1 E6 CD 27 16 3B 38 A9 B5 CF B0 5F 64 BD 6D
##$RELAX= 
##$RELAX= 
##$RELAX= 
##$RELAX= 
##$RELAX= 
##$RELAX= 
$$ Bruker specific parameters
$$ --------------------------
##$DU= <C:/Bruker/XWIN-NMR>
##$EXPNO= 1
##$NAME= <H-C>
##$PROCNO= 1
##$TYPE= <nmr>
##$USER= <yarkov2>
##$AMP= (0..31)
100 100 100 100 100 100 100 100 100 100 100 100 100 100 100 100 100 100 
100 100 100 100 100 100 100 100 100 100 100 100 100 100 
##$AQSEQ= 0
##$AQ_mod= 1
##$AUNM= <au_zg>
##$AUTOPOS= <>
##$BF1= 200.13
##$BF2= 200.13
##$BF3= 200.13
##$BF4= 200.13
##$BF5= 200.13
##$BF6= 200.13
##$BF7= 200.13
##$BF8= 200.13
##$BYTORDA= 1
##$CFDGTYP= 0
##$CFRGTYP= 5
##$CHEMSTR= <none>
##$CNST= (0..31)
1 1 145 1 1 1 1 1 1 1 1 1 1 1 1 1 1 1 1 1 1 1 1 1 1 1 1 1 1 1 1 1 
##$CPDPRG= <>
##$CPDPRG1= <>
##$CPDPRG2= <>
##$CPDPRG3= <>
##$CPDPRG4= <mlev>
##$CPDPRG5= <mlev>
##$CPDPRG6= <mlev>
##$CPDPRG7= <mlev>
##$CPDPRG8= <mlev>
##$CPDPRGB= <>
##$CPDPRGT= <>
##$D= (0..31)
0 0.7 0 0 0 0 0 0 0 0 0 0.03 0 0 0 0 0 0 0 0 0 0 0 0 0 0 0 0 0 0 0 0 
##$DATE= 1773989098
##$DBL= (0..7)
120 120 120 120 120 120 120 120 
##$DBP= (0..7)
150 150 150 150 150 150 150 150 
##$DBP07= 0
##$DBPNAM0= <>
##$DBPNAM1= <>
##$DBPNAM2= <>
##$DBPNAM3= <>
##$DBPNAM4= <>
##$DBPNAM5= <>
##$DBPNAM6= <>
##$DBPNAM7= <>
##$DBPOAL= (0..7)
0.5 0.5 0.5 0.5 0.5 0.5 0.5 0.5 
##$DBPOFFS= (0..7)
0 0 0 0 0 0 0 0 
##$DE= 6
##$DECBNUC= <off>
##$DECIM= 32
##$DECNUC= <off>
##$DECSTAT= 4
##$DIGMOD= 1
##$DIGTYP= 9
##$DL= (0..7)
0 120 120 120 120 120 120 120 
##$DP= (0..7)
$$ [...]
##$SUBNAM2= <"">
##$SUBNAM3= <"">
##$SUBNAM4= <"">
##$SUBNAM5= <"">
##$SUBNAM6= <"">
##$SUBNAM7= <"">
##$SUBNAM8= <"">
##$SUBNAM9= <"">
##$SW= 18.0517328524113
##$SWIBOX= (0..15)
0 0 2 0 0 0 0 0 0 0 0 0 0 0 0 0 
##$SW_h= 3612.71676300578
##$TD= 16384
##$TD0= 1
##$TE= 0
##$TE2= 300
##$TE3= 300
##$TEG= 300
##$TL= (0..7)
0 120 120 120 120 120 120 120 
##$TP= (0..7)
150 150 150 150 150 150 150 150 
##$TP07= 0
##$TPNAME0= <>
##$TPNAME1= <>
##$TPNAME2= <>
##$TPNAME3= <>
##$TPNAME4= <>
##$TPNAME5= <>
##$TPNAME6= <>
##$TPNAME7= <>
##$TPOAL= (0..7)
0.5 0.5 0.5 0.5 0.5 0.5 0.5 0.5 
##$TPOFFS= (0..7)
0 0 0 0 0 0 0 0 
##$TUNHIN= 0
##$TUNHOUT= 0
##$TUNXOUT= 0
##$USERA1= <user>
##$USERA2= <user>
##$USERA3= <user>
##$USERA4= <user>
##$USERA5= <user>
##$V9= 5
##$VALIST= <valist>
##$VCLIST= <CCCCCCCCCCCCCCC>
##$VD= 0
##$VDLIST= <DDDDDDDDDDDDDDD>
##$VPLIST= <PPPPPPPPPPPPPPP>
##$VTLIST= <TTTTTTTTTTTTTTT>
##$WBST= 1024
##$WBSW= 4
##$XGAIN= (0..3)
0 0 0 0 
##$XL= 0
##$YL= 0
##$YMAX_a= 152855
##$YMIN_a= -144587
##$ZGOPTNS= <>
##$ZL1= 120
##$ZL2= 120
##$ZL3= 120
##$ZL4= 120
##$ABSF1= 0
##$ABSF2= 0
##$ABSG= 0
##$ABSL= 0
##$ALPHA= 0
##$AQORDER= 0
##$ASSFAC= 0
##$ASSFACI= 0
##$ASSFACX= 0
##$ASSWID= 0
##$AUNMP= <proc_1d>
##$AZFE= 0.1
##$AZFW= 0.1
##$BCFW= 0
##$BC_mod= 2
##$BYTORDP= 0
##$COROFFS= 0
##$CY= -3
##$DATMOD= 1
##$DC= 0
##$DFILT= <>
##$DTYPP= 0
##$F1P= 0
##$F2P= 0
##$FCOR= 1
##$FTSIZE= 16384
##$FT_mod= 6
##$GAMMA= 0
##$GB= 0
##$INTBC= 1
##$INTSCL= 3.241238e-09
##$ISEN= 128
##$LB= 0.25
##$LEV0= 0
##$LPBIN= 0
##$MAXI= 10000
##$MC2= 0
##$MEAN= 0
##$ME_mod= 0
##$MI= 1.114404
##$NCOEF= 0
##$NC_proc= -8
##$NLEV= 6
##$NOISF1= 3.799351
##$NOISF2= 2.8
##$NSP= 0
##$NTH_PI= 0
##$NZP= 0
##$OFFSET= 15.46373
##$PC= 1
##$PHC0= -5299.148
##$PHC1= 6.821927
##$PH_mod= 1
##$PKNL= yes
##$PPARMOD= 0
##$PSCAL= 0
##$PSIGN= 0
##$REVERSE= no
##$SF= 200.130011602145
##$SI= 16384
##$SIGF1= 3
##$SIGF2= 2
##$SINO= 0.751879
##$SIOLD= 32768
##$SREGLST= <19F.Aceton>
##$SSB= 0
##$STSI= 16384
##$STSR= 0
##$SW_p= 3612.71676300578
##$SYMM= 0
##$S_DEV= 0
##$TDeff= 16384
##$TDoff= 0
##$TI= <>
##$TILT= no
##$TM1= 0
##$TM2= 0
##$TOPLEV= 0
##$USERP1= <user>
##$USERP2= <user>
##$USERP3= <user>
##$USERP4= <user>
##$USERP5= <user>
##$WDW= 1
##$XDIM= 16384
##$YMAX_p= 457461033
##$YMIN_p= -1501167
$$ End of Bruker specific parameters
$$ ---------------------------------
##NTUPLES= NMR SPECTRUM
##VAR_NAME=  FREQUENCY,     SPECTRUM/REAL,   SPECTRUM/IMAG
##SYMBOL=    X,             R,               I
##VAR_TYPE=  INDEPENDENT,   DEPENDENT,       DEPENDENT
##VAR_FORM=  AFFN,          ASDF,            ASDF
##VAR_DIM=   16384,         16384,           16384
##UNITS=     HZ,            ARBITRARY UNITS, ARBITRARY UNITS
##FACTOR=    0.220516191357247, 1,           1
##FIRST=     3094.75643597372, 0,            0
##LAST=      -517.960327032065, 0,           0
##MIN=       -517.960327032065, -1501167,    0
##MAX=       3094.75643597372, 457461033,    0
$$ Real data points
##PAGE= N=1
##DATA TABLE= (X++(R..R)), XYDATA
$$ [...]
8026 -52846 49658 114587 111890 232246 73609 376977 -89645 -62703 -8957 118651 216213
8015 216213 -29854 126920 257477 181340 -25473 -77607 -65143 75658 47353 158131
8005 158131 226875 181753 -110601 195132 103354 100413 217890 67108 -19281 249973 133216
7994 133216 259358 443620 458541 360816 -3303 -215814 -262480 -178934 -32779 -116930 -189201
7983 -189201 -75344 -24177 38919 -201612 -266386 -157254 26917 -143496 99793 1890
7973 1890 56920 -49621 -308680 -74102 157202 205305 271903 401877 177015 67535 -157683
7962 -157683 -128896 52949 76637 90293 165233 186497 224221 33461 28427 251215 313351
7951 313351 85479 -48244 -99024 28912 161992 184040 173607 23565 -88535 103037
7941 103037 102865 122773 -12096 -142714 -2413 -4041 55538 -13742 -24219 128279 233507
7930 233507 -34175 -327865 -389145 -300922 -242108 271220 128497 265430 301135 -83010
7920 -83010 1536 70432 152212 289353 42524 8519 172210 362270 382374 280716 252387
7909 252387 148168 82298 124539 221124 15361 -13172 186084 481830 263083 81483
7899 81483 15485 -7906 173278 353608 138923 47609 278648 209564 330392 263311 168936
7888 168936 -16064 39205 61726 235503 226937 162597 -122295 -95113 182677 215753 -35123
7877 -35123 197613 458674 166780 -126000 -158436 -54698 -109170 -8615 -209490 -37693
7867 -37693 174869 411879 309428 -23987 287703 155150 -51995 37390 57740 50673 210101
7856 210101 298868 203168 140143 31099 97592 351000 420405 -12952 -15148 52835 105695
7845 105695 -76807 -13451 63242 59466 182208 102234 47563 185502 176177 71638 368416
7834 368416 363127 -49836 89078 215531 326637 204076 155735 137477 180172 291920 243378
7823 243378 21491 -194367 -105066 -130450 137798 178071 245779 593139 492515 275725
7813 275725 134920 -21124 -184229 -340337 -219078 256624 148302 609431 289582 -223695
7803 -223695 -54633 -36545 -89347 28509 -26959 -335446 77537 156328 51060 11283 -9831
7792 -9831 148429 140519 2798 -71105 -180137 139854 241033 -6450 -15077 -215620 -366992
7781 -366992 -289380 -169323 -20836 -154413 -200479 117218 175337 97401 6245 -42120 -23131
7770 -23131 378300 553755 289512 150760 -45023 -56670 343607 43330 -232733 -111679
7760 -111679 -171358 90072 337960 295897 150910 91703 -210199 2877 189264 128787
7750 128787 -61684 -179932 47033 -34569 47867 75358 -45427 7191 -130920 213651
7740 213651 153153 218387 317614 208622 -89751 36667 -95484 49706 70716 64592 476691
7729 476691 154805 4173 113799 -148718 -370137 -417247 -252442 84044 99300 396936
7719 396936 97726 -92509 32004 200165 403184 351202 153987 298045 260152 69901
7709 69901 60658 111989 18179 -224766 -216626 85131 115971 -107343 -401942 -385772 -197944
7698 -197944 42411 53942 -93259 209039 185439 244945 304590 270654 341603 203828 132395
7687 132395 125522 127392 -58494 -291399 -216394 -304198 -42703 129123 205060 264000 162075
7676 162075 15798 26022 119748 -62079 17090 105006 -8136 63280 174920 -72077 -84308
7665 -84308 224834 -776 -74432 -122816 15348 198965 193738 265303 62601 63740 35917
7654 35917 -64100 30535 -113057 93518 171616 151736 44308 -25080 189362 421416 438877
7643 438877 353957 132383 242393 294880 188890 219815 308 23391 115197 -78087 -93204
7632 -93204 -230690 -34688 -105473 109479 394449 416651 294892 59472 175353 294505
7622 294505 262890 114472 21737 38144 372171 239699 205796 -154510 15841 287616
7612 287616 126262 -163816 90088 -72792 -205700 -26191 110937 126788 190725 242942
7602 242942 140640 325151 506483 308733 216507 157796 -40517 -190607 135540 232879
7592 232879 4339 -6816 -137272 -342219 -264986 -128865 -296115 -108810 -73662 -253143
7582 -253143 -190019 -123413 -256319 -263659 -47475 -54725 -179816 -283498 -204460 -175521 20815
7571 20815 63632 176976 160291 107104 22138 86203 166207 310552 113520 378092 458173
7560 458173 205514 73518 34466 763 -97937 54549 -189304 -126990 -26195 79186
7550 79186 -4352 -69505 -54111 127770 277260 391245 168997 -147374 -42192 81632
7540 81632 220476 44378 19499 183564 335451 241466 91154 -16503 -268707 -145676
7530 -145676 -112581 -126509 -163794 -14938 -104466 -4851 203586 -33011 -417667 -275933 -3018
7519 -3018 73431 327110 178078 -101270 10441 299002 131990 -129144 -52452 -101213 115397
7508 115397 175998 -4730 -166098 143736 135423 146905 26453 238544 252236 243489 -2809
7497 -2809 -255432 -197914 79020 200050 360302 269630 -30823 32084 -82430 72973 51839
7486 51839 -225668 -30110 85352 -180604 -207619 -287999 -144158 -234648 -148436 62714 45083
7475 45083 -18799 -215642 -223365 -220733 -274922 -19968 238429 44889 -33244 -52304 -55492 -16793
7463 -16793 1962 153949 144685 285076 407885 382367 385307 229185 282432 116476 91342
7452 91342 180896 82105 308289 157016 25883 86824 -84052 62159 493924 323168
7442 323168 -9636 99836 239832 104963 243306 39068 1546 22342 115815 13869
7432 13869 -121958 53569 127291 216519 49568 217483 212375 -43362 -101035 -140161 82977
7421 82977 164238 -36524 220700 299725 209717 145702 137454 221773 270773 251714 18241
7410 18241 178982 471612 220882 215301 264709 -29487 41352 133316 -32857 26319 137858
7399 137858 173773 102262 269541 327541 270949 3623 -76432 -145011 -29559 138114 60448
7388 60448 249582 159567 282286 -143755 58618 -59684 -33650 32788 23710 -32764 117512
7377 117512 242586 266004 258824 15984 16358 -3845 98614 142198 158209 54439 125881
7366 125881 377172 444198 146537 -60324 13634 -49375 60675 62825 -111810 -11236 195117
7355 195117 182396 106154 -138498 -358647 -176303 81814 119681 -8551 -124555 -144204
7345 -144204 -135409 -137723 -108238 -168127 -104649 245555 479330 332389 420800 434937 148305
7334 148305 362907 430912 420887 419075 354061 411171 260285 194060 288106 52613 -127844
7323 -127844 -84831 -16839 116080 152798 72480 146686 296800 111590 172418 129631 101824
7312 101824 43920 118680 84296 88038 51576 95877 275094 238195 272736 345566 196875
7301 196875 163663 77038 -40056 -256477 -114194 16928 -192916 -125340 121533 198077
7291 198077 309255 239252 376902 160381 -83777 -101157 108363 289877 223193 75970
7281 75970 -52913 40864 2771 -51847 317716 365238 365531 366287 521608 484425 300817 203940
7269 203940 243424 252701 48839 35586 98642 -250726 -519511 -324216 -168992 -201314 -212538
7258 -212538 -49810 -42851 -2212 201382 275060 52794 -23899 -194290 -141075 141306 206668
7247 206668 227806 10718 -118787 64374 -291110 -206544 177203 605 -72899 131783
7237 131783 114652 25132 168280 288860 48413 -88305 -200207 -124871 240973 153095
7227 153095 -206404 68454 -7124 159307 82615 16117 285262 132097 -46111 -71038
7217 -71038 27516 22642 121038 -135995 -49870 448467 299105 27728 -14361 115856 79238
7206 79238 240563 89098 227522 413106 307009 405857 400289 189751 203550 185994 87622
7195 87622 217275 236673 145760 -70868 10926 262405 311159 446410 470827 318785 17795
7184 17795 153897 403017 227774 -18720 -45515 -142409 -133997 -17761 -50168 352020 15195
7173 15195 -105810 28482 98348 112544 -85020 5262 -42344 -261791 -258284 -64552 -117473
7162 -117473 58369 256638 255735 452969 272584 192207 247619 485776 117883 193463 322597
7151 322597 101493 -20859 -131849 149372 -31880 -98106 40313 93214 178029 407945
7141 407945 407200 228723 121587 38859 -81075 -149387 -220355 -62826 -168262 -185145 -5287
7130 -5287 156973 185325 -85216 -209363 -88834 52050 122095 -171983 -243617 -284189 -1619
7119 -1619 -15776 63912 124104 -41634 -133772 -70051 -65864 -244624 -45862 -13842 15405 -97406
7107 -97406 40815 60471 341346 374535 316416 292763 276098 250526 350169 330404 115772
7096 115772 156455 513354 619536 475419 582234 389486 249522 33084 -123345 86918
7086 86918 65143 281263 264195 266882 239419 -10812 -81398 13861 777 -236448 -229275 -43846
7074 -43846 -92027 -77922 28959 130588 216244 379088 302187 235529 45006 -17757 100748
7063 100748 268732 156999 -25581 -926 -187666 -19104 -58322 -76830 -255688 -274931
7053 -274931 -14311 29649 246842 400001 366978 244849 129379 247100 318831 122586
7043 122586 102247 -117959 18624 323391 731956 445343 475986 644097 336840 330863
7033 330863 465541 722343 549150 500234 416115 561435 487172 567281 461459 451207 662662
7022 662662 533510 268237 234693 283399 157196 405339 612242 445066 696044 102134
7012 102134 307291 346512 158754 217380 218997 123081 -2108 199863 281509 349722 130165
7001 130165 -119744 -35480 65957 136041 229505 283514 226041 335603 270369 323892 274924
6990 274924 -22810 249908 250666 292790 138328 402793 471358 209601 -11496 153498 474236
6979 474236 430274 135428 63528 166340 127967 7867 5622 14017 501363 480347 241073
6968 241073 221342 -130366 -12264 -56327 14907 176032 -41948 -171178 123350 107111
6958 107111 12065 231195 188593 396067 297120 26526 -2270 142427 231753 314149 279233
6947 279233 208733 154429 106566 197341 164023 382652 278554 52848 83556 410277 296408
6936 296408 128994 260057 108764 145627 158868 333742 448046 139120 195031 400096
6926 400096 300576 367739 214563 -76913 -141960 -261878 138590 451272 277160 133287
6916 133287 114712 360030 281652 264222 424800 318576 99195 203326 385306 228617
6906 228617 -27720 52282 -5061 -122637 -45501 301174 314535 233350 203346 153646 239421
6895 239421 708949 559201 -22258 14559 52365 235070 345038 282993 403200 408338 335571
6884 335571 231604 119297 -119 48031 93417 172013 83293 45631 -57622 -90969 -35995
6873 -35995 290727 329657 -46467 175954 261379 281128 212550 174497 -167387 -74084 231354
6862 231354 451666 345811 557416 623512 567830 628543 696290 682107 526761 307389 471495
6851 471495 521687 574091 451952 186926 412486 571511 390689 381671 644806 538354
6841 538354 365431 471083 171176 92822 327140 544673 313144 109457 272312 324359
6831 324359 315999 449137 630542 406601 257715 506557 866163 472444 304108 234549
6821 234549 152301 298590 363275 119422 128104 291439 163305 132885 307843 177770 253381
6810 253381 622362 682708 576037 527505 475223 424540 292871 150549 260517 460949
6800 460949 439198 177473 335358 589922 389792 335472 368219 306280 337352 427737 389581
6789 389581 118225 224046 126042 336840 269634 363170 523591 254326 257275 56229 76430
6778 76430 111796 -116056 -157935 12657 -12389 -14733 115292 222916 -1166 -51814 35341
6767 35341 5151 265358 246690 208212 366319 396299 275411 173464 174151 78270 217264
6756 217264 38523 -94716 105247 293380 447183 277870 86797 57282 99934 132725
6746 132725 -172476 -29928 136586 79516 35089 110381 93923 176302 -106738 237825 362227
6735 362227 67533 113548 438838 242196 325144 242555 160244 23273 -244498 157009
6725 157009 153533 102505 71382 339151 103714 181332 366338 459331 288094 471161 365289
6714 365289 281796 246027 285446 265078 208501 18881 -176415 -96145 147286 372448 155555
6703 155555 465207 544070 657767 228128 242305 115303 120760 77045 138751 230696 430721
6692 430721 336501 280934 528495 373730 653348 630593 481100 371518 61152 -40773
6682 -40773 43308 150806 249446 331585 564585 458817 489700 395216 422744 285164 134573
6671 134573 -4342 184651 139805 -18229 100475 295632 308505 479594 649546 593849
6661 593849 800918 512882 280407 565692 367663 409556 332948 410810 342561 450576
6651 450576 405274 276185 379679 393714 415557 230572 336571 396722 417420 333055 237362
6640 237362 552950 684864 623443 561768 487519 345802 475185 616379 459798 427261
6630 427261 223301 292637 379106 607718 595855 267888 381391 228582 140415 386425
6620 386425 339872 17493 95998 575114 827187 563043 496184 464976 256560 382889
6610 382889 494261 452380 389816 677847 711368 443272 674864 595388 399518 435722 397150
6599 397150 666109 526861 496701 849942 542177 521968 457274 363523 313744 490447 506323
6588 506323 713693 516292 332914 449509 640757 590116 506059 540016 422739 439856
6578 439856 436486 646428 690117 538666 612979 484541 433439 420670 428728 519212 275227
6567 275227 491712 576560 496427 516738 687703 151596 274355 264321 419372 354394 220962
6556 220962 255016 499324 192555 419435 506940 527053 468664 400997 411977 397071 288734
6545 288734 461629 520448 596273 799272 723589 602774 535132 421779 366430 502454 327015
6534 327015 365616 679321 500862 622822 518947 518174 920572 944691 774589 851214 869911
6523 869911 725474 889683 671793 536242 414491 642754 1015296 962941 740402 560359
6513 560359 565713 709607 584931 523108 606239 680218 445943 336687 230435 216653 165271
6502 165271 415237 505893 569891 588238 706745 591550 457753 447395 494035 649991 902850
6491 902850 549234 545754 967036 1025279 621517 729714 814111 785643 570286 448863 540017
6480 540017 935798 812710 599104 759432 722774 815076 978012 853180 759009 566405
6470 566405 831789 802871 359461 165466 59407 381443 725168 777330 466299 405869
6460 405869 416686 575834 575010 405384 507422 573471 648458 594790 25527 358369 508539
6449 508539 676884 678262 691693 687303 751717 531502 623104 627624 348123 619821 757580
6438 757580 544520 478226 453812 599075 678801 494280 551651 510023 627216 517673 739416
6427 739416 914111 832875 915320 912411 936481 819601 654408 688867 640909 746990 669416
6416 669416 875554 497152 499862 754626 984606 1095110 1105529 1052652 935117 482108
6406 482108 668317 813542 971367 912563 565022 537722 510679 516775 817872 908375 612924
6395 612924 980106 795071 723123 863758 1008489 1118243 1029995 809577 875143 986319
6385 986319 860942 746890 532281 586662 779617 618278 665654 615742 712125 799691 958321
6374 958321 953887 883926 716638 537594 629263 805748 727800 604523 621546 826190 596487
6363 596487 852496 873897 834470 942785 958941 1101355 925938 903556 1243125 936853
6353 936853 887831 938275 770489 485107 377563 469260 683609 731118 825171 750428 644415
6342 644415 818319 1141810 1074345 1221670 1601810 1264891 1250980 1265485 1216413 1020309
6332 1020309 957302 1134549 1405463 1558114 1553850 1431408 1560122 1729578 1443739 1551949
6322 1551949 1684014 1738017 1804395 1417757 1762622 1979527 1921342 1955252 1932125 1906722 1868638
6311 1868638 1664585 1768791 1795865 1751864 1608079 1684721 2047279 1783001 1740594 1914402
6301 1914402 2136651 2411800 2728574 2917418 2868648 2955920 2881578 2799355 3070585 2997395
6291 2997395 2971065 3166945 2674867 2618510 2586063 2412828 2287802 2170798 2310923 2214930
6281 2214930 2160205 2159722 1944307 2213206 2332284 2554824 2701273 2470892 2664130 2819334
6271 2819334 2814804 2830027 2470277 2491718 2793824 2630610 2801398 2881972 2544254 2545102 2754479
6260 2754479 2708319 2612591 2574715 2394300 2487355 2604495 2530845 2278158 2153942 2372505
6250 2372505 2529969 2218181 2189580 2091765 2224039 2339116 2345732 2329666 2115711 2292471
6240 2292471 2522329 2610652 2454352 2515273 2566478 2420398 2217775 2196508 2355090 2559048
6230 2559048 2618877 2804508 2510376 2298573 2632643 2776957 2710186 2334662 2361168 2255627
6220 2255627 2177726 2328828 2065869 2166775 2153843 1930055 2207728 2205696 2270359 2458579
6210 2458579 2430711 2099109 2045250 2064307 2139241 2277436 2059858 2151317 2214991 2385966 2316491
6199 2316491 1881086 2157354 2326525 2255064 2229171 2040032 2247557 2221495 2237976 2100252
6189 2100252 2387719 2462513 2432697 2189351 1963135 2128904 2055920 2259863 2334763 2110491
6179 2110491 2302504 2314378 2300021 2552021 2498850 2339288 2162931 2310732 2431025 2604317
6169 2604317 2502891 2345545 2518779 2438790 2459668 2536250 2546930 2579090 2794246 2742190 2789645
6158 2789645 2730696 2867925 2862271 2772459 2970195 2785091 2646449 2741913 3082378 3096372 3049981
6147 3049981 3250023 3208045 3084535 3239194 3181126 3199966 3084233 3175272 3293716 3224713
6137 3224713 3186363 3241715 3125881 3144381 3397701 3411093 3595316 3635969 3785511 4282741
6127 4282741 4671025 4640756 4713671 4748950 4646623 4565365 4996891 5149852 5158711 5479953 5781510
6116 5781510 6215502 6807145 7820056 9038151 9758179 9825341 9787623 9181241 8564528 8039174
6106 8039174 7506743 7095670 6917125 6857280 6841541 6847795 7109701 7271614 7411394 7374370
6096 7374370 7608463 7931360 8136946 8703220 8621138 8467899 8654517 9077932 9526905 9928668
6086 9928668 10619154 11510834 12711156 13888764 14866732 15039009 14354699 13772680 13310591
6077 13310591 12452405 11647147 11490949 11249847 11223012 11133766 10871805 10917727 10947204 10965267
6067 10965267 11044257 11024273 11060974 11546017 11803110 11624083 11992513 12212808 12605616 12707513
6057 12707513 12970445 13504871 14083029 14889335 15762791 16840193 18033186 20223631 23067938
6048 23067938 26532677 30719324 35123237 38453509 39707226 39251336 37422942 35447016
6040 35447016 33619337 31907093 30636613 30353004 30432589 30844255 31917410 33000077 34474966
6031 34474966 35953414 37235540 38402269 40259136 42677662 45989680 50237315 56340147
6023 56340147 64386799 73020309 81538562 88943214 95034956 99810574 103302423 105922512
6015 105922512 107239694 106889039 105172360 101722040 96048709 89048129 81932669 75324644
6007 75324644 69334090 64290232 59981874 56830642 55098646 54450682 55766875 58926235
5999 58926235 64852299 73835667 86017990 100217420 112887630 120304849 120875654 116856794
5991 116856794 110225645 101905420 92270223 81293244 70162830 59794266 51017278 43744270
5983 43744270 37658371 33180614 29561043 26829620 24250074 22389001 21004785 19805065
5975 19805065 19201681 18657756 17983801 17551577 16956202 16426076 15920648 15245924 14748571
5966 14748571 14304843 13557882 12961835 12171804 11620702 11130488 10771325 10749613 10307088 10187267
5956 10187267 9968117 10098512 10094826 9929689 9998979 10000420 10136778 10685611 11232336 11848072
5946 11848072 12489798 12872100 13117436 13109088 12496183 11750963 11287247 10943076 10610165 10668916
5936 10668916 10642692 10785019 11001856 11164089 11464703 11713952 12395742 13025168 13570861 14469406
5926 14469406 15738944 16614040 17624034 18561479 18751198 17995014 17249343 16575470 15942956
5917 15942956 15659316 15238943 15358495 15804918 16605960 17224684 18075094 18850334 19293657
5908 19293657 19754367 20009751 20016548 20037433 19851010 19256838 18588629 18434141 18320944 18364991
5898 18364991 18721812 19287565 20045956 20468584 20811261 21157132 21697949 22266652 23015364
5889 23015364 23749990 24506915 24714524 24919734 25146252 25191990 25682745 26574123 27370611 27546563
5879 27546563 27546113 27405952 27381010 27729720 28642265 29873353 30940286 31477611 31595786 31365079
5869 31365079 30684228 30032552 29185519 28835965 29043428 29175841 29687724 29677991 29670730 29577271
5859 29577271 29683829 29937467 29877614 29754307 29908697 29898413 29954672 30015306 29933365 29655538
5849 29655538 29380209 29503822 29721678 29833237 29664945 29433109 28662424 27499822 26024598
5840 26024598 24193765 22883924 22160647 21744677 21444583 21122764 21086394 20802245 20788104
5831 20788104 20838757 21022126 21557310 22231845 22697713 22656942 21853605 20435262 19462990 18376812
5821 18376812 17531065 16770282 15871553 14576633 13262583 12010321 10985698 10197262 9261854
5812 9261854 8803975 8933328 8935344 8497498 8526178 8841791 9230629 9780332 9936424 10130213
5802 10130213 10276670 9698882 9196302 8509166 7727080 6978467 6793564 6216514 5517734
5793 5517734 5236863 5074775 4711324 4348816 3939101 3656843 3629326 3474540 3274913 3571675
5783 3571675 3355447 3225935 3144727 3022768 2896211 2940971 2749583 2734425 2785265 2846634
5773 2846634 2870618 2729615 2763505 2580511 2579380 2505753 2666413 2542767 2527862 2403691 2320343
5762 2320343 2233653 2283953 2358292 2288282 2378354 2442505 2656271 2602362 2474926 2523514 2603062
5751 2603062 2520316 2564229 2594969 2348838 2341736 2625033 2610817 2284287 1931857 2019662 2279119
5740 2279119 2181913 2025673 1989569 2145078 2071652 2008284 2215149 2294139 2260944 2271531 2187880
5729 2187880 2290571 2182286 2327830 2231095 2363682 2235196 2038276 2119360 2230726 2189870
5719 2189870 2125582 2165464 2228709 2151385 2201956 2218062 2175215 1949287 1709768 1876235 2277666
5708 2277666 2451191 2549887 2485023 2516937 2493968 2380879 2399983 2308527 2355743 2288120 2379621
5697 2379621 2424167 2204183 2071081 2186569 2440241 2515242 2346687 2265228 2193405 2463937
5687 2463937 2365092 2001146 2073277 2037795 1936980 1971224 2043579 2024382 1934567 1844445 2026120
5676 2026120 2115370 2267789 2245893 2059377 2065777 1775898 1789353 1898085 1894656 2031753 2122479
5665 2122479 1746262 1940743 2091341 2069201 2231954 2298934 2221853 1951502 1807616 1853090
5655 1853090 2053675 1657379 1895915 1786830 1814965 1886883 1854620 2044629 2133489 2010480
5645 2010480 1634709 1754057 1623746 2010009 2045573 2102706 1726625 1670374 1918757 2311933
5635 2311933 2126779 1938459 2004762 2062979 1993290 1947916 1923915 1968633 1953920 1769755 1758064
5624 1758064 1786996 1703881 1703678 1699040 1497241 1850697 2161312 2277062 2257936 2178138 2076417
5613 2076417 2130718 2239119 2155767 2045523 1930825 1910922 2026612 2101187 2294256 2323781
5603 2323781 2289479 1992405 1902141 1935315 1994534 1913409 1663594 1685694 2027962 2185995 2044116
5592 2044116 2043037 2246325 2219167 2014876 1997322 1928981 1924175 1989960 1657074 1519267 1922728
5581 1922728 2070775 1938636 2162088 2113427 1939159 1991188 2168524 1946260 2003097 2111701
5571 2111701 2099245 1982026 1901796 2038077 1956271 1938606 2181795 2119750 1881786 1852003 1917729
5560 1917729 1742321 1894467 2011582 2038126 2016075 2100847 2196733 2172866 2203363 1902881 1857662
5549 1857662 2121612 2134036 2165387 2124861 2200058 2448951 2234167 2240326 2391399 2195668 2157294
5538 2157294 1995685 1939892 1923960 2061227 2159196 2037145 1971432 1976287 2029457 1856557 1947979
5527 1947979 1996684 2207629 2254735 2110670 1991978 1837492 2075650 2334728 2166862 2033283
5517 2033283 2180783 2230518 1928808 1808854 1804735 1890199 2104877 2107243 1748061 1995768 1985750
5506 1985750 2186390 2307091 2152858 2067482 2194665 2211373 2225730 1992624 2195519 2319211
5496 2319211 2200136 2293655 2323277 2029596 1988421 1970755 1961229 2086240 2022924 2076907 2071486
5485 2071486 2008364 2186341 2324684 2253026 2370247 2113934 2163719 2132072 2150026 2156078 2053385
5474 2053385 1951682 2010204 1944487 2012316 2250231 2180310 2294881 2147724 2117661 2295160
5464 2295160 2332388 2174384 2245553 2332151 2320599 1954144 1665787 1851803 1709151 1737763
5454 1737763 1983372 2264131 2267483 2432729 2312213 2474952 2437184 2321382 2278165 2048625
5444 2048625 2152024 2216990 2258078 2494886 2466334 2434796 2462598 2337380 2236340 2104047
5434 2104047 2184004 2207204 2088993 1741863 1865862 2064910 2037090 2110289 1888994 1908203
5424 1908203 2192158 2044423 2008634 2048527 2002850 2090544 2187825 2171028 2172607 2607657 2384025
5413 2384025 2272874 2277980 2104821 1948378 2158686 2367644 2244493 2092909 2052469 1930543
5403 1930543 2206826 2408945 2540974 2643120 2409691 2339774 2384373 2324038 2166184 2454035
5393 2454035 2663564 2525092 2447400 2427126 2484757 2695988 2600916 2400316 2395925 2640495 2566730
5382 2566730 2370471 2351051 2565170 2877781 2914977 2837207 2681651 2602988 2520178 2629386
5372 2629386 2611176 2636952 2602193 2535484 2504749 2454506 2682492 2748368 2630620 2484550 2674798
5361 2674798 2586063 2471036 2465959 2631199 2588495 2472594 2495964 2341348 2427515 2612292 2689611
5350 2689611 2691399 2388069 2631449 2700196 2677774 2634750 2462155 2780180 2793394 2781871 2641545
5339 2641545 2608975 2627404 3092221 2953334 2873853 2818782 2838022 2753045 2432791 2517054 2803435
5328 2803435 2844311 2535521 2805474 3067940 2926733 2898331 2958405 2856918 2712576 2592576
5318 2592576 2833085 2828915 2937182 2967191 2941469 3048470 3125947 2862336 2929708 3094568 2908045
5307 2908045 2939571 2873589 2944614 3119806 3001699 2978859 2883272 3079238 3069644 2852352 3090751
5296 3090751 2982247 2944191 2750154 2659110 2796154 2665617 2813260 2901984 3081119 3241132
5286 3241132 3171761 2886207 3068064 3379867 3253448 3114856 3170849 3292645 3466240 3324793
5276 3324793 3073419 3281622 3215098 3069359 3142826 3085576 3279386 3182459 3277849 3375845 3514642
5265 3514642 3427828 3417272 3527060 3409994 3294324 3490580 3192255 3063602 3143580 3233576
5255 3233576 3259453 3105752 3094419 3210513 3400337 3422376 3510712 3425337 3293271 3382094 3543012
5244 3543012 3393915 3363920 3462612 3371057 3389466 3440223 3637491 3617689 3223898 3145075 3256805
5233 3256805 3401297 3121725 3321124 3501139 3603741 3538290 3381904 3362044 3326142 3343414
5223 3343414 3560488 3798534 3901717 3661681 3588692 3734289 3763963 3469911 3511339 3538365
5213 3538365 3239905 3412577 3730419 3621561 3814017 4102685 3969982 3817347 3642838 3504451
5203 3504451 3737847 3710418 3749043 3546418 3526927 3778552 3810006 3603599 3663400 3717811 3991036
5192 3991036 4019092 3741307 3500777 3709525 3901744 3753566 3712813 3526517 3432017 3583701
5182 3583701 3994914 3915844 3732424 3751721 3675980 3407612 3417282 3227249 3200810 3341502 3395230
5171 3395230 3513791 3388962 3314859 3270925 3385874 3148386 3155322 3122924 3278549 3396622
5161 3396622 3664647 3537711 3572099 3859716 3707823 3777848 3719975 3712097 3486743 3424609 3432102
5150 3432102 3546931 3687052 3855420 3837229 3810849 3829466 3779460 3602694 3501023 3783228
5140 3783228 3846895 3940647 3963955 4044809 4166653 4087174 4033256 4118675 4183807 4102593 4008888
5129 4008888 4205517 4578462 4576112 4394439 4150922 4463236 4308690 4306503 4179309 4200971
5119 4200971 4158745 4262279 4307036 4391502 4423051 4341022 4202771 4318036 4289309 4239928 4216897
5108 4216897 4173942 4151806 3930282 4156812 4232085 4126367 4504547 4264150 3954231 4210632
5098 4210632 4369554 4449538 4673477 4426266 4342545 4443942 4501459 4659640 4521343 4577899
5088 4577899 4545223 4429123 4699957 4665446 4603181 4559007 4701564 4659622 4678405 4481280 4494751
5077 4494751 4874848 4918198 4944822 5050995 5185393 5153217 5042672 5252315 5329886 5218195
5067 5218195 5351451 5732990 5805341 5462772 5527764 5607773 5537266 5265161 5301086 5249039 5445281
5056 5445281 5394216 5322847 5286069 5144761 5295137 5541101 5780453 5960754 5973371 5627094
5046 5627094 5247787 5535575 5547383 5814233 5834679 5772427 5809015 5658619 5143756 5165963
5036 5165963 5237899 5332492 5332541 5346203 5229426 5132806 4872070 4677030 4943460 5153307 5114230
5025 5114230 5086360 5033438 5236773 5392578 5113331 5191633 5505550 5325597 5306654 5539768
5015 5539768 5468295 5599054 5628175 5458322 5391000 5412002 5491296 5435789 5470082 5414218 5351591
5004 5351591 5402876 5422737 5458857 5635646 5770302 5611005 5723637 5596735 5590226 5449856
4994 5449856 5313701 5331671 5401776 5705316 5782058 5517386 5521652 5517306 5524428 5688612 5817085
4983 5817085 5863895 5786214 5921924 5747801 5660771 5726182 5739414 5889128 6220706 6127866 6142537
4972 6142537 6138564 5981129 6009999 5938726 6104707 6019290 5990675 6207945 6481489 6111112 6049978
4961 6049978 6184769 6382989 6459959 6432055 6490859 6781207 6761173 6606698 6594071 6730692
4951 6730692 7058753 7266785 7377731 7343166 7383820 7582976 7482417 7529515 7803208 7992353
4941 7992353 8316395 8306414 8439493 8847960 8990163 8826607 8955320 9299541 9574532 9837186
4931 9837186 10473674 10925610 11051758 11266734 11335332 11223130 10792326 10768460 10827291 10729362
4921 10729362 10958157 10957598 10937134 11350098 11518839 11840893 12150224 12688832 13240087 13549723
4911 13549723 13803202 13955742 13922907 13735767 13586998 13375051 13134743 13461095 13238287 13084807
4901 13084807 13480130 13556563 13304497 13168292 13483640 13585576 13576953 13668316 13748501 13918377
4891 13918377 14275827 14169285 14477203 14888171 15130353 15557072 16019804 16420935 16778485
4882 16778485 17397229 18023332 18306483 19170297 19860416 20619558 21908425 23044029 24199980
4873 24199980 25326688 26108232 26822966 27688235 28661763 30097697 31478409 32824661 34595199
4864 34595199 36104667 37804488 39345701 40744200 42761387 44408935 46298507 47922654
4856 47922654 49400472 51186709 53279137 55457201 58275792 61673585 65400311 68780105
4848 68780105 71242350 73050551 74131545 74957308 75547045 76378002 77728853 79310177 81250607
4839 81250607 83285737 85396960 87621728 89403868 91090846 92872135 94911765 97401635
4831 97401635 100061589 101860625 102793226 102183666 100773095 99067126 97630387 96835735 96226657
4822 96226657 95807410 95728334 95316558 94725623 93658049 91874271 90051626 88582745 86638301
4813 86638301 85002074 83413624 81769474 79711248 78063109 77135204 76175674 75566553 75375428
4804 75375428 75849026 76804703 78140580 80312567 82642656 85736112 89461547 93903460
4796 93903460 99308056 104754030 109290298 111914779 112804398 112224079 110932965 109479641
4788 109479641 108264596 106999145 106311230 105139762 104063880 102909857 101602208 100187695
4780 100187695 99575127 99911362 101657385 104092078 106865053 108662278 108889798 108075029 106558735
4771 106558735 104809842 103576459 103489433 104435882 106704603 109763572 113398018 117260485
4763 117260485 120959132 124680334 129084482 133569553 137636896 140715428 141889385 140463265
4755 140463265 136471622 131245851 125528688 119455279 113597101 108443372 103826981 99517741
4747 99517741 95331381 92136545 89382620 87736715 86573463 85623481 85410411 85265600 85429454
4738 85429454 85516909 85763235 85176312 84758588 84063586 83306290 82430400 80662318 78538766
4729 78538766 75987379 73034081 70066269 67553487 65220562 63992240 63459829 63458382 63742844
4720 63742844 63683541 62842450 60121230 56147125 52178658 47993737 44174866 41449674 39013987
4711 39013987 37268765 36186542 35969135 36615571 37358735 39066551 41192142 42605312 42325846
4702 42325846 40812236 38215292 35166314 32088813 28924195 26671381 24946017 23153250
4694 23153250 21821604 21176938 20423697 19437836 18707378 18405909 17869076 17053427 16677960
4685 16677960 16484344 16220103 16256657 16125783 16254340 16252025 16455913 16414416 16441926 16663006
4675 16663006 16491343 15983929 15509316 15035352 14753012 14375407 13895848 13669019 13460376
4666 13460376 13224676 12951686 12821662 12800149 12576506 12194536 11915786 11911324 12089895 12217246
4656 12217246 12229620 12023463 12047282 12267645 12135715 12270760 12280585 12313040 12817446 13009607
4646 13009607 13053313 13537114 13804673 14216154 14687756 15112277 16106595 16881689 17703445 18598714
4636 18598714 18812146 18900056 18794916 18770170 19175985 19542721 20390329 21546213 22820865
4627 22820865 24718623 27196593 30452077 34868576 39976606 45806900 51259630 55047852
4619 55047852 56257291 55167297 52223527 48437174 45076596 42191179 40125020 38756063
4611 38756063 37695579 36572153 35497639 34006950 32070827 30408808 28767610 27879865
4603 27879865 26752983 25657898 25252233 25087804 24802162 24332970 24236817 24660738 25559922
4594 25559922 26676897 27795405 29703823 32444329 35758409 40342599 45447116 51323237
4586 51323237 57757363 64090595 69047429 71396822 71355711 68951176 65185122 61504463
4578 61504463 57711162 54745238 52675109 50722440 49199763 48024773 47536171 47950489
4570 47950489 48823376 50673983 53161961 55356512 57149172 57451011 56132252 53069892
4562 53069892 48984882 44878078 41208740 38121690 35986955 34431256 33661533 33579057 34249763
4553 34249763 34790151 35733404 36395066 36508485 36658791 36517034 36264031 36113938 36029927 36620940
4543 36620940 37124208 37312235 37298073 37000965 36280635 35646626 35319942 35252198 35909330 37716573
4533 37716573 40536535 43744134 47274203 49945393 51144989 49782376 46666492 42414171
4525 42414171 37623534 33266741 29431827 26123911 23591572 21475175 19995318 18940506
4517 18940506 18116505 17507655 17258775 17240833 17862345 18629360 19877410 21124288 22493655
4508 22493655 23697842 24860340 25248073 24873011 23657970 21792563 20049656 18318978
4500 18318978 16658538 15313995 13686360 12191077 11477198 10650124 10245160 9768765 9172236
4491 9172236 9039623 8927271 8608750 8407351 7934075 7699000 7564789 7430583 7392340 7322675
4481 7322675 7244913 7213182 6968859 7056059 6912102 6511722 6453919 6644786 6870117 6688500
4471 6688500 6643813 6656973 6474735 6205184 6343353 6495215 6396159 6023690 6005345 5988254
4461 5988254 5930200 5870332 5990692 6124037 5827578 5700712 5431447 5285813 5359457 5649640
4451 5649640 5856295 5677202 5991943 5976003 5795344 5697722 5616443 5604194 5468068 5641294
4441 5641294 5709271 5823997 5774630 5583712 5328059 5289176 5105532 5091206 5030703 5151745
4431 5151745 5236572 5072311 5109622 5327154 5475038 5572732 5352698 5337076 5247479 5087916
4421 5087916 5385320 5551572 5712336 5587385 5438149 5685280 5650842 5419938 5553831 5358684
4411 5358684 5412332 5618659 5543390 6050830 6127613 5994661 6233203 6429487 6701906 6895864
4401 6895864 7664005 8803725 10115640 11763481 12904015 12795241 11703375 10319505 8872089
4392 8872089 8035162 7675954 6899663 6574353 6631481 6403852 6038417 6062669 5902534 5668602
4382 5668602 5867082 5878525 5712428 5714813 5691667 5667136 5602309 5618248 5746188 5670523 5897558
4371 5897558 5775621 5406028 5700174 5595179 5406513 5351819 5454273 5518151 5508012 5572205
4361 5572205 5295695 5714960 5743609 5487029 5547601 5590296 5470305 5402262 5426976 5444470 5451174
4350 5451174 5563255 5481345 5516500 5594763 5625619 5793630 5899602 5944606 5838632 5629352
4340 5629352 5942389 5926784 5704652 5752659 5831304 5809629 5887991 5756954 5915702 6041526
4330 6041526 6363167 6639814 6666143 6696666 6390040 6771620 6776981 6592673 6661486 6864093
4320 6864093 6961672 7017307 7172590 7300739 7543119 7811924 8374893 9397980 9578682 9648225
4310 9648225 9416357 8932951 8345376 8275716 8166822 7824360 7728909 7684315 7750053 7625682
4300 7625682 7647206 7418369 7164858 7052417 6985251 7187428 7348319 7168212 7283607 7501143
4290 7501143 7730535 7865131 7537665 7536596 7397036 7245157 7584230 7630171 7315040 7385039
4280 7385039 7576617 7480972 7335681 7159990 7449439 7639063 7780227 7943699 8076402 7852564
4270 7852564 8057455 8204555 8284885 8324971 8344819 8510696 8385242 8412189 8680676 8711246
4260 8711246 8591059 8648426 8852575 9087044 8970735 9274140 8934897 9069854 9178715 9240203
4250 9240203 9323072 9011900 9062647 9294165 9244875 9258322 9204284 9130389 8909071 8819051 8822995
4239 8822995 9004927 8992222 9037311 8824556 8571488 8756221 8841743 8926412 8932376 8746463 8902702
4228 8902702 9165860 9049311 9043259 9180989 9215125 8989178 9054969 9066655 9079953 9194900 9026726
4217 9026726 8873746 8944400 8784811 9103643 9426667 9358393 9182073 9435203 9389447 9575557
4207 9575557 9773479 9782430 9988905 10028192 9885841 10103225 10341001 10495172 10551809 10563460
4197 10563460 10499631 10158993 9989283 10046460 10313522 10229819 10016859 10092737 10229591 10443201
4187 10443201 10358357 10164379 10325313 10403708 10483487 10552770 10434956 10432092 10754171 10686660 10579064
4176 10579064 10544687 10879203 11075089 11013877 11277696 11147594 11281306 11305064 11391530 11494611
4166 11494611 11713910 11906652 12061190 12077878 12503716 12770254 12862864 13199069 13738630 14326306
4156 14326306 14634719 15069620 15543396 16057854 16782834 17660685 18317772 19018529 20046752
4147 20046752 21186007 21877322 22194725 22857234 23377954 23798011 23967880 24256933 24625892
4138 24625892 24864967 25564997 26324703 27397604 28398927 29632984 30810722 31791257 32609031
4129 32609031 33499365 34135175 34604444 35126795 36277809 37299233 38220569 39219446 39748279
4120 39748279 40572342 41693156 42677288 43511170 44516606 45633396 46387820 46850959 47711429
4111 47711429 48583268 49812838 51384145 53349018 55755876 58695994 61115945 62875287
4103 62875287 64356365 64966638 65265772 65657725 65839752 65990828 66211416 66522524 66906498
4094 66906498 67062206 67352521 68230909 69301563 70318078 71016418 71748636 72158088 72243135
4085 72243135 72502149 72513347 72761518 73721382 75989795 78659449 81937578 85926452 89907690
4076 89907690 93249791 96105869 98306709 100790530 103109977 104873961 106675079 108451076
4068 108451076 109938085 111434159 112601574 113636030 114308003 114455508 113797061 112441975
4060 112441975 111695053 111618097 111493578 111784749 112057765 112281198 112663980 113007487 112787688
4051 112787688 112409681 112168009 111616352 111150424 111031309 111144295 111214241 112165538 113430790
4042 113430790 114608728 115193735 115975324 116204111 115996323 115536008 114478363 112635160 110206747
4033 110206747 107569247 105380433 103469957 101068006 97891076 94100822 89606410 85056054
4025 85056054 81536376 78973708 77066807 75758762 74915414 74543612 74229160 73646310 73110005
4016 73110005 72740610 72370312 71830405 71375183 70573796 69386046 68075302 66698465 65039032
4007 65039032 64125209 63460659 63751838 64393761 64942792 65086949 64004099 62211171 59791452
3998 59791452 57102607 54400080 52468404 50727383 49550880 48748208 48260440 47504644 46379766
3989 46379766 45318204 44122696 42724403 41179932 40382512 39543530 38426826 37678494 36948770
3980 36948770 36574908 36303263 36015468 35645248 35147298 34556916 33814987 32629195 31689961
3971 31689961 30750638 29573133 28861102 28308587 27944473 27368697 26486291 25711115 24804051
3962 24804051 24172474 23882067 23687164 23440911 23257168 22784181 22479306 22312862 21555129
3953 21555129 20820444 20295084 19682270 19535826 19333226 18597536 18201491 17850736 17547389
3944 17547389 17521268 17401244 17369984 17269958 17227594 17343871 17185617 16884829 16887675 17234288
3934 17234288 17473543 17698874 17990067 17977419 18257416 18742111 18398764 18353247 18518191 18723532
3924 18723532 18747513 18974051 19134801 19474574 20074019 20246137 20643182 21012526 21187557 21696851
3914 21696851 22085443 22262994 22273323 22875049 23189408 23566053 23841204 24327249 24793938 25033832
3904 25033832 25211371 25557031 26206281 26878930 27603513 28331057 29411897 30582385 31312766
3895 31312766 31621858 32325281 33047184 33838939 34417417 35472577 36424243 37102920 38165607
3886 38165607 39300666 40184473 41256536 42480597 43759483 45094874 47021538 48568402
3878 48568402 50241555 51759171 53334527 55206894 56709932 58284456 60126310 62119591
3870 62119591 63864397 65482636 67024285 68421154 69388568 70230060 70986138 71131576 71125174
3861 71125174 71462033 71741854 72618459 73366102 74248331 75567755 76897143 78391408 79275853
3852 79275853 79494894 78936007 77510496 75351618 73028191 70676562 68702040 67071077
3844 67071077 65640161 64807432 64313175 63733802 62939980 61944566 60971119 60065795 58711041
3835 58711041 57191730 55819315 54534937 53682091 53421313 53655115 53661016 53767850 53972636
3826 53972636 54583535 55053749 54687738 53875199 52826952 51164469 49158867 47132747 45265904
3817 45265904 43784160 42840694 42364542 41539223 41068917 40666961 40523154 40314355 39922238
3808 39922238 39591169 39099681 38801510 38196243 37318834 36650841 36032432 35440954 34992820
3799 34992820 34458124 34321089 34916912 35485444 36308487 37156486 38234734 39264018 40483100
3790 40483100 41665009 42541595 43558446 44528788 45008846 45198280 45090975 44902598 44988513
3781 44988513 45112381 45374675 45986310 47388235 49140524 51479721 54988301 58988435 63332202
3772 63332202 67549420 71616270 74387457 76187706 76581230 75649477 73359806 69577850
3764 69577850 65606797 61179957 56722008 52785698 49977295 48280215 47080462 46339123
3756 46339123 46607473 47801593 49612559 51723583 53851562 55854085 57127671 58037429
3748 58037429 58531733 58872750 59904782 61810059 64525050 68206761 73145785 78789356
3740 78789356 84897201 90920090 96570164 101555696 105489062 107998287 109188803 108570840
3732 108570840 105875834 101903202 97412731 92776913 88403691 84496220 80448706 76459766
3724 76459766 73236016 70006578 67331769 64972478 63352040 62497125 62324650 62395611 62755449
3715 62755449 63750625 65452340 67304866 68395993 68793749 68862196 68271355 67054971 65480888
3706 65480888 63791285 61677840 59328851 57286266 55639302 54087964 52994034 52686453
3698 52686453 52593161 52428886 51567641 50496608 48759346 46177474 43707153 41565268 39572225
3689 39572225 37874914 36887454 35882923 34454184 33341510 32463514 31626406 31056403 30610683
3680 30610683 30035824 29633273 28904130 27971851 27034181 26547690 25888883 25242645 25279305 25771516
3670 25771516 26486499 26914114 27368326 28299661 28495244 28503400 28176200 27485146 26941457 26150263
3660 26150263 25870733 25405780 25128069 25123015 25478832 25718035 26160329 26731299 27095346 27409992
3650 27409992 27346031 27258612 27262072 27222204 27139416 27041627 26919025 27029173 26486955 25572491 24784904
3639 24784904 23415112 22050649 20421432 18803526 17438554 16385407 15433921 14427561
3631 14427561 13587584 13146763 12532700 12249974 11909233 11463767 11212007 11191562 11512523 11232702
3621 11232702 11177661 11005705 10823017 10823279 10865054 10489454 10315918 10260606 10507794 10407066
3611 10407066 10483791 10461208 10398464 10137408 10243229 10570173 10499005 10559373 10319005 10280348
3601 10280348 10520721 10609130 10509183 10208424 10259442 10315922 10457427 10605641 10712848 10903519
3591 10903519 10681916 10601593 10847336 10598653 10376580 10167382 9755674 9681216 9866038 9928949
3581 9928949 9704476 9629395 9435457 9530254 9699398 9574484 9452412 9653263 9595136 9291331
3571 9291331 9228080 9260719 9335168 9312511 9334612 9242364 9150171 9093851 9386971 9362039 9092794
3560 9092794 9185838 8919582 8765804 8752492 9276320 9540023 9540363 9298376 9588928 9610952 9490365
3549 9490365 9676101 9860720 10075792 10296051 10318841 10147979 10071158 10308049 10096662 10266135
3539 10266135 10471772 10733887 10896880 10922749 11162735 11217287 11394800 11606653 11593668 11522166
3529 11522166 11787050 11738231 11668735 11914723 12207412 12428441 12601857 12672406 12800277 12856215
3519 12856215 12985222 12911270 12820310 12727569 13169337 13293982 13552208 13697580 13757074 13764666
3509 13764666 13829979 13809387 13764465 14049713 13690839 13628744 13899767 14097368 14307643 14549136
3499 14549136 14749641 15295158 15674399 15731400 16047389 16609151 17523719 18158358 18708842 19359397
3489 19359397 20066271 21117657 22418943 23546078 24185766 25079124 25836598 26150767 26530953
3480 26530953 26573264 25936028 24639069 23637444 22288972 21038740 20012471 19483208 19100219
3471 19100219 18521386 18157294 17992632 17678094 17617404 17369296 17062067 17370650 17142060 17073904
3461 17073904 17088029 16858202 16547805 16430444 16309322 16257892 16278966 16085487 15831420 15612647
3451 15612647 15047234 14461884 14211259 14142710 13809247 13562919 13427809 13279891 13126112 12969621
3441 12969621 12861206 12792320 12254510 11970166 11928265 11531385 11270392 11338552 11278383 11365095
3431 11365095 11120304 11193165 11428963 11390554 11127211 11031586 11064490 11171899 11135249 11252101
3421 11252101 11428174 11306566 11559129 11707799 11891289 11699225 11802572 11693724 11600815 11535684
3411 11535684 11666463 11893463 11910282 11709921 11905398 11902657 11994854 11943999 11850031 12224715
3401 12224715 12053902 12074300 12004954 11820321 12144099 12281835 12101922 12390231 12723071 12722385
3391 12722385 13038815 13187862 13213251 13090095 13313763 13338020 13035644 12989528 12878985 12697687
3381 12697687 12553253 12673317 12679910 12687850 12615498 12419310 12260471 12568606 12853328 12566920
3371 12566920 12893417 12959591 13135600 13323255 13177806 13584383 13969101 14681050 15175262 15632724
3361 15632724 15935864 16405817 16815060 16942707 17183693 17364685 17377574 17654078 17623433 17654503
3351 17654503 18084699 18501560 19180248 19591790 20201324 20934900 21226841 21739566 22286929
3342 22286929 22887928 23425423 24180130 24935642 25885617 26196670 26162251 26151494 26158809 25833827
3332 25833827 25602440 25720289 25974841 26093896 25672544 25740554 25729085 25401686 24816732 24227693
3322 24227693 23800612 23833635 23758127 23633356 24119128 24900988 25446097 25895358 26330674 27183072
3312 27183072 27861470 28278908 28847608 29620535 30470491 31188010 32230246 33675438 35920463
3303 35920463 38236175 40603041 43725936 46873657 50876687 55734724 61787303 68902648
3295 68902648 76843745 85020233 93038094 100192846 104923128 107090163 106617232 103652269
3287 103652269 98753420 92311689 84778073 76966618 69151495 62532841 57058089 51892946
3279 51892946 47575400 44184308 41383266 39348046 38196600 37213651 36921448 36937029 37423756
3270 37423756 37919231 38654430 39633099 40407008 42138241 44387566 46901049 50092312 53651152
3261 53651152 57780465 62376310 67255350 72608994 78104439 83280787 87578058 89884872
3253 89884872 90353127 88814891 85930155 82494181 78441800 73988394 68716449 63290682
3245 63290682 57940642 53355724 49155640 45349874 41986700 39400626 37489636 36008715
3237 36008715 34985769 34364410 33860457 34079757 34310533 34009348 33544135 33192789 33102130
3228 33102130 33089734 33018619 32986057 32681132 32270428 31774847 31291206 31323669 31098062 31120936
3218 31120936 31361965 31666451 32089186 32403499 32953321 33459364 34527883 35158211 35936412
3209 35936412 36828234 37650489 38694282 39847339 41024128 42010389 43190826 44003538 45048982
3200 45048982 46281639 47989328 50250404 52478545 55100324 58361616 62202982 66759798
3192 66759798 72147961 78858550 87887961 100413072 117743573 140813652 169593389 202783917
3184 202783917 235822154 263689640 282726747 291778863 293598365 293325748 295498562 300865326
3176 300865326 306379619 307439249 299532977 281150378 253624084 221417025 188905956
3169 188905956 159171419 134235435 114129607 98276179 86317769 76816589 69608505
3162 69608505 64037917 59535851 55785866 52897500 50312029 48174908 46187039 44827969
3154 44827969 43644511 42242822 41168322 40214293 39570169 39012734 38811854 38678227 39191616
3145 39191616 39296877 39395424 39142742 38891041 38397352 37826328 37121655 36560712 36123576 35850137
3135 35850137 35378775 35018492 34688827 34393592 34479638 34162725 34351907 34521207 34707811 34991791
3125 34991791 35529098 36039303 36714048 36987895 37561842 38542154 39402149 40032842 41076623
3116 41076623 42209862 42990329 43971694 44797293 45711837 46868573 48406507 50097875 52289457
3107 52289457 55066028 58473761 62783748 68153407 74930693 82623055 90714397 99410144
3099 99410144 107815887 114857407 120308742 123487464 124424782 123387929 120675375 117963416
3091 117963416 116602554 117362555 120753014 127821534 139873114 158608655 185537851 221613950
3083 221613950 264156928 304389331 330727268 335958068 322725721 300672043 279394767
3076 279394767 267271355 269375959 287974561 320203869 356823339 383644041 391465920
3069 391465920 382806275 366629400 352974126 347202388 348888381 353687361 355738748 351924605
3061 351924605 342974311 332186490 324064396 322009971 325448607 330498024 331659042 324157575
3053 324157575 306906531 281875399 253423728 225858707 200826248 178099484 156630987
3046 156630987 136413402 118665836 103441839 90903606 80609554 72363138 66353754
3039 66353754 61223293 57150349 54148853 52023195 50384555 48704144 46977536 44786513
3031 44786513 42704732 40529059 38155335 35718522 34039051 32296949 31030441 29629026
3023 29629026 28286548 27324387 26499897 25703337 24717847 23878431 23129744 21940350 21537256
3014 21537256 21071267 20767481 20385487 19802969 19417284 19017370 18716189 18276527 18047715
3005 18047715 17883800 17459605 16661612 16400205 16280731 16243763 15964498 15845248 15976557 16223478
2995 16223478 16406436 16212490 16210809 16327729 16444715 16507052 16770094 16800890 16612062 16489818
2985 16489818 16097309 15512317 15121759 14785922 14122799 13642666 13194297 13124580 13137193 12748598
2975 12748598 12617298 12788754 12357136 12351681 11873779 11185351 10958945 10584160 10014530 9465004
2965 9465004 9073368 8619917 8145978 7883231 7290100 7084611 7101914 7351199 7189319 6688587
2955 6688587 6661036 6611749 6554478 6692602 6548407 6283217 6345285 6300931 6207922 6223120 5920372
2944 5920372 5906124 6019903 5713885 5715150 5730398 5459681 5530532 5822170 5938332 6181328
2934 6181328 6213936 6298829 6361550 6084998 6171540 5816061 5619232 5229566 5019379 4974468
2924 4974468 4428746 4428277 4349426 3935582 3822904 4029973 4284415 4258903 4272724 4602459 4804553
2913 4804553 4824087 4850370 4482602 4138176 4144099 4052455 3777186 3483802 3405761 3525524 3583920
2902 3583920 3490649 3505312 3660394 3854904 3987405 3954045 3781343 3857501 3689390 3835380
2892 3835380 3540033 3289909 3260760 3457438 3072778 2890615 2716824 2265051 2285652 2009005
2882 2009005 1996558 2063608 1809862 1775997 1766010 1896189 2007989 1792130 1567054 1616586 1685230
2871 1685230 1604099 1723689 1707868 1413694 1300630 1085912 1079042 900863 1119925 1241451
2861 1241451 1139709 1145260 914798 1055852 1166527 1113794 1227343 1143091 1066076 899709
2851 899709 738361 734640 880966 935733 1196251 1331021 1188715 739813 637445 819263
2841 819263 619477 722083 756816 713267 776811 756963 671071 555509 672405 832813 672377
2830 672377 829649 635521 529870 479119 609425 782205 770691 658048 518068 695679
2820 695679 608377 586306 742115 515331 735920 729155 835680 1024043 1047193 1123270 857917
2809 857917 770847 1007193 873208 832576 861340 875995 958026 1168104 1443004 1540415 1784583
2798 1784583 1959069 1922479 2169935 2093264 1824045 1857220 1737026 1717393 1709832 2000578 2117550
2787 2117550 2062836 2400837 2363639 2141785 1942543 1927545 2014341 2143121 2310554 2180143
2777 2180143 1821145 1493488 1469814 1607298 1588659 1964969 1950679 1934598 1974560 1663120
2767 1663120 1282135 1338960 1159349 896438 989662 664833 539641 757555 324231 268140
2757 268140 510367 577640 652284 728654 471427 384408 374383 255695 520408 250013 414660
2746 414660 316928 586742 596797 440339 645879 680358 370201 215996 410687 475826
2736 475826 416326 545401 441769 329171 56659 95565 45272 22754 -161628 -134185 13349
2725 13349 15731 -88284 -29410 -8045 -255079 -41748 49687 205267 188487 9433 86661
2714 86661 41620 242079 194762 127206 186418 129451 123472 313721 346850 1131 81750
2703 81750 18283 335510 236593 143315 107593 186846 35969 -60049 -7618 175315 166373
2692 166373 72090 -213604 -147001 12888 299110 167496 96270 250831 122410 -88679
2682 -88679 170404 375697 51252 290918 156371 173483 20657 83763 153925 8902
2672 8902 40559 227282 114784 272599 334498 376059 522970 365521 11389 98295 242926
2661 242926 -92528 -33479 55974 63662 195896 224030 119404 204366 62628 131328 386799
2650 386799 249711 187122 103670 218254 393684 288914 363451 375574 473850 485463 359184
2639 359184 295464 385438 218557 230221 355377 405814 318036 241808 362560 246618 138823
2628 138823 273909 337593 172114 71281 168976 297630 349845 558081 266336 361909
2618 361909 610071 507012 443502 770244 1135297 1352602 1670461 2465355 2669285 2569583
2608 2569583 2241247 1790775 1485384 1106327 1023817 784133 599656 480244 502804 629106
2598 629106 672892 412494 308528 329471 172829 257169 556906 695528 338420 129575
2588 129575 375615 477298 132593 151443 584752 546721 556585 450574 133050 324282
2578 324282 472194 264820 56157 302653 845270 674536 575169 544573 267479 345195
2568 345195 194776 190857 231282 449756 410259 242506 161473 470644 533617 181406 356518
2557 356518 321956 340494 300807 -6013 -8096 238981 423871 576753 513495 407441 359770
2546 359770 122229 217025 216002 539490 462338 406891 592381 470395 483679 630499 316177
2535 316177 226530 329115 183457 537905 489979 395041 245148 339624 433969 535415 409641
2524 409641 537409 594106 690773 611224 888907 878552 808775 699494 693696 581316 613261
2513 613261 761724 812381 842840 824535 771049 547818 549963 773670 767186 400804 357756
2502 357756 653694 962842 862471 820600 1100451 1090629 974615 593951 371344 664995
2492 664995 580783 561707 607869 263911 421262 774963 822358 1024701 1002383 908196 900452
2481 900452 959253 965825 939177 1032888 1021769 1002450 1156039 1063671 1168365 1320861 1033197
2470 1033197 956116 920415 1003198 1115147 1040004 1297739 985789 1300802 1434247 1451866
2460 1451866 1698831 1302932 1281863 1225598 1553555 1612995 1528544 1420462 1603558 1646259
2450 1646259 1712088 1748339 1629954 1204272 1418080 1876647 1819280 1465755 1582614 1808050
2440 1808050 1758493 1797847 1558735 1713066 1837380 2088599 2256424 2260257 2120190 2355875
2430 2355875 2339727 2210156 2327291 2374282 2256296 2279361 2230439 2419277 2669912 2730219
2420 2730219 2695489 2891047 3062770 3287243 3286074 3295445 3218695 3133602 3458584 3523244 3505624
2409 3505624 3414663 3571151 4099217 3875894 3875166 3792685 3755912 4060024 4020614 3970499 4162566
2398 4162566 4493622 4749690 4918813 5135405 5324202 5630728 5660228 5858422 6029378 6271131
2388 6271131 6449532 6502554 6550463 6969228 7258970 7559381 7607343 7521188 7539812 7945647
2378 7945647 7844367 8316030 8740086 9016205 9383102 9834645 10361056 10980461 11513864 12166537
2368 12166537 12550246 13208306 14168774 15401642 16337040 17798844 19984212 23277971 27906867
2359 27906867 32564797 34082216 34438589 34801588 35836544 37629145 41294187 46685191
2351 46685191 55271707 67115756 85571621 114164005 164963608 250676601 372432798
2344 372432798 457461033 435846214 369841419 290931431 218269619 165336761 126676846
2337 126676846 98631788 76907043 60557631 48973050 41251754 36464870 34303038
2330 34303038 34068492 33897448 31313871 28199536 25212629 22071951 19556005 18072345
2322 18072345 16594374 15272850 14087693 13119194 12318301 11944402 11331552 11099533 10532271
2313 10532271 10239941 9701021 9055326 8695745 8490648 7865629 7770094 7597735 7308238 6652923
2303 6652923 6532158 6392069 6087323 5582811 5796842 5803725 5435960 5277707 5118675 4883272
2293 4883272 4655678 4516538 4606513 4165505 3926666 4016293 4168962 4092689 4095825 3975944
2283 3975944 3801863 3295817 3200282 3239175 3284890 3344382 3129731 2665071 2658517 2585776 2570378
2272 2570378 2608295 2377412 2300100 2224841 2178955 2290738 2276251 2266648 2259773 1948071 1965401
2261 1965401 2036683 2183140 2132689 1928183 1758554 1701005 1754580 1445582 1673080 1582837
2251 1582837 1312379 1506890 1744190 1682435 1449978 1321978 1328466 1306393 1194658 1031001
2241 1031001 1238442 1179891 1145590 1180622 1220466 1204582 878456 788596 576964 217680 228450
2230 228450 568898 725798 760777 685206 672204 437702 452011 490419 643537 643731 283924
2219 283924 458440 469149 392513 614541 815131 784902 548370 325418 389406 79375
2209 79375 -179258 7978 167262 121193 82956 81338 112222 -45780 114242 264947 -96381
2198 -96381 8107 -6194 -36148 18062 -133954 -154336 133221 -132011 -136365 71136 25483
2187 25483 198653 -82759 -115295 45327 -72117 -122247 -206826 -119802 41780 230206 125646
2176 125646 29414 -94156 -35437 -337310 -739089 -445907 -10271 -195414 -32845 -186220
2166 -186220 -295397 -131944 -129251 -340124 -161359 -86507 23354 -260112 -479261 -140728
2156 -140728 -73639 -78987 -335357 -510190 -541148 -182238 -200333 -150176 -147228 -255531 -236352
2145 -236352 -107985 -156335 -203856 -339717 -273914 -298151 -259692 -265881 -224809 -315925 -543595
2134 -543595 -397462 -288737 -305722 -159071 -100041 -288810 -219895 -318872 -386291 -323249 -331626
2123 -331626 -280386 -122069 -383869 -610540 -412447 -176685 -377170 -257139 -192818 -433068
2113 -433068 -395323 -283310 -336028 -471944 -444080 -211398 -258165 -356985 -528969 -298397 -132417
2102 -132417 -295049 -202455 -65365 -263205 -539942 -588502 -422044 -502798 -556180 -329143
2092 -329143 -411079 -167207 -96726 -46577 -188343 -284557 -215033 -243202 -298556 -210838 29709
2081 29709 -197568 39837 -22665 393387 595171 770122 1315023 1581856 1638009 1470086
2071 1470086 1024223 418759 338817 196894 -143058 -246447 -321760 -374173 -82372 -121122
2061 -121122 -487133 -423680 -75143 -315741 -220358 -84519 19424 -98300 -155429 -376921
2051 -376921 -398821 -236981 183003 94879 -314037 -270644 -313898 -668726 -693193 -270747 -270656
2040 -270656 -204195 -295797 -338571 -459279 -570903 -478200 -419904 -318421 -429992 -384040 -485066
2029 -485066 -310126 -257000 -516896 -683218 -404074 -419629 -226480 70948 -18902 -234507
2019 -234507 -232739 -211919 -476711 -659604 -397404 -3317 -335684 -341128 26704 -147991 -322127
2008 -322127 -322464 -312321 -272804 -343692 -624219 -730794 -756839 -565685 -461615 -406250 -396708
1997 -396708 -258075 -100534 -485055 -426689 -507878 -656814 -741541 -669155 -466475 -257100
1987 -257100 -293667 -493535 -574045 -591359 -545322 -535498 -534240 -535547 -564946 -385453 -611879 -636381
1975 -636381 -619374 -423046 -317222 -617756 -578641 -457092 -118777 -312165 -564932 -740741
1965 -740741 -725799 -618884 -633878 -321528 -407701 -497009 -628783 -503477 -492577 -719506 -880615
1954 -880615 -727494 -451547 -398855 -273960 -410220 -248472 -515975 -536276 -263639 -275446
1944 -275446 -263730 -139469 -215073 -343936 -370438 -442301 -745899 -695523 -365572 -547119 -327203
1933 -327203 -447750 -49140 211982 53283 -101215 -210756 -59410 -275600 -485386 -454330
1923 -454330 -430355 -515634 -463782 -646679 -527082 -416686 -384564 -342485 -193743 -274562 -509345
1912 -509345 -126798 -135014 -439325 -446467 -560294 -480401 -230222 -125258 -123069 -323679 -384617
1901 -384617 -240984 -341365 -602988 -483440 -514194 -341790 -322246 -423091 -247641 -54177
1891 -54177 -263041 -168016 -153817 -68235 -309487 -498533 -240747 -100225 -250010 -416024
1881 -416024 -481507 -504711 -646089 -504566 -407017 -232525 -143325 -432244 -511354 -432572 -595216
1870 -595216 -418284 -464700 -648252 -501575 -523750 -217549 -123268 -246138 -184504 -205814 -371246
1859 -371246 -373310 -192040 -277796 -541613 -575561 -619210 -659512 -710267 -533132 -364377 -135024
1848 -135024 -613057 -532964 -577462 -620184 -764063 -510356 -378413 -484738 -360353 -207707
1838 -207707 -384092 -659654 -464769 -338104 -423535 -548044 -383946 -185224 -357777 -465473
1828 -465473 -544580 -566338 -756566 -665051 -407713 -320209 -553457 -364438 -195780 -284349 -777317
1817 -777317 -742437 -529064 -478055 -455638 -448091 -229037 -569011 -623114 -606237 -521283 -449466
1806 -449466 -520583 -564237 -537765 -585923 -492515 -535543 -612557 -430063 -281005 -280341 -242098 -63241
1794 -63241 -141557 -130189 99936 -504398 -540442 -776941 -715756 -547905 -478729 -560705 -605158
1783 -605158 -553258 -293760 -290085 -643087 -433563 -236710 -371280 -341741 -260409 -493029 -515069
1772 -515069 -256555 -404967 -465245 -38637 -104479 -57503 -149912 -237541 -277731 -371656 -449549
1761 -449549 -706235 -556312 -651948 -650860 -543088 -304997 -447216 -487701 -420105 -406450 -588836
1750 -588836 -704352 -561145 -326966 -250182 -461388 -513586 -634865 -614332 -861838 -679675
1740 -679675 -559246 -566663 -540100 -423449 -301887 -482507 -542506 -527558 -547937 -334438 -92138
1729 -92138 -175808 -302573 -387010 -580966 -742349 -705303 -346777 -469633 -457055 -365150 -385428
1718 -385428 -605807 -703136 -594195 -357098 -526470 -607455 -599342 -506013 -309272 -277586 -213162
1707 -213162 -275138 -345355 -517672 -350137 -523707 -669566 -706911 -672044 -538813 -322541
1697 -322541 -407061 -342039 -17539 -102968 -125480 -241581 -228448 -177013 -162476 -259709 -635333
1686 -635333 -607660 -526943 -734140 -496150 -395053 -374244 -348803 -140169 -129753 -215497 -207548
1675 -207548 -378641 -379304 -456522 -444048 -501812 -310514 -286941 -143986 -220659 -436816 -494048
1664 -494048 -509312 -276917 -103159 -359072 -464932 -397482 -564999 -442240 -503258 -611176
1654 -611176 -598212 -533489 -425637 -334247 -349191 -298997 -230973 -596084 -446508 -474377 -327180
1643 -327180 48019 -430942 -360442 78893 -3665 -93813 -277969 -288733 -384606 -487538 -386478
1632 -386478 -300481 -385591 -380906 -416181 -401434 -288990 -222403 -353361 -356788 -480750 -644021
1621 -644021 -424362 -294873 -407402 -467500 -439369 -518701 -515167 -406115 -408518 -411461 -268378
1610 -268378 -298776 -547605 -505042 -440839 -524311 -462606 -399527 -496821 -614653 -681333 -793845
1599 -793845 -580612 -504317 -598642 -428482 -283939 -405550 -509660 -490535 -454988 -480524 -191874
1588 -191874 -105643 -245328 -395345 -305456 -356579 -278681 -315505 -300289 -255847 -492770 -836458
1577 -836458 -702754 -441246 -247366 -230454 -379744 -328063 -583780 -462442 -466321 -323723
1567 -323723 -363661 -602559 -526423 -425095 -258028 -377268 -489719 -389244 -241242 -536978
1557 -536978 -494611 -402754 -190500 -294933 -550867 -682463 -742350 -368143 -341542 -361158 -436631
1546 -436631 -559516 -392839 -409186 -520580 -407686 -419831 -223327 -355339 -825635 -698680
1536 -698680 -550324 -707257 -812106 -827729 -767986 -646180 -851388 -633609 -439586 -343185
1526 -343185 -381412 -307500 -71354 -231359 -314207 -523253 -668042 -603287 -359192 -633349
1516 -633349 -631684 -295043 -248315 -118956 -319731 -359925 -523147 -562784 -612563 -630298 -602796
1505 -602796 -461411 -573511 -623515 -407542 -218616 -184272 -438523 -481223 -657530 -688397
1495 -688397 -676004 -564152 -511445 -379293 -444832 -409179 -450491 -319749 -335417 -214620 -377803
1484 -377803 -565581 -521781 -547547 -569834 -541569 -333718 -184993 -195079 -319013 -236683 -321824
1473 -321824 -709028 -615736 -669605 -324338 -345297 -599196 -761502 -684299 -641838 -487582 -422048
1462 -422048 -303150 -291245 -354964 -484823 -509190 -311707 -136103 -169160 -623661 -576804 -441807
1451 -441807 -584774 -638776 -405787 -493257 -606544 -428189 -371600 -512541 -377017 -426141
1441 -426141 -537232 -277395 -454286 -618699 -393109 -448064 -608465 -541254 -529715 -502091
1431 -502091 -458156 -506691 -547412 -762882 -749098 -626281 -493222 -638228 -472111 -271156
1421 -271156 -397402 -718568 -414032 -297252 -218746 -145627 -233586 -452632 -497932 -512906 -28168
1410 -28168 -92555 -199367 -129025 -412150 -392686 -356087 -506131 -345473 -528020 -541849 -290520
1399 -290520 -118847 -77756 -372768 -507077 -501191 -178786 17112 -56062 -32656 -202686 -122441
1388 -122441 -193018 -186111 -217108 -259155 -257687 -507014 -317949 -318066 -212715 -157368 -193499 -295029
1376 -295029 -212569 -100406 -387433 -390440 -95341 -327054 -444443 -603964 -458254 -400655
1366 -400655 -420893 -719083 -650644 -569462 -253697 -263969 -263312 -469926 -580003 -558956 -334006
1355 -334006 -174809 -216058 -509801 -849066 -712327 -472503 -367244 -420300 -330070 -541717
1345 -541717 -527884 -366911 -133646 -590807 -544054 -616783 -412592 -317113 -399970 -412253 -245728
1334 -245728 -92331 -174663 -103405 -165478 -126041 -221704 -478419 -306154 -472257 -442435 -352493
1323 -352493 -440940 -370694 -430820 -592905 -330909 -101008 -369863 -205349 -444244 -607148
1313 -607148 -505155 -552871 -342575 -149287 -21667 -258655 -476083 -523225 -675542 -547282
1303 -547282 -417788 -506546 -407998 -134734 -52000 -191763 -385435 -657030 -1001665 -667479
1293 -667479 -423097 -438204 -382607 -408949 -499097 -387472 -355158 -531703 -597808 -329391 -406224
1282 -406224 -329265 -510966 -507717 -672162 -573086 -464193 -471384 -164169 -262699 -450788 -423286
1271 -423286 -777727 -455970 -350380 -474176 -517120 -707078 -690780 -749911 -440493 -447198 -449867
1260 -449867 -600056 -817181 -392884 -246290 -450337 -314162 -333675 -681851 -689661 -513870
1250 -513870 -465900 -226394 -210983 -670852 -724358 -233286 -388233 -334802 -404374 -481175 -483335
1239 -483335 -538441 -590508 -540863 -658388 -612922 -579057 -430851 -358476 -218823 -378115 -448140
1228 -448140 -395689 -318397 -509822 -555393 -386236 -221028 -358742 -444536 -261896 -267116 -314726
1217 -314726 -468354 -359611 -259157 -467180 -536639 -731699 -481932 -92087 -218087 -145444
1207 -145444 -34114 -215198 -531253 -417091 -480674 -564358 -653121 -679891 -383271 -367171 -403808
1196 -403808 -378321 -339944 -195927 -320854 -262542 -254646 -213867 -270169 -585526 -874128 -650783
1185 -650783 -520759 -601720 -602297 -483628 -480170 -479651 -306973 -393992 -532552 -551208 -439068 -593371
1173 -593371 -473688 -244348 -309506 -552144 -529342 -591527 -686899 -377635 -374639 -374695 -149722
1162 -149722 -346225 -321619 -267719 -394258 -518636 -542829 -259628 -248437 -424215 -418172 -423358
1151 -423358 -605025 -686707 -492405 -444412 -635530 -507950 -332492 -276245 -377869 -394863
1141 -394863 -359704 -400954 -533575 -516593 -409438 -139243 -388958 -214543 -314197 -311367 -601574
1130 -601574 -843674 -679760 -337998 -285928 -213274 -4177 -259146 -67820 -264208 -442360
1120 -442360 -423795 -209928 -252423 -369021 -259824 -128921 -35073 -442918 -449191 -385631 -451850
1109 -451850 -315838 -186617 -47567 -311850 -310548 -389746 -56690 97226 -51750 -102093
1099 -102093 -231335 -273348 -467579 -283181 -234446 -282911 -397986 -461107 -469158 -429924 -256166
1088 -256166 -350854 -327302 -447817 -443945 -613608 -544598 -501114 -618262 -273932 -45870 -132308
1077 -132308 -104586 -241228 -351943 -432734 -376393 -262909 -231572 -312899 -563852 -857419 -836097
1066 -836097 -566364 -517164 -555615 -734154 -740377 -574348 -549740 -547134 -550000 -579887 -321933
1055 -321933 -314407 -314568 -328334 -183854 -134290 -138138 -93330 -34464 -113167 -467720 -635347 -574906
1043 -574906 -479312 -545890 -193133 -282126 -342007 -345129 -453942 -208280 -140319 -40604 137396
1032 137396 -171381 -292604 -245236 -297663 -623231 -318626 -173279 -327998 -309263 -277306
1022 -277306 -622083 -715441 -538055 -603384 -512477 -501379 -526694 -331070 -448213 -556456 -439642
1011 -439642 -429012 -382491 -429665 -484296 -646196 -619985 -481953 -367513 -577836 -554248 -408341
1000 -408341 -442587 -403768 47002 -213156 -194803 -303275 -484690 -575400 -620209 -467860 -366581
989 -366581 -526173 -566947 -140264 -283291 -516814 -233245 -371048 -347803 -314701 -328988 -348476
978 -348476 -259288 -159356 -242975 -439228 -271217 -196317 -481677 -197131 -170369 -315987 -111222
967 -111222 -88373 -110098 -24866 -208508 -206061 -565037 -557238 -391811 -430777 -488799 -580310 -393807
955 -393807 -291923 -217729 -432051 -70733 -3659 -199671 -128527 -327678 -246880 -355666 -262543
944 -262543 -433300 -527513 -420655 -321826 -305103 -468040 -273319 -205876 -657618 -604705 -415375
933 -415375 -606882 -359232 -390952 -334827 -160060 -152705 30823 -2940 -23137 -163179 -194656
922 -194656 -362768 -422826 -196277 -52995 -211400 -448614 -208931 -15499 -102970 -256019
912 -256019 -447540 -423364 -204161 -49439 -97694 -167503 -74549 -385083 -597946 -472829 -451423
901 -451423 -357035 -324667 -454021 -509207 -516272 -505531 -548822 -479808 -108104 -313302 -473279
890 -473279 -613098 -581406 -429666 -615975 -443735 -395433 -593105 -158892 -207344 -317087
880 -317087 -298353 -249720 -263560 -171703 -206721 -440516 -385582 -291518 -444135 -286971 -116894
869 -116894 -411101 -303820 -237293 -292111 -413083 -384456 -376380 -389852 -320885 -398772 -504233
858 -504233 -238521 -197654 -378053 -293627 -113656 -444488 -552240 -89875 -40703 -282738
848 -282738 266 -201136 -465556 -610657 -572556 -456057 -470748 -333170 -121973 -281146
838 -281146 -467448 -281054 -527811 -542666 -179010 -321399 -438533 -582267 -423977 59880
828 59880 413 -393944 -232789 -356096 -163933 -138026 -193798 -374675 -506710 -403816 -401093
817 -401093 -449637 -438206 -448368 -621676 -372628 -578827 -670728 -590748 -436863 -444360 -417061
806 -417061 -309598 -333497 -668463 -512582 -514576 -515972 -578034 -199348 -404279 -445367 -506846
795 -506846 -449939 -546552 -640701 -590918 -258382 -55772 -197692 -173692 -252207 -266308 -199114
784 -199114 -300294 -621573 -589916 -318817 -191854 -894755 -569674 -368770 -178936 -195355
774 -195355 -218808 -332204 -429940 -310137 -574728 -817924 -729622 -724054 -615184 -334327 -398833
763 -398833 -622719 -647052 -591847 -388186 -382935 -781358 -897401 -790277 -665605 -354073 -248969
752 -248969 -298487 -271464 -334037 -241150 -328928 -548317 -298247 -276826 -197076 -111320 26253
741 26253 -10978 -90280 -314362 -332827 -211564 -158682 -125031 -266919 -81776 -93554 -33116
730 -33116 -200972 -393649 -311157 -315554 -478592 -366330 -167234 -233477 -397957 -376780 -313983
719 -313983 -212543 -337869 -746880 -707849 -429481 -269519 -192163 -319074 -364786 -421630 -365946
708 -365946 -483404 -156662 -64083 -227626 -131958 -205450 -62700 -124380 -246205 -237130 -366057
697 -366057 -227978 -56812 140250 10915 -41269 -156134 -61971 35669 53571 -167715 -358263
686 -358263 -482797 -573138 -513167 -589975 -551715 -376858 -377174 -439532 -228844 -32194 61754
675 61754 -378685 -442072 -459048 -369290 -524467 -605746 -574418 -397000 -506887 -587685 -341809
664 -341809 -295522 -132500 -383074 -447329 -228110 -257786 -500441 -653485 -401468 -107669
654 -107669 -1029 -336537 -387555 -246535 -306839 -191429 -319701 -432639 -570931 -567530 -458769
643 -458769 -481328 -590197 -380085 -227781 -378125 -482753 -416525 -509630 -510336 -235543 -365534
632 -365534 -369593 -238264 -208390 -231391 -230368 -348223 -276605 -353421 -488665 -470670 -482386 -306298
620 -306298 -265436 -244244 -392775 -413030 -444901 -292458 -322526 -419275 -360764 -395930 -394550 -398164
608 -398164 -552464 -698410 -572015 -353679 -312367 -518146 -435950 -415759 -262552 -338878 -467933
597 -467933 -368099 -164823 -57228 -123041 -391831 -547277 -517057 -463352 -471991 -348203 -95373
586 -95373 -133989 -249923 -331169 -142370 40076 -29654 -321625 -634664 -615595 -427940 -84630
575 -84630 -122556 -243481 19105 -309956 -739362 -617053 -254083 -120130 -19474 -70114
565 -70114 -472826 -561532 -660530 -273993 -268638 -494679 -495642 -383582 -406254 -427548 -245469 -191911
553 -191911 -215095 -239892 -129476 -438865 -495637 -579482 -528421 -599599 -681059 -651674 -443632
542 -443632 -641782 -509403 -262302 -438736 -586365 -340475 -447932 -487044 -464807 -270629
532 -270629 -262265 -448675 -313872 -413026 -315012 -41560 -355679 -817293 -396361 -493796 -528309
521 -528309 -383992 -189356 -271366 -213925 -279201 -188048 -519577 -577890 -449107 -244176 -332077
510 -332077 -218878 -246434 -196676 -3351 -182500 -282223 -534370 -311558 -478576 -551142 -547219
499 -547219 -584088 -258251 -223164 -373341 -245802 -314826 -376814 -650680 -401007 -202990 -351656
488 -351656 -314735 -473472 -268682 -152020 -163660 -261266 -397193 -193991 -86669 265731
478 265731 125461 -64172 -190470 -248337 -124675 130981 -49963 -114685 -84884 -10632 -33955
467 -33955 -95581 -186951 -74283 -77454 -72248 -438860 -619118 -280711 -174411 -127696 -159688
456 -159688 -342543 -526345 -313269 -344700 -262774 -270069 -226765 -392405 -546341 -49538 -160773
445 -160773 -378460 -265647 -257990 -286446 -133093 41983 -51483 -68886 -161475 -330822 -372001
434 -372001 -146562 -309094 -393974 -433978 -481939 -224855 -256810 -523744 -169393 -295163 -332491
423 -332491 -372944 -397158 -134183 -216359 -294385 -345715 -111878 -162232 -537512 -437213 -192038
412 -192038 -219468 -158587 40044 6734 -418783 -696124 -570297 -98298 -118271 -249798 -271989
401 -271989 -337397 -291018 -31469 -101123 -337956 -482604 -535814 -399566 -374143 -42318 -291248
390 -291248 -304410 -319583 -92484 -94088 -31479 -309971 -420099 -245731 -104528 -240128 -152734
379 -152734 78284 -413793 -422582 -608049 -511173 -378389 -368631 -223281 -270900 -254680 -336775
368 -336775 -328208 -365218 -553015 -387005 -396923 -406304 -411018 -360002 -292335 -393364 -500878 -401673
356 -401673 -650588 -535831 -483579 -555804 -279740 -359841 -183831 -244881 -408589 -308481 -157790
345 -157790 5856 50587 29996 72090 -267444 -470028 -204049 -136506 -418711 -478674 -349895
334 -349895 -291933 -327904 -258482 -296317 -401570 -317714 -188270 -540828 -545208 -409488 -469039
323 -469039 -365856 -484665 -388009 -456861 -297200 -432174 -544079 -483951 -530659 -400651 -263549
312 -263549 -293529 -290508 -116874 -224886 -197844 -178901 -216015 -387189 -591383 -453303 -588083
301 -588083 -525730 -468608 -366668 -419612 -303078 -356424 -240266 -402457 -412576 -390244 -538788
290 -538788 -386618 -191417 -20184 -146290 -418335 -492684 -570751 -370446 -210079 -169767
280 -169767 -407498 -646712 -546963 -477237 -264675 -264804 -306163 -178970 -379015 -378803 -249044
269 -249044 -449240 -757083 -465863 -258429 -366583 -159690 -95370 -28950 -105082 -384522
259 -384522 -230048 -21718 59024 74144 -348711 -190582 -47220 -117767 -275348 -299316 -77858
248 -77858 120356 -111949 -221432 -183039 -341650 -341472 -351912 -510980 -446989 -265268 -426532
237 -426532 -246645 -43058 -330281 -349346 -326607 -182594 -413469 -581500 -729301 -575540
227 -575540 -702911 -744252 -367812 -152295 -187399 -41772 -241433 -379299 -543672 -436318
217 -436318 -525405 -733523 -350132 -134536 -221464 -616881 -388976 -282692 -236455 -370584
207 -370584 -187872 -131396 -418254 -474691 -460773 -534985 -769148 -527694 -494712 -701209 -680629
196 -680629 -326502 -265244 -429646 -335501 -270792 -144116 -371809 -660239 -640493 -542777 -189284
185 -189284 -235603 -501513 -612432 -534448 -360596 -410750 -493220 -461569 -303325 -364504 -354386
174 -354386 -373250 -383739 -410943 -520541 -645277 -338257 -213187 -315538 -182236 -152707 -334280
163 -334280 -385562 -298102 -337173 -320400 -313286 -478437 -338095 -320839 -673604 -666141 -305902
152 -305902 -257814 -208634 -164639 -351448 -237349 -347351 -705009 -509421 -273997 -391503
142 -391503 -498239 -404942 -389027 -412436 -505698 -381726 -403875 -630650 -451585 -451524 -560659
131 -560659 -235776 -325162 -767383 -693294 -482352 -631834 -745731 -519020 -431314 -301155
121 -301155 -496523 -519283 -482777 -496512 -593030 -447611 -406560 -603016 -666483 -592736 -487440
110 -487440 -456843 -361241 -463760 -559973 -516789 -457426 -297966 -165625 -275655 -222091 -348231
99 -348231 -295577 -404376 -465436 -474662 -503405 -567387 -680647 -509640 -497206 -550662 -408634
88 -408634 -287293 -304721 -412536 -552940 -550160 -525003 -479403 -230436 -260695 -356019 -359668 -235760
76 -235760 -323939 -385190 -571916 -740072 -497513 -568797 -552673 -496886 -464379 -352384 -355183
65 -355183 -666997 -686932 -539432 -355040 -500156 -642723 -629293 -727850 -363796 -393480 -415472
54 -415472 -463381 -452820 -542822 -560171 -510888 -592079 -462956 -567448 -445213 -294585 -308423
43 -308423 -391584 -582874 -482436 -525301 -561959 -560809 -833603 -849925 -660905 -594927 -428652
32 -428652 -520170 -459883 -367843 -377869 -287441 -495761 -659176 -849565 -704844 -874284 -997685
21 -997685 -811608 -818994 -871131 -631127 -588783 -582744 -683052 -558938 -482211 -433910 -593513
10 -593513 -669234 -536862 -624711 -489711 -529214 -433067 -452256 -565388 -610184 -714800
0 -714800
$$ Imaginary data points
##PAGE= N=2
##DATA TABLE= (X++(I..I)), XYDATA
16383 -2832425 -2695341 -2946482 -2791913 -2788474 -2815455 -2751532 -2719252 -2775000 -2767080 -2615804 -2611206
16372 -2611206 -2324707 -2414158 -2480767 -2353947 -2351460 -2251643 -2243991 -2383469 -2295050 -2168924 -2213741
16361 -2213741 -2121910 -1990936 -1753242 -1817390 -1666330 -1639377 -1565428 -1683249 -1754470 -1584647
16351 -1584647 -1520028 -1461696 -1602139 -1678336 -1671978 -1662971 -1762451 -1730327 -1579210 -1439562 -1157997
16340 -1157997 -990081 -1166852 -1101869 -824457 -778687 -1068587 -932250 -693777 -615687 -875219
16330 -875219 -1083411 -1024875 -753682 -561601 -610041 -825892 -958231 -863087 -902272 -738271
16320 -738271 -547875 -616879 -482867 -436594 -443675 -351726 -264656 -129810 -120644 103432 49578
16309 49578 41992 72431 -33467 -34884 -83082 -53699 41657 155099 20606 5850 224189
16298 224189 187718 75734 222236 10316 197850 521611 401534 357840 384147 546616
16288 546616 621739 538102 730227 755660 736293 647254 671709 706276 583721 501753 586273
16277 586273 769493 817077 770173 910469 988772 921546 1221830 1204917 1099670 1051844 1050633
16266 1050633 1055572 1228911 1177467 1170908 1153136 1256703 1349681 1431638 1449785 1566153 1486447
16255 1486447 1273391 1381741 1430597 1332182 1434285 1628620 1603638 1734540 1655969 1475211
16245 1475211 1628794 1795918 1820195 1802539 1809285 1882790 1896816 1781036 1762182 1852553 1670648
16234 1670648 1592442 1786836 2053555 1895351 2129699 2181363 2001604 2078624 2189230 2214199
16224 2214199 2066351 2178735 2012846 1892853 2007445 2257517 2080337 2154667 2186238 1991099
16214 1991099 1963005 1764992 1669679 1784732 1988558 2229640 2195942 2083579 1990365 2197385
16204 2197385 2392298 2316085 2317523 2532825 2454108 2219059 2334211 2525491 2453927 2483625
16194 2483625 2740334 2543127 2565322 2491175 2798950 2784123 2821213 2637303 2606917 2540509
16184 2540509 2436264 2556441 2756942 2655760 2689502 2738847 2467740 2781648 3101814 2999165
16174 2999165 2790508 3068068 3141618 2953474 2847351 2807947 2786307 2861297 2540723 2694433
16164 2694433 2982810 3010725 2976700 2726745 2883947 3050023 3181161 3002831 3235301 3366579
16154 3366579 2989764 2790788 2514819 2567651 2510588 2694334 2733190 2744225 2673602 2710051
16144 2710051 2846463 2976504 2933714 2984332 3054979 3045308 2954460 3238137 3057671 3002647 2917743
16133 2917743 2997108 3067823 3182699 3074277 3025509 2992347 2981297 3197959 3133387 2956385
16123 2956385 2987144 3123145 3153254 3154705 3176223 3367880 3159306 3249398 3126492 3179825 3125767
16112 3125767 3219589 3196575 3114028 3193434 3374999 3373698 3176940 3247903 3235878 2988705 3223451
16101 3223451 3110500 3120389 3127602 3014802 3048123 3143110 3184448 3098224 3031978 3231856 3279514
16090 3279514 3254662 3419676 3328026 3137982 3113659 3092830 3496575 3694916 3611899 3410372
16080 3410372 3460509 3453988 3253212 3432896 3185732 3042166 3147972 3200870 3321637 3360158
16070 3360158 3360468 3216361 3278781 3528321 3633605 3535747 3270869 3542655 3520415 3328073
16060 3328073 3464744 3473186 3502545 3269779 3144415 3423509 3289305 3242501 3289634 2961947
16050 2961947 3029577 3306160 3403016 3552272 3536691 3487105 3382385 3648174 3614870 3256824
16040 3256824 3366657 3296663 3220553 3374519 3464137 3305943 3114342 3095894 3283334 3422197
16030 3422197 3437845 3280759 3418063 3221246 3010353 3459734 3449900 3447142 3450163 3415506 3584211
16019 3584211 3391340 3113954 3564648 3543421 3379940 3245115 3170665 3282592 3499640 3329830
16009 3329830 3538042 3686704 3470486 3295539 3357331 3553805 3483735 3336120 3275734 3190710
15999 3190710 2818123 2957640 3055200 3103093 3287724 3430826 3283631 3536208 3322101 3489160
15989 3489160 3723508 3585535 3738490 3520821 3630434 3697368 3489761 3419284 3355584 3332781
15979 3332781 3445109 3273659 3179190 3172894 3392273 3422307 3421708 3515976 3454884 3555368 3333775
15968 3333775 3423873 3507327 3546961 3523279 3545241 3651523 3409258 3434585 3488664 3316835 3226509
15957 3226509 3242857 3453430 3391746 3401807 3497954 3245449 3249843 3343644 3492802 3582789 3819547
15946 3819547 3626579 3394591 3321145 3003009 3325273 3582917 3561741 3353598 3394556 3273654
15936 3273654 2965387 3251798 3176720 3201962 3331633 3274326 3384533 3205576 3158675 3260651
15926 3260651 3286174 3312039 3283567 3086589 3288100 3323913 3400474 3511124 3408506 3472928
15916 3472928 3514378 3529954 3410796 3181018 3534873 3512983 3460676 3424100 3245347 3217104
15906 3217104 3112052 3327482 3263570 3285354 3013622 3241558 3242984 3452595 3515727 3415402
15896 3415402 3220112 3427032 3388865 3391738 3529303 3493644 3483471 3238632 3195697 3339274
15886 3339274 3448673 3544914 3354304 3314140 3554385 3462667 3218019 3087124 3331828 3354618
15876 3354618 3301015 3074879 3293035 3394459 3454090 3405276 3341367 3451051 3781979 3567450
15866 3567450 3404056 3249668 3375627 3519204 3540973 3699773 3658092 3743374 3500179 3294787
15856 3294787 3078951 3136200 3455299 3520924 3306982 3262908 3174593 3119995 3150796 3444417
15846 3444417 3382662 3496927 3684004 3655578 3557996 3526553 3334705 3177236 3288350 3430272
15836 3430272 3600530 3765548 3547285 3443563 3720135 3899421 3610921 2933726 3283188
15827 3283188 3566289 3451783 3440324 3671420 3722780 3610915 3496875 3608082 3508608 3480297
15817 3480297 3535713 3392251 3487697 3496345 3631170 3647041 3713924 3811255 4191232 3823171 3268980
15806 3268980 3164546 3107996 3583850 3550688 3543791 3614610 3495513 3393525 3688025 3478309
15796 3478309 3349458 3319290 3419130 3542774 3705686 3749902 3658246 3510956 3623259 3624320
15786 3624320 3688204 3573507 3643003 3466495 3028644 3177706 3297718 3305459 3237435 3016640
15776 3016640 3179452 3465538 3564785 3502928 3859635 3953336 3563275 3534950 3413553 3291399
15766 3291399 3366238 3541842 3446513 3420835 3223746 3108978 3127505 2976466 3158173 3148260
15756 3148260 3158700 3220640 3129092 3273748 3293311 3476461 3330822 3256702 3415997 3658570
15746 3658570 3540317 3616875 3667149 3683560 3627299 3583900 3446986 3299882 3169911 3402335
15736 3402335 3571552 3546358 3430122 3134011 3357908 3798666 3664016 3314496 3304767 3823377
15726 3823377 3554943 3459278 3502915 3594038 3396930 3474900 3501621 3656056 3748086 3936647
15716 3936647 3752417 3386595 3277289 3324999 3453111 3487079 3776053 3673312 3333988 3317679
15706 3317679 3171488 3302464 3595789 3587725 3363883 3272355 3334860 3471161 3484148 3400169
15696 3400169 3581788 3603465 3550570 3459480 3713922 3559674 3549359 3345139 3255734 3285835
15686 3285835 3348183 3290637 3462205 3460849 3630244 3239086 3130220 3369502 3386611 3521821
15676 3521821 3309768 3285013 3307158 3487668 3563892 3338713 3582792 3529011 3310047 3306242
15666 3306242 3264190 3151810 3347930 3205244 3074724 3284462 3006003 3307337 3635834 3583866
15656 3583866 3689473 3513908 3626753 3541584 3669570 3503120 3249442 3338326 3287465 3206119
15646 3206119 3422047 3659274 3608799 3554803 3440760 3433501 3511520 3610960 3459515 3574552
15636 3574552 3675639 3652195 3719848 3558661 3573608 3480824 3443166 3447225 3557831 3731006 3742265
15625 3742265 3947119 3653837 3413516 3554199 3592386 3373261 3381432 3358254 3375653 3450982
15615 3450982 3537739 3464070 3331654 3399736 3620226 3554157 3564413 3593274 3760706 3696839 3553147
15604 3553147 3735292 3574439 3473754 3378147 3578051 3668109 3496642 3457824 3665342 3586866
15594 3586866 3237460 3331100 3470829 3181794 3246504 3527818 3704071 3523041 3711330 3736047
15584 3736047 3489996 3358142 3500738 3514117 3357939 3296240 3426885 3727311 3489859 3281159
15574 3281159 3234283 3316223 3417813 3654649 3601172 3228121 3407598 3656631 3605077 3537584
15564 3537584 3695744 3670673 3504745 3397855 3249820 3302577 3437245 3713570 3519015 3530329
15554 3530329 3488491 3425274 3393598 3235643 3273684 3156906 3312833 3355065 3542678 3466779
15544 3466779 3442093 3451157 3619394 3730898 3509709 3634002 3628908 3684008 3722858 3483633 3462824
15533 3462824 3484822 3530260 3684819 3355666 3448999 3462092 3219372 3416522 3693274 3634599
15523 3634599 3507657 3184018 3762411 3967645 3539061 3582723 3807540 3628916 3689981 3755932
15513 3755932 3586840 3525856 3378456 3379364 3295615 3394040 3434234 3510236 3477129 3497207 3649810
15502 3649810 3709503 3764898 3467479 3395735 3681077 3646521 3454035 3575988 3789411 3754429
15492 3754429 3586679 3683929 3613953 3746750 3564909 3354832 3540327 3881687 3679107 3562647
15482 3562647 3726315 3791911 3840039 3539058 3649345 3622863 3531642 3363652 3304839 3427839
15472 3427839 3466068 3362480 3602109 3381198 3498622 3523257 3570508 3757434 3578592 3693268
15462 3693268 3424691 3461421 3483517 3664103 3704566 3662469 3601658 3506197 3154927 3429089
15452 3429089 3483886 3464606 3483671 3313071 3472068 3667731 3644869 3671919 3788971 3624771
15442 3624771 3757280 3599704 3893060 3994656 3835930 3679611 3257659 3253426 3541526 3552687
15432 3552687 3519258 3457602 3516686 3466232 3366154 3426188 3131257 3110234 3317529 3344374 3644434
15421 3644434 3597224 3314488 3560805 3872957 3721157 3619652 3505619 3248788 3263793 3628794
15411 3628794 3546225 3405059 3660013 3658670 3441969 3639526 3442793 3273340 3303849 3567716
15401 3567716 3318282 3385195 3500726 3322386 3369555 3485763 3438808 3512067 3340409 3568824
15391 3568824 3584215 3662388 3791648 3724548 3700471 3696051 3465035 3571689 3646991 3600364 3684951
15380 3684951 3752781 3893374 3683831 3701107 3710927 3643683 3609623 3240287 3256921 3124706 3336574
15369 3336574 3640422 3407221 3571554 3559282 3809178 3758580 3792526 3606088 3542575 3592630
15359 3592630 3500094 3315702 3407235 3457156 3592643 3430331 3518728 3873137 3879167 3588174
15349 3588174 3482272 3458082 3710768 3619848 3629526 3664414 3813271 3579392 3666103 3578826 3325016
15338 3325016 3453071 3569531 3624150 3602348 3581752 3547712 3752692 3843550 3797796 3553764
15328 3553764 3685329 3585314 3569820 3580549 3452414 3486350 3786514 3799798 3584426 3637913
15318 3637913 3546701 3308847 3664730 3914329 3879627 3555134 3259247 3392590 3636119 3429556
15308 3429556 3535298 3644023 3695349 3583234 3373301 3606835 3696263 3762582 3460424 3484332
15298 3484332 3586156 3843791 3567146 3515179 3796391 3651463 3599492 3860877 3712205 3678234
15288 3678234 3977925 3896922 3657391 3735848 3733305 3852004 3651735 3704245 3699814 3503884 3460126
15277 3460126 3646391 3567358 3345790 3541403 3593905 3549563 3612839 3677206 3438340 3385492
15267 3385492 3489602 3657091 3709019 3595768 3445336 3667724 3763852 3583579 3475020 3402097
15257 3402097 3573820 3480391 3636572 3687995 3683391 3774626 3783609 3768527 3656007 3675784 3688488
15246 3688488 3680231 3636097 3805121 3681632 3632824 3403402 3450169 3630255 3509981 3259401
15236 3259401 3183507 3236075 3417472 3509243 3552887 3363947 3362005 3374039 3250339 3325446 3291401
15225 3291401 3264778 3371123 3208393 3168510 3068480 3374098 3491715 3536711 3554768 3544009
15215 3544009 3601670 3393457 3463464 3523991 3491318 3454065 3644651 3738997 3762208 3670654 3389814
15204 3389814 3308428 3069149 3272191 3392431 3498557 3321059 3246407 3423224 3712022 3344124
15194 3344124 3177317 3524445 3738755 3772361 3509889 3701876 3632640 3897990 3852890 3883889
15184 3883889 3937713 3850877 3841148 3869972 3982380 3807687 3706628 3483733 3676622 3721610
15174 3721610 3510139 3392485 3487944 3510614 3542580 3385169 3390190 3543656 3376144 3374297 3608518
15163 3608518 3697359 3645452 3724666 3750965 3815133 3670300 3748754 3800243 3455502 3558879 3631474
15152 3631474 3369268 3460705 3572658 3779004 3637593 3634888 3776247 3552802 3526816 3478737
15142 3478737 3474176 3432310 3633735 3884999 3720604 3692190 3753700 3572369 3553131 3824066
15132 3824066 3730123 3600460 3661826 4078077 3869332 3867222 3646644 3660395 3797631 3820873
15122 3820873 3747973 3841097 3631257 3746298 3752807 3603241 3665750 3497699 3321616 3302261
15112 3302261 3409274 3476158 3880232 3679750 3735715 3912516 3730716 3750380 3654249 3511750
15102 3511750 3740013 3779995 3590458 3570803 3475859 3523485 3941191 3665156 3585548 3734558
15092 3734558 3671951 3870897 3767725 3585646 3794541 3761746 3739749 3715990 3732569 3817419
15082 3817419 3835638 3795705 3792066 3858735 3792857 3856627 3846767 3830964 3750175 3633821 3576170
15071 3576170 3765278 3639237 3717599 3906130 3672906 3713937 3789456 3796228 3797218 3850626 3711861
15060 3711861 3754460 3999608 4029894 3866235 3587395 3637724 3730834 3726668 3551693 3794648
15050 3794648 3942904 3891861 3827478 3621987 3564285 3797440 4044190 3923923 3861265 3992278
15040 3992278 3715912 3769461 3815535 4139525 3984757 3852246 4007776 3955120 3805006 3673843
15030 3673843 3936884 3959124 3593278 3357141 3667423 4037842 4247524 3803855 3641956 3744514
15020 3744514 3928063 3725761 3652251 3655653 3630806 3592411 3727512 3568075 3411686 3564062
15010 3564062 4038920 3920792 3746464 3896265 3799283 3514290 3989906 3971321 3772099 3714601
15000 3714601 3564228 3700144 3766801 3549229 3713095 3781708 3641505 3651889 3436885 3450222
14990 3450222 3398926 3450980 3597186 3544056 3522944 3403883 3415018 3518002 3466196 3740332
14980 3740332 3794584 3533024 3555158 3731084 3510340 3287597 3638031 3550392 3329277 3704200
14970 3704200 3779934 3739492 3691420 3602537 3440274 3392742 3660211 3705682 3739181 3796570 3833215
14959 3833215 3772048 3499508 3870812 4088521 4116570 4095419 3759554 3789523 3795474 3603646
14949 3603646 3770952 3920819 3825748 3687589 3922781 3769886 3641311 3637575 3766778 3746862
14939 3746862 3598554 3707756 3983238 3958873 3790577 3818058 3824649 3688145 3816691 3847786
14929 3847786 3814066 3678261 3523766 3569464 3691358 3461803 3436172 3391065 3526330 3578940
14919 3578940 3848781 4023209 4008437 3919956 3633486 3702824 3614286 3829147 3726705 3803971
14909 3803971 3654769 3502933 3554121 3869295 4194730 3956287 4103599 4180218 3954885 3816435
14899 3816435 3916749 4021149 3793874 3743124 3744443 3894714 3873778 4069925 3797448 3698063
14889 3698063 3759469 3975459 4273188 4086466 3952681 3765481 3609915 3639921 3614793 3740983
14879 3740983 3669863 3883562 3974505 3673949 3768453 3476813 3495155 3596486 3746859 3791638
14869 3791638 3672265 3754237 4254788 4183195 3926544 3965804 3852186 3774138 3699402 3759012
14859 3759012 3689050 3857609 3912633 3765861 3681339 3536755 3646546 3764922 3834642 3651248
14849 3651248 3687267 3626684 3821897 3868613 3934173 3982588 3991691 4010449 3821859 3735034 3768502
14838 3768502 3625330 3652060 3874728 3885940 3793327 3898988 3771100 3667690 3930981 3876744
14828 3876744 4105216 4019762 3994911 3545713 3525579 3626454 3685104 3638038 3627751 3911937
14818 3911937 3772900 3709479 3660273 3260430 3550879 3515308 3498891 3814199 3695830 3739662
14808 3739662 3629981 3696179 4015527 4208289 4051912 3962252 3996086 3629886 3718095 3834019
14798 3834019 3645780 3906322 3732541 3615836 3618971 3712385 3895841 4011891 3914775 3680562
14788 3680562 3747766 3685539 3435213 3499156 3722525 3712731 3483922 3535911 3701364 3856564
14778 3856564 3704574 3625133 3524432 3778103 3861042 3940305 3934063 3973874 4039813 3773464 4026610
14767 4026610 4041633 3724029 3743147 3907314 3697405 3615662 3565744 3815594 3939646 4197747
14757 4197747 4038763 4049226 3907376 3564309 3738849 3649194 3735554 4060181 3901565 3547809
14747 3547809 3928272 3715295 3868693 3871908 3862888 3913165 3974825 4112057 3813902 3615566
14737 3615566 3400401 3518196 3584076 3615670 3722074 3786348 4063482 3889999 3716612 3894313
14727 3894313 3711277 3759373 3855631 4051913 3868512 4015270 4110205 4077187 3912832 3964392
14717 3964392 3861617 3987701 3957216 3863094 3899436 3980082 3645931 3443774 3794512 3719789
14707 3719789 3731792 3824268 3975602 3935177 3916615 3952264 3738500 3773768 3827917 3909702 4068911
14696 4068911 4035547 3861221 3897145 3845968 3853727 3700537 3624198 3848052 3576269 3747755
14686 3747755 3788818 3509561 3786713 3984488 3927508 4065709 3866929 3807389 3805113 3938945
14676 3938945 3961795 3777214 3390253 3612421 3762684 3641875 3487402 3726680 3684116 3711013
14666 3711013 3876664 3639700 3690022 3760352 3915319 3962285 3892982 3795779 3943921 3997576
14656 3997576 3689944 3545195 3468364 3584621 3808943 3963902 3757064 3631423 3977070 4092315
14646 4092315 4023570 3970138 4149686 4017204 3826898 3734593 3747895 4053835 3814974 3798013
14636 3798013 3750723 3833170 3960067 3673842 3825892 3835472 3620884 3811152 3787680 3826098
14626 3826098 3854571 3971297 3741519 3624959 3743097 3854080 3926669 3915063 3913764 3724710
14616 3724710 3626308 3741545 4016669 4153748 3869269 3717729 3672551 3994411 3988361 3871831
14606 3871831 3711373 3499587 3862608 3873086 3983612 3977372 4130080 3906687 3916135 3864595
14596 3864595 3945121 3858627 3976425 3964754 3847008 3911732 3596643 3647521 3878774 3994693
14586 3994693 3811412 3627955 3901005 3910817 3578804 3989188 4165748 4010707 3753606 3490767
14576 3490767 3393536 3620326 3877738 3791634 3885364 4143213 4095180 3986013 4125945 4038891
14566 4038891 4036773 4069369 4208298 4077031 4064391 4037755 3834056 3817669 3825596 3914183 4045726
14555 4045726 3938689 4049875 3972699 3960445 3964398 4116474 3871111 3590852 3598301 3574314 3732381
14544 3732381 3802218 4058738 4044594 3996267 3947745 3807092 3690767 3819310 4043459 4054231
14534 4054231 4128769 3885077 3929836 3880206 3963498 4047135 4089236 4021929 4186553 4063392 4016600
14523 4016600 4113316 3977178 3958395 3889838 3899155 3845866 3917591 3884853 3677322 3717365 3687222
14512 3687222 3577841 3878515 3846337 3905664 3880694 3992674 3951493 4043710 4028582 4135136
14502 4135136 4021917 4240840 4175818 4080743 3866231 3686361 3636869 3522454 3650876 3984895
14492 3984895 3909571 3625753 3740711 4088695 4082204 3885667 3999979 4039113 4162827 4193031
14482 4193031 3964406 4121858 4135898 4077862 4178675 3667013 3769792 3786392 3870335 4197222
14472 4197222 4212614 4292709 4226535 3999271 3791957 3549655 3767029 4007513 3682466 4029631
14462 4029631 4290983 4021446 4117638 4263120 4218795 4148281 4046749 4163491 4019363 3965130
14452 3965130 4166393 4224482 3829561 3926864 4159175 4030213 3870827 3911327 4127413 4206482
14442 4206482 4117645 4101782 4118534 3841772 3890537 3946246 3940696 3783525 3908662 3961295 4023864
14431 4023864 4022093 4113859 4067498 4178728 4033562 4006548 4165229 3913866 3671309 3630811
14421 3630811 3716724 3853626 3819664 3569463 3719715 3876351 3778541 3842142 3710940 3996012
14411 3996012 4068778 3818746 3829292 3940765 4004325 3761723 3673908 3714294 3959809 4109641
14401 4109641 3963892 3857658 3802109 3980620 4077270 4149262 4046863 3768646 3893390 3955185
14391 3955185 4027180 4150451 3900604 3890929 3884751 3946343 4056466 3820719 3635565 3365313
14381 3365313 3536673 3703522 3892222 3992035 4034503 4084526 3851575 4113060 4233537 4075945
14371 4075945 4142786 4109901 4249954 4157491 4112902 4062208 4009983 3840436 3721764 3761487 4216370
14360 4216370 4234284 3907807 3880296 4036112 4020817 3754140 3726430 3852808 3906745 3963938
14350 3963938 3933853 4010484 4151811 3916472 3811357 3740024 3918975 3710067 3611614 3871766
14340 3871766 3803465 3812179 3990724 3795411 3882158 3948370 3851546 4113127 4002769 4144391
14330 4144391 4347885 4224400 4501222 4244606 4186590 4028680 3921543 4043369 3968730 3867972
14320 3867972 3497728 3833785 4003263 3896178 3873798 4102069 4222788 4150098 3969907 3773249
14310 3773249 3809265 3819255 3904170 3919589 3572638 3868454 4174668 4141368 3956901 3761079
14300 3761079 4093414 4188192 4433030 4391212 4426106 4378956 4301097 4154119 4030672 4211802
14290 4211802 4088775 3962334 3919677 3816579 3894071 3825479 3869117 3869299 3695667 3850966 3920740
14279 3920740 3880190 3688311 4003131 4061980 4017104 4085575 3980543 4044041 3978275 3878777 3907547
$$ [...]
##END NTUPLES=NMR SPECTRUM
##END=
