##TITLE=1H_DE-80H_X3
 200.13MHz, d2o
 8 sc
 
 19ns.26.2.2025
##JCAMPDX= 6.0         $$ Bruker NMR JCAMP-DX V2.0
##DATA TYPE= NMR SPECTRUM
##DATA CLASS= NTUPLES
##ORIGIN= UXNMR, Bruker Analytische Messtechnik GmbH
##OWNER= pz
$$ XWIN-NMR		Version 3.5
$$ Fri Mar 20 09:42:41 2026 Russian Standard Time (UT+4h)  Yarkov@DPX200
##.OBSERVE FREQUENCY= 200.1313
##.OBSERVE NUCLEUS= ^1H
##.ACQUISITION MODE= SIMULTANEOUS
##.ACQUISITION SCHEME= undefined
##.AVERAGES= 8
##.DIGITISER RES= 18
##SPECTROMETER/DATA SYSTEM= spect
##.PULSE SEQUENCE= zg30
##.SOLVENT NAME= CDCl3
##.SHIFT REFERENCE= (INTERNAL, CDCl3, 0, 15.4637)
##AUDIT TRAIL= $$ (NUMBER, WHEN, WHO, WHERE, WHAT)
$$ ##TITLE= Audit trail, XWIN-NMR		Version 3.5
$$ ##JCAMPDX= 5.01
$$ ##ORIGIN= Bruker BioSpin GmbH
$$ ##OWNER= Yarkov
$$ C:/Bruker/XWIN-NMR/data/yarkov2/nmr/H-C/1/pdata/1/auditp.txt
$$ ##AUDIT TRAIL=  $$ (NUMBER, WHEN, WHO, WHERE, WHAT)
(   1,<2026-03-20 09:41:54.79 +0400>,<Yarkov>,<DPX200>,
      <created by zg, POWCHK disabled, PULCHK disabled
       configuration hash MD5:
       00 E9 B6 7A A2 85 ED C7 34 08 36 98 17 FE 4E 26
       data hash MD5: 16K
       6D 76 17 84 BE A6 4C 00 2D 2A E8 0C 2A BC 47 86>)
(   2,<2026-03-20 09:42:02.71 +0400>,<Yarkov>,<DPX200>,
      <Start of raw data processing
       efp BC_mod = 2 LB = 0.25 FT_mod = 6 PKNL = 1 PHC0 = -5299.148 PHC1 = 6.821927 SI = 16K 
       data hash MD5: 16K
       8A 93 9D 42 76 C0 BD 7B F1 43 3C 44 23 D9 22 17>)
$$ ##END=
$$ 
$$ hash MD5
$$ 10 53 62 75 50 B5 B3 8A DB 29 F0 A0 F7 13 F7 4C
##$RELAX= 
##$RELAX= 
##$RELAX= 
##$RELAX= 
##$RELAX= 
##$RELAX= 
$$ Bruker specific parameters
$$ --------------------------
##$DU= <C:/Bruker/XWIN-NMR>
##$EXPNO= 1
##$NAME= <H-C>
##$PROCNO= 1
##$TYPE= <nmr>
##$USER= <yarkov2>
##$AMP= (0..31)
100 100 100 100 100 100 100 100 100 100 100 100 100 100 100 100 100 100 
100 100 100 100 100 100 100 100 100 100 100 100 100 100 
##$AQSEQ= 0
##$AQ_mod= 1
##$AUNM= <au_zg>
##$AUTOPOS= <>
##$BF1= 200.13
##$BF2= 200.13
##$BF3= 200.13
##$BF4= 200.13
##$BF5= 200.13
##$BF6= 200.13
##$BF7= 200.13
##$BF8= 200.13
##$BYTORDA= 1
##$CFDGTYP= 0
##$CFRGTYP= 5
##$CHEMSTR= <none>
##$CNST= (0..31)
1 1 145 1 1 1 1 1 1 1 1 1 1 1 1 1 1 1 1 1 1 1 1 1 1 1 1 1 1 1 1 1 
##$CPDPRG= <>
##$CPDPRG1= <>
##$CPDPRG2= <>
##$CPDPRG3= <>
##$CPDPRG4= <mlev>
##$CPDPRG5= <mlev>
##$CPDPRG6= <mlev>
##$CPDPRG7= <mlev>
##$CPDPRG8= <mlev>
##$CPDPRGB= <>
##$CPDPRGT= <>
##$D= (0..31)
0 0.7 0 0 0 0 0 0 0 0 0 0.03 0 0 0 0 0 0 0 0 0 0 0 0 0 0 0 0 0 0 0 0 
##$DATE= 1773985314
##$DBL= (0..7)
120 120 120 120 120 120 120 120 
##$DBP= (0..7)
150 150 150 150 150 150 150 150 
##$DBP07= 0
##$DBPNAM0= <>
##$DBPNAM1= <>
##$DBPNAM2= <>
##$DBPNAM3= <>
##$DBPNAM4= <>
##$DBPNAM5= <>
##$DBPNAM6= <>
##$DBPNAM7= <>
##$DBPOAL= (0..7)
0.5 0.5 0.5 0.5 0.5 0.5 0.5 0.5 
##$DBPOFFS= (0..7)
0 0 0 0 0 0 0 0 
##$DE= 6
##$DECBNUC= <off>
##$DECIM= 32
##$DECNUC= <off>
##$DECSTAT= 4
##$DIGMOD= 1
##$DIGTYP= 9
##$DL= (0..7)
0 120 120 120 120 120 120 120 
##$DP= (0..7)
$$ [...]
##$SUBNAM2= <"">
##$SUBNAM3= <"">
##$SUBNAM4= <"">
##$SUBNAM5= <"">
##$SUBNAM6= <"">
##$SUBNAM7= <"">
##$SUBNAM8= <"">
##$SUBNAM9= <"">
##$SW= 18.0517328524113
##$SWIBOX= (0..15)
0 0 2 0 0 0 0 0 0 0 0 0 0 0 0 0 
##$SW_h= 3612.71676300578
##$TD= 16384
##$TD0= 1
##$TE= 0
##$TE2= 300
##$TE3= 300
##$TEG= 300
##$TL= (0..7)
0 120 120 120 120 120 120 120 
##$TP= (0..7)
150 150 150 150 150 150 150 150 
##$TP07= 0
##$TPNAME0= <>
##$TPNAME1= <>
##$TPNAME2= <>
##$TPNAME3= <>
##$TPNAME4= <>
##$TPNAME5= <>
##$TPNAME6= <>
##$TPNAME7= <>
##$TPOAL= (0..7)
0.5 0.5 0.5 0.5 0.5 0.5 0.5 0.5 
##$TPOFFS= (0..7)
0 0 0 0 0 0 0 0 
##$TUNHIN= 0
##$TUNHOUT= 0
##$TUNXOUT= 0
##$USERA1= <user>
##$USERA2= <user>
##$USERA3= <user>
##$USERA4= <user>
##$USERA5= <user>
##$V9= 5
##$VALIST= <valist>
##$VCLIST= <CCCCCCCCCCCCCCC>
##$VD= 0
##$VDLIST= <DDDDDDDDDDDDDDD>
##$VPLIST= <PPPPPPPPPPPPPPP>
##$VTLIST= <TTTTTTTTTTTTTTT>
##$WBST= 1024
##$WBSW= 4
##$XGAIN= (0..3)
0 0 0 0 
##$XL= 0
##$YL= 0
##$YMAX_a= 280347
##$YMIN_a= -271388
##$ZGOPTNS= <>
##$ZL1= 120
##$ZL2= 120
##$ZL3= 120
##$ZL4= 120
##$ABSF1= 0
##$ABSF2= 0
##$ABSG= 0
##$ABSL= 0
##$ALPHA= 0
##$AQORDER= 0
##$ASSFAC= 0
##$ASSFACI= 0
##$ASSFACX= 0
##$ASSWID= 0
##$AUNMP= <proc_1d>
##$AZFE= 0.1
##$AZFW= 0.1
##$BCFW= 0
##$BC_mod= 2
##$BYTORDP= 0
##$COROFFS= 0
##$CY= -3
##$DATMOD= 1
##$DC= 0
##$DFILT= <>
##$DTYPP= 0
##$F1P= 0
##$F2P= 0
##$FCOR= 1
##$FTSIZE= 16384
##$FT_mod= 6
##$GAMMA= 0
##$GB= 0
##$INTBC= 1
##$INTSCL= 3.241238e-09
##$ISEN= 128
##$LB= 0.25
##$LEV0= 0
##$LPBIN= 0
##$MAXI= 10000
##$MC2= 0
##$MEAN= 0
##$ME_mod= 0
##$MI= 1.114404
##$NCOEF= 0
##$NC_proc= -7
##$NLEV= 6
##$NOISF1= 3.799351
##$NOISF2= 2.8
##$NSP= 0
##$NTH_PI= 0
##$NZP= 0
##$OFFSET= 15.46373
##$PC= 1
##$PHC0= -5299.148
##$PHC1= 6.821927
##$PH_mod= 1
##$PKNL= yes
##$PPARMOD= 0
##$PSCAL= 0
##$PSIGN= 0
##$REVERSE= no
##$SF= 200.130011602152
##$SI= 16384
##$SIGF1= 3
##$SIGF2= 2
##$SINO= 0.751879
##$SIOLD= 32768
##$SREGLST= <19F.Aceton>
##$SSB= 0
##$STSI= 16384
##$STSR= 0
##$SW_p= 3612.71676300578
##$SYMM= 0
##$S_DEV= 0
##$TDeff= 16384
##$TDoff= 0
##$TI= <>
##$TILT= no
##$TM1= 0
##$TM2= 0
##$TOPLEV= 0
##$USERP1= <user>
##$USERP2= <user>
##$USERP3= <user>
##$USERP4= <user>
##$USERP5= <user>
##$WDW= 1
##$XDIM= 16384
##$YMAX_p= 346327637
##$YMIN_p= -1272216
$$ End of Bruker specific parameters
$$ ---------------------------------
##NTUPLES= NMR SPECTRUM
##VAR_NAME=  FREQUENCY,     SPECTRUM/REAL,   SPECTRUM/IMAG
##SYMBOL=    X,             R,               I
##VAR_TYPE=  INDEPENDENT,   DEPENDENT,       DEPENDENT
##VAR_FORM=  AFFN,          ASDF,            ASDF
##VAR_DIM=   16384,         16384,           16384
##UNITS=     HZ,            ARBITRARY UNITS, ARBITRARY UNITS
##FACTOR=    0.220516191357247, 1,           1
##FIRST=     3094.75643597382, 0,            0
##LAST=      -517.960327031957, 0,           0
##MIN=       -517.960327031957, -1272216,    0
##MAX=       3094.75643597382, 346327637,    0
$$ Real data points
##PAGE= N=1
##DATA TABLE= (X++(R..R)), XYDATA
$$ [...]
7994 -83198 -186358 -162230 -94517 -48478 -78423 -80705 -78292 -44139 -10790 -48388 125871 114001
7982 114001 -11718 -38231 -98781 -29018 -35322 -109209 -102361 -59253 -96553 -96925 -113700 -154093
7970 -154093 -110527 -127755 -109550 -55482 -193056 -234579 -118625 -210073 -200084 -110993 -87436
7959 -87436 71779 83550 -21864 -143007 -8710 -15356 -178546 -115209 -153655 -99230 -15892
7948 -15892 -60244 28101 86879 -19746 -36609 -181789 -236061 -117641 -177265 -194711 -216677
7937 -216677 -78085 17954 -96965 -94259 -194480 -170635 -12754 -132785 -117251 -40292 -84124
7926 -84124 -95163 -128440 38549 69248 7573 32042 47136 11949 30397 41620 -16624 -60492
7914 -60492 -82450 -124451 -100072 -58507 76468 20448 -121094 -77901 -64729 -165372 -122552
7903 -122552 -123227 -59104 -83072 -81905 -66096 7762 9428 -17975 -100227 -67139 -110344 -38479
7891 -38479 153242 114026 172534 62804 97959 48438 6596 46419 -55261 -24934 71790
7880 71790 222472 202420 88062 42766 73467 29862 -5111 -40363 -60824 -151431 -106176
7869 -106176 -103879 -37024 79395 175198 81306 -22276 96041 33721 16898 -136788 -204499
7858 -204499 -16100 26676 -61834 -36752 54956 -14524 82076 71741 -106465 -159138 -132255
7847 -132255 -23980 47763 56126 -94807 -180333 -65247 18028 -121664 -42139 -77411 -126885
7836 -126885 -80985 70010 52081 108899 62102 10347 -110954 -26260 40953 7365 14764
7825 14764 29181 104226 72900 -36449 12953 3846 -47588 87594 48813 -87688 -120163
7814 -120163 -49041 -13415 -44380 -38347 -96641 -52708 -61667 -145044 69771 -125801 -408070
7803 -408070 -319350 -217223 -87462 -196115 -225975 -219358 -170863 -179277 -35793 84685 -85475
7792 -85475 -112335 93660 106977 20373 36253 52756 50568 52228 18080 -91780 -97569 56617
7780 56617 78043 -42541 66184 20550 -102515 68656 112583 -84818 -215541 -159835 -58471
7769 -58471 -47975 -53598 -25549 -19651 42553 -60485 -89274 -25316 -177325 -128047 -87596 -69224
7757 -69224 -115768 -17265 -170 -48769 54165 225474 87057 89229 -19778 -8218 61746
7746 61746 -82930 -36885 111451 27542 -36416 -40536 -180177 -24648 80377 -32116 -84719
7735 -84719 -288885 -135843 184345 222784 -28729 32911 51612 -74508 -53436 91744 5432
7724 5432 37114 -44389 -31882 -41993 -72889 -50229 -108336 -51188 -84406 -26167 -122078 -138238
7712 -138238 -45410 -40693 -49206 31679 -27208 -24116 -23327 -107955 -81609 -14670 71052 121107 -29230
7699 -29230 -12917 53228 124459 74682 144211 123261 91301 25043 -9408 56824 78963 -35468
7687 -35468 14720 73887 167491 165987 129202 115515 157045 -40538 -51349 -6066 -101935 -62258
7675 -62258 61981 112359 -16172 -26709 -70538 -967 196155 97894 13948 90815 222897
7664 222897 155160 42473 180156 109729 -21236 -48806 -1025 67075 127099 -72731 12664
7653 12664 262465 179550 58480 68321 82501 72982 24646 24384 -86883 -71733 -23584 58064
7641 58064 -29842 -51389 6850 -103231 -116261 -44407 -59341 -56500 -30384 122458 132739 2511
7629 2511 6025 -5779 -28676 -47315 62748 39394 108725 115269 9210 -75549 -51502 14598
7617 14598 -42788 -160030 -17017 29433 94686 92196 22991 -33309 36316 122865 86852 -28241
7605 -28241 -109106 -30725 28932 61635 46285 58944 83860 6040 50986 10626 -94305 -127633
7593 -127633 -20811 131595 161299 51562 -8111 66085 -74192 -172232 -11289 15548 -92952
7582 -92952 54914 63910 76553 -13098 -48689 -97639 -118549 35586 80674 15994 42743 102471
7570 102471 -41028 -204275 -123079 49269 -44534 -28562 22965 12807 85816 -2378 -53868
7559 -53868 -87457 -179123 -183440 97740 -73677 -191751 -124635 -150612 -137836 -127064 -134685 -41132
7547 -41132 197679 253470 97317 19266 -45187 31000 74315 -13019 -122581 -40519 -28344
7536 -28344 -110994 -97566 15463 123381 36055 44107 -67225 -30199 -74963 -110301 -31717
7525 -31717 -19532 -73542 3070 64966 60179 -49901 -119355 -141715 -176899 -131344 94173 227820
7513 227820 119166 8112 24785 92600 56197 30060 5722 -42557 -54935 -137814 -81347
7502 -81347 87833 61146 31731 -95405 -233174 -104870 17046 -31557 -29503 27225 17617
7491 17617 -27413 -1685 13152 38499 88190 -27003 34054 38291 -55445 -45280 36673 76526
7479 76526 80429 226343 85378 39884 -12504 -82499 -56933 -12428 -146670 -146928 -42465 43608
7467 43608 53236 -42988 -85979 6257 113074 71192 2653 -9716 32725 76990 128019 57717
7455 57717 57228 6717 -59980 -10102 30283 187855 176732 66617 78933 45767 172178 154891
7443 154891 201226 219532 201806 118378 129943 135463 161729 269986 326111 319048 228810 96005
7431 96005 15211 -131431 -50739 24832 -21284 33908 40619 -90390 -192531 -84883 59322
7420 59322 28413 23940 -32002 -86330 20716 34870 15307 -39812 -29713 -89455 -26631 75172
7408 75172 41120 -80325 -53963 -41912 60610 42708 -19565 23247 -556 132662 93509
7397 93509 25194 34617 -8576 41983 21507 23087 108341 150207 172844 97093 -9277 53047
7385 53047 22303 -27923 -6496 115746 91768 28737 -21346 83829 67880 125338 200195
7374 200195 -22034 9396 74252 61501 -4564 38940 -21290 -68282 2491 -35414 -931
7363 -931 93231 130541 107519 79100 100653 -18533 90269 33937 4789 -27898 -10108 33582
7351 33582 -5760 -17745 74879 28092 66488 100701 17124 42460 20923 50490 -7283 -6854
7339 -6854 7995 -19064 48428 27561 86063 79163 38021 46595 33006 79217 72619 91979 6659
7326 6659 49862 133487 178795 118739 124600 86040 113206 111565 167029 31105 118206 112082
7314 112082 92075 129741 160341 87087 102775 215650 185775 64525 6522 96078 58072
7303 58072 175352 164383 63536 15668 -37099 -38575 65933 88862 79649 109164 147390 115082
7291 115082 159843 3425 -109248 116318 141416 193413 180368 66088 36737 32329 -33590
7280 -33590 33899 71720 29997 19375 -2272 33461 48046 50149 37634 -46775 9992 85948
7268 85948 199217 227935 192534 92632 152432 114618 78008 314372 235989 183174 -39582
7257 -39582 -133252 -48635 -58390 -44423 45995 22512 -12344 -61424 -66684 39059 57179 -6792
7245 -6792 -171179 -138537 46497 -13631 -4421 109528 112281 132195 127338 144847 65300 -96601
7233 -96601 -9991 -70008 51536 105246 119824 35762 -48902 -6188 160939 187012 168310
7222 168310 159278 96150 -18394 16227 -88409 -51127 81173 162511 247442 117206 123368
7211 123368 108743 16197 135683 134886 58156 62198 84980 210271 95631 115295 110112 165181
7199 165181 196117 210000 110886 170497 166985 200782 194223 300767 345086 195268 55701
7188 55701 104853 165520 112892 65554 121239 -2578 76384 -19648 -2657 76104 15888 164259
7176 164259 206785 126318 -2562 98617 153584 116176 136118 179111 193162 130639 105283
7165 105283 94600 42100 19107 47431 185542 126495 111010 186142 207996 69282 113261
7154 113261 139491 80538 -19258 43079 25091 175570 128658 91216 -2253 101428 95764
7143 95764 -33311 -66182 67463 176757 75089 157431 273279 129369 155432 156993 62053
7132 62053 67936 15325 -32047 38674 161240 -21488 71113 119955 52658 97653 157708 69152
7120 69152 63920 68781 9485 -18526 -9940 40185 125381 39621 -18413 36505 105488 68982
7108 68982 227714 302986 169421 -22300 -44824 26077 -10971 66101 66616 -65719 -13687
7097 -13687 78385 139693 135527 215575 234267 257180 196529 120690 169343 192078 54375 -52448
7085 -52448 159137 262501 231774 210066 284099 346451 345972 244319 83114 42744 14013
7074 14013 70268 72493 -11400 31241 18516 41933 93209 83474 156934 32811 278456 238847
7062 238847 57340 96252 77461 131631 70871 65769 89228 90565 184617 153322 83022 95866
7050 95866 177291 110439 127223 169058 208019 183956 62702 18401 20302 -9895 -55266 19334
7038 19334 123196 97317 123974 152999 263985 261804 300632 382167 304459 185724 162974
7027 162974 132632 -30717 123970 158981 226148 252089 277813 283285 310721 182417 181047
7016 181047 158050 72787 46172 191422 233277 229848 283729 250622 195198 301036 156379
7005 156379 171632 64765 -140032 92495 115062 159323 188652 179457 158422 148437 245731
6994 245731 262882 265938 89965 101059 1584 25750 138570 164171 176093 211910 161776
6983 161776 110476 3513 -6211 224729 110067 128209 194290 187224 155129 -13008 20882
6972 20882 3500 108128 146054 244314 170359 43131 147038 248519 188299 91471 48809
6961 48809 105643 103061 133922 226766 237356 116029 53299 169409 90091 -31318 34405
6950 34405 111992 157506 149357 117877 96331 -26742 -94228 17356 207278 175552 96402
6939 96402 35083 139405 70114 32130 -127312 3706 84317 -91037 -98120 8832 -17470
6928 -17470 -60924 -44567 16830 149194 172282 207165 170579 151089 178446 100239 225744
6917 225744 240035 233933 155484 243881 119427 183190 180193 196609 187660 245077 193701 52840
6905 52840 191901 257919 282974 202723 116833 24726 141155 235815 109453 133359 170838
6894 170838 141110 -24783 -4158 25446 76766 160095 133058 254523 374915 286992 91392
6883 91392 183009 333029 337467 309021 295992 361351 234080 112233 250303 230577 262530
6872 262530 230849 122063 263043 260599 104764 183743 213743 214495 162683 296346 251177
6861 251177 178875 170139 111176 -36564 51332 280399 283006 215984 230701 306187 287561 233938
6849 233938 202326 320508 310327 215185 178357 101778 132488 196549 252341 214446 86614
6838 86614 237816 321570 174225 147366 182243 262146 231612 267473 198618 299584 302670
6827 302670 250492 208859 198745 232864 236790 185928 204630 254290 249596 325585 402276 354319
6815 354319 304851 204122 244485 287480 196047 194699 172961 146909 254806 288493 170837
6804 170837 150486 283660 260747 244373 184498 150138 205451 300840 284127 308003 337204
6793 337204 343835 197316 87216 36599 -1427 -30495 54581 252498 247468 334383 287114
6782 287114 180739 150497 166511 230493 295132 144213 122853 122097 98428 13023 53061 102386
6770 102386 194184 113316 128223 182191 200657 219307 120772 108633 96964 167601 282830
6759 282830 351518 325034 218862 158892 175754 250528 326365 302189 172952 152398 124642
6748 124642 192955 264289 290404 252857 315091 426336 268083 147313 141037 195725 194050
6737 194050 168608 175570 180351 139394 159567 176889 200780 335569 354443 245975 175209 235817
6725 235817 196173 180341 182654 228818 277947 230420 199942 287576 261911 258388 271250 212599
6713 212599 305303 367231 279809 181652 98347 207071 291752 311362 238551 216523 214043 220031
6701 220031 293351 335353 165877 212008 257233 180335 177970 211662 283081 254503 288129 221564
6689 221564 367803 290831 248518 321422 362871 359053 354139 263187 96916 208520 331606
6678 331606 266664 236356 301406 253525 225501 221700 179621 258387 280780 319090 139466 136345
6666 136345 183127 103004 183553 196137 208272 288044 358746 399887 356736 332034 338738 351482
6654 351482 361911 390464 335625 461135 453544 345176 206514 359942 344563 307356 359199
6643 359199 259500 314831 320532 329671 280663 343797 96793 66788 190367 192496 324897 399602
6631 399602 356242 415196 427558 516611 448158 285903 390716 372973 313590 233399 246207
6620 246207 365839 377756 373331 304173 298484 285739 258678 267765 281546 464853 442146 422698
6608 422698 499734 602139 571509 427051 380757 366238 401445 308960 369983 353921 266053
6597 266053 348084 417749 386888 421585 313996 267095 420232 498667 412822 564245 411757
6586 411757 361621 465424 398707 277797 361381 519101 502275 460718 277222 317098 314140
6575 314140 407666 482953 479308 506048 572257 545819 531408 417259 295433 328579 419426
6564 419426 422320 510131 434846 267615 308747 332160 349642 451781 394551 297850 200733
6553 200733 372742 437323 491611 614007 594180 689230 546053 480052 499688 481585 472618
6542 472618 505601 422235 389479 452615 396855 408478 376797 374230 547876 636445 714167 565980
6530 565980 507174 672913 708585 695078 638346 525501 509458 412962 402505 428635 410917
6519 410917 495227 433384 417199 454876 547146 601866 538008 545764 451995 474678 628895 453425
6507 453425 387403 432940 398258 198527 292790 391978 472539 587898 432384 485550 386109
6496 386109 314228 350963 318666 370757 381572 540005 492962 420602 579831 556852 435258
6485 435258 443535 485540 411159 502852 588347 548390 593471 620179 580993 553445 551836 522560
6473 522560 646881 585236 419458 473121 588554 442873 464214 590874 457211 472217
6463 472217 549783 601973 663257 559838 569477 578722 503494 611343 466202 531972 494120
6452 494120 515044 496273 547276 587614 526938 564645 580963 474180 564025 635754 640798 570574
6440 570574 558225 523186 583716 530833 506690 731067 662478 609891 602947 479693 478217 556255
6428 556255 532438 430367 574652 654824 663274 503987 566176 661416 649371 612873 560207
6417 560207 534139 500912 691829 548010 445485 533443 609562 672023 648941 504766 555422
6406 555422 478172 546920 568160 704391 635489 564941 664411 710613 659783 681042 591777
6395 591777 743328 740668 687864 703828 668865 692803 685210 740040 794087 805642 779736 685147
6383 685147 812429 843361 788534 756463 771379 849900 910880 903793 852772 643028 667628
6372 667628 791512 739596 749542 1015705 950194 922295 1020777 897167 756550 728994 774612
6361 774612 860920 950247 834842 805896 771933 741509 903122 993957 925696 956105 954767
6350 954767 1024255 898849 911854 888536 901972 835390 876335 892426 1026353 995892 1019274
6339 1019274 1001308 1010786 1065067 1120058 1007459 1102392 1077962 1068829 1047239 1080286 1192113
6328 1192113 1279917 1314294 1384865 1355146 1217585 1257297 1192453 1317911 1405163 1327233 1450611
6317 1450611 1451568 1340466 1223714 1254954 1339029 1350007 1474626 1456895 1515771 1530813 1500442
6306 1500442 1550460 1656482 1646948 1767154 1798700 1780044 1715263 1763543 1805001 1782210 1885461
6295 1885461 1962568 1896156 1808322 1856472 1901090 1902291 1937489 2102551 2009380 1842814 1997270
6284 1997270 1980208 2195721 2223160 2132149 2173825 2200881 2279377 2138230 2102500 2125252 2071407
6273 2071407 2210577 2296377 2351572 2467497 2497764 2645297 2643074 2545366 2397038 2394838 2417811
6262 2417811 2231943 2124739 2143071 2132821 2346223 2338886 2166718 2310518 2360322 2321871 2391465
6251 2391465 2458450 2372848 2428415 2657630 2804917 2724722 2889504 2991837 2969967 2840650
6241 2840650 2789867 2658839 2571024 2585654 2612908 2563122 2537934 2461246 2387376 2523598 2473658
6230 2473658 2412657 2387007 2553008 2565218 2547590 2594349 2645714 2700959 2788685 2832308 2807096
6219 2807096 2761478 2784588 2755151 2693921 2720175 2711793 2694569 2662953 2641689 2725645 2628178 2574010
6207 2574010 2649723 2721105 2598007 2411613 2442754 2351421 2312891 2384365 2604130 2489765 2520116
6196 2520116 2489292 2347154 2422755 2565574 2598239 2627125 2690010 2714464 2687019 2630843 2488132
6185 2488132 2448052 2575943 2475021 2388952 2449278 2451766 2400511 2347617 2274416 2290381 2368825
6174 2368825 2491327 2466705 2522476 2583657 2634119 2617335 2414110 2447848 2476743 2538455 2602698
6163 2602698 2665150 2543459 2493343 2636425 2624263 2593687 2674148 2736614 2591493 2704882 2832269
6152 2832269 2935895 2935813 2871734 2787323 2937288 2982047 2890442 2924454 3023882 3107096 3036164 2999148
6140 2999148 3075939 3124968 3119513 2979907 3017680 3106838 3393558 3431251 3507152 3611005 3742669
6129 3742669 3733568 3781622 3858111 3855666 4066232 4221540 4306019 4328708 4584132 4657991 4883778
6118 4883778 5128155 5425869 5706153 6316044 7035761 7860639 8542574 8695224 8510332 7940453
6108 7940453 7297944 6797215 6609802 6392553 6189683 6007924 6052462 6257710 6254019 6172731
6098 6172731 6220403 6298814 6474853 6659126 6786437 7048712 7419308 7770144 8337902 8831246
6088 8831246 9369748 10031800 10591879 11251070 12108684 12964461 13510445 13541009 13012926 12199394
6078 12199394 11323817 10603525 10044863 9853902 9618706 9511263 9489308 9622368 9660869 9672562
6068 9672562 9688853 9671681 9838557 10018414 10190337 10346440 10681891 10916498 11090197 11309828
6058 11309828 11501086 11854973 12463958 13105240 13754575 14553776 15447552 16667288 18145060
6049 18145060 20227391 23109114 26721537 30389302 33065282 33908381 33254197 31440744
6041 31440744 29340289 27166934 25484070 24389612 23528626 23251545 23170347 23562018 24224431
6032 24224431 25036710 26136547 27549811 29158572 31129063 33640481 37092627 41857591
6024 41857591 48258696 56020268 64976404 73835960 81490091 87580835 92274260 95745592
6016 95745592 98018316 98798486 97287781 93299561 86850156 79021641 70831533 63350140
6008 63350140 57045934 52213192 48555722 46000071 44596387 43953994 44363105 46030306
6000 46030306 49107135 54158008 61600668 71910636 84273136 96606800 105853338 109921931
5992 109921931 108765468 103257164 94831884 85037382 74821608 65146715 56495080 48947850
5984 48947850 42482975 36762043 32142314 28230647 25141381 22482796 20463609 18871339
5976 18871339 17413811 16305283 15366723 14743709 14027173 13630400 13466975 13246655 13427762
5967 13427762 13606278 13792267 13925945 13976810 13675144 13288921 12669901 12021201 11441583 10955459
5957 10955459 10543541 10002822 9680714 9432352 9130907 8994641 8984687 9226494 9537382 9945829
5947 9945829 10389249 10891749 11168560 10833341 10319014 9687867 9246858 9001995 8787735 8578479
5937 8578479 8555055 8629938 8577316 8830442 9006850 9061759 9351635 9838522 10530365 11336135
5927 11336135 12488655 13777987 15007108 15837174 16120760 15697886 14949515 14077157 13455508
5918 13455508 13028592 12883983 12782959 12865702 13446476 13959522 14354347 14720282 14867967 14843776
5908 14843776 14881826 15105160 15388930 15574016 15726719 15754650 15654289 15511366 15541959 15747737
5898 15747737 16120483 16450074 16868957 17222302 17390640 17650953 17957662 18306734 18700334
5889 18700334 19141328 19590136 20042711 20450687 20892828 21310255 21801346 22437496 23067439
5880 23067439 23623231 23728506 23912971 24503354 25111440 25729355 26319333 26702697 26671960 26431624
5870 26431624 25956995 25328675 24902010 24462249 24114225 24147581 24551511 25018134 25633328 26140321
5860 26140321 26353005 26453460 26323948 26033362 25819601 25739504 25871200 26148779 26370133 26340557
5850 26340557 25856183 25268414 24988596 25254357 25858457 26397360 26308615 25529747 24066504
5841 24066504 22441300 20990464 19959252 19325646 19145289 19067049 18724039 18346474 17847842
5832 17847842 17416314 17184121 17414705 18040613 18723762 19401091 19501625 19196340 18501209
5823 18501209 17674932 16826087 15823483 14857955 13830629 12813694 11846215 10560264 9643661
5814 9643661 8876315 8262948 7898549 7554026 7514845 7531541 7694287 7746736 8014234 8251521
5804 8251521 8437622 8220888 8072642 7973055 7593585 7079034 6521429 5955299 5505741 5032997
5794 5032997 4586018 4253010 4120528 3749315 3503945 3272324 3072944 3026532 2883051 2939513
5784 2939513 2843478 2811448 2723516 2683381 2694444 2563737 2484474 2501800 2501637 2407399 2326889 2211534
5772 2211534 2122345 2313069 2241598 2156997 2177646 2098074 2054318 2249655 2154740 2151440 2074880
5761 2074880 1963412 1917265 1956931 2034330 2153188 2093483 1825511 1844755 1991682 2068354 1928804
5750 1928804 2047893 2055461 1963291 1932373 1980007 1936710 1997972 2118408 2006560 1962022 1974026
5739 1974026 1868048 1796011 1765555 1823137 1782732 1727151 1703778 1868045 1797283 1788559 1759280
5728 1759280 1731704 1728368 1838797 1933075 1848218 1760438 1730467 1819895 1773780 1761253 1766252 1848883
5716 1848883 1933838 2134669 2137103 2077645 2084511 1925689 2135405 2183402 2117149 2164446 2117183
5705 2117183 2093922 2198043 2111280 2032706 1994811 1971022 1934637 1874105 1892857 1710110 1756930
5694 1756930 1770047 1909276 1837681 1755661 1809639 1833766 1842331 1904177 1929006 2008860 2001419 2007787
5682 2007787 2107589 2053389 2064164 2175693 2068693 1998171 1797515 1670711 1692006 1530167
5672 1530167 1688464 1661647 1593566 1672097 1632484 1721642 1743928 1496789 1429789 1555120 1654417
5661 1654417 1800707 1868431 1770449 1634122 1731899 1821166 1986371 2014099 1952403 1806947 1706117
5650 1706117 1642055 1769291 1835380 1836844 1816516 1861436 1908932 1874811 1925924 1796622 1692373
5639 1692373 1807397 1677801 1828668 1853648 1765002 1779731 1786585 1938533 1793188 1879893 1837361
5628 1837361 1849931 1898556 1906859 1788936 1811828 1796159 1789213 1673910 1719828 1727967 1766146 1944009
5616 1944009 1886151 1729277 1854555 1957329 1877451 1846335 1860165 1787794 1783359 1806867 1829164
5605 1829164 1855627 1899198 1975484 1903499 1854291 1818276 1820884 1859983 1930265 2106753 2009482
5594 2009482 1885789 1874658 1976874 2098226 2012884 2030504 2057464 2089696 2089591 2105691 2102001
5583 2102001 2012885 1942176 1994362 1936942 1964058 1944190 1956371 2090718 2102914 2095202 2144569
5572 2144569 2072929 2008609 1955988 1951297 1975638 1906112 1906022 2055999 2099017 2065817 2003192 2251181
5560 2251181 2283741 2148439 2033137 1990225 2069687 2218830 2252475 2204472 2188750 2171382 2167070
5549 2167070 2126718 2031120 2271040 2384522 2286690 2215629 2010474 1956812 2072232 2199437
5539 2199437 2132323 2275491 2294556 2270732 2196451 2195840 2186495 2172831 2113797 2233204 2232740 2132603
5527 2132603 2132986 2260515 2134639 2037529 2184828 2242588 2144464 2256595 2298856 2342652 2327206
5516 2327206 2220138 2244833 2441591 2466682 2315854 2270843 2310798 2400941 2405817 2499005 2389514
5505 2389514 2393816 2322063 2392826 2452160 2477640 2522644 2366610 2312093 2382030 2291286 2510586
5494 2510586 2591739 2578678 2568953 2551857 2425819 2344159 2593958 2645332 2540055 2387098 2421792
5483 2421792 2493548 2378202 2434027 2537002 2574189 2621817 2650977 2718090 2704696 2656418 2620485
5472 2620485 2598757 2638030 2596430 2661888 2639772 2621167 2676253 2795140 2771370 2688000 2739923
5461 2739923 2664746 2743387 2742260 2797302 2722749 2786029 2803611 2724149 2763085 2792678 2904618
5450 2904618 2846769 2793831 2852430 2854279 2867137 2842738 2862118 2835569 2752070 2689101 2691414 2741585
5438 2741585 2815291 2839617 2839092 2793342 2694948 2659712 2708548 2745393 2826954 2983107 2887185 2820841
5426 2820841 2874963 2840915 2953466 2881600 2890725 2899567 3021657 3109206 3018543 3092442 3064453
5415 3064453 3014802 3008213 3048179 2957269 2898628 2883713 2972256 3027429 3023875 3024750 2974541 2906145
5403 2906145 2898789 2968103 3049263 3041245 3022374 2998634 3050805 3094439 3073875 2954665 2962194 2842777
5391 2842777 2882305 2979238 3127129 3090634 2887089 2779795 2957624 2985482 2892807 3008423
5381 3008423 2994865 2951004 2994492 2927087 2808704 2892380 2908468 3011215 3019709 3108051 3052369
5370 3052369 3001805 2956080 2950496 2919093 2908232 2922233 3021856 3154929 3070474 3040428 3141923
5359 3141923 3167358 3160466 3106757 3025131 3008397 3102022 3057813 3040105 3165794 3167275 3044438
5348 3044438 2961500 3151492 2998046 2880213 2950008 3004518 3104171 3041993 2979454 3135239 3124383
5337 3124383 3140491 3119096 3063742 3102965 3099566 3091919 3069481 3091534 3113085 3324542 3423437 3335194
5325 3335194 3215894 3119332 3086243 3238102 3144777 3172466 3249790 3270681 3334000 3179198 3201331
5314 3201331 3189049 3248444 3144189 3029572 3129550 3095759 3291681 3271244 3307231 3388163 3393934
5303 3393934 3325604 3293224 3226120 3312656 3315913 3396094 3403994 3205858 3360349 3406126 3373746
5292 3373746 3410082 3371599 3357711 3473236 3406982 3417695 3504216 3499684 3453652 3479812 3416999
5281 3416999 3507032 3495032 3465680 3386838 3420363 3584004 3482812 3622276 3658375 3570323 3610748
5270 3610748 3689549 3765979 3592688 3624125 3571020 3563565 3636823 3747896 3883366 3800387 3669408
5259 3669408 3699332 3702556 3547877 3654281 3636984 3596702 3609838 3626179 3628965 3522400 3425542
5248 3425542 3488042 3431253 3451290 3547957 3626775 3689859 3552212 3475354 3469264 3573594 3412971
5237 3412971 3418401 3443037 3528387 3699580 3555926 3481613 3602065 3569964 3423811 3582100 3674514
5226 3674514 3770031 3666496 3760762 3708392 3551455 3623229 3622526 3634687 3718687 3759367 3691307
5215 3691307 3700327 3729774 3725921 3805466 3750380 3729621 3746769 3704895 3689204 3850583 3816293 3675939
5203 3675939 3802569 3707032 3711380 3836091 3916988 3847720 3915181 4004705 4020698 3991715 4041583
5192 4041583 3955215 4037030 4028793 3974859 3985987 3888556 3868855 3844600 3753352 3718744 3627204 3549635
5180 3549635 3520542 3434848 3435267 3535496 3587760 3503909 3524444 3577792 3663136 3674663 3515245
5169 3515245 3549602 3687587 3678577 3597473 3707622 3842863 3930195 3898091 3998289 4004634 3924696
5158 3924696 3973551 3896457 3845341 3807265 3809492 3840356 3812688 3712204 3777876 3664603 3551773
5147 3551773 3703617 3859831 3909742 3962901 3952915 3829101 3808908 3879542 3936944 4060274 4090931
5136 4090931 4088759 4032077 4097949 4181269 4235477 4142750 4250490 4366420 4310495 4245867 4372266
5125 4372266 4268324 4186014 4059753 3987038 4145848 4126315 4064278 4071563 4113613 3985825 3994429
5114 3994429 3951196 3884013 3859686 3978116 3935854 3835092 3904113 3907682 4018335 4073963 3976614
5103 3976614 3888637 3913013 4062480 4029818 4051279 4039620 4123238 4122152 4094544 4117918 4123197 4242738
5091 4242738 4266851 4238594 4252498 4400473 4280250 4229010 4400386 4231360 4253787 4296563 4391683
5080 4391683 4539149 4674186 4613973 4535857 4695572 4683080 4732298 4668314 4688985 4722562 4953543
5069 4953543 4954735 5063362 5157161 5177026 5233472 5269081 5232969 5231794 5017896 5012331 5093139 5073181
5057 5073181 5156086 4936110 4979198 5076368 5128222 5099701 4953110 4796802 4884391 4933445 4972951
5046 4972951 4967565 4948189 5021812 5139947 5014956 4858250 4766517 4867885 4881672 4850302 4762970
5035 4762970 4781117 4790204 4739806 4715134 4589353 4651988 4562949 4710720 4879049 4781333 4757003
5024 4757003 4763798 4751125 4878376 4907528 4855315 4886035 4879789 4806057 4753767 4747567 4629362 4672979
5012 4672979 4739717 4827423 4872238 4930256 4897532 4909408 4927268 4982797 4956835 4908333 5028121
5001 5028121 5003455 4918465 4936132 4986809 4925897 4943625 4886596 5003344 5071285 4974035 4847788
4990 4847788 4891736 4838567 4966958 5044780 5026316 5116065 5053064 5094120 5114406 5067592 5161964
4979 5161964 5262537 5240586 5341233 5372933 5399246 5451910 5486366 5392000 5421396 5482725 5590348
4968 5590348 5664277 5625322 5690416 5780077 5687446 5688266 5802756 5820771 5957628 6011233 6043811
4957 6043811 6152968 6164391 6153211 6212667 6450080 6496500 6501510 6539209 6710098 7002953 7099671
4946 7099671 7168133 7269893 7401559 7592675 7746500 7947182 8054868 8163803 8311195 8401398
4936 8401398 8334105 8273801 8403729 8561555 8656651 8869675 9100460 9159652 9401066 9517168
4926 9517168 9654863 9761407 9971586 10009985 10175013 10352799 10460556 10630818 10489090 10701962
4916 10701962 11108903 11280650 11386238 11508146 11673834 11777305 11855795 11916125 12155702 12349619
4906 12349619 12317442 12257528 12220721 12104277 12032204 12138996 12215776 12370219 12477697 12520600
4896 12520600 12694106 12767468 12996713 13439348 13705877 13901143 14173611 14398509 14702975 15115401
4886 15115401 15424567 15667139 16114175 16476762 16923872 17566180 18141024 18733656 19235270
4877 19235270 19848956 20825513 21842848 22806181 23991215 25324622 26751191 28108519 29392385
4868 29392385 30693774 31899038 33064729 34144260 35286499 36372954 37646408 38851952
4860 38851952 40199247 41724857 43130410 44672032 46527082 48626346 51111771 54217605
4852 54217605 57678750 61251122 64129445 66177192 67460251 67989288 68171310 68668020 69367492
4843 69367492 70351297 71566689 72697721 73605364 74386335 75177695 76266569 77597031 79396702
4834 79396702 81794904 84229538 86087274 87082902 87116066 86337512 85268063 84206020 83647816
4825 83647816 83425992 83186367 82768643 82111698 81132206 79884314 78576369 77214032 75807221
4816 75807221 74484734 72938304 71400709 69886446 68398035 67278748 66570805 66219943
4808 66219943 66453689 67449924 68818796 70393937 72474053 75002847 77593899 80695139
4800 80695139 84697794 89322499 94634931 99968748 104312052 107248577 107895041 106924708
4792 106924708 105245528 103070211 100763045 98330681 95868206 93159532 90337039 87981183
4784 87981183 86087325 85074354 85319141 86565809 89024912 92584786 96651321 100648041
4776 100648041 103170761 104175118 104188203 104023393 104377078 105596807 107472838 109669206 111949201
4767 111949201 114258887 116589583 118917303 121515815 123953453 125635469 126311068 125354990
4759 125354990 122844029 118871365 113860929 108689133 103702590 99089447 95140602 91762103
4751 91762103 88952594 86584572 84498020 82990278 81994841 81274457 80952521 80800557 80367528
4742 80367528 79785700 79031112 78143183 77141629 76002002 74871018 73473008 71572757 69244165
4733 69244165 66572745 63955212 61344260 58787320 56628115 54834403 53471824 52995436
4725 52995436 53213769 53977902 54987265 55054568 53758932 51151009 47715494 44056941 40702714
4716 40702714 37835564 35641899 33861482 32335408 31500523 31393330 32019740 33141209 34802175
4707 34802175 36356704 37239877 36723397 34851039 31992323 29129746 26513214 24045080
4699 24045080 22178121 20590739 19201707 18198664 17430830 16728880 15882795 15290621 14851502
4690 14851502 14574444 14264112 13887108 13399553 13124653 12888393 12562446 12395562 12241277
4681 12241277 12094108 11930632 11726482 11638939 11585786 11458427 11414395 11336357 11206971 11105345
4671 11105345 10844205 10715153 10572492 10440902 10368697 10060052 9965440 9898739 9773478 9736921
4661 9736921 9725586 9656677 9607386 9637718 9780365 9706462 9656133 9851081 10006819 10113182 10170041
4650 10170041 10366448 10461860 10632380 10893469 11017230 11322659 11596632 11892445 12277829 12599254
4640 12599254 12975421 13532381 14283621 14953671 15615466 16266402 16878408 17638219 18737084
4631 18737084 20109164 21918755 24183183 27027442 30552029 34451368 38297027 41727555
4623 41727555 44419992 46136998 46544109 45660939 43838937 41593954 39467958 37500997
4615 37500997 35648973 34063177 32420899 30492859 28659226 26697492 24986280 23477900
4607 23477900 22144136 21219021 20625308 20336745 20339920 20371722 20647576 21068399 21914359 22941467
4597 22941467 24298362 26081106 28190925 30689730 33924771 37577431 41575200 45934299
4589 45934299 50568989 55083094 58785354 60916334 60876934 59082651 56590779 53572105
4581 53572105 50780085 48332200 46257576 44700871 43325851 42515635 42465689 42899304 43771346
4572 43771346 44919838 45987109 46692374 46872606 46470836 45355899 43535560 40974110 38242310
4563 38242310 35566520 33422687 32084933 31292145 31127954 31294981 31786876 32365655 32553665
4554 32553665 32448982 32091274 31743717 31483985 31396985 31786583 32155283 32423248 32506357 32209574
4544 32209574 31541782 30799773 30065729 29780706 30139947 30865832 31940348 33605839 35611979
4535 35611979 37775334 39714677 41134820 41437853 40083608 37500115 33754882 29930583
4527 29930583 26405617 23426050 21049388 19294422 17696382 16669346 16091239 15704987
4519 15704987 15658814 15922838 16427386 17133251 18145778 19401536 20316671 21244575 21642723
4510 21642723 21242783 20230473 19067642 17628791 15846874 14080816 12674955 11500984
4502 11500984 10404663 9569063 8731464 8157075 7773372 7411284 7245095 6978655 6576670
4493 6576670 6366898 6205381 6019573 5871574 5644786 5610034 5544121 5382645 5320767 5217453
4483 5217453 5255506 5240228 5208162 5143207 4937040 5014589 5064910 5135344 4932325 4869379 4827115
4472 4827115 4770103 4893229 4848982 4822864 4666789 4645677 4662729 4632639 4497965 4517862 4514300
4461 4514300 4458503 4405700 4346312 4225775 4247833 4371734 4225280 4235048 4256817 4186695 3994215
4450 3994215 4006949 4069431 3944611 3958994 4096812 4028081 3859805 3775792 3661562 3690236 3744232
4439 3744232 3786475 3776002 3692650 3531609 3545356 3632855 3565059 3537682 3519175 3447150 3559824
4428 3559824 3570091 3585688 3637680 3666781 3640590 3666188 3800830 3785047 3687483 3771454 3777042
4417 3777042 3845327 3836218 3891376 3872029 3901693 4076169 4066945 4084258 4352588 4405749 4545642
4406 4545642 4832790 5302644 5949505 6217525 6030465 5772012 5437881 5031278 4750215 4637424
4396 4637424 4506200 4429659 4318612 4147699 4063987 4064175 4112520 4269324 4427081 4411004 4395980
4385 4395980 4456823 4536802 4402488 4347454 4268452 4200344 4300201 4307348 4329001 4342485 4259261
4374 4259261 4143670 4162616 4325236 4275474 4201467 4334191 4382808 4421925 4374828 4301907 4267913
4363 4267913 4335791 4486422 4399072 4337865 4246083 4157713 4174653 4098603 4140240 4182836 4131311
4352 4131311 4205507 4337867 4309043 4349370 4270272 4246923 4321155 4460546 4432532 4336975 4309477
4341 4309477 4366973 4433727 4435852 4398577 4452859 4581621 4631380 4769802 4938873 4989972 5003636
4330 5003636 5080436 5028839 5159756 5117390 5032447 5185015 5341617 5361735 5463399 5615405
4320 5615405 5803340 5920174 6133558 6542916 7028084 7966011 9385510 10082000 10005242 9347773
4310 9347773 8257636 7540099 6964075 6578029 6477005 6111441 5819682 5802798 5794231 5791379
4300 5791379 5778073 5795018 5876982 5868129 5872830 5798198 5733456 5832686 5858041 5680648 5719440 5649938
4288 5649938 5774409 5687323 5866592 5964164 5833470 5831234 5847278 5797112 5774316 5847231 5696410
4277 5696410 5706589 5843728 5867012 5871834 5896077 5871126 5988287 6035563 5943899 6047398 6011881
4266 6011881 5925592 5925521 5954289 6002296 5979923 6201727 6137700 6119983 6215052 6238080 6205552 6153215
4254 6153215 6148822 6163370 6399916 6408318 6323910 6338005 6278394 6319955 6285839 6198766 6213894 6226640
4242 6226640 6202418 6319458 6308825 6402912 6540402 6482864 6515824 6487275 6487527 6581044 6669333
4231 6669333 6688847 6833806 6871742 6911239 6878308 6856984 6948997 6825674 6730746 6766771 6813111
4220 6813111 6860170 6842340 6814128 6817749 6827812 7062117 7227056 7336025 7258953 7120228 7150555
4209 7150555 7210399 7335323 7556816 7434572 7447777 7591857 7792450 7798360 7821972 7914590 8057159
4198 8057159 8194906 8302149 8274471 8301542 8385868 8514763 8667068 8713393 8708292 8698268 8634387
4187 8634387 8620831 8710448 8910069 9022527 9167148 9164903 9245110 9382952 9573228 9832875
4177 9832875 10030392 10196232 10297838 10467394 10782246 10893916 11088890 11348683 11439556 11711623
4167 11711623 12139691 12495163 12819450 13217486 13721758 14241317 14705915 15524507 16425719
4158 16425719 17731873 20085942 23514905 27886179 31459522 32326632 31139046 28572399
4150 28572399 26592221 25272794 24246398 23595667 23180085 23068029 23167577 23294977 23578790
4141 23578790 24289728 25251668 26232740 27253142 28248349 29050098 29817091 30417779 31011614
4132 31011614 31676468 32434224 33235478 34045646 34759552 35455167 36344435 37075116 37839945
4123 37839945 38655044 39541843 40459205 41342470 42127802 42827280 43612524 44261701 45294734
4114 45294734 46772077 48707418 50973276 53176682 55189429 56584601 57378045 57746106
4106 57746106 57992254 58190437 58574151 58987192 59331099 59539324 59847058 60388500 61218370
4097 61218370 61851710 62807303 63749989 64644167 65297346 65792976 66322276 66849898 67443956
4088 67443956 67883968 69181786 71171089 73951082 77166563 80689862 83719580 86362009
4080 86362009 88687778 90887251 92993197 94895592 96506063 98025908 99487716 100719602
4072 100719602 101903081 103310886 104669830 105753928 106492752 106515090 106168146 105822850 105635615
4063 105635615 105620816 105750631 105919030 106166306 106242467 106315816 106589017 106690029 106748887 106588996
4053 106588996 106421237 106606796 106988914 107737936 108387746 108965157 109147171 109113304 108984274
4044 108984274 108766587 108155002 107305261 106018668 104458452 102638456 100857725 98827952
4036 98827952 96289960 93095203 89125702 84768920 80660043 77162280 74515488 72594681
4028 72594681 71241681 70410070 69763449 69289683 68731006 68100605 67356347 66698912 65898369
4019 65898369 65125952 64299974 63446707 62225759 60688053 59231972 58042354 57339250 57029502
4010 57029502 57233401 57731047 57676803 57147171 55764386 53473480 51005658 48654233 46698970
4001 46698970 45247354 44064272 43401363 42792544 41942918 41230061 40343013 39262691 38255643
3992 38255643 37082036 36030141 35228145 34629721 33796396 33038980 32500368 31952524 31383482
3983 31383482 31207191 30912744 30539359 29888127 29057625 28217431 27361329 26451536 25574169
3974 25574169 24942580 24401390 23831319 23172767 22521503 21904936 21286040 20711064 20447950
3965 20447950 20161153 20030699 19740662 19596378 19059594 18590233 18156357 17697180 17223050
3956 17223050 16711159 16390832 15920815 15584550 15349428 15160056 15127268 15022989 15080419 15320432
3946 15320432 15330840 15320576 15335970 15364853 15345513 15324445 15308100 15351889 15491749 15529707 15568913
3935 15568913 15746469 15858841 15952350 15953293 16073279 16249717 16445678 16818751 17009138 17288160
3925 17288160 17529872 17735980 18050663 18314033 18596116 19013512 19162067 19493817 19875383
3916 19875383 20356429 20765553 21045618 21168262 21465328 21935024 22185524 22609949 23017812
3907 23017812 23641437 24316546 25081522 25754142 26568321 27221001 27955602 28533577 29266977
3898 29266977 30211217 30978533 31759699 32594711 33380756 34225752 35076935 35987743 36939451
3889 36939451 37936092 39256447 40442455 41806021 43353696 44849364 46391716 47860282
3881 47860282 49452546 51200397 52910463 54737223 56679212 58284491 59728233 61027794
3873 61027794 61899881 62566890 63005281 62982047 62890841 63003795 63192621 63874346 64677122 65476924
3863 65476924 66470152 67780114 68949385 69820613 70090869 69800205 68608667 66825311 64792972
3854 64792972 62553624 60551031 59028667 57852661 57339373 57114737 56672755 56030661 55234119
3845 55234119 54065284 52722459 51267901 49779160 48484972 47310329 46438874 45808938
3837 45808938 45686713 45688153 45972322 46456439 46751077 46746411 46692512 46468226 46054659 45120782
3827 45120782 43750723 42015000 40023876 38201444 36545357 35088397 33861584 32845228
3819 32845228 31970783 31403592 30721294 30085529 29612382 29337815 29112985 28612452 28326926
3810 28326926 27976988 27632238 27363561 27061845 27049261 27169592 27331374 27635451 28013756 28470442
3800 28470442 29026895 29839057 30674546 31565335 32530088 33554635 34317345 35039397 35536992
3791 35536992 35740330 35867651 35899041 35978399 35969819 36219945 36648626 37493162 38647742 40465427
3781 40465427 43298093 46836223 50963536 55344892 59430999 62695487 65046097 66362999
3773 66362999 66366859 64745313 61961211 58307312 54117077 50006833 46385685 43577563 41344422
3764 41344422 39968177 39358522 39405105 40297802 41821238 44002440 46447736 48769268 50859951
3755 50859951 52177804 52949677 53798429 54826795 56364585 58376427 60946132 63947523
3747 63947523 67490192 71549765 76427178 81511415 86252944 90649424 94001282 96042892
3739 96042892 96323845 94662451 91521190 87483294 83091094 78931750 75080849 71640800
3731 71640800 68275397 65129001 62353716 60006619 58090610 56644609 55538197 54948956
3723 54948956 54626410 54688825 55583805 56970684 58663089 60320771 61731400 62400511 62188080
3714 62188080 61273371 59595315 57239536 54570186 51770812 49020870 46722732 45114712
3706 45114712 44232874 43869295 44006232 43942947 43584591 42799833 41355731 39402530 37452097
3697 37452097 35708859 33963760 32465638 31365413 30117379 28778792 27645354 26556804
3689 26556804 25815365 25241861 24767643 24618591 24444470 24206463 23819984 23518891 23207353
3680 23207353 22696175 22401755 22335092 22581735 23103224 23897128 24540441 24975235 25060991 24835310
3670 24835310 24305700 23716953 23067049 22585587 22069466 21658268 21480530 21674604 22197582
3661 22197582 22765717 23588708 24158566 24473203 24645273 24645707 24524016 24230338 23982587 23976031
3651 23976031 23589713 23130502 22833656 22118387 21388637 20464238 19341909 18017675 16681754
3642 16681754 15343192 14236010 13348159 12688761 11904355 11296836 10840706 10580293 10381589
3633 10381589 10104103 10009415 9933038 9869930 9659668 9418332 9391011 9458928 9455217 9552962 9566407
3622 9566407 9488367 9421627 9464991 9631422 9807407 9868559 9831438 9912790 9975552 9922004 10045784
3611 10045784 10131249 10154229 10146858 10340946 10430774 10648387 10697292 10768430 10770345 10852036 10845781
3600 10845781 10966525 10971857 10999865 10976051 10973013 10990816 10905422 10816429 10937438 11119173 11131434
3589 11131434 11119688 11218890 11320235 11401845 11582327 11711114 11989003 12257450 12514841 12607039
3579 12607039 12912234 13167034 13355703 13442169 13707358 13939223 14036004 14034246 13897589 14037468
3569 14037468 14110796 14059836 14215548 14315719 14449470 14512117 14597179 14724880 15002095 15334074
3559 15334074 15711545 15946816 16367404 16740511 17305566 18032128 18649050 19454988 20113636
3550 20113636 20793755 21268607 21604996 22118207 22537661 23205168 23814642 24283789 24817958
3541 24817958 25211612 25822133 26183397 26363820 26496498 26704579 27045688 27439167 27659342
3532 27659342 28271500 29106915 29840492 30714160 31756958 33003874 34289416 35518606 36851108
3523 36851108 38045154 39032159 39902114 40870544 41812297 42706409 43710142 44779211 46284927
3514 46284927 48273748 50664226 53673113 57416384 61788271 66991591 72685491 78528802
3506 78528802 84200117 89647632 94987296 99286445 101994373 102905508 101946399 99408957
3498 99408957 95524738 90725252 85437073 80227141 75657816 71689501 68423804 65518659
3490 65518659 62666336 59671442 56866269 54072247 51300963 48741609 46349842 43957960
3482 43957960 41616264 39327660 37147677 35179480 33438403 31832777 30330382 28886048
3474 28886048 27518864 26327647 25252718 24421291 23557837 22751621 22024192 21501076 20955108
3465 20955108 20374746 20001110 19712864 19326504 18995567 18678539 18352438 17750912 17054061
3456 17054061 16459043 15863644 15423975 15081932 14747568 14567405 14294101 14127327 13830766
3447 13830766 13713787 13574931 13432671 13162376 13095190 12942289 12907032 12950620 12872877 12951740
3437 12951740 12897741 12720166 12551138 12312514 12059632 11964863 11719726 11465937 11501320 11510419
3427 11510419 11411574 11102904 11067606 11105737 11042952 10984435 10784127 10755760 10854264 10768110 10807816
3416 10807816 10878357 10855595 10932679 11064708 11031438 11026467 11008465 10932473 10985621 10990622 11066855
3405 11066855 11094116 11169014 11230932 11269100 11425193 11596349 11877414 12064658 12395159 12924266
3395 12924266 13325026 13817942 14236658 14593614 14697606 14699623 14350998 13881001 13258779 13036324
3385 13036324 12767947 12512578 12340858 12220945 12122455 12159932 12239144 12244293 12321505 12487991
3375 12487991 12770200 12920557 13319376 13775968 13958939 14475612 14879090 15160841 15219817 15264373
3365 15264373 15311652 15249100 15112539 15338877 15712267 15966915 16348348 16662426 17085918 17620215
3355 17620215 18246387 18777049 19152075 19521184 19971804 20552544 20931393 21578599 22244807
3346 22244807 22716001 23059323 23381028 23661093 23770189 23519824 23290858 23459229 23657542
3337 23657542 23661300 23810328 23989574 24063380 23964433 23549119 23376378 23092124 22736200 22462049
3327 22462049 22358645 22442118 22616238 22926074 23577269 24306976 25048989 25571984 26135189 26617859
3317 26617859 27018889 27633742 28439326 29257093 30275413 31806365 33815811 36175005 38647205
3308 38647205 41390733 44599300 48299292 52644687 57918803 64245642 71419750 78795926
3300 78795926 85768929 91513949 95337398 96961701 96192739 93444729 88541520 82308318
3292 82308318 75609751 68589868 61955025 56133493 51108928 46851859 43329296 40617932
3284 40617932 38446423 36888740 35810500 35214914 35095668 35169900 35525392 36175953 36909191
3275 36909191 37806000 39087840 40701463 42602444 45020465 47955763 51312905 54969553
3267 54969553 59007410 63363873 67959168 72563520 77177965 80816837 82778519 83082932
3259 83082932 81704835 78829187 75330141 71706414 67688800 63182575 58374830 53852180
3251 53852180 49558712 45806866 42663124 40016016 37906087 36047490 34665977 33770794
3243 33770794 33114814 32670439 32555575 32580058 32701798 32750371 32744511 32794833 32877939 33181910
3233 33181910 33562150 33672998 33519060 33379800 33257308 33060725 32961649 33009352 33285241 33637074
3223 33637074 34253533 34700511 35534398 36296946 37176719 38519126 40132074 42147996 44439377
3214 44439377 46691804 48490141 49606273 50079719 50408002 50833309 51735609 52833235 54420177
3205 54420177 56342333 58820835 61887150 65509174 69771015 74807830 80671445 88064748
3197 88064748 97590789 110336803 127574097 150559894 179082947 210725154 241261592
3190 241261592 266198567 282036791 288733372 289801343 290704755 294749547 301795794 308003386
3182 308003386 308126912 298357523 278221578 250629120 220112417 191139150 166349476
3175 166349476 146469776 130891253 118913001 109738153 102156901 95417243 89734004 84908978
3167 84908978 80647102 77234191 74606266 72748374 71655936 71138719 71258868 72253869 74362301
3158 74362301 78463479 85642329 96603956 108124379 115722113 116457650 110054552 100413770
3150 100413770 90671687 82161590 75124962 69905157 65653779 62406091 59636846 57019668
3142 57019668 54965844 53073298 51354392 49924527 48766292 47873268 47432222 47245319 47218732
3133 47218732 47388457 47712345 48403738 49331115 50456097 51988151 53834768 55935302 58030233
3124 58030233 59845021 60644802 60378510 59324854 57780626 56105250 54710020 53417043
3116 53417043 52476252 51811119 51727899 52251759 53288094 55108570 57339364 60002238 62718790
3107 62718790 65743233 68870126 71989358 74797419 76999863 78748450 80150890 81463308
3099 81463308 83090258 85457233 88876719 93709636 100478201 109823865 123200124 142114064
3091 142114064 168906357 203877467 242230682 274679301 291596231 290043396 274698493
3084 274698493 255487987 242194430 241086354 255119641 282186569 313821265 337945820
3077 337945820 346327637 339957916 327156725 317194417 314304133 316829441 319656910 318198756
3069 318198756 310691333 299284548 288365684 281968024 281965870 285962127 288963566 285627077
3061 285627077 273046373 251233754 223109256 193181081 165292428 141425747 122038272
3054 122038272 106366544 93171622 81855924 72163322 64130299 57473032 52001923 47638605
3046 47638605 44177395 41371045 39333618 37695881 36261982 35047220 33899673 32573616
3038 32573616 31130324 29914702 28578094 27307512 26134000 24885843 23760496 22803569
3030 22803569 21972346 21331935 20815921 20268226 19734978 19505666 19457993 19446101 19502099 19580549
3020 19580549 19626193 19825782 19650544 19668196 19581985 19221533 18943992 18320115 17429461 16290227
3010 16290227 15325198 14316289 13450367 12745663 12107898 11523164 11174992 10864312 10789345
3001 10789345 10661642 10400529 10443571 10551265 10873687 11188977 11596334 12128532 12875732 13534470
2991 13534470 14025989 13992097 13300062 12449047 11544097 10484736 9565096 8651036 8060843
2982 8060843 7672958 7345686 7267793 7125224 6871271 6734934 6713594 6659564 6549123 6521103
2972 6521103 6281468 5968310 5680754 5392464 5201889 5033448 4909352 4804729 4861135 4904432
2962 4904432 4802286 4832410 5205127 5933338 6730696 7529067 8297181 8597487 8328616 7451610
2952 7451610 6417892 5673302 4916250 4467806 4119414 3884009 3690427 3566114 3523852 3348453
2942 3348453 3244785 3055472 3061270 2948279 2902629 2987137 2903612 2831154 2961943 2778601 2428655
2931 2428655 2234202 2142823 2173059 2208708 1988483 1922275 1834282 1776340 1836337 1862927 1728730
2920 1728730 1840877 1817706 1877979 1935291 1929776 1829869 1738059 1817950 1929631 1839208 1888261
2909 1888261 2054431 2080746 2166303 2354001 2306095 2146611 2063185 2147986 2198388 2140251 2073500
2898 2073500 2101187 1991408 1958137 1734162 1366492 1190782 972593 791135 749851 763834
2888 763834 769018 753032 685015 669613 555156 487988 462646 573335 477538 457164 576993
2877 576993 429620 471309 453841 419944 497566 314145 232574 438827 536872 432797 480601
2866 480601 529240 336130 198498 128349 95814 114955 133817 51242 -21681 14067 -24711
2855 -24711 41689 -33011 43350 116818 60435 -46747 -52289 78454 54596 -19221 131203
2844 131203 130202 177252 162451 69198 19069 100226 -22091 -16103 -13463 13938 -44356 -71043
2832 -71043 -79688 40195 -90466 -144825 -108096 -21133 67876 115159 112845 123048 -11919 -455
2820 -455 107926 26246 178434 177567 61206 112270 195773 152114 79244 74103 233964 275262
2808 275262 526854 720594 871598 911912 1006105 1057777 935022 916132 947061 1007532 882299
2797 882299 1105872 1232993 1266262 1352367 1312159 1300189 1275192 1181381 1142496 1153327 1102444
2786 1102444 1240869 1184832 989883 962070 844375 879402 934757 905945 1100646 939806
2776 939806 720863 485308 338118 176526 35501 114710 87543 -91805 -115722 -159245
2766 -159245 -222185 -163110 -190738 -209363 -289130 -426445 -459392 -410197 -491837 -453584 -634090
2755 -634090 -569208 -585790 -676633 -656666 -570209 -408982 -510918 -490889 -406165 -452209 -368397
2744 -368397 -344360 -478616 -584598 -647283 -592786 -541128 -567917 -585740 -536130 -617620 -710558
2733 -710558 -668519 -630548 -631017 -559577 -512231 -466860 -558361 -435157 -516276 -627334 -597151 -563261
2721 -563261 -598099 -589953 -491580 -495489 -588691 -648425 -664661 -691529 -765097 -677377 -522621 -430964
2709 -430964 -581424 -604833 -676748 -521965 -437088 -415716 -520572 -561261 -450213 -557118 -675679
2698 -675679 -589123 -526320 -413511 -531811 -474691 -436041 -448222 -457343 -394723 -404938 -500090
2687 -500090 -483128 -503965 -376121 -376396 -572383 -583387 -539032 -504369 -370166 -413050 -476257
2676 -476257 -461683 -421903 -486631 -515079 -392996 -386587 -494915 -460156 -417966 -412517 -393956 -356791
2664 -356791 -535801 -594536 -546970 -430442 -366698 -255767 -325078 -406611 -497046 -463897 -448688
2653 -448688 -475609 -501181 -546014 -545140 -476017 -407873 -448230 -502787 -579470 -599226 -541304 -556272
2641 -556272 -517661 -472205 -446938 -483631 -637631 -547325 -470842 -591831 -539662 -478142 -447618
2630 -447618 -400492 -444324 -496428 -445756 -393954 -347790 -276160 -125514 35837 356782 524484
2619 524484 463476 346134 246511 -32804 -278982 -417645 -464933 -395161 -428557 -435945 -447246
2608 -447246 -474672 -500157 -471899 -494631 -524986 -505975 -338014 -326845 -390266 -251189 -195102
2597 -195102 -272268 -450672 -450216 -424360 -299688 -324048 -452630 -402021 -356441 -252311 -338280
2586 -338280 -437604 -400768 -431713 -392898 -439094 -389207 -505364 -414415 -499879 -421270 -450826
2575 -450826 -450358 -399989 -400019 -463702 -454353 -362640 -377225 -271043 -397442 -495047 -447586 -554772
2563 -554772 -521114 -474269 -484363 -441095 -411363 -370552 -326304 -297663 -388180 -337160 -388626 -297796
2551 -297796 -422468 -367322 -428218 -483777 -318621 -393393 -282164 -225090 -263801 -280310 -184064
2540 -184064 -268324 -379740 -323630 -362995 -386372 -400471 -395430 -410861 -169904 -210927 -198268
2529 -198268 -212049 -295965 -358708 -390578 -353639 -366162 -493991 -350624 -224138 -293737 -391190
2518 -391190 -307497 -243236 -237195 -352994 -342609 -153903 -248898 -234437 -128268 -82991 -147991
2507 -147991 -128037 -190715 -30232 109210 -18266 -56635 -37254 -164405 -178403 -150990 -172091
2496 -172091 -134235 -140982 -99210 -33544 -147155 -120185 56542 131284 107343 112730 77374 39644
2484 39644 -2056 -29579 34362 69752 80269 95963 254174 228549 167968 80143 141280 83316
2472 83316 61758 157623 197410 188974 241748 219304 171654 288742 316008 277145 356468 286898
2460 286898 318050 229350 247303 272267 183691 239455 398837 458866 350581 405056 603608
2449 603608 561149 625297 447691 372642 386104 401442 460805 610310 526934 452260 405758
2438 405758 460549 569924 674740 717660 619786 729250 925162 943431 914102 752076 713171
2427 713171 846842 826263 776273 872016 858656 1025235 1131289 1190113 1257960 1347805 1381236
2416 1381236 1392465 1467989 1577616 1475608 1632702 1596261 1606968 1735604 1772922 1966552
2406 1966552 1979715 1881348 2040118 2265103 2360341 2494947 2439228 2579617 2684922 2874027
2396 2874027 2942075 3071992 3287115 3378345 3369949 3421236 3471452 3642967 3723627 3980792 4148901
2385 4148901 4438726 4420107 4717152 4860950 5150545 5241444 5700170 6119596 6603556 6962682
2375 6962682 7609987 8165098 9018571 9708028 11205345 13238568 15443518 17019358 17888676
2366 17888676 17765066 18246877 19204252 21215670 23432097 27015285 31164505 37668881 46183460
2357 46183460 62811205 94662347 149979360 201103446 223915382 208349944 161060087
2350 161060087 118537044 86625514 65704106 50603921 39536719 30212459 23339211
2343 23339211 18382284 15938312 14752520 14700314 14636108 14452441 13357231 11589738 9790638
2334 9790638 8510491 7478379 6878141 6109819 5609932 5130733 4912505 4729722 4455933
2325 4455933 4197025 3997897 3868314 3630933 3499399 3336175 3284602 3183558 2956557 2860090
2315 2860090 2622492 2510600 2355794 2206179 2074241 2087122 1831098 1621254 1734700 1703146
2305 1703146 1668948 1677539 1703267 1585241 1405748 1274922 1362610 1318825 1205931 1160037 1093755
2294 1093755 1047778 1003010 841838 865931 915163 908660 883076 678067 610204 584338 504215
2283 504215 519473 564863 633444 410389 401533 319397 254653 251236 316749 313483 184355 140449
2271 140449 104127 92454 114371 42341 17874 233 39501 53934 103981 -36195 -11225
2260 -11225 -21791 -4773 -116511 -230220 -263482 -241338 -208723 -197370 -80260 -127691 -218342
2249 -218342 -112796 -89302 -169409 -190910 -302161 -384444 -384950 -379503 -360259 -498155 -423811 -420646
2237 -420646 -484852 -460985 -500431 -506099 -357703 -419261 -391275 -474121 -436549 -566295 -626102
2226 -626102 -657384 -617605 -650625 -646617 -614675 -642449 -616910 -550944 -592388 -590218 -536254 -591253
2214 -591253 -588579 -499550 -519358 -659581 -638454 -608411 -645958 -513745 -507730 -652086 -705675
2203 -705675 -736585 -707036 -706487 -628161 -581549 -483261 -336957 -500508 -599427 -561480 -590973 -693158
2191 -693158 -599560 -640928 -636942 -638895 -713582 -728316 -852829 -783621 -868897 -709229 -673177 -706109
2179 -706109 -715937 -826579 -777939 -733699 -809488 -709584 -636339 -679663 -919193 -957558 -923810
2168 -923810 -931303 -755990 -707677 -688506 -662301 -487204 -618361 -728327 -630510 -617014 -578614
2157 -578614 -631405 -651854 -538314 -596310 -620708 -653941 -722167 -785593 -799687 -652040 -729931
2146 -729931 -752980 -664785 -690429 -656070 -699245 -643686 -633477 -673631 -738538 -721950 -791300 -810281
2134 -810281 -731845 -819193 -808747 -901371 -903572 -971503 -889521 -847079 -706792 -680517 -686054 -736797
2122 -736797 -751045 -752188 -862745 -778318 -748900 -792886 -712649 -777941 -936608 -919595 -883496
2111 -883496 -774191 -813433 -793723 -703093 -702872 -671768 -627259 -641568 -549773 -629890 -637836 -604197
2099 -604197 -638405 -500521 -554244 -682229 -697043 -625581 -709340 -748044 -605804 -472317 -437513
2088 -437513 -474672 -282942 -27621 23433 191596 168478 230033 59427 -205915 -319158
2078 -319158 -272578 -429280 -480199 -616739 -501662 -539497 -751354 -777403 -660849 -500356
2068 -500356 -567685 -495550 -440556 -504330 -604342 -624890 -579876 -675077 -631334 -731560 -803092
2057 -803092 -785201 -810875 -821342 -808665 -768362 -705305 -701022 -613313 -718408 -831865 -763013
2046 -763013 -798999 -732510 -751500 -844565 -906189 -822202 -807381 -820192 -796484 -793347 -852227 -819153
2034 -819153 -913765 -895220 -919745 -894479 -762960 -802112 -811935 -841859 -911681 -804309 -870633
2023 -870633 -816102 -793899 -810033 -820765 -746174 -735004 -736774 -659629 -691494 -683127 -625478 -647423
2011 -647423 -663701 -807181 -932787 -733464 -592447 -601455 -705259 -788164 -783878 -743031 -696275
2000 -696275 -720660 -677760 -826146 -834647 -813560 -789402 -731978 -680198 -666102 -671502 -901914 -905272
1988 -905272 -746821 -669989 -634692 -597443 -755751 -650192 -612964 -615466 -695455 -764539 -767596
1977 -767596 -845801 -757334 -672769 -688787 -662663 -725341 -800409 -792515 -773462 -722603 -794665 -780783
1965 -780783 -683178 -778778 -805211 -700501 -736954 -724817 -725294 -790798 -772287 -594660 -602259 -618863
1953 -618863 -578553 -543402 -716965 -882109 -914231 -890904 -807424 -765952 -684054 -651233 -586234
1942 -586234 -604317 -674462 -743721 -779314 -699940 -725216 -750001 -768245 -900699 -932072 -886545
1931 -886545 -872871 -734314 -778433 -787876 -736965 -674498 -746475 -666037 -696198 -669103 -659072 -748333
1919 -748333 -690668 -673891 -749553 -616421 -518877 -669889 -806988 -758478 -642092 -613326 -749599
1908 -749599 -691084 -779278 -737591 -733045 -760794 -710307 -732789 -748036 -731830 -677519 -663461 -596783
1896 -596783 -579563 -551498 -780885 -763533 -724400 -746112 -660821 -741114 -691749 -698737 -671402 -724250
1884 -724250 -756697 -704778 -663494 -711589 -626146 -738380 -786225 -764501 -781973 -793792 -847791
1873 -847791 -791621 -805517 -853024 -789031 -665459 -756153 -749374 -728989 -852218 -877434 -809441
1862 -809441 -694349 -710710 -919449 -982820 -764860 -753595 -856832 -716569 -781922 -750524 -711790
1851 -711790 -702271 -792621 -725568 -697368 -729930 -811885 -852552 -787281 -566548 -678239 -806580
1840 -806580 -639330 -467182 -633234 -737888 -626633 -561608 -583128 -700032 -775273 -718396
1830 -718396 -644828 -497421 -628321 -558881 -558206 -572186 -599116 -570557 -505463 -506997 -549394 -698446
1818 -698446 -690806 -752174 -637925 -724749 -626437 -727737 -771985 -830623 -614737 -583872 -703263
1807 -703263 -641086 -649773 -706890 -579778 -549450 -685678 -759991 -565231 -702518 -777847 -627668
1796 -627668 -609366 -690063 -600360 -480534 -552057 -452272 -452296 -466090 -629319 -671082 -640375 -658524
1784 -658524 -689605 -634457 -595598 -559818 -689215 -679976 -670815 -632157 -547437 -706497 -700005 -710194
1772 -710194 -668969 -626216 -673626 -545776 -501688 -468192 -459535 -460609 -464997 -438013 -606087 -632154
1760 -632154 -642979 -625655 -630360 -629965 -667935 -683770 -701896 -679745 -635440 -602377 -633429 -581009
1748 -581009 -552096 -585448 -490004 -612524 -717798 -735806 -755624 -759470 -886995 -1037828 -915041
1737 -915041 -773722 -729350 -736922 -738338 -680233 -580511 -473640 -571372 -649628 -584002 -612007 -650239
1725 -650239 -708662 -662140 -596081 -492252 -580757 -677850 -544128 -578021 -633541 -554310 -635232
1714 -635232 -712109 -707367 -755125 -781909 -641101 -576465 -599364 -697116 -606871 -677009 -697966 -676936
1702 -676936 -778761 -714601 -737142 -626778 -574429 -597918 -623397 -705523 -689448 -787166 -715884
1691 -715884 -664937 -710268 -698416 -717283 -723586 -627057 -838294 -772412 -676520 -757875 -598697
1680 -598697 -471293 -613337 -768454 -662895 -639185 -689608 -761106 -711430 -625514 -614100 -701468
1669 -701468 -666573 -580875 -708719 -776128 -763526 -794217 -629784 -629052 -641869 -624121 -583300 -678643
1657 -678643 -748749 -855041 -796498 -841469 -832415 -774381 -716043 -657755 -595385 -618240 -656522 -753473
1645 -753473 -839969 -772060 -683194 -640193 -579725 -599692 -575405 -596487 -695596 -511327 -466237
1634 -466237 -648879 -650766 -492960 -505856 -477650 -515194 -578794 -575858 -588745 -729947 -657119
1623 -657119 -632309 -629757 -630603 -651858 -706644 -774378 -842589 -773695 -583758 -358623 -382445 -417950
1611 -417950 -501098 -598985 -608117 -741604 -723471 -646426 -586902 -685670 -734953 -664205 -635988 -677328
1599 -677328 -757707 -686140 -504620 -479332 -630503 -696373 -565188 -693208 -744518 -675576 -804231
1588 -804231 -654421 -567532 -657096 -651059 -665916 -647317 -566084 -533127 -461811 -508683 -537827 -509659
1576 -509659 -535882 -508779 -452588 -414893 -474798 -480608 -466313 -541201 -597591 -562061 -538571 -654176
1564 -654176 -696777 -483537 -435120 -410047 -385363 -541927 -563121 -467558 -447052 -475914 -493113
1553 -493113 -632203 -606063 -605154 -681806 -717994 -788493 -720408 -689413 -554944 -596372 -723922
1542 -723922 -746323 -682270 -649815 -730068 -760328 -726201 -757278 -646504 -588967 -524768 -622774
1531 -622774 -662455 -546858 -536415 -421610 -473408 -421877 -460127 -475676 -433029 -464862 -605080
1520 -605080 -668720 -618498 -653884 -639079 -536144 -609060 -560529 -620187 -650743 -783119 -765218
1509 -765218 -630400 -659479 -684569 -614142 -449032 -391809 -472650 -437316 -483244 -570416 -527637
1498 -527637 -669105 -626340 -570860 -816160 -728608 -647978 -619939 -591389 -577167 -416698 -450302
1487 -450302 -526416 -588262 -471707 -573548 -616217 -728244 -723940 -689833 -551888 -535394 -612615
1476 -612615 -729820 -710017 -777766 -668818 -518487 -508040 -546236 -564991 -618765 -613559 -523139
1465 -523139 -486780 -583287 -539114 -521572 -523044 -531921 -643459 -637030 -671142 -640256 -584669 -546720
1453 -546720 -625471 -644443 -606028 -474529 -515274 -582207 -656201 -675902 -722623 -694926 -792656
1442 -792656 -729014 -650255 -589250 -553982 -632856 -620414 -630898 -676585 -595140 -598883 -634408 -640536
1430 -640536 -704210 -595393 -598488 -583642 -572582 -563518 -548310 -518619 -579396 -630815 -519617 -559705
1418 -559705 -633458 -660100 -692730 -620450 -700175 -649727 -602159 -517595 -479875 -415106 -496401 -673026
1406 -673026 -711373 -735419 -645732 -613317 -579246 -630855 -688028 -688407 -626769 -603909 -559886 -619716
1394 -619716 -557672 -570409 -501334 -372805 -320121 -453128 -476981 -451178 -558981 -559534 -497293
1383 -497293 -603577 -688350 -555728 -522518 -676824 -663725 -601924 -589032 -669517 -650529 -630965
1372 -630965 -706858 -623699 -672244 -779211 -623321 -596428 -592180 -486160 -573298 -646239 -636071
1361 -636071 -641219 -504025 -567171 -609975 -642903 -664474 -618598 -595628 -772259 -736534 -634799
1350 -634799 -675198 -588491 -641361 -634548 -615564 -666839 -729092 -517268 -638298 -562082 -472360
1339 -472360 -502964 -544731 -661580 -526759 -455225 -530692 -446777 -414974 -576638 -645708 -554132
1328 -554132 -491005 -482944 -557717 -573903 -560744 -515333 -611273 -545162 -662803 -544563 -577399
1317 -577399 -658364 -520387 -647549 -665011 -564335 -550425 -741564 -564582 -602527 -658760 -532095
1306 -532095 -502646 -660196 -728950 -690061 -671357 -586770 -617105 -597765 -555462 -614352 -536643
1295 -536643 -456376 -477764 -468965 -385743 -488721 -551881 -554439 -665819 -738607 -643503 -666744 -664179
1283 -664179 -665779 -694254 -702047 -768637 -703812 -693670 -653725 -673667 -589940 -539401 -547677 -491768
1271 -491768 -530991 -624911 -686201 -633980 -580332 -644538 -691006 -582236 -469620 -559486 -643114
1260 -643114 -608378 -613276 -659168 -578018 -541556 -721879 -619372 -531567 -636233 -631393 -638647 -588949
1248 -588949 -586658 -584429 -478017 -577699 -511748 -444336 -547539 -524610 -630240 -707408 -815364
1237 -815364 -794098 -802256 -642699 -591945 -618652 -641301 -609793 -590583 -620996 -465440 -526907
1226 -526907 -708714 -610714 -605552 -613243 -561445 -561974 -472181 -484187 -469503 -519512 -565241 -531739
1214 -531739 -545601 -609779 -629520 -603316 -575740 -549910 -586873 -544894 -518460 -458837 -423383 -568963
1202 -568963 -604985 -563888 -639598 -595242 -500399 -569984 -603084 -697075 -719555 -653038 -733781 -727453
1190 -727453 -576943 -546267 -498122 -543745 -581835 -592984 -584195 -499826 -588521 -613845 -618826 -522405
1178 -522405 -453048 -434435 -540642 -530304 -400437 -490762 -590905 -521617 -556802 -614762 -458303
1167 -458303 -486901 -616899 -640847 -537929 -511134 -391405 -490161 -464630 -453751 -502570 -455720
1156 -455720 -505544 -617295 -515802 -469446 -555701 -551744 -472825 -338696 -347204 -523157 -592387
1145 -592387 -565099 -440085 -416918 -401224 -423403 -543220 -611809 -549195 -556460 -613711 -467234
1134 -467234 -391802 -478960 -497340 -489264 -589737 -613105 -622505 -559933 -563959 -545182 -688264 -672498
1122 -672498 -611276 -646806 -648541 -636989 -634564 -649825 -517301 -590099 -583325 -633283 -528324 -602052
1110 -602052 -643877 -623754 -596789 -527353 -554797 -425168 -330533 -382964 -455088 -538328 -528330 -556511
1098 -556511 -639238 -741511 -719536 -633422 -681387 -822473 -741882 -497023 -350160 -430711 -527884
1087 -527884 -409415 -434543 -439439 -579556 -486469 -609046 -676121 -700790 -557640 -576877 -739208
1076 -739208 -647986 -548714 -547526 -645538 -605557 -561702 -648845 -641940 -685368 -670265 -564814 -447282
1064 -447282 -567435 -519793 -498894 -507563 -482055 -608582 -502842 -642153 -762498 -665916 -659038
1053 -659038 -645742 -665015 -581291 -645536 -707796 -627606 -463005 -425362 -455458 -645049 -652174
1042 -652174 -553400 -568260 -526278 -619495 -599508 -613863 -690299 -663314 -614336 -614900 -530901 -475580
1030 -475580 -353949 -480795 -491253 -403091 -421201 -541591 -507854 -444807 -435529 -330329 -490939
1019 -490939 -544920 -464254 -442737 -629842 -753819 -803361 -630280 -517759 -585891 -536655 -460416
1008 -460416 -613207 -689923 -543563 -571989 -525889 -616623 -561506 -575648 -519230 -585453 -584489 -547119
996 -547119 -618727 -588724 -492308 -406863 -486888 -479966 -603176 -585059 -619376 -674678 -576930 -590433
984 -590433 -674205 -677817 -451424 -507490 -503780 -592685 -562234 -545768 -609346 -527261 -566180 -517763
972 -517763 -530422 -636704 -647401 -596670 -512981 -319866 -234487 -339909 -579170 -690172 -775173
961 -775173 -580207 -483083 -496243 -424105 -450814 -565093 -650315 -587643 -445832 -372802 -486176
950 -486176 -474960 -565601 -587571 -685784 -664044 -481318 -463546 -534103 -430820 -517381 -544776
939 -544776 -444775 -517689 -529581 -468349 -492708 -590424 -592311 -576341 -503301 -464791 -446608 -477693
927 -477693 -455317 -447782 -403083 -474937 -496954 -421738 -420700 -423867 -551943 -560978 -517704 -456659
915 -456659 -389896 -555334 -402781 -418118 -477492 -431535 -392090 -250029 -431189 -489754 -488289
904 -488289 -469395 -406171 -538865 -626215 -633714 -474706 -445363 -653163 -679025 -601288 -522308
893 -522308 -509845 -563048 -559815 -451827 -432727 -540687 -306617 -243728 -424492 -483871 -614555
882 -614555 -565710 -574081 -584675 -537222 -580904 -569235 -489026 -500973 -503954 -590489 -638054 -644904
870 -644904 -545891 -505713 -605815 -708159 -641640 -567115 -678222 -648289 -546432 -428315 -515903
859 -515903 -511177 -516005 -651316 -698475 -583697 -602604 -586249 -512084 -637539 -630915 -499175 -512675
847 -512675 -460893 -592467 -535477 -565734 -675916 -626678 -707626 -562268 -506723 -500795 -376989
836 -376989 -469981 -548351 -481124 -460507 -412675 -388964 -456147 -445535 -506698 -559768 -538638 -623868
824 -623868 -586159 -382805 -398244 -494245 -605302 -757188 -784183 -739301 -686110 -654548 -542801
813 -542801 -505900 -501546 -609027 -527160 -521176 -445728 -476032 -452328 -490378 -425660 -341005 -314022
801 -314022 -312775 -299828 -457123 -521062 -551863 -644943 -542130 -462494 -382594 -437382 -429988 -600905
789 -600905 -548454 -557902 -621946 -503401 -431054 -395095 -457180 -420528 -429045 -552809 -673089 -740768
777 -740768 -610466 -517401 -550127 -707201 -620830 -539448 -563114 -774302 -776742 -775073 -685701 -631375
765 -631375 -628254 -434192 -342500 -390309 -420608 -573145 -655084 -577019 -546602 -492196 -427204 -420431
753 -420431 -548083 -551527 -598445 -510479 -469657 -438451 -439804 -545845 -550812 -424074 -400411 -335318
741 -335318 -457540 -564960 -519723 -526614 -479566 -694962 -609604 -332426 -303669 -457681 -465584
730 -465584 -464294 -388841 -348459 -317405 -378229 -509458 -534296 -527427 -412968 -597336 -618849 -728153
718 -728153 -664565 -519142 -523426 -494381 -506046 -521000 -477136 -507708 -701093 -633805 -459269
707 -459269 -394907 -539123 -610365 -623998 -513348 -524007 -590410 -525232 -585546 -557275 -585497
696 -585497 -557405 -477319 -438169 -379689 -441959 -570945 -609415 -494187 -502357 -495881 -551507 -310920
684 -310920 -285815 -488998 -519560 -642248 -590293 -562607 -369156 -486665 -427843 -463391 -423589
673 -423589 -554386 -667139 -600551 -599905 -563162 -616328 -487868 -428326 -513248 -529003 -407921
662 -407921 -482783 -540034 -517014 -486882 -524664 -473050 -430595 -409134 -368999 -457549 -394287 -495417
650 -495417 -494124 -451966 -549305 -600585 -439780 -464862 -405262 -360276 -456875 -451119 -561746 -568706
638 -568706 -531053 -493423 -532071 -350354 -469134 -467792 -433865 -587218 -587095 -620310 -566173 -496811
626 -496811 -527749 -500494 -470233 -516745 -548858 -516083 -462640 -494559 -555047 -598163 -553417 -580247
614 -580247 -516185 -480096 -559708 -543381 -665146 -562320 -544343 -607985 -636694 -598766 -588389
603 -588389 -661950 -566345 -489149 -522827 -509723 -428440 -557913 -663012 -492867 -440715 -504329
592 -504329 -550187 -414598 -462654 -519887 -434021 -417609 -458643 -444969 -380378 -328138 -235251 -383442
580 -383442 -344950 -481054 -511096 -489040 -427325 -392465 -510644 -682677 -681183 -524327 -594269
569 -594269 -478295 -463402 -499888 -593060 -544725 -616481 -509951 -433166 -327598 -491920 -539231
558 -539231 -471159 -496486 -507919 -477039 -404066 -430888 -516522 -510624 -532076 -514631 -562854 -690976
546 -690976 -604793 -542225 -569842 -520877 -467119 -560962 -501527 -597079 -481631 -389551 -468558 -374273
534 -374273 -396903 -491148 -687829 -707867 -547685 -495419 -505988 -652666 -496778 -514345 -495812
523 -495812 -470494 -431785 -580449 -571050 -504948 -608494 -541138 -516497 -630990 -545199 -444294
512 -444294 -446821 -569279 -511193 -537937 -546431 -539329 -541035 -573966 -565571 -465912 -478772 -445140 -518145
499 -518145 -420546 -510217 -461417 -384501 -432912 -435354 -478214 -428364 -501067 -547176 -503500 -562204
487 -562204 -599309 -513012 -513080 -505158 -435246 -435984 -491890 -462045 -430721 -426917 -456669 -462647 -423797
474 -423797 -474710 -511827 -406648 -506260 -602439 -511628 -484000 -444959 -589079 -655789 -572843
463 -572843 -539107 -468656 -488390 -650444 -632420 -511816 -408663 -434581 -459821 -616360 -671320
452 -671320 -448102 -342178 -407824 -541821 -540629 -536546 -521833 -538530 -553382 -545644 -453297 -389183
440 -389183 -526249 -511186 -495383 -569071 -578613 -512601 -625101 -669668 -501961 -426669 -445389
429 -445389 -339673 -425789 -491124 -516639 -491987 -494639 -596565 -564776 -582609 -610650 -445726
418 -445726 -475594 -546162 -546266 -456973 -491938 -558695 -468415 -483239 -314741 -480073 -600747 -556916
406 -556916 -603795 -513918 -373413 -265085 -258477 -302760 -324278 -443126 -584027 -545340 -530102
395 -530102 -670090 -598200 -676341 -577085 -485625 -468076 -570243 -719523 -600782 -607446 -571316
384 -571316 -416062 -418702 -631206 -628641 -524579 -385763 -362228 -425746 -620589 -589470 -536643
373 -536643 -458033 -533319 -604459 -516005 -509286 -466753 -487176 -542297 -539118 -502990 -722860 -605631
361 -605631 -564788 -500506 -389707 -396889 -297281 -451387 -497956 -476763 -475817 -493712 -447463 -487263
349 -487263 -493591 -379836 -535601 -556812 -360763 -562902 -653599 -644783 -619544 -479325 -549757
338 -549757 -552939 -496697 -593621 -489876 -415820 -368779 -259983 -359097 -573173 -465543 -493901
327 -493901 -641820 -544652 -473752 -556607 -580762 -475596 -568916 -640874 -541106 -488380 -457281
316 -457281 -398345 -475840 -451116 -424614 -439043 -485901 -643121 -667007 -466221 -555081 -577572
305 -577572 -450253 -478390 -645042 -596845 -597986 -564620 -552673 -484234 -497132 -519137 -491591 -534268
293 -534268 -600469 -510491 -467273 -405106 -477050 -599894 -591042 -651588 -633657 -506335 -423729 -448971
281 -448971 -527329 -568859 -429341 -379098 -485093 -443326 -462514 -498354 -508471 -611656 -464185
270 -464185 -522744 -450052 -433416 -553527 -469179 -340268 -427388 -603324 -475555 -382358 -362643
259 -362643 -441899 -477419 -445599 -462880 -424479 -444408 -498289 -569503 -449278 -463588 -450756 -570630
247 -570630 -531465 -514336 -341129 -408039 -476321 -510926 -506802 -569895 -552996 -432280 -486222 -452230
235 -452230 -461731 -381120 -482711 -563229 -471061 -407632 -376626 -440526 -463952 -430031 -492371 -509415
223 -509415 -523076 -499568 -453694 -420012 -463889 -360040 -373011 -396118 -447296 -525248 -347814
212 -347814 -330538 -508571 -484520 -501239 -407898 -469933 -484565 -457600 -440807 -482438 -438139 -510974
200 -510974 -412674 -325657 -551510 -668371 -536233 -554018 -534031 -440438 -389654 -448292 -455785
189 -455785 -394567 -488841 -439018 -494881 -578661 -448120 -460470 -548233 -557547 -515919 -531682 -636057
177 -636057 -532708 -408872 -472977 -493305 -435487 -495831 -476021 -407633 -510344 -506659 -472907
166 -472907 -437484 -387419 -551473 -494406 -523623 -541934 -526958 -478754 -535546 -443238 -450577 -575451
154 -575451 -614501 -554298 -504095 -538112 -484373 -506610 -619982 -625595 -539150 -594745 -610276 -615869
142 -615869 -663619 -597646 -538439 -712490 -677491 -623009 -543462 -496577 -495903 -447021 -404345 -407421
130 -407421 -596181 -532888 -582541 -620667 -559053 -523026 -581044 -596910 -575587 -601770 -742755
119 -742755 -683390 -556256 -523132 -465422 -508131 -498795 -543847 -578918 -608247 -691912 -632131 -547503
107 -547503 -541587 -651078 -609170 -688025 -662772 -579565 -631890 -648828 -677944 -598819 -595930 -631679
95 -631679 -587305 -502975 -495155 -589591 -523751 -498206 -489556 -567918 -636399 -579219 -574951 -613124 -626558
82 -626558 -574873 -585678 -667620 -757280 -756751 -733541 -570033 -502944 -669865 -621761 -636170 -561586
70 -561586 -559624 -651234 -592618 -599517 -555838 -610029 -552632 -663082 -660594 -643299 -609908 -583696
58 -583696 -553565 -506238 -547919 -606245 -546264 -617690 -579832 -586122 -548222 -595733 -756410 -821648
46 -821648 -737030 -658578 -549685 -545917 -601974 -655579 -648679 -675533 -683021 -653642 -602697 -573954
34 -573954 -630909 -637368 -653349 -605573 -704197 -742313 -659291 -676435 -656049 -614371 -590379 -597302
22 -597302 -618438 -653427 -693944 -707158 -682469 -603013 -626230 -609837 -607154 -656644 -726251 -660838
10 -660838 -587053 -575606 -581231 -589752 -639073 -628562 -621356 -583677 -586559 -660337
0 -660337
$$ Imaginary data points
##PAGE= N=2
##DATA TABLE= (X++(I..I)), XYDATA
16383 -2548810 -2534703 -2515888 -2566156 -2550418 -2548701 -2455643 -2344252 -2384918 -2315065 -2230373 -2197531
16372 -2197531 -2223178 -2094765 -2042153 -2062034 -2079906 -2075590 -2069757 -1958879 -1902772 -1822281 -1864777
16361 -1864777 -1790890 -1744354 -1779970 -1726266 -1690678 -1621420 -1643977 -1689890 -1669034 -1521732 -1426826
16350 -1426826 -1474951 -1537978 -1474450 -1393951 -1264331 -1254376 -1195642 -1198022 -1151248 -1122023 -1166569
16339 -1166569 -1118613 -1046314 -945270 -919489 -917370 -924196 -985314 -816993 -779448 -723311 -669992
16328 -669992 -777430 -700379 -587507 -449173 -440496 -512857 -397696 -440294 -383390 -328487 -352485
16317 -352485 -307575 -276001 -264681 -235924 -185081 -219676 -200494 -175501 -94404 -129382 -53644
16306 -53644 -286 48652 47351 82996 167128 239478 203373 192389 299059 265807 287600 287900
16294 287900 293588 341863 443656 425449 383020 542823 592421 612684 575714 584893 545381
16283 545381 588972 653503 669197 728833 781166 695473 766692 738471 837274 1014204 990458
16272 990458 976237 947510 995941 996074 1022012 1042813 1055391 1021129 1051774 1103616 1128530 1085812
16260 1085812 1040422 1103647 1215049 1193487 1173548 1257393 1334665 1416199 1357777 1360290 1419860
16249 1419860 1383491 1482542 1543330 1501321 1491852 1570240 1668953 1604681 1562476 1559174 1593189 1649282
16237 1649282 1644405 1465086 1537295 1671379 1628604 1723888 1688155 1772377 1891891 1809699 1773512
16226 1773512 1914276 2003553 2024083 2099937 2011226 2053144 2060161 2045263 2072468 1961211 2045910
16215 2045910 1981352 2015732 2171071 2183019 2223876 2126760 2030944 2086766 2141755 2221687 2209569
16204 2209569 2241576 2232107 2221750 2274488 2284965 2192967 2075906 2161538 2315044 2423467 2311796
16193 2311796 2248501 2232381 2265023 2333646 2381735 2402937 2406066 2410062 2453780 2417306 2340786 2329371
16181 2329371 2356200 2497819 2470347 2581067 2462151 2359355 2421377 2552573 2611411 2639106
16171 2639106 2659836 2524345 2573367 2706054 2689666 2622751 2568863 2586448 2643159 2554227 2548139
16160 2548139 2587808 2640101 2619069 2586950 2618111 2580841 2713475 2751253 2742268 2829596 2851963
16149 2851963 2811211 2765972 2794210 2746497 2772482 2812199 2757159 2829245 2791682 2820033 2788581
16138 2788581 2686985 2690964 2690519 2680413 2640589 2751253 2888315 2924618 2894139 2868195 2870024
16127 2870024 2839439 2870369 2923226 2914631 3008361 3047796 2925475 2758460 2791916 2845518 2979206
16116 2979206 3027378 2897651 2769437 2771643 2882501 2842308 2851634 2981011 2902945 2925792 2904502
16105 2904502 2991236 2942569 2928590 2913452 3174592 3113082 3107132 3121284 3030837 3012091 2873556
16094 2873556 2935514 2977399 3058203 3039493 2980751 2872868 2878411 2840918 2887614 2871188 2819200
16083 2819200 2827736 2958977 2975157 2984389 2975211 3000755 2981206 3107919 2939757 2967952 2976729
16072 2976729 3010105 3035138 3030567 3062002 3057180 3015908 3048454 3001329 2939478 3011193 3085951 3052140
16060 3052140 2987749 3013307 2983303 3042190 3228225 3237562 3104822 3082819 2970995 2993879 2989113
16049 2989113 2922300 2908408 3011430 3143056 3098137 3047745 3093975 3024632 3105621 3199171 3136730
16038 3136730 3095204 3052399 3053144 3125534 3041482 3010425 3025787 3007292 2892327 2963189 3171873
16027 3171873 3209146 3067105 3064037 3080639 3050978 2954702 2984035 2948733 2981378 2967513 2892670
16016 2892670 2953201 2964284 2900215 3052107 3013599 2952080 2898304 2985527 3079929 2926039 2954740
16005 2954740 3087315 3090686 2965974 2879447 2984325 3109217 3070442 3062671 3132624 3167965 3161421
15994 3161421 3065919 2921708 2986736 3099379 3169816 3102370 3057882 3063061 3009431 3008457 3133787
15983 3133787 3105866 3156299 3056509 3011515 2947843 2918192 2995866 3228740 3212234 3132073 3092062
15972 3092062 2995155 3012128 2997247 3011339 2919021 3019666 3011257 3033557 3169416 3167241 3169841
15961 3169841 3175142 2955804 2936841 3158072 3065452 3140705 3125314 3145003 3246173 3032402 2997727
15950 2997727 3055253 3085657 3049373 2938837 2995081 3017479 3053528 2990220 3039069 2935151 3079465
15939 3079465 3205782 3144405 3067941 3041228 3124678 3042807 3058948 3027081 3184359 3147135 3096555
15928 3096555 3257265 3167036 3164438 3076366 2903204 2994958 2933603 3112438 3162720 3246410 3191409
15917 3191409 3124307 3092016 3097525 3063220 3156755 3142079 3095346 3097139 3109359 3254282 3211675
15906 3211675 3175071 3089264 3092927 3044686 3068013 3078102 3044339 3025464 3271349 3069755 2932780
15895 2932780 3065398 3045986 3120472 3146940 3164304 3175747 3073411 3049449 3096581 3061110 3007336
15884 3007336 3073029 3074413 2994124 2936583 2797864 3014171 3187236 3043026 3093207 3136428 3159117
15873 3159117 3140586 3080234 3046538 3046862 3029216 3114454 3114614 3020694 3107708 3106362 3174752 3059796
15861 3059796 3090586 3151859 3237768 3227719 3193988 3095871 2888342 2868035 2847492 3033030 3108132
15850 3108132 3089514 3035924 3095720 3157883 3099321 3026757 3018652 2972661 2889081 2921765 2945944
15839 2945944 2970009 3012844 3006420 2987306 3031814 3046686 3087382 2999661 2955178 2999544 3000430 3154764
15827 3154764 3122387 3037066 3039698 3154992 3261643 3138967 2975505 2989274 3109384 3133201
15817 3133201 3153781 3117538 3162254 3155862 3090490 3154342 3112504 3045540 3065179 3129971 3086851
15806 3086851 3115795 3139796 3101446 3084863 3194956 3330405 3281321 3169568 3166715 3067903 3101652
15795 3101652 3012514 2913182 2913829 2990969 3100530 3053665 3189174 3163282 3096200 3020747 3178506
15784 3178506 3225561 3119532 3118068 3130057 3021451 2942123 3142581 3192279 3064741 3101141 3117755
15773 3117755 3238588 3117003 3048281 3214314 3161092 3060992 3068253 3128869 3189568 3237062 3189842
15762 3189842 3079642 3079315 3134335 3072648 3096751 3091283 3066284 3077328 3187628 3163335 2979427
15751 2979427 3032252 3113690 3150301 3023879 3024187 2960620 3053866 3041278 3079165 3183001 3129677
15740 3129677 3094295 3025905 3070512 3146981 3263033 3294135 3173890 3177700 3163453 3284359 3269960
15729 3269960 3093644 3164251 3238957 3188371 3184997 3196311 3280010 3277367 3135833 3164965 3216243
15718 3216243 3129988 2948532 2939104 3121663 3185947 3059793 3199718 3047152 3106991 3131623
15708 3131623 3048314 3137308 3004269 2936258 3029568 3012047 3058185 3140502 3241271 3235288 3208919
15697 3208919 3247360 3162267 3149653 3236273 3232868 3317916 3200638 3210698 3248847 3096304 2976218
15686 2976218 3087576 3157853 3070172 3112355 3092817 3051241 2983706 3054854 3183382 3146573 3169748
15675 3169748 3125961 3214915 3099433 3127966 3171740 3196333 3211447 3277340 3146000 3115436 3258690
15664 3258690 3249536 3067141 3017998 3058174 3001704 3058455 3200351 3222287 3113678 3260783 3266045
15653 3266045 3258918 3080179 3087184 3098063 3181636 3087419 3135986 3299954 3246106 3229738 3052823
15642 3052823 3008899 3141249 3143092 3171994 3217956 3206193 3313367 3254544 3137582 3134575 3107836
15631 3107836 3236084 3251607 3309872 3259219 3150316 3135305 3238583 3227858 3255205 3095610
15621 3095610 3243027 3269332 3108789 3020953 3110751 3244663 3237225 3220688 3331213 3245208 3180459
15610 3180459 3136928 3103674 3187616 3218322 3198577 3298927 3330674 3155743 3155138 3231737 3308793
15599 3308793 3209362 3244226 3146451 3082558 3192271 3270007 3223990 3182251 3265991 3229745 3257467
15588 3257467 3342877 3231362 3164469 3207101 3278066 3245575 3108573 3147345 3173781 3193777 3342050
15577 3342050 3302919 3230683 3168190 3152948 3184869 3127231 3106122 3109589 3138138 3063160 3107530
15566 3107530 3232430 3125741 3178877 3158904 3192135 3209170 3305904 3212591 3157253 3155136 3252049
15555 3252049 3138637 3103052 3084591 3112809 3348967 3243646 3139495 3021653 3022540 3149954
15545 3149954 3267581 3308900 3165822 3082170 3071764 3148920 3193466 3183142 3191808 3178209 3231909
15534 3231909 3023779 2949393 2957669 3080937 3157462 3179981 3125018 3040208 3204119 3202733 3185248
15523 3185248 3236630 3295710 3254840 3173328 3123551 3078433 3192803 3185292 3130452 3181277 3008348
15512 3008348 3058692 3086384 3174381 3200652 3081609 2979083 3063683 3147837 3154187 3181006 3256165
15501 3256165 3142173 3101454 3176958 3214976 3264037 3271517 3190132 3153508 3220193 3221194 3216864 3195507
15489 3195507 3191336 3215978 3228006 3250918 3205663 3108263 3133222 3200514 3186707 3203195 3167006
15478 3167006 3147136 3273033 3227408 3409266 3363517 3170508 3017884 3070060 3219277 3258789
15468 3258789 3197302 3229042 3198762 3212918 3212407 3268428 3268597 3204024 3123675 3041818 3052413 3080335
15456 3080335 3216980 3291098 3233739 3258067 3150952 3200998 3205345 3192410 3286621 3367713 3331223
15445 3331223 3231081 3188052 3154076 3115519 3033990 3273670 3292329 3230121 3206463 3224622 3280737
15434 3280737 3241685 3331844 3292311 3325887 3120734 2960812 3058265 3158367 3245408 3221540 3277195
15423 3277195 3330669 3230491 3131149 3199263 3280076 3267300 3306903 3343728 3319417 3230653 3248418
15412 3248418 3108120 3124537 3232861 3349244 3355680 3165672 3219724 3077023 3160374 3248936
15402 3248936 3218001 3189529 3133132 3118064 3217782 3370466 3290153 3231289 3190794 3179182 3117100
15391 3117100 3120993 3068659 3138573 3154995 3073973 3161751 3324378 3187873 3129410 3223987 3220076
15380 3220076 3442398 3390652 3310525 3278141 3331882 3217609 3210036 3198842 3180677 3191326 3249132
15369 3249132 3117199 3172799 3257910 3288905 3263295 3199419 3013452 3155132 3191191 3193973 3233183
15358 3233183 3391570 3370611 3308377 3180751 3202056 3185764 3227996 3359226 3168934 3097864
15348 3097864 3142160 3317572 3419537 3365619 3411263 3325271 3258062 3331764 3315204 3361153 3317476
15337 3317476 3299184 3196694 3174409 3234016 3373768 3217163 3220574 3305018 3316596 3368479 3439064
15326 3439064 3361106 3340751 3281267 3270239 3282481 3203303 3110344 3166923 3152883 3247476 3232918
15315 3232918 3255776 3372247 3416867 3267575 3173924 3157677 3200084 3167237 3296571 3376780 3386092
15304 3386092 3234057 3169533 3233613 3214908 3262768 3314189 3273524 3225482 3198345 3175577 3208038
15293 3208038 3258957 3437809 3480312 3430176 3365153 3238814 3217001 3146324 3261437 3443313
15283 3443313 3403845 3369653 3319910 3222223 3245579 3270504 3207360 3215396 3278462 3383872 3466981
15272 3466981 3400363 3317527 3403002 3445815 3474601 3365895 3296599 3265015 3248338 3272656 3353407
15261 3353407 3470078 3439952 3355301 3286882 3347181 3433311 3381071 3289730 3171445 3217594 3356454
15250 3356454 3410799 3268645 3270463 3291675 3310678 3366008 3245844 3279317 3269168 3291719 3416552
15239 3416552 3188659 3188970 3327916 3390674 3298120 3298167 3348019 3323403 3224322 3244601 3284311 3318989
15227 3318989 3339946 3308691 3263946 3212860 3263360 3206276 3234318 3297616 3291969 3351202 3380827
15216 3380827 3256552 3353405 3338907 3324303 3332281 3286747 3278576 3257270 3312714 3267997 3401340
15205 3401340 3410677 3265906 3246063 3159981 3145852 3258500 3278839 3340743 3348576 3366142 3367995
15194 3367995 3347581 3332027 3436508 3473365 3338987 3316122 3257742 3205125 3306214 3341772 3517054
15183 3517054 3520508 3418159 3418801 3514822 3361886 3426013 3380926 3306201 3375546 3365760 3327607 3222480
15171 3222480 3239962 3212942 3285038 3305759 3257704 3228158 3253174 3210202 3203810 3242570 3453154
15160 3453154 3390872 3490360 3452921 3366494 3273136 3297013 3484785 3421321 3426970 3370635 3360574
15149 3360574 3347422 3373819 3342685 3293213 3274028 3305752 3303140 3200853 3223882 3272578 3248573
15138 3248573 3307136 3518017 3398776 3416437 3492641 3457991 3454032 3367061 3134447 3283778 3271617
15127 3271617 3328979 3398510 3377751 3328029 3517638 3665132 3502725 3260211 3191345 3390467
15117 3390467 3469547 3578910 3461169 3319227 3387825 3385316 3348617 3318259 3209198 3180540 3152588
15106 3152588 3314400 3359049 3441746 3335603 3225672 3349565 3355279 3379636 3434492 3423512 3329841
15095 3329841 3350729 3355422 3364306 3397607 3262483 3327045 3379399 3370924 3258533 3275964 3362231
15084 3362231 3415939 3402742 3354677 3342669 3315696 3305479 3229494 3299639 3407728 3421919 3394563
15073 3394563 3258428 3310869 3545150 3485129 3464762 3492726 3394215 3307374 3242850 3250308 3409785
15062 3409785 3392784 3316724 3240466 3397840 3548572 3299445 3204804 3242152 3283162 3324356 3376218
15051 3376218 3308024 3437662 3414857 3367129 3419468 3323382 3348752 3352721 3490104 3514725 3384304
15040 3384304 3352897 3366603 3354149 3298087 3353160 3422789 3409724 3379655 3397878 3348000 3317456
15029 3317456 3269625 3244593 3294685 3532693 3451537 3550342 3520875 3492648 3553513 3451713 3432439
15018 3432439 3452541 3312014 3273339 3234017 3250227 3398191 3483333 3313459 3253912 3378178
15008 3378178 3433384 3478240 3350685 3447274 3420050 3473039 3380148 3346151 3223653 3292015 3328041
14997 3328041 3428258 3527818 3381237 3405845 3378533 3307242 3277328 3369394 3423406 3403734 3542870
14986 3542870 3528317 3450148 3583036 3595141 3432340 3266527 3353645 3378056 3256486 3385467
14976 3385467 3268783 3308913 3407554 3377620 3293864 3336124 3366158 3393218 3381158 3411894 3285554
14965 3285554 3218435 3388200 3503586 3435330 3361117 3377218 3391080 3408609 3487971 3391841 3335909
14954 3335909 3414181 3278388 3296886 3332739 3385328 3375174 3502166 3396920 3370324 3331084 3141099
14943 3141099 3173222 3292540 3407110 3423965 3322216 3328101 3428715 3361274 3307586 3410556
14933 3410556 3406830 3398422 3418141 3447359 3518070 3433170 3475319 3551369 3471302 3367233 3323560
14922 3323560 3353332 3324168 3341708 3316241 3346782 3397499 3445113 3479875 3501132 3497356 3385985
14911 3385985 3496465 3390892 3301255 3352437 3394628 3579755 3601728 3542486 3435149 3380218
14901 3380218 3416148 3543019 3562347 3512788 3413296 3446232 3383420 3458206 3368145 3342984 3397802
14890 3397802 3563377 3555287 3303539 3195970 3211727 3275931 3268252 3389102 3369920 3400467 3434904
14879 3434904 3510888 3495630 3456900 3345794 3370654 3499433 3462818 3403443 3431341 3417585 3347390
14868 3347390 3425290 3513593 3572661 3434927 3358799 3416782 3405119 3534449 3506857 3441683 3469448
14857 3469448 3503149 3482426 3523003 3650072 3658774 3601497 3444675 3340572 3366730 3406014 3397969
14846 3397969 3438737 3493004 3510677 3520988 3470144 3405729 3300582 3383020 3496389 3436606 3373907
14835 3373907 3418201 3346300 3490745 3554190 3469333 3576251 3578394 3319465 3295428 3409230 3414260
14824 3414260 3524728 3407023 3526064 3467130 3433614 3467121 3516599 3491597 3531305 3455316 3278648
14813 3278648 3458054 3511659 3481341 3397477 3398664 3494370 3470327 3461793 3421722 3447475 3528798
14802 3528798 3389806 3346963 3372957 3402732 3409752 3512492 3397294 3439578 3419965 3421523 3339409
14791 3339409 3375423 3313168 3334637 3406953 3414537 3452731 3487552 3517672 3644189 3585420 3375556
14780 3375556 3464902 3418143 3409210 3500729 3408942 3386886 3458453 3463285 3543522 3543057 3648859 3661393
14768 3661393 3569371 3528074 3570828 3546952 3515249 3340448 3343186 3424955 3545849 3525447 3467522
14757 3467522 3470597 3513027 3547183 3491950 3495554 3562804 3454258 3360032 3447207 3592761 3623729
14746 3623729 3655747 3685477 3570350 3623616 3649810 3628600 3563318 3522278 3662529 3559688 3529761
14735 3529761 3543967 3580175 3516898 3532606 3467540 3399762 3488323 3564391 3630671 3568495 3511104
14724 3511104 3453683 3444830 3636170 3658317 3543931 3605441 3571405 3573030 3656150 3552142 3276063
14713 3276063 3215707 3308742 3407633 3315766 3332516 3413783 3449024 3448099 3396456 3413871 3605212
14702 3605212 3532810 3370844 3265645 3388046 3338128 3499257 3573135 3494668 3614471 3597658
14692 3597658 3607699 3518314 3485419 3392486 3455527 3559429 3405376 3431325 3551856 3502297 3410440
14681 3410440 3311589 3335637 3444819 3416813 3287294 3347878 3432018 3468103 3470974 3525514 3697358
14670 3697358 3610957 3487814 3574706 3568318 3560865 3497187 3509994 3396942 3362369 3450380 3419337
14659 3419337 3347300 3230970 3232366 3479350 3462291 3495402 3523688 3385118 3364426 3409460 3416298
14648 3416298 3510776 3384467 3287666 3413572 3443266 3400383 3399885 3474146 3531331 3510337 3477007
14637 3477007 3432997 3522361 3475041 3477342 3455094 3463784 3483033 3468698 3474509 3405403 3450048 3520580
14625 3520580 3449760 3459589 3389668 3425707 3511358 3419871 3535102 3476781 3446072 3459438 3647245
14614 3647245 3544191 3536780 3468883 3515366 3571194 3523601 3460683 3511873 3572878 3545288 3532472
14603 3532472 3609014 3602483 3577313 3550067 3520972 3481372 3470617 3541295 3547111 3501427 3537156 3456033
14591 3456033 3343211 3461200 3593286 3548880 3566443 3438143 3345550 3332756 3413498 3433938
14581 3433938 3496935 3630785 3659383 3602928 3468741 3453154 3412270 3290295 3236754 3266050 3429266
14570 3429266 3407442 3501067 3576535 3532522 3532017 3376099 3468343 3439801 3337939 3372040 3549279
14559 3549279 3720698 3698830 3517513 3499689 3434686 3566133 3633479 3671887 3538185 3655505
14549 3655505 3643890 3548801 3549239 3540269 3648442 3539949 3476504 3639766 3705788 3577736 3418874
14538 3418874 3485186 3679488 3587086 3524325 3554015 3555889 3566311 3625788 3638521 3625361 3521399
14527 3521399 3544290 3626826 3431769 3470274 3694340 3580177 3569456 3604956 3503950 3327986
14517 3327986 3264670 3549256 3636517 3624292 3606789 3526185 3539565 3594886 3533438 3409797 3393646
14506 3393646 3491803 3487569 3665722 3691721 3581137 3471958 3460666 3534744 3536821 3560535 3636201
14495 3636201 3621376 3832551 3797004 3756042 3789458 3769924 3683766 3582393 3567939 3555667 3589478
14484 3589478 3575515 3550739 3495811 3483001 3336301 3380144 3543334 3596683 3582733 3571210 3536892
14473 3536892 3444834 3485846 3517391 3521416 3607869 3565380 3513102 3416462 3442611 3522960 3641447
14462 3641447 3642225 3669115 3694877 3654663 3634371 3647775 3622160 3634257 3621298 3650750 3595415 3595948
14450 3595948 3533868 3536036 3608473 3736500 3829230 3735547 3522969 3472597 3454702 3477844 3596243
14439 3596243 3553694 3499743 3500535 3480426 3615964 3708087 3649396 3495722 3489119 3520413 3622614
14428 3622614 3656882 3550491 3585937 3701752 3834665 3669877 3574881 3665260 3629443 3559555
14418 3559555 3667594 3584642 3450294 3472250 3593462 3598297 3517630 3517836 3534802 3565083 3581811
14407 3581811 3605785 3623906 3680434 3636832 3660074 3713207 3764830 3726224 3649784 3702549 3683760
14396 3683760 3696428 3607938 3731806 3673676 3559868 3646454 3638408 3662495 3644343 3699142 3553751
14385 3553751 3480261 3385759 3411592 3530646 3541581 3654114 3601235 3549841 3522219 3501269 3573488
14374 3573488 3487398 3552682 3714331 3816286 3772050 3696025 3726294 3708022 3638258 3604070 3748817
14363 3748817 3701961 3559877 3549738 3489075 3445907 3614378 3679655 3589489 3509106 3531048 3567146
14352 3567146 3574434 3666657 3661258 3605035 3618846 3682246 3756723 3658899 3618428 3659548 3661597 3666077
14340 3666077 3666041 3604903 3647203 3715853 3615555 3615992 3603224 3577123 3643748 3622000 3636370 3544756
14328 3544756 3539016 3636747 3855377 3788524 3700741 3619125 3637225 3605967 3733788 3659796 3571813
14317 3571813 3620166 3566335 3586044 3653986 3725173 3477075 3469044 3584332 3708145 3658680 3731024
14306 3731024 3694297 3520063 3561139 3591188 3703575 3702044 3673851 3678781 3646967 3635813 3533591
14295 3533591 3530133 3609977 3688293 3529036 3596426 3605144 3590702 3685307 3770553 3704880 3623079
14284 3623079 3599421 3703110 3781655 3661034 3444426 3344398 3504736 3574855 3571716 3687278
14274 3687278 3715401 3659717 3640687 3602284 3643504 3606003 3575349 3647204 3695938 3650558 3615324
14263 3615324 3650425 3658805 3597162 3636935 3668480 3724316 3655027 3670904 3798426 3881369 3798864
14252 3798864 3634184 3599786 3648323 3738055 3704692 3639700 3744786 3725904 3658871 3634995 3666082
14241 3666082 3632636 3684744 3673673 3681876 3719236 3772117 3713438 3579253 3821120 3826760 3656439
14230 3656439 3779865 3662226 3580237 3622895 3597526 3684042 3773332 3759935 3582310 3621741 3558437
14219 3558437 3465500 3571684 3780378 3804643 3803185 3656130 3688074 3746247 3686690 3702756 3705503
14208 3705503 3691397 3583977 3488134 3598974 3760993 3673360 3744717 3761292 3707798 3751178 3778009
14197 3778009 3759824 3754427 3589359 3713733 3859851 3748106 3678227 3791091 3835201 3742922
14187 3742922 3667824 3626954 3757243 3877993 3902162 3734385 3663625 3644745 3554385 3584586 3606000
14176 3606000 3608355 3651069 3671793 3657702 3648749 3688402 3662838 3640859 3669103 3868625 3750992
$$ [...]
##END NTUPLES=NMR SPECTRUM
##END=
