##TITLE=1H_DE-80H_X3
 200.13MHz, d2o
 8 sc
 
 19ns.26.2.2025
##JCAMPDX= 6.0         $$ Bruker NMR JCAMP-DX V2.0
##DATA TYPE= NMR SPECTRUM
##DATA CLASS= NTUPLES
##ORIGIN= UXNMR, Bruker Analytische Messtechnik GmbH
##OWNER= pz
$$ XWIN-NMR		Version 3.5
$$ Thu Jun 26 09:31:02 2025 Russian Standard Time (UT+4h)  Yarkov@DPX200
##.OBSERVE FREQUENCY= 200.1313
##.OBSERVE NUCLEUS= ^1H
##.ACQUISITION MODE= SIMULTANEOUS
##.ACQUISITION SCHEME= undefined
##.AVERAGES= 8
##.DIGITISER RES= 18
##SPECTROMETER/DATA SYSTEM= spect
##.PULSE SEQUENCE= zg30
##.SOLVENT NAME= DMSO
##.SHIFT REFERENCE= (INTERNAL, DMSO, 0, 15.5122)
##AUDIT TRAIL= $$ (NUMBER, WHEN, WHO, WHERE, WHAT)
$$ ##TITLE= Audit trail, XWIN-NMR		Version 3.5
$$ ##JCAMPDX= 5.01
$$ ##ORIGIN= Bruker BioSpin GmbH
$$ ##OWNER= Yarkov
$$ C:/Bruker/XWIN-NMR/data/yarkov2/nmr/H-C/1/pdata/1/auditp.txt
$$ ##AUDIT TRAIL=  $$ (NUMBER, WHEN, WHO, WHERE, WHAT)
(   1,<2025-06-26 09:30:08.15 +0400>,<Yarkov>,<DPX200>,
      <created by zg, POWCHK disabled, PULCHK disabled
       configuration hash MD5:
       00 E9 B6 7A A2 85 ED C7 34 08 36 98 17 FE 4E 26
       data hash MD5: 16K
       6A 97 CE 81 0C 55 45 3A 68 BC 9B 4D 6C 76 2F 0D>)
(   2,<2025-06-26 09:30:14.92 +0400>,<Yarkov>,<DPX200>,
      <Start of raw data processing
       efp BC_mod = 2 LB = 0.25 FT_mod = 6 PKNL = 1 PHC0 = -1721.113 PHC1 = 8.566601 SI = 16K 
       data hash MD5: 16K
       7A 39 C0 2E 31 31 D2 80 29 89 81 D9 5D 36 19 A8>)
(   3,<2025-06-26 09:30:19.14 +0400>,<Yarkov>,<DPX200>,
      <abs ABSG = 5 
       data hash MD5: 16K
       1B E2 1B D9 D0 A6 7B 00 2F ED DA A3 A2 69 25 FB>)
$$ ##END=
$$ 
$$ hash MD5
$$ F9 29 40 87 65 D0 FF 1B 7F 34 5A A9 DE 79 50 E3
##$RELAX= 
##$RELAX= 
##$RELAX= 
##$RELAX= 
##$RELAX= 
##$RELAX= 
$$ Bruker specific parameters
$$ --------------------------
##$DU= <C:/Bruker/XWIN-NMR>
##$EXPNO= 1
##$NAME= <H-C>
##$PROCNO= 1
##$TYPE= <nmr>
##$USER= <yarkov2>
##$AMP= (0..31)
100 100 100 100 100 100 100 100 100 100 100 100 100 100 100 100 100 100 
100 100 100 100 100 100 100 100 100 100 100 100 100 100 
##$AQSEQ= 0
##$AQ_mod= 1
##$AUNM= <au_zg>
##$AUTOPOS= <>
##$BF1= 200.13
##$BF2= 200.13
##$BF3= 200.13
##$BF4= 200.13
##$BF5= 200.13
##$BF6= 200.13
##$BF7= 200.13
##$BF8= 200.13
##$BYTORDA= 1
##$CFDGTYP= 0
##$CFRGTYP= 5
##$CHEMSTR= <none>
##$CNST= (0..31)
1 1 145 1 1 1 1 1 1 1 1 1 1 1 1 1 1 1 1 1 1 1 1 1 1 1 1 1 1 1 1 1 
##$CPDPRG= <>
##$CPDPRG1= <>
##$CPDPRG2= <>
##$CPDPRG3= <>
##$CPDPRG4= <mlev>
##$CPDPRG5= <mlev>
##$CPDPRG6= <mlev>
##$CPDPRG7= <mlev>
##$CPDPRG8= <mlev>
##$CPDPRGB= <>
##$CPDPRGT= <>
##$D= (0..31)
0 0.7 0 0 0 0 0 0 0 0 0 0.03 0 0 0 0 0 0 0 0 0 0 0 0 0 0 0 0 0 0 0 0 
##$DATE= 1750915807
##$DBL= (0..7)
120 120 120 120 120 120 120 120 
##$DBP= (0..7)
150 150 150 150 150 150 150 150 
##$DBP07= 0
##$DBPNAM0= <>
##$DBPNAM1= <>
##$DBPNAM2= <>
##$DBPNAM3= <>
##$DBPNAM4= <>
##$DBPNAM5= <>
##$DBPNAM6= <>
##$DBPNAM7= <>
##$DBPOAL= (0..7)
0.5 0.5 0.5 0.5 0.5 0.5 0.5 0.5 
##$DBPOFFS= (0..7)
0 0 0 0 0 0 0 0 
##$DE= 6
$$ [...]
##$SUBNAM3= <"">
##$SUBNAM4= <"">
##$SUBNAM5= <"">
##$SUBNAM6= <"">
##$SUBNAM7= <"">
##$SUBNAM8= <"">
##$SUBNAM9= <"">
##$SW= 18.0517328524113
##$SWIBOX= (0..15)
0 0 2 0 0 0 0 0 0 0 0 0 0 0 0 0 
##$SW_h= 3612.71676300578
##$TD= 16384
##$TD0= 1
##$TE= 0
##$TE2= 300
##$TE3= 300
##$TEG= 300
##$TL= (0..7)
0 120 120 120 120 120 120 120 
##$TP= (0..7)
150 150 150 150 150 150 150 150 
##$TP07= 0
##$TPNAME0= <>
##$TPNAME1= <>
##$TPNAME2= <>
##$TPNAME3= <>
##$TPNAME4= <>
##$TPNAME5= <>
##$TPNAME6= <>
##$TPNAME7= <>
##$TPOAL= (0..7)
0.5 0.5 0.5 0.5 0.5 0.5 0.5 0.5 
##$TPOFFS= (0..7)
0 0 0 0 0 0 0 0 
##$TUNHIN= 0
##$TUNHOUT= 0
##$TUNXOUT= 0
##$USERA1= <user>
##$USERA2= <user>
##$USERA3= <user>
##$USERA4= <user>
##$USERA5= <user>
##$V9= 5
##$VALIST= <valist>
##$VCLIST= <CCCCCCCCCCCCCCC>
##$VD= 0
##$VDLIST= <DDDDDDDDDDDDDDD>
##$VPLIST= <PPPPPPPPPPPPPPP>
##$VTLIST= <TTTTTTTTTTTTTTT>
##$WBST= 1024
##$WBSW= 4
##$XGAIN= (0..3)
0 0 0 0 
##$XL= 0
##$YL= 0
##$YMAX_a= 47877
##$YMIN_a= -38213
##$ZGOPTNS= <>
##$ZL1= 120
##$ZL2= 120
##$ZL3= 120
##$ZL4= 120
##$ABSF1= 15.47364
##$ABSF2= -2.578209
##$ABSG= 5
##$ABSL= 3
##$ALPHA= 0
##$AQORDER= 0
##$ASSFAC= 0
##$ASSFACI= 0
##$ASSFACX= 0
##$ASSWID= 0
##$AUNMP= <proc_1d>
##$AZFE= 0.1
##$AZFW= 0.1
##$BCFW= 0
##$BC_mod= 2
##$BYTORDP= 0
##$COROFFS= 0
##$CY= -3
##$DATMOD= 1
##$DC= 0
##$DFILT= <>
##$DTYPP= 0
##$F1P= 0
##$F2P= 0
##$FCOR= 1
##$FTSIZE= 16384
##$FT_mod= 6
##$GAMMA= 0
##$GB= 0
##$INTBC= 1
##$INTSCL= 3.241238e-09
##$ISEN= 128
##$LB= 0.25
##$LEV0= 0
##$LPBIN= 0
##$MAXI= 10000
##$MC2= 0
##$MEAN= 0
##$ME_mod= 0
##$MI= 1.114404
##$NCOEF= 0
##$NC_proc= -10
##$NLEV= 6
##$NOISF1= 3.799351
##$NOISF2= 2.8
##$NSP= 0
##$NTH_PI= 0
##$NZP= 0
##$OFFSET= 15.51221
##$PC= 1
##$PHC0= -1721.113
##$PHC1= 8.566601
##$PH_mod= 1
##$PKNL= yes
##$PPARMOD= 0
##$PSCAL= 0
##$PSIGN= 0
##$REVERSE= no
##$SF= 200.130001900694
##$SI= 16384
##$SIGF1= 3
##$SIGF2= 2
##$SINO= 0.751879
##$SIOLD= 32768
##$SREGLST= <19F.Aceton>
##$SSB= 0
##$STSI= 16384
##$STSR= 0
##$SW_p= 3612.71676300578
##$SYMM= 0
##$S_DEV= 0
##$TDeff= 16384
##$TDoff= 0
##$TI= <>
##$TILT= no
##$TM1= 0
##$TM2= 0
##$TOPLEV= 0
##$USERP1= <user>
##$USERP2= <user>
##$USERP3= <user>
##$USERP4= <user>
##$USERP5= <user>
##$WDW= 1
##$XDIM= 16384
##$YMAX_p= 418689846
##$YMIN_p= -5369963
$$ End of Bruker specific parameters
$$ ---------------------------------
##NTUPLES= NMR SPECTRUM
##VAR_NAME=  FREQUENCY,     SPECTRUM/REAL,   SPECTRUM/IMAG
##SYMBOL=    X,             R,               I
##VAR_TYPE=  INDEPENDENT,   DEPENDENT,       DEPENDENT
##VAR_FORM=  AFFN,          ASDF,            ASDF
##VAR_DIM=   16384,         16384,           16384
##UNITS=     HZ,            ARBITRARY UNITS, ARBITRARY UNITS
##FACTOR=    0.220516191357247, 1,           1
##FIRST=     3104.45859522455, 0,            0
##LAST=      -508.25816778123, 0,            0
##MIN=       -508.25816778123, -5369963,     0
##MAX=       3104.45859522455, 418689846,    0
$$ Real data points
##PAGE= N=1
##DATA TABLE= (X++(R..R)), XYDATA
$$ [...]
8394E6999K15602L31802L72991M75753j77979K21459J94623o268O6435l40636
8384A410781k22715J510344o56703n75686q3158j39009m65153j09818m6686r2293
8374E29904m38947O7814J5771L16724R9370n40420J63520l61101k12750L33746
8364b6369M28712n20655j78443o74641P3921P0800R80837J2177l03972l13761
8354d51394j18673M09417N46480L30324p14710q20853P7201J10261K9919k73279
8344h75307L80157l5616K916L43478j52658j27896K0127N98984o3228m473K49334
8333C35818n94913l96114k91886M90455J018066j97957k93373n32048k41580L68680
8323c34852m355j45274j36343L831K50557K41127J52463l94168r0042k02864M82867
$$ plain form
8394 56999 272601 604403 977394 1453147 1275168 1496627 1691250 1684982 1751417 1410781
8384 1410781 1188066 2698410 2041707 1466021 1382863 1243854 778701 668883 622197 529904
8374 529904 90957 158771 174542 491266 590636 50216 213736 -147365 -360115 -26369
8364 -26369 402343 -118312 -296755 -971396 -897475 -826675 154162 166339 -137633 -451394
8354 -451394 -570067 -160650 385830 716154 1444 -819409 -742208 -631947 -602028 -875307
8344 -875307 -495150 -530766 -527850 -184372 -337030 -464926 -444799 154185 90957 86484 335818
8333 335818 -259095 -655209 -947095 -456640 561426 363469 70096 -461952 -703532 -334852
8323 -334852 -339207 -484481 -620824 -616993 -366436 -125309 27154 -367014 -457056 -659920 -177053
8312a77053l13176p2578O95896J47913j52699k09831m56876j32578k57005l65430
8302a293417M81665j56644L1492M73979j33350K35355K9361j6241k95468N5975
8292e87293M21467O7349n67964p3265J57232P25797j52845j36221k19175O18304
8282B53386j18371j36556M2988l81881m56660N6154J48617J45442M53215J41757
8272A48091M32698n50162J28821M17376K89689l28436m00401j19103K52771k18998
8262E2346K59889K21176k93658K58065j66941n79596J19098K48426M45974n63832
8252I47P5095r6768L18328J33704k87590r3888M15185J37689n70427l70381L31381
8241f725J09143M80065n51057j56649O84822J20809k95201l48511o7229k52363
$$ plain form
8312 -177053 -490229 -562807 133089 281002 128303 -81528 -538404 -670982 -927987 -1293417
8302 -1293417 -811752 -968396 -936904 -462925 -596275 -360920 -331559 -347800 -643268 -587293
8292 -587293 -165826 -98477 -666441 -739706 -582474 143323 -9522 -145743 -364918 253386
8282 253386 135015 -1541 41447 -340434 -797094 -740940 -592323 -446881 6334 148091
8272 148091 580789 30627 159448 576824 866513 538077 137676 18573 271344 52346
8262 52346 312235 533411 239753 497818 330877 -248719 -129621 118805 564779 947
8252 947 76042 -20726 297602 431306 143716 49828 465013 602702 32275 -338106 -6725
8241 -6725 102418 582483 31426 -125223 559599 680408 385207 36696 -30533 -282896
8231b82896L75022L77981r87285P5403L35079L51545K41333l551l08202k87546
8221a13117J7019M81098k43377K4927J46598m41205K89406M8626K95045l45489
8211A59531K28108l23354n1444q01518k41378K87965J35090J99548P63009k38149
8201A17408r0868q47070J123748O7339M4736k16811L83237p15385K164780k731779
8191g00665m669298K704030j66146M50671L00289M29286l62738j46104J00212
8182b060463K9041P84735K52873p34399m5838J46460M75263Q7291m07629J85194
8172a287472O05080j26206K42805j15652P6674j52323p467K55254n67414j30002
8162a206723J57093p71197M6624K58127q9556J9446L74785N28382N7062o72655
$$ plain form
8231 -282896 92126 470107 -517178 -441775 -106696 244849 486182 482631 174429 -113117
8221 -113117 -96098 385000 141623 166550 313148 -128057 161349 209975 505020 159531
8211 159531 387639 64285 12841 -788677 -1030055 -742090 -607000 -407452 355557 117408
8201 117408 26540 -820530 303218 370557 415293 198482 581719 -133666 2031114 -700665
8191 -700665 -5369963 -2665933 -2832079 -2381408 -2081119 -1651833 -2014571 -2160675 -2060463
8182 -2060463 -2031422 -1246687 -993814 -1728213 -1774051 -1627591 -1152328 -1065037 -1472666 -1287472
8172 -1287472 -682392 -808598 -565793 -681445 -604771 -757094 -764561 -509307 -1076721 -1206723
8162 -1206723 -1049630 -1820827 -1774203 -1516076 -1605632 -1586186 -1211401 -683019 -625957 -1298612
8152a298612M3157K35765J65407q36330n48761L89251N62024M05643j53616j15178
8142a151250K0701r0010J57464L35837m38813m43553l38881q2873l10801J090846
8132a251333O73023l03130J73116m4625n19268l81295M39204N70391L60616m46764
8122g30065J43720J9159j56236K68276J82135n00683l83971J7256r4026R1588
8112a142847l41694O2714J91120l77788K90104P23851k13968j65990j36341n21040
8102a631879L32467L06522k78900q7389M92312K07315l10976J47827Q9358L3954
8092f99389m46072M25349k44382j57886j77046j21201j23890O24739k30424K37779
8082i12423M4662k27860Q6960R2786l78540o4349L61858k04781J72825J16571
$$ plain form
8152 -1298612 -1255455 -1019690 -854283 -1690613 -2239374 -1850123 -1288099 -882456 -1036072 -1151250
8142 -1151250 -1130549 -1220559 -1063095 -727258 -1166071 -1609624 -1948505 -2031378 -2342179 -1251333
8132 -1251333 -578310 -881440 -708324 -752949 -1272217 -1653512 -1214308 -643917 -283301 -730065
8122 -730065 -586345 -567186 -723422 -455146 -273011 -773694 -1157665 -1140409 -1234435 -1142847
8112 -1142847 -1484541 -1421827 -1230707 -1608495 -1318391 -594540 -808508 -974498 -1110839 -1631879
8102 -1631879 -1299412 -992890 -1271790 -1359179 -866867 -659552 -970528 -822701 -733343 -699389
8092 -699389 -1145461 -720112 -964494 -1122380 -1299426 -1420627 -1544517 -919778 -1150202 -912423
8082 -912423 -867761 -1095621 -1008661 -915875 -1294415 -1358764 -996906 -1201687 -1028862 -912291
8072i12291K7916o6930J54240k65115j45611K67868L2800J44036m6897p662Q4117
8061g33529j80957l12921j91683j11983j14538L07478J55423J99241n05454o01560
8051b090483K77105Q28932o78822m0543P49647j04729j72881J90976j26799N8088
8041a109509J21558K34760K52907m43620j44680K54871n64380Q9892L78836J12713
8031h16652r4101l29861O29318k32015k16026K5387J94655N57681J57094m62158
8021e86678Q0548n30226j85943O4960K12255K11117k53710J31690l1250n57506
8011a444743K62460j39632N57114j1551m96964L95808K35184Q7101m48280J80437
8001h23066J32933k19083o46144M48225K58203L07143m18417m29963n748J86189
$$ plain form
8072 -912291 -884375 -951305 -797065 -1062180 -1207791 -939923 -907123 -763087 -809984 -817646 -733529
8061 -733529 -914486 -1227407 -1419090 -1531073 -1645611 -1338133 -1182710 -983469 -1488923 -2090483
8051 -2090483 -1813378 -984446 -1663268 -1703811 -954164 -1058893 -1231774 -1040798 -1167597 -1109509
8041 -1109509 -987951 -753191 -500284 -943904 -1088584 -833713 -1398093 -1308201 -929365 -816652
8031 -816652 -910753 -1240614 -611296 -843311 -1059337 -1033950 -839295 -281614 -124520 -586678
8021 -586678 -506130 -1036356 -1222299 -1157339 -945084 -733967 -987677 -855987 -887237 -1444743
8011 -1444743 -1182283 -1321915 -764801 -776352 -1273316 -877508 -642324 -555223 -1003503 -823066
8001 -823066 -690133 -909216 -1555360 -1107135 -848932 -541789 -960206 -1390169 -1395917 -1209728
7991a209728M58533K05932k82277M7142J63247j89161K95985K80534k06954l25897
7981g62644k32774j96574N6770N50114m67300l81499K03630K50144K03279n50267
7971a327121J22038N03026k85414K77356l80698j0322j44951k25538L57657N79685
7961e34282l75033l18618M866k67896O41684M69295m06895o36589J57494M57017
7951h08957k40192M71450J07009l15795P2718k95096p9639K3838n20625j61390
7941a746679Q09048L94985n35630N5258N4636l3186l10233K2731J46910K48645
7931h93515Q8924n8089k73959J33881L49573j88675Q4207n2540j13094K5358K41064
7920f56865o07249K68765M18269l1638n50402m7904r9034N4034K24918k85232
$$ plain form
7991 -1209728 -751195 -545263 -827540 -780398 -617151 -806312 -510327 -229793 -436747 -762644
7981 -762644 -995418 -1191992 -1135222 -585108 -1052408 -1433907 -1230277 -980133 -776854 -1327121
7971 -1327121 -1205083 -702057 -987471 -710115 -1090813 -1101135 -1246086 -1471624 -1113967 -534282
7961 -534282 -909315 -1227933 -1223067 -1490963 -849279 -379984 -786879 -1423468 -1265974 -808957
7951 -808957 -1049149 -577699 -470690 -786485 -713767 -1008863 -1088502 -1064664 -1585289 -1746679
7941 -1746679 -937631 -542646 -1078276 -1023018 -968382 -1001568 -1311801 -1289070 -1142160 -893515
7931 -893515 -804591 -862680 -1136639 -1002758 -653185 -841860 -757653 -810193 -923287 -897929 -656865
7920 -656865 -1264114 -995349 -577080 -608718 -1159120 -1207024 -1306058 -1252024 -1027106 -1312338
7910a312338Q0447K83373K08707j35963m75111L64470M49923K85829m44414p95854
7900a490931K84906M81458m04346O83103l81015K33928J87084m91890K56396j25857
7890g67164l49757l0404O6266J73332L02950k49772j79522L93662m19619K58792
7880h01236Q7619l99954K19563q1774J98152M13674p4975p107m74335j65261J52215
7869i33419m0022O5913l01480l1838K79942O45115m42903M07461O5541k43844
7859e29534P7763K63188k06402k87957L77360n93826K11457Q8850j68207J16524
7849f50784j52378r3537J11339j47476R9100j40286K45200J33461L14334o11034
7839h92061Q5215k58428j64560M3773L33252m572l66277J95725k65456j50600
$$ plain form
7910 -1312338 -1231891 -948518 -739811 -875774 -1350885 -986415 -536492 -250663 -695077 -1490931
7900 -1490931 -1206025 -724567 -1128913 -445810 -826825 -592897 -405813 -897703 -641307 -767164
7890 -767164 -1116921 -1147325 -1081059 -907727 -604777 -854549 -1034071 -640409 -1060028 -801236
7880 -801236 -713617 -1113571 -894008 -975782 -777630 -363956 -438931 -446038 -920373 -1085634 -933419
7869 -933419 -973441 -907528 -1209008 -1240846 -960904 -315789 -758692 -351231 -285690 -529534
7859 -529534 -451771 -188583 -394985 -682942 -305582 -899408 -687951 -599101 -767308 -650784
7849 -650784 -803162 -896699 -785360 -932836 -833736 -974022 -728822 -595361 -281027 -892061
7839 -892061 -806846 -1065274 -1229834 -1186061 -852809 -857381 -1223658 -1027933 -1293389 -1443989
7829a443989P32871K61719k44027k17363M364j88002J44251K33471J30189R1708
7819d94808r33566p0193m8274M14305N42530j13870k04597M37113o27493J49998
7809i48855j77921j52854l22284L36660p28758L708160p91743j570375m8143l17661
7799a013774R46150j23906K10658L8017m4002m58122J002j49540P0427j81710
7789g04800j98898K40779P909k9292Q9102N36560l25557P322j20262k55177J94246
7778e58068m04364K90430K52422q3253k79848M48080l14069K05907K99858j35292
7768b78197j77727L41458n42540l2142n21097J18472K41997P4664k53730J96077
7758h32765k9411q3069K70229L22792l15809K9633j85962l50761j11936N27179
$$ plain form
7829 -1443989 -711118 -449399 -693426 -910789 -906425 -1094427 -950176 -716705 -586516 -494808
7819 -494808 -1428374 -1498567 -1546841 -1132536 -590006 -703876 -908473 -471360 -1098853 -948855
7809 -948855 -1126776 -1279630 -1601914 -1265254 -1994012 1714148 922405 -647970 -696113 -1013774
7799 -1013774 -67624 -191530 19128 57145 13143 -444979 -443977 -593517 -523090 -704800
7789 -704800 -903698 -662919 -655010 -684302 -595200 -58640 -384197 -376875 -497137 -752314 -558068
7778 -558068 -962432 -672002 -419580 -502833 -782681 -334601 -648670 -442763 -142905 -278197
7768 -278197 -455924 -114466 -657006 -689148 -1210245 -1091773 -849776 -775112 -1028842 -832765
7758 -832765 -862176 -945245 -675016 -352224 -668033 -638400 -824362 -1175123 -1287059 -759880
7748g59880J91039m00576j18588j95898J78839r5921O28605J90302k33534l41810
7738i57422j65090K63313J75117r53776J65763Q67928o2148L37009m42132n69183
7728a340621l09650P89208N08651J5665J3110O43621k30336m61342k69717j2812
7718f54223O02861k83276n30894J69832L85196n53669j24859L40980J80858M59317
7708g877l17926n80231L6434j78745J51912M29205n5592m09065j34705m14619
7698a481209O8913O52178k06594J750J09797k73548L97274r2771j86541J56388
7688h54363O00490J63007J1396n91189j61139L11774K04972n49674L03065j9337
7678e80998J9076M57106j65069m97404N5905K26332K08108j26733m60611M22346
$$ plain form
7748 -759880 -568841 -969417 -1088005 -1283903 -1105064 -1200985 -572380 -382078 -615612 -957422
7738 -957422 -1122512 -859199 -684082 -1637858 -1472095 -604167 -666315 -329306 -771438 -1340621
7728 -1340621 -1650271 -861063 -352412 -336747 -323637 319984 89648 -371694 -641411 -654223
7718 -654223 -51362 -334638 -865532 -695700 -310504 -864173 -989032 -648052 -467194 -7877
7708 -7877 -325803 -906034 -869600 -1048345 -896433 -467228 -522820 -931885 -1066590 -1481209
7698 -1481209 -1412296 -760118 -966712 -964962 -855165 -1128713 -731439 -824210 -1010751 -854363
7688 -854363 -253873 -90866 -79470 -670659 -831798 -520024 -315052 -864726 -561661 -580998
7678 -580998 -561922 -104816 -269885 -767289 -711384 -485052 -276944 -403677 -864288 -441942
7668d41942k54274M8648P0296n56715K14310N18761Q0249j6527m86908J54796
7658f69306M31388q8646l98217j01742J1709L47957m12942p1009K03237J21284
7648f26287J90601r88035L70046L68829p12653J4899N11384m6590J8188L72706
7638e26912l7408k47271K51979r941l70421K85255M21818j42997j85281l389O5288
7627d99280M60029K30018j38078J40112n09836n7325J4731k85450K20142J31054
7617b93883l69142J5359N01652n1187q21628q2197K49948P5071R2070L46250k07666
7606e45353l14161L93888m63083m82756N3369p3280J4511O36209m74568J34321
7596a120903K09057K78983O43978N3869k22297Q0101j95479n2009J71731K91777
$$ plain form
7668 -441942 -696216 -647568 -577272 -1133987 -919677 -400916 -320667 -337194 -824102 -669306
7658 -669306 -237918 -326564 -724781 -826523 -814814 -466857 -879799 -950808 -747571 -626287
7648 -626287 -435686 -1423721 -1053675 -684846 -1397499 -1382600 -871216 -917806 -899618 -526912
7638 -526912 -564320 -811591 -559612 -569553 -939974 -654719 -232901 -375898 -561179 -564568 -499280
7627 -499280 -39251 190767 52689 192801 -317035 -374360 -359629 -645079 -424937 -293883
7617 -293883 -663025 -647666 -146014 -197201 -1018829 -1101026 -851078 -776007 -683937 -337687 -545353
7606 -545353 -859514 -465626 -928709 -1411465 -1358096 -1431376 -1416865 -780656 -1255224 -1120903
7596 -1120903 -911846 -632863 11115 64984 -157313 -77212 -272691 -324700 -152969 138808
7586A38808j00565j20610m09974K07773J48497M6895p5101L07492K38286o82722
7576c01221j51023l75999L57329L75245Q4114k72416n44365K53417j65582M3282
7566f97219L73584P1412o40610J30368P15482J25013k66909N09038O21895M23614
7556A365668o54950n00478j21609J06111j05187J67897N56266M6668O47487Q50464
7546B358337J009380q1471M12901J31426Q85455J71301l36219j462194j100719
7537A988197o27140n2764j36313q66455R8887j59106J98083J55400m44726l05095
7527a51032m9657N8530K48354J18627L21571R7658p1309k31754J28033l5426l06643
7516A26952l60740K8943N17116k74700o73068l4908R71438l62129k64977l0437
$$ plain form
7586 138808 38243 -82367 -492341 -284568 -136071 -89176 -164277 143215 381501 -301221
7576 -301221 -452244 -828243 -470914 -95669 -11555 -283971 -828336 -574919 -740501 -697219
7566 -697219 -323635 -252223 -892833 -762465 -46983 78030 -188879 320159 942054 1365668
7556 1365668 710718 210240 88631 194742 89555 257452 813718 860386 1507873 2358337
7546 2358337 3367717 3286246 3699147 3830573 4716028 4887329 4551110 3088916 1988197
7537 1988197 1361057 1308293 1171980 305525 404412 245306 443389 598789 154063 -151032
7527 -151032 -200689 -142159 106195 224822 546393 644051 572742 340988 469021 433595 126952
7516 126952 -233788 -204845 312271 37571 -635497 -670405 301033 -61096 -326073 -356510
7506c56510n03150L17870Q26151j14830j28366j71566J31455P5397l50419J01893
7496a72075K43800l06947k3217J21826J80051K4421M064l22883j92368M28845
7486a4483l74871j37295J84684o0314J5825M22259n61172k1525m16764l5416L3896
7475i65176n6125L79468l34293J31043k92786K70562L8103L18869k41308L33089
7465d18554J06412K0689J16753m52527R8332M7841o1100l52041j71085M08677
7455f56603j64893Q1339O2013K94899J46406k23670J87664k50401J92467J6190
7445c14589m12940M7250K86223O06130J47305o81377N33586l6046n5208m86140
7435c65806J86965n26797L726K83711J53092p2365M1428j54544J41008k39294
$$ plain form
7506 -356510 -859660 -541790 284361 169531 41165 -130401 1054 76451 -273968 -172075
7496 -172075 71725 -235222 -258439 -136613 43438 67859 71923 -250960 -443328 -14483
7486 -14483 -389354 -526649 -341965 -402279 -386454 35805 -525367 -546892 -963656 -999072 -965176
7475 -965176 -1021301 -641833 -976126 -845083 -1137869 -867307 -829204 -510335 -751643 -418554
7465 -418554 -312142 -291453 -174700 -627227 -528895 -481054 -542154 -894195 -1065280 -656603
7455 -656603 -821496 -740157 -678144 -383245 -236839 -460509 -272845 -523246 -330779 -314589
7445 -314589 -727529 -680279 -394056 212074 359379 -321998 211588 175542 120334 -365806
7435 -365806 -178841 -705638 -701912 -418201 -265109 -337474 -296046 -450590 -309582 -548876
7425e48876j0531l54702o02880K69845K68118J41930l17817M90750K15870L56183
7415i2110l19631j58926N73825m01191j87222J61149m2519k00800J86531K91022
7405a89872n32n49000J88853o3055k14853l26600K36307J88402O4745L92528J55707
7394a17370j76524q60166l51002j05426M55161K55318R2308L18775J04583k24972
7384f09315k37019R6361L8702k94151N10512l8493r2280k6514k6011m11942M73416
7373f16734l54978J57452K14376R1737P7012m75086N98751j20554k15125k08308
7363h51457k91721l74473M60980K6880K299N38154R7764j36897l80042k97640
7353a206153L6634L36351J61374n6947M81139L96500k91271j73288K19211J9401
$$ plain form
7425 -548876 -559407 -914109 -1516989 -1247144 -979026 -837096 -1154913 -664163 -448293 -92110
7415 -92110 -411741 -570667 3158 -398033 -585255 -424106 -466625 -667425 -480894 -189872
7405 -189872 -190404 -739404 -550551 -613606 -828459 -1155059 -918752 -730350 -665605 -273077 -117370
7394 -117370 -293894 -1154060 -1505062 -1610488 -1155327 -900009 -807701 -488926 -384343 -609315
7384 -609315 -846334 -749973 -711271 -1005422 -494910 -533403 -625683 -652197 -678208 -1090150 -616734
7373 -616734 -971712 -814260 -599884 -508147 -431135 -906221 -307470 -428024 -643149 -851457
7363 -851457 -1143178 -1517651 -1056671 -1029791 -1027492 -489338 -391574 -528471 -908513 -1206153
7353 -1206153 -1169519 -833168 -671794 -728741 -247602 148898 -142373 -315661 -96450 -77049
7343g7049l83699L0039n29308L75504P68013K32078o15955l95842l18023l98048
7333a312290J99457J18340L26945j73928j27984N40610n43937K8680J15203l30625
7323a159529N6308J8537P6329m6322L77470K77490l47314L02937l5281J58843
7313c20532j47759k25736J89580l17061K53811k27810k16035N62258o191m16465
7303h71940k00234k14974j48403J54532N18085J91983J22287r2467N11867j2298
7293d1562J65943o02988J19241K09892K8231l62517L66950M40372m8701n24582
7283b49721m06238L17274r74K75595m07989L50636K0965j5773k26912O0781L03720
7272B1364K27949q4376m24541J45387N69109l53982k11276Q1033j91839L9882
$$ plain form
7343 -77049 -460748 -430709 -960017 -584513 183500 415578 -200377 -596219 -914242 -1312290
7333 -1312290 -1112833 -994493 -667548 -841476 -969460 -428850 -972787 -944107 -828904 -1159529
7323 -1159529 -1103221 -1084684 -1008355 -1054677 -677207 -399717 -747031 -444094 -479375 -320532
7313 -320532 -468291 -694027 -504447 -821508 -567697 -795507 -1011542 -449284 -455475 -871940
7303 -871940 -1072174 -1287148 -1435551 -1281019 -762934 -570951 -448664 -541131 -29264 -41562
7293 -41562 124381 -478607 -359366 -149474 -121243 -483760 -116810 323562 274861 -249721
7283 -249721 -655959 -338685 -339659 -64064 -472053 -121417 -100452 -116225 -343137 -282356 21364
7272 21364 249313 164937 -259604 -114217 454892 100910 -110366 -29333 -221172 -181290
7262a81290j25167k53986L03872O6000o91360k60874k81770L74884M08129J94233
7252d47329N08779k98834o98622J70599m7484J2155M64645J68868l2771m3750
7242b43744K35606L0784o6754m15698l02717J43289O12302r0175r2379k22930
7232d12416J24196o768j333j03768m39218M81726J55688N968N2791l36569m92897
7221i72600o4618J9733l1728j98401K37767P34702k78172L62271J22741n04026
7211e72331L71956K84553Q3875n97665j79325j70614R4646L52405O86527M098
7201C58125k6917k85385p71545k28153J91089K59277J45697k6263l7966o8857
7191d90898n16931L64302Q5311K59178J96055Q9131k20388j42967J79213L08062
$$ plain form
7262 -181290 -306457 -560443 -256571 -190571 -881931 -1142805 -1424575 -1049691 -641562 -447329
7252 -447329 61450 -237384 -936006 -765407 -812891 -800736 -336091 -167223 -199994 -243744
7242 -243744 -8138 22646 -44108 -459806 -762523 -619234 -6932 -97107 -189486 -412416
7232 -412416 -288220 -294988 -296321 -400089 -839307 -357581 -201893 -195925 -143134 -479703 -972600
7221 -972600 -1037218 -1017485 -1049213 -1247614 -1009847 -275145 -553317 -191046 -68305 -572331
7211 -572331 -200375 84178 168053 -429612 -608937 -779551 -684905 -332500 354027 358125
7201 358125 331208 45823 -725722 -953875 -762786 -503509 -357812 -384075 -422041 -490898
7191 -490898 -1007829 -643527 -558216 -299038 -102983 -13852 -234240 -377207 -197994 110068
7181A10068m47954J2189K59266m50107J15824k95905k56468J36938N27028M28825
7171A39704K04707k66499j0304P9677J15655q02168j26184Q8763K67161M2913
7161b66575k61678L5738j90221j096035N12709N64418N64671Q0715l38796q9195
7151d84249J93940M1150n11819j13249M70922O24678K77557n25226j01789K96569
7141A68484k98402K78389k31744O4956M14428K61720m49745R5233p43780J00300
7131c40161k12909M83379M38697j1787r1660n35182m00179J74659O5356J38200
7121b91587M12653k31263k37300k31019n31210K48807J11224K64702n4283L93237
7111a46039Q64870o01104p21980j83194N13531K88973l99233n00788m6305J89985
$$ plain form
7181 110068 -337886 -325697 -66431 -516538 -400714 -696619 -953087 -816149 -289121 139704
7171 139704 344411 77912 67608 147285 262940 -539228 -665412 -576649 -309488 -266575
7161 -266575 -528253 -492515 -682736 -1778771 -1266062 -701644 -136973 -56258 -395054 -484249
7151 -484249 -290309 -249159 -760978 -874227 -403305 221373 498930 -26296 -128085 168484
7141 168484 -129918 148471 -83273 -18317 396111 657831 208086 303319 -440461 -340161
7131 -340161 -553070 -69691 369006 357219 265559 -269623 -669802 -495143 -429787 -291587
7121 -291587 121066 -110197 -347497 -578516 -1109726 -860919 -749695 -484993 -539276 -146039
7111 -146039 718831 117727 -604253 -787447 -273916 15057 -384176 -884964 -931269 -741284
7101g41284J83151J09798K9982K27442K89392k29221l86274p3405K21566M84234
7091A15381K47694l08574j77850R1628j0027m26897q5026K47825n7353N03745
7081A40546N12991m79447l99236l15098n14625L30526P07435l59199k07032J77021
7071d06118j68724K15381k05056L41990J6925l57080Q43183L35052j47034J5689
7061D84208j76543J71281L3403o55704n36056k02033M09947r7673p588J4915N30893
7050c0950P2008K5774P5220m51493m255m2188j54823P73754K42786m98673J1809
7039A8969l95676j28321J67348K46972j08804j22579j8500L74572m30921J84520
7029b12420O36093k09970j9543k11993K41913p0556r22566p4409N80071K570J80924
$$ plain form
7101 -741284 -558133 -448335 -418353 -190911 98481 -130740 -517014 -590419 -368853 115381
7091 115381 363075 54501 -123349 -31721 -41748 -468645 -553671 -305846 -363199 140546
7081 140546 653537 174090 -225146 -540244 -1054869 -724343 -16908 -376107 -583139 -406118
7071 -406118 -574842 -359461 -564517 -222527 -205602 -562682 280501 615553 468519 484208
7061 484208 307665 478946 512349 -143355 -679411 -881444 -471497 -569170 -576758 -561843 -30950
7050 -30950 41058 66832 142052 -309441 -313696 -355884 -510707 263047 505833 7160 18969
7039 18969 -376707 -505028 -337680 -90708 -199512 -322091 -340591 33981 -396940 -212420
7029 -212420 423673 213703 194160 -17833 224080 153524 -769042 -843451 -263380 -260810 -79886
7018g9886K65157J88870L68407j83152p55522j59298J80878L44751R5320n6974
7008B08551J59786p12467l13513J40691M95415N57138n05778o22488M81285K37164
6998A25784l56972j1694L5862M51511k57063R9391k9445m39677p22301j5559Q24655
6987b95508n90203L10555M05156k94097K25573Q6449r0023J3715K02169l60379
6977c86593N2663L96467L86625l39589K38574r7603M8218k37026L39774q124n28892
6966a35506K57053o59745m8252N0764R61155Q7257o64272L07081o2982M18989
6956E11542j05377n66220k92067K59845K90396k73187j52315p9280j68287K91332
6946b83618L8660j83383O12072j94383J62964P9218o2202r4364J42609K54189
$$ plain form
7018 -79886 185271 374141 742548 559396 -196126 -355424 -174546 170205 265525 208551
7008 208551 368337 -344130 -657643 -516952 -21537 535601 29823 -592665 -111380 125784
6998 125784 -231188 -242882 -207020 244491 -12572 86819 57374 -382303 -1104604 -1120163 -295508
6987 -295508 -885711 -575156 -170000 -464097 -238524 -152075 -242098 -228383 -26214 -386593
6977 -386593 -333930 62537 449162 109573 348147 250544 298762 61736 401510 393386 -135506
6966 -135506 121547 -538198 -586450 -535686 425469 512726 -151546 155535 92553 511542
6956 511542 406165 -160055 -452122 -192277 98119 -175068 -327383 -406663 -574950 -283618
6946 -283618 -244958 -428341 183731 -10652 152312 231530 169328 74964 217573 471762
6936D71762m83994R9219J42376J70098m2691J51231k26139n98092m39156J47880
6926f07506J069340l51837r466O29803R1163L8030m43540l74473j06395J51767
6916H6886j26880m95901k16053L61439Q80057K50872J29542r6982j58529o60286
6906d5835j83057L89025N76898j44394J99349l44150j33878j93840J44395R4806
6896C59319m42295l92704O18269k94654L50730P48607k43822K59169k50588n12149
6886A99882J85884o02232k11495M99568j42843M83954j31394n72420J46118L57272
6876B12294k24464J63746p050O68319j91622m88598M03782N71568o00465m83915
6866B3595j30625N29094n97163J46130J9657l13400j5074j32373N07063K12648
$$ plain form
6936 471762 -12232 86987 229363 399461 356770 508001 281862 -316230 -755386 -607506
6926 -607506 461834 109997 100531 730334 821497 859527 415987 41514 -64881 86886
6916 86886 -39994 -535895 -751948 -390509 489548 740420 869962 772980 614451 -45835
6906 -45835 -228892 160133 737031 592637 791986 447836 313958 120118 264513 359319
6896 359319 -82976 -475680 142589 -152065 198665 947272 703450 962619 712031 199882
6886 199882 385766 -216466 -427961 71607 -71236 412718 281324 -291096 -144978 212294
6876 212294 -12170 151576 144526 812845 621223 132625 536407 1107975 507510 23595
6866 23595 -107030 422064 -175099 -28969 -9312 -322712 -337786 -470159 36904 249552
6856B49552M1703j03383p18327j20623P07613J92841M4787J36131o44025K25839
6846A2108J54883l37563o7295K30448N40942M86657m04658J38460j88528j45282
6836D20172m09267n47416L87610K39615M25173L13339j54793l45432k65257j81471
6826a17727K74207o56375K94580K32036m2537J56092K71037m2378k8786K50366
6816E90515j4990n25201l87173o6606P05058M7233l49441P1092K79186j06502
6806B43171K71685j01728J52461R6634J5425n6694m15191k88173l9142K07442
6796H5890J172m09813N0227O27945m95853K06981Q09070J90255n76119O7154P0216
6785F27125k19226j87261J2925j40834J21087J39524P4415K21757K13229o20273
$$ plain form
6856 249552 291255 187872 -530455 -651078 56535 249376 294163 430294 -213731 12108
6846 12108 166991 -170572 -237867 -7419 533523 1020180 615522 753982 565454 420172
6836 420172 10905 -536511 -148901 90714 515887 829226 674433 329001 63744 -117727
6826 -117727 156480 -499895 -205315 26721 -15816 140276 411313 368935 340149 590515
6816 590515 575525 50324 -336849 -403455 301603 348836 -605 70487 349673 243171
6806 243171 514856 413128 565589 662223 677648 620954 205763 -82410 -121552 85890
6796 85890 87062 -322751 -272524 355421 -140432 66549 875619 1065874 489755 556909 627125
6785 627125 407899 220638 233563 92729 213816 353340 427755 649512 862741 242468
6775B42468l2751O42073l08847K84986J80956m52414J52627r6328k01928J6319
6765D27161L11062R6163k33628K98571l32533p28649L89628L40654J47861Q2214
6755G98504K03002j60157j88291n5121m27134M05252L12936j04631j4408J69838
6745I39790K29713k34390m86153n01830p21736N63913K64052N81269j87914j04461
6735C42253n7045k52880K89705Q7746K99371P2052o79448L27017n9921k75217
6725I3633J72518J19471j96252K3975L95099k65808L05232L7286m71364k49360
6715c5570N15866r0329K70721l55748k76992M22065Q89952m9274p5354l6009j96590
6704I82738k55507m35975k73975q8371L17501N29563J34067n21063J63105O10155
$$ plain form
6775 242468 209717 851790 542943 827929 1008885 556471 709098 612770 410842 427161
6765 427161 738223 834386 600758 899329 566796 -161853 227775 568429 716290 798504
6755 798504 1001506 841349 653058 597937 170803 576055 888991 784360 769952 939790
6745 939790 1169503 935113 448960 -52870 -774606 -210693 53359 634628 446714 342253
6735 342253 285208 32328 322033 409779 709150 781202 101754 428771 368850 93633
6725 93633 266151 385622 189370 213345 608444 342636 647868 685154 213790 -35570
6715 -35570 480296 389967 660688 304940 27948 450013 1339965 1290691 1215337 1179328 982738
6704 982738 727231 291256 17281 -71090 246411 775974 910041 388978 552083 1162238
6694A162238k10958k18517K87128K01902Q8392m74308j97248J23752n2715m16507
6684B93159L26882J30613K89301j08372L83526n80341l08661K85585n32642L93936
6674E72986N28507k79068k32836j1933J25140J37362K8824m07141J51285L08708
6664I21834l13746J26966n9191r5408K56260Q1421n24529K65192J30913j55459
6654F34253p62023P34920M19758r08296m60032N22037p4128Q38062J11514p13889
6644C42176K62683M2984P4082j01343m70830J40731J06100M54847k48653R3421
6634F96198J65403K576j4534l9986J98845J44992J00924p31787O49614j66682
6624A005563k38236m39550L46545k36544l49282N00814L33853L8031J53247P436
$$ plain form
6694 1162238 951280 732763 1019891 1221793 1310185 835877 638629 762381 709666 293159
6684 293159 620041 750654 1039955 931583 1315109 734768 426107 711692 179050 572986
6674 572986 1101493 822425 589589 577656 702796 840158 868982 461841 613126 921834
6664 921834 608088 735054 675863 580455 836715 918136 393607 658799 789712 634253
6654 634253 -127770 607150 1026908 118612 -341420 180617 106489 944551 1056065 342176
6644 342176 604859 647843 721925 620582 149752 290483 396583 851430 602777 696198
6634 696198 861601 864177 849643 809657 1008502 1153494 1254418 522631 1172245 1005563
6624 1005563 767327 327777 674322 437778 88496 589310 923163 961194 1114441 1121877
6614A121877R9636m66418K21846J92305k78537k3154k50297L68681o60759j64126
6604A61054L03333j78703L80693k3965j95367L61282K37744j49581n39942M8817
6594D05365O99787K63337l76925k84863M81216q0045M6647j79358m77567L73292
6584H70886k07215j90556L96905j7484K29934j73326j60978M42703N4784n25645
6574G20008q5507O76015m82975o5601Q2422j92676J01798n45556L94783L72565
6564I75276k40578K187Q8817j2677n16083K39617K3628L53155k87957j77591K37289
6553F85083J07500j08384j151K69397k00702L47522J93518K8980j02631l10750
6543I08382k40K45261k72070N83694K20530m02609K48853n46442K63039l17494
$$ plain form
6614 1121877 1221513 755095 976941 1169246 890709 867555 617258 985939 325180 161054
6604 161054 464387 285684 666377 642412 447045 808327 1046071 896490 356548 405365
6594 405365 1105152 1368489 991564 706701 1187917 1107872 1154519 975161 497594 870886
6584 870886 663671 473115 870020 852536 1082470 909144 748166 1190869 1245653 720008
6574 720008 634501 1310516 827541 761940 844362 651686 753484 207928 602711 975276
6564 975276 734698 736885 825702 813025 296942 536559 560187 913342 625385 447794 685083
6553 685083 792583 684199 683048 952445 751743 1099265 1292783 1321763 1219132 908382
6543 908382 908142 1153403 881333 1465027 1685557 1282948 1531801 985359 1248398 930904
6533I30904L94013l4632m81269M68717K23517O6277m32129J01283l65189M8170
6523I19662K7933k35878J27881O1041L51794J78613m11198K57093j719m94849
6513G80373k03993J02762K24183N15077J40168L6643O5054j60614n43448J66153
6503A122358J99276J14464r4395m88992k32942M74944J48099j52229k980L59792
6493A447395j42660j25307O7065l96691L37913J18625j51698M85179m05011m84874
6483G49936L29656O67847j34803o32765j0564K48958J0608r4994P2465k77310
6473I29034J73065n8339L03706K79897L87323n24549l32736m880L77999P5327
6463A605847m48726L18573J92462k88047L86710m55040O1756Q5397p6452L57532
$$ plain form
6533 930904 1324917 1290285 809016 1277733 1501250 1567527 1135398 1236681 871492 919662
6523 919662 947595 711717 839598 900639 1252433 1431046 1019848 1276941 1275222 780373
6513 780373 576380 679142 903325 1418402 1558570 1595213 1660267 1499653 956205 1122358
6503 1122358 1321634 1436098 1341703 852711 619769 1094713 1242812 1090583 1087603 1447395
6493 1447395 1304735 1179428 1246493 849802 1187715 1306340 1154642 1639821 1234810 749936
6483 749936 1079592 1747439 1612636 979871 969307 1218265 1228873 1133879 1206344 929034
6473 929034 1102099 1043760 1347466 1627363 2014686 1490137 1157401 1152521 1530520 1605847
6463 1605847 1157121 1475694 1668156 1380109 1766819 1311779 1373535 1458932 1382480 1740012
6453A740012j35428k41006m91189K87602N45392O5211L18113M4430k90016K91876
6443B134997j4714r16323l77923j6254j40846M49698q1439J62468Q01125m15572
6433A585217K6260p8900r1489N2452k95387N77917k16631k39376J66826m62661
6423A024228k06674P78099J17055j82050j07977P3196K27699l30488r2553K76925
6413A577460k38467j96369J66703K94702K78372l09853j65355q7691P4712K96698
6403A690912N14482l63419l37132N74080m59054J39711J88374j92995j22399K87349
6393A919909n2563M83080j001332p5318L88703k30577l8341l50157J24031J65072
6383A332507o6970j8965k79254K92605o2437K73542N74429n23090j67001m5577
$$ plain form
6453 1740012 1604584 1363578 872389 1159991 1705383 1770594 2088707 2133137 1843121 2134997
6443 2134997 2120283 1203960 826037 809783 668937 1118635 1037196 1199664 2000789 1585217
6433 1585217 1611477 1532577 1441088 1493540 1198153 1776070 1559439 1320063 1486889 1024228
6423 1024228 817554 1595653 1712708 1530658 1422681 1495877 1723576 1393088 1300535 1577460
6413 1577460 1338993 1142624 1309327 1604029 1882401 1572548 1407193 1319502 1394214 1690912
6403 1690912 2205394 1841975 1504843 2078923 1619869 1759580 1947954 1754959 1632560 1919909
6393 1919909 1867346 2350426 1349094 1273776 1662479 1431902 1393561 1043404 1167435 1332507
6383 1332507 1265537 1246572 967318 1259923 1197486 1471028 2045457 1522367 1355366 1309789
6373A309789k79765K37198L05751j38219M26297k75728P25476q76024k72022o2074
6363A100679K81106J67591l92500J24932J96821R6620O4540o21057j10675M90119
6353A398176j94399L74105R2045K6014k08575N3176j05317N6326k66500j36936
6343A088115O50365n5236k80208J12160K79706n82771L72601L32722K74117Q0275
6333B271846j99571k06694L0231K54345l40904l16312k08440m3347K1679K97755
6323A560588K50010K23832j35058J03442k34576N6903J3971o0120N20156J69584
6313B468732o6271k03446m61589K56717j79942j70626q516k20180j12159O29436
6303A932156J50565l2253j71970j81839O53392J71804m98625l11238j79754j0087
$$ plain form
6373 1309789 1030024 1267222 1572973 1434754 1861051 1585323 2310799 1434775 1162753 1100679
6363 1100679 1381785 1549376 1156876 1281808 1478629 1575249 1639789 1018732 908057 1398176
6353 1398176 1203777 1577882 1669927 1695941 1487366 1540542 1435225 1491551 1225051 1088115
6343 1088115 1738480 1683244 1403036 1515196 1794902 1212131 1584732 1917454 2191571 2271846
6333 2271846 2072275 1865581 1895812 2150157 1809253 1492941 1284501 1241154 1262833 1560588
6323 1560588 1810598 2034430 1899372 2002814 1768238 1825141 1839112 1778992 2299148 2468732
6313 2468732 2402461 2199015 1737426 1994143 1814201 1643575 1635059 1414879 1302720 1932156
6303 1932156 2082721 2050468 1878498 1696659 2350051 2521855 2023230 1711992 1532238 1522151
6293A522151J19725M14924j50873j76489K08843M71249J30492n05870k40917K99178
6283B092413M5626k79692j2853n430j8112n9841j64567J9886Q9039K16666J05061
6272B028196J11023L39801l40962j98580j81687J24951K44241l15756j47604J4143
6262A677766K34525L4705J19623Q3701j13543M57483N6794J28168k49117J68942
6252B599047o40033j83179N96580K16573r0408o1076k71393K9314L03668o00444
6242A898649K17616L27406N0334k78879k67383L02455M30423r1543q5517m22042
6232B081519J04499L39578l526j18822J02317J50362j58612j09165K43724J84837
6222B816711k06986k76782R7551n49850J95131J59772L14432k23669p3436M04504
$$ plain form
6293 1522151 1641876 2056800 1905927 1729438 1938281 2409530 2540022 2034152 1793235 2092413
6283 2092413 2138039 1858347 1845494 1840064 1821952 1762111 1597544 1617430 1706469 1923135 2028196
6272 2028196 2139219 2479020 2138058 1939478 1757791 1882742 2126983 1811227 1663623 1677766
6262 1677766 1912291 1946996 2066619 2150320 2036777 2494260 2551054 2679222 2430105 2599047
6252 2599047 1959014 1775835 2372415 2588988 2498580 2437504 2166111 2195425 2499093 1898649
6242 1898649 2116265 2443671 2494005 2215126 1947743 2250198 2680621 2589078 2503561 2081519
6232 2081519 2186018 2525596 2522070 2403248 2505565 2655927 2497315 2388150 2631874 2816711
6222 2816711 2609725 2332943 2430494 1880644 2075775 2235547 2549979 2326310 2252874 2657378
6212B657378n6985J01269n1988p240R481K18716M49814p2097l62329Q68154j99084
6201C555089p74969o85355N59937M65773J55973O3736k19165k56770k97166n9325
6191B507758J6936J63909K10253p10783N89206m21670K86135M81922K41834n3593
6181C311907n95097J5669j70174J02593K9371O2362l03942k02437L26689m7548
6171B529393J12964o9049J05454R4124k41896M64884L69554m41453m8403l0430
6161B845142j44274p2229n7467N85054k17238L48123r4930L28420N7689l48934
6151C229356l89869k40616P7209K68038o2028m6517k0918n1320J72136K97573
6141C233044P9665j93908m2262M4869K81665k56340k27273j66509n0148N40507
$$ plain form
6212 2657378 2600393 2701662 2649674 2642434 2651915 2870631 3320445 3248348 2886019 3754173 3555089
6201 3555089 2780120 2094765 2654702 3120475 3276448 3340184 3121019 2864249 2567083 2507758
6191 2507758 2524694 2688603 2898856 2188073 2777279 2355609 2641744 3123666 3365500 3311907
6181 3311907 2716810 2732479 2562305 2664898 2694269 2756631 2452689 2250252 2576941 2529393
6171 2529393 2642357 2573308 2678762 2772886 2530990 2995874 3365428 2923975 2875572 2845142
6161 2845142 2700868 2628639 2571172 3156226 2938988 3287111 3192181 3520601 3578290 3229356
6151 3229356 2839487 2598871 2676080 2944118 2882090 2835573 2814655 2763335 2935471 3233044
6141 3233044 3312709 3118801 3076539 3121408 3403073 3146733 2919460 2752951 2702803 3243310
6131C243310k25958k76948N72447K435k43675J46248j79264K42427M18680l21621
6121C378081o5270J71759R1343j73046j43920L81246M4866l48135Q4420L44515
6111C765859Q1187j55864l69288o1543P51379K02746p15267J37233K97226k11898
6101C721770J98107L3403m11095K92018k77235J77622j0419j46011J09468M8370
6091C735998k37742m6489j21094J22044J35501O5437o2596l26202k26935K42812
6081C280734N8454J09360l73298J07868N35372R3128K49013k55261q7784K70383
6071C987969J31301j0871P8555K56919J29692l8332J5768o41j89209m01554J91175
6060D150772M3223j00848k85p8827l15670N28115n78084r3484L04293J68539J45674
$$ plain form
6131 3243310 3017352 2740404 3312851 3315286 3071611 3217859 3038595 3281022 3699702 3378081
6121 3378081 3312811 3484570 3575913 3402867 3258947 3640193 3685059 3336924 3421344 3765859
6111 3765859 3847046 3691182 3321894 3260351 4011730 4214476 3499209 3636442 3933668 3721770
6101 3721770 3919877 3953280 3542185 3834203 3556968 3734590 3724171 3578160 3687628 3735998
6091 3735998 3498256 3451767 3330673 3452717 3588218 3653655 3591059 3264857 3037922 3280734
6081 3280734 3339188 3448548 3075250 3183118 3718490 3811618 4060631 3805370 3717586 3987969
6071 3987969 4119270 4108399 4186954 4443873 4573565 4535233 4551001 4550360 4361151 3959597 4150772
6060 4150772 4193995 4093147 4092862 4014035 3698365 4226480 3648396 3554912 3859205 4027744 4173418
6049D173418J64607J91854p9081K7515L34979j3464r14083K57674j24770K33756
6039D252405r8968r2994M6624k41942N58488J61767j40325K16593K02044l19731
6029D543961J27748K689P6942J01046l70708M76294j32856q09596L17030K02012
6019D534562L35276n57400k96372o06995J24529N54078Q6402J75106K27606k45534
6009D331258N37757J56858J45012k61102K61867J93349J05402M07099j71689L65806
5999F071617m52979n61325R1786K13270L04577M1530l18469o68911J3512P23775
5989E458383j23355L51608J32530l72222j2350L68910m74046J28621J42686J9505
5979E620270k17043n41245K54033K13244L52787Q2069n01233L66507J11278j43922
$$ plain form
6049 4173418 4338025 4529879 4450798 4478313 4813292 4799828 3885745 4143419 4018649 4252405
6039 4252405 4153437 4060443 4107067 3865125 4423613 4585380 4445055 4661648 4863692 4543961
6029 4543961 4671709 4674398 4751340 4852386 4481678 4957972 4825116 4015520 4332550 4534562
6019 4534562 4869838 4312438 4016066 3409071 3533600 4087678 4174080 4349186 4576792 4331258
6009 4331258 4869015 5025873 5170885 4909783 5171650 5364999 5470401 5877500 5705811 6071617
5999 6071617 5618638 5057313 5149099 5362369 5666946 5708476 5390007 4721096 4734608 5458383
5989 5458383 5335028 5686636 5819166 5446944 5434594 5803504 5329458 5458079 5600765 5620270
5979 5620270 5403227 4861982 5116015 5329259 5682046 5764115 5262882 5629389 5740667 5596745
5969E596745L84762J72114L66608l63559N8312k59466J18893O7361n95123J23765
5959E670412j70136L07963J31325o197l70052K67174K3467K91779k197l6048M55954
5948F563444n7202k22905K75607j46522o4188r5429L44259Q6729K38143L14922
5938G236858k41575J32802p8269j86857j46756K060k32451k0385Q7746J46062
5928F699235R3312m5541L84170j08296j85496j09828M7217k61812L24346Q5479
5918F922786K99132K86624P0912J29612L63281J47574j93702K9373j99121K57059
5908H113530p9361J77446n8544n7820J47385K18304k92936J45733j4910l79985
5898G918842n2191L66873j90237L3056m2830N27341m94872j13659L53814j58423
$$ plain form
5969 5596745 5981507 6153621 6520229 6156670 6214982 5955516 6074409 6141770 5546647 5670412
5959 5670412 5500276 5808239 5939564 5933367 5563315 5830489 5853956 6145735 6143538 6107490 6563444
5948 6563444 6506242 6283337 6558944 6412422 6348234 6252805 6597064 6683793 6921936 7236858
5938 7236858 6995283 7128085 7049816 6862959 6716203 6718263 6485812 6465427 6553173 6699235
5928 6699235 6792547 6747006 7131176 7022880 6837384 6727556 6774773 6512961 6837307 6922786
5918 6922786 7221918 7508542 7579454 7709066 8072347 8219921 8026219 8055592 7856471 8113530
5908 8113530 8034169 8211615 8153071 8095251 8242636 8460940 8168004 8313737 8298827 7918842
5898 7918842 7866651 8233524 8043287 8076343 8033513 8560854 8065982 7952323 8306137 8147714
5888H147714q7007K62449K71170n22420j52607j20436m9095P22484K38207n9343
5878H651116O40728k2706n62102L89299L59799k18472J1729L9583K89414k10776
5868I367612p24910r142K03500M82451k05691j78244J78402J96141Q6988m48223
5858H948884o0955l13249N54357L65729o6129J76918l94015L85296M27305N04452
5848A0528593r4013o34924L05884j5852M55741J94055k80539L88407L712l27500
5838A0523564K48897j82610O1053n0213k9215j57432O75490K5363m28164j10381
5828A0576352Q068J91324M00139J51866j60445m64214l72250J143586K50053J76336
5818A1900815n0829l69603O68830Q1432L5547n78832j17620L03884J59166k994
$$ plain form
5888 8147714 8060707 8323156 8594326 8071906 7919299 7798863 7749768 8472252 8710459 8651116
5878 8651116 9291844 9269138 8707036 9096335 9456134 9237662 9249391 9288974 9578388 9367612
5868 9367612 8642702 8633560 8837060 9319511 9113820 8935576 9113978 9310119 9397107 8948884
5858 8948884 8887929 8574680 9129037 9494766 9428637 9605555 9211540 9596836 10024141 10528593
5848 10528593 10434580 9799656 10105540 10089688 10545429 10739484 10458945 10847352 10851064 10523564
5838 10523564 10772461 10589851 10650904 10600691 10571476 10414044 11089534 11114897 10686733 10576352
5828 10576352 10584420 10775744 11175883 11327749 11167304 10703090 10330840 11474426 11724479 11900815
5818 11900815 11849986 11480383 12149213 12230645 12266192 11687360 11569740 11873624 12032790 12029796
5808A2029796j60765K34445Q09103L19154l91438k77504J53631L74313J60245
5799A3250980j31555K12917o2955R0076J5959m30175R9253J142961M14055m00208
5789A4201308M4005J4696L52158j4610q6268k09805J88975L11980R9128k20280
5779A4681287M3502k07899P2850M3382L07830J53055M23126Q0095l48077K39354
5769A5488505K15492J48254P6799J56732k82812l59742J05683M85444L09230J93026
5759A6536611N86826m7100J72055j20170L5675J73039k47783M44071M08278P9903
5749A8021405q3429o14963L06596L31296L89038K06893K33344O4443K85855j03693
5739A9036785N6207L13242l2714L40896m1975P08070L25618m73351N7674l9078
$$ plain form
5808 12029796 11869031 12103476 12912579 13231733 12840295 12562791 12716422 13090735 13250980
5799 13250980 13119425 13332342 13269387 13359463 13375422 12945247 13044500 14187461 14601516 14201308
5789 14201308 14245313 14260009 14612167 14597557 14511289 14301484 14490459 14802439 14901567 14681287
5779 14681287 14724789 14516890 14589740 14633122 14940952 15094007 15517133 15597228 15249151 15488505
5769 15488505 15703997 15852251 15929050 16085782 15802970 15443228 15548911 16034355 16343585 16536611
5759 16536611 17123437 17076337 17248392 17128222 17163897 17336936 17089153 17533224 17941502 18021405
5749 18021405 17937976 17323013 17629609 17960905 18349943 18556836 18790180 18854623 19140478 19036785
5739 19036785 19092992 19406234 19373520 19714416 19672441 20380511 20706129 20232778 20290452 20251374
5729B0251374K35706L66233L34465p4226k26049P02655L10592n09767j85221O00815
5719B1806577O19015J20437O78122Q1368j7452M04822O6513M64673K01715L58293
5709B4784083K28355n97764L53768N4210q8694N95049K98579r541J12600L1284
5699B5761929K93905L54385j42492J98905K27011K61439K77070N89267j77716
5690B7643703N1977N70879K42329J39520M02604O28499K01817j16641O90686l7433
5680C0417940L067k43090O04844j37127N68528J15485M22520K06511m71208J021346
5670C2508816J294859N68687l6272K92247J48952j85811l7575L63691Q48230K97025
5660C6062849L14418L43332M30071L18136L72388M53550N58525L38361M87061
$$ plain form
5729 20251374 20487080 20853313 21187778 21113552 20887503 21590158 21900750 21390983 21205762 21806577
5719 21806577 22425592 22546029 23224151 23305519 23288067 23692889 23759402 24224075 24425790 24784083
5709 24784083 25012438 24414674 24768442 24822652 24733958 25329007 25627586 25618045 25730645 25761929
5699 25761929 26055834 26410219 26267727 26466632 26693643 26955082 27232152 27821419 27643703
5690 27643703 27695680 28266559 28508888 28648408 29051012 29679511 29881328 29764687 30455373 30417940
5680 30417940 30421007 30177917 30782761 30645634 31214162 31329647 31752167 31958678 31487470 32508816
5670 32508816 33803675 34372362 34336090 34628337 34777289 34591478 34553903 34917594 35765824 36062849
5660 36062849 36377267 36720599 37150670 37468806 37841194 38294744 38853269 39191630 39678691
5651C9678691o2755M14542O20022M22484M84505l2551P84954K49663N64075N08672
5641D3632302Q47123M35474J81619O70197L72332L68659M34835N04545N9500R63836
5631D8470422J55718R3900P08791N72958N31977N03318P05636O08880P73958K84504
5621E3410062P67564O47306P44353L34169O50484R32897J182574l71448Q91154
5612E9189115R00591J86678M43114J203118R09071J192906J070739Q59587L83967
5603F6338886N51329J329489J044161M26611N74159J055321Q65813J352247R49998
5594G4488014N78375J449644P62274M55945R89332J595226J058734J223052J106572
5585H3707168R11695J697418J220372J116093J117371J166129J254939J686311
$$ plain form
5651 39678691 39615936 40030478 40650500 41072984 41557489 41524938 42309892 42559555 43123630 43632302
5641 43632302 44479425 44914899 45096518 45766715 46139047 46507706 46942541 47447086 47506586 48470422
5631 48470422 48626140 48720040 49428831 50001789 50533766 51037084 51742720 52351600 53125558 53410062
5621 53410062 54177626 54824932 55569285 55903454 56553938 57486835 58669409 58297961 59189115
5612 59189115 60089706 60276384 60719498 61922616 62831687 64024593 65095332 65954919 66338886
5603 66338886 66890215 68219704 69263865 69690476 70264635 71319956 72185769 73538016 74488014
5594 74488014 75066389 76516033 77278307 77734252 78723584 80318810 81377544 82600596 83707168
5585 83707168 84618863 86316281 87536653 88652746 89770117 90936246 92191185 93877496
5577I3877496J406075P15557J746139J620883J924007J134141J493729J777491
5569A05695518J858032J720709J730309K074152J566481J819346J702722K397186
5561A20564455J946111J824749J909787K601965K251812J849389J978153K708910
5553A37635331K273449K707642K863181K645734K488230K920872K760738K829200
5545A59124377L052654K793389K240842L465822L041369L246584L374592L737263
5537A84076892L766906L407980L475180L765296L511744L839959L904682M593925
5529B14342564M019327L761971M110694M364239M193525M451114M828257M648681
5521B48720372M682013M703316N205327M733945M342910M961192N315361N292985
$$ plain form
5577 93877496 95283571 95999128 97745267 99366150 101290157 102424298 103918027 105695518
5569 105695518 107553550 109274259 111004568 113078720 114645201 116464547 118167269 120564455
5561 120564455 122510566 124335315 126245102 128847067 131098879 132948268 134926421 137635331
5553 137635331 139908780 142616422 145479603 148125337 150613567 153534439 156295177 159124377
5545 159124377 162177031 164970420 167211262 170677084 173718453 176965037 180339629 184076892
5537 184076892 187843798 191251778 194726958 198492254 202003998 205843957 209748639 214342564
5529 214342564 218361891 222123862 226234556 230598795 234792320 239243434 244071691 248720372
5521 248720372 253402385 258105701 263311028 268044973 272387883 277349075 282664436 287957421
5513B87957421N156696M880306N739427N307997N124861N346841M888797N105030
5505C29507376N452257N671522N361046M684256M703544M687336M819148M500252
5497C69386737M392030M373730M150287M205787M149058L928387L617689L000027
5489D01203732L537488K502701K257222J611189J791629J883857K032485P54241
5481D17574544O28233K71423K03016J2630o81674q57330k056860j911975j576554
5472D11605453k064863k372009k970907k515633l060720l637015l972985l628448
5464C87382873m075586m647738m712025m363324m374590n269204m948427n099658
5456C49892321n038957n162929n190819n042582m684937m916920n640820n475290
$$ plain form
5513 287957421 293114117 297994423 303733850 309041847 314166708 319513549 324402346 329507376
5505 329507376 334959633 340631155 345992201 350676457 355380001 360067337 364886485 369386737
5497 369386737 373778767 378152497 382302784 386508571 390657629 394586016 398203705 401203732
5489 401203732 404741220 407243921 409501143 411112332 412903961 414787818 416820303 417574544
5481 417574544 418202777 418474200 418677216 418689846 418008172 417150842 415093982 413182007 411605453
5472 411605453 409540590 407168581 404197674 401682041 398621321 394984306 391011321 387382873
5464 387382873 383307287 378659549 373947524 369584200 365209610 359940406 354991979 349892321
5456 349892321 344853364 339690435 334499616 329457034 324772097 319855177 314214357 308739067
5448C08739067n572698n577130n098944m701094n365903n587783m634352m787948
5440B67413215m986287n339831m897127m641657m466875m379200m554019m649577
5432B29498642m426512m376832m115035m040495l755887m132190l991258m003442
5424A96656991l782072l262405l484313m086907l064595l566361l694447l011986
5416A68703905k783400l044460l424477l074184k673514l195945k645980k017911
5408A45844034k567042k910389k609649k157383k199311k794911k256053j956118
5400A26393178k387767j900682k598039k277894j705146j816472k065327j745111
5392A09896740j933349j435105k086882k166042j606610j579816k125884j236748
$$ plain form
5448 308739067 303166369 297589239 292490295 287789201 282423298 276835515 272201163 267413215
5440 267413215 262426928 257087097 252189970 247548313 243081438 238702238 234148219 229498642
5432 229498642 225072130 220695298 216580263 212539768 208783881 204651691 200660433 196656991
5424 196656991 192874919 189612514 186128201 182041294 178976699 175410338 171715891 168703905
5416 168703905 165920505 162876045 159451568 156377384 153703870 150507925 147861945 145844034
5408 145844034 143276992 140366603 137756954 135599571 133400260 130605349 128349296 126393178
5400 126393178 124005411 122104729 119506690 117228796 115523650 113707178 111641851 109896740
5392 109896740 107963391 106528286 104441404 102275362 100668752 99088936 96963052 95726304
5384I5726304j351819j626689j217189j275151j175456j704363j283664j280083
5376H4811890j777024j346637p88957j337644j142238r22124j031350j155058
5368G5310858j566857j088391j161475j244488r01040j246691p80240m26995j539688
5359F5354993o74045o98413j554577j287418l88692k61557j280050k28501n30047
5350E8451693p61515j565567r65104m30732q07153o16483m54357m89858m65329
5341E1895595j106653j263303q45151l43667o37823k48709l11579j107958p41196
5332D5289556j021330j0043o45934p24040m29118r00753m80593l37003m71758
5323D0268984m40099m14466m23513j15895q91779q26070k29838m99768j11213
$$ plain form
5384 95726304 94374485 92747796 91530607 90255456 89080000 87375637 86091973 84811890
5376 84811890 83034866 81688229 80899272 79561628 78419390 77497266 76465916 75310858
5368 75310858 73744001 72655610 71494135 70249647 69348607 68101916 67321676 66894681 65354993
5359 65354993 64680948 63982535 62427958 61140540 60751848 60490291 59210241 58981740 58451693
5350 58451693 57690178 56124611 55159507 54728775 53921622 53305139 52850782 52360924 51895595
5341 51895595 50788942 49525639 48680488 48336821 47698998 47450289 47138710 46030752 45289556
5332 45289556 44268226 44258183 43612249 42888209 42459091 41558338 41077745 40740742 40268984
5323 40268984 39828885 39414419 38990906 38875011 37983232 37157162 36927324 36427556 36316343
5314C6316343j45704p96205j33106p44164l32418l67306n54796J02689l92438
5305C2952895l23014o7177m4590k53731m95213o09617n65299n34323k17920l60236
5295B9481775m44762r6425p85107n01312j58051l99889N20010m82334l88394l46840
5285B6398671m18392o21566j88254k28103n8331L4513q98438m83228N37965J88966
5275B4263803n60574j16985L7346k48080o71932j278492K52376J68957K86716
5266B2133135q23044N8674M17528o72373p8579q57932R4856J93860n86352j96707
5256A9683066J36011p08096k90986j71841J78588k35824m03809m35323k08463
5247A7543323r6087J25275q2828j23777k65477j30371p98505m16510M72725K48108
$$ plain form
5314 36316343 36170639 35374434 35241328 34497164 34164746 33797440 33242644 33345333 32952895
5305 32952895 32629881 32562704 32518114 32264383 31769170 31159553 30594254 30059931 29842011 29481775
5295 29481775 29037013 28940588 28155481 27654169 27496118 27096229 27616239 27133905 26745511 26398671
5285 26398671 25980279 25358713 25170459 24942356 24884025 24918538 24020100 23536872 24074837 24263803
5275 24263803 23703229 23586244 23623590 23375510 22703578 21425086 21677462 21846419 22133135
5266 22133135 21310091 21368765 21786293 21113920 21035341 20177409 20272265 20466125 19879773 19683066
5256 19683066 19819077 19110981 18819995 18648154 18826742 18590918 18187109 17751786 17543323
5247 17543323 17447236 17572511 17489683 17365906 17100429 16970058 16171553 15755043 16227768 16475876
5237A6475876n00415J04515j13719m93440m80627J76908N38365p65444O23769
5228A5565788l70036k72471m97821J34216l68876K28920K99799m66207m94321
5219A3758991O837N59829j05390n33178m11771m9076j07444l8404o46561J4650
5209A2448483j75803J54775L43222l06608j26997J76473J21333l07224k17901
5200A2109753k86028k25942m763k43585k48383k8026J5601O6623K68865o94778
5190A0729337j51575K99170l8511l6746p51112m7809M58869j63802Q8411o0734
5180A0325498J00634o29872K0734k06763k63768J99988J05049J24604m33648J90429
5170I532885l44254j93720L78265M993l28948k60419j79307j71357K42618n9686
$$ plain form
5237 16475876 15975461 16079976 15966257 15472817 14992190 15169098 15707463 14942019 15565788
5228 15565788 15195752 14923281 14425460 14559676 14190800 14419720 14719519 14253312 13758991
5219 13758991 13765828 14325657 14220267 13687089 13275318 13226242 13118798 13080394 12433833 12448483
5209 12448483 12272680 12427455 12770677 12464069 12337072 12513545 12634878 12327654 12109753
5200 12109753 11823725 11597783 11593020 11349435 11101052 11073026 11088627 11155250 11424115 10729337
5190 10729337 10577762 10876932 10838421 10801675 10050563 10002754 10461623 10297821 10386232 10325498
5180 10325498 10426132 9796260 9816994 9610231 9346463 9546451 9651500 9776104 9342456 9532885
5170 9532885 9188631 8994911 9373176 9378169 9049221 8788802 8609495 8438138 8680756 8621070
5160H621070K41987P0700n10899j53091j85816j66233K49979k89382L44751L38589
5150H561655n17091m15976o2926k22711J35792K7046L52231k2439K61270K67176
5140H364027o19322r7167k46110n2555K22022k15719M71542j22711q1708k97575
5130G324724j79086M68441k14682m74633J75239j8315R2296N9662j23573J04616
5120G214689m70671K38638M4085K00878L2821j90933l00226N4930r27076K30675
5110F127810q9452P4590K43175K13470J23364j80913J49482j2467m69640k22314
5100E957105M33914k57829j73463L42815O6798l6805R8860m57483k48872k21929
5090E503111N43620R1903k02594k84991R464n05241L34221L58518j93565j83558
$$ plain form
5160 8621070 8863057 8933757 8422858 8269767 8083951 7917718 8167697 7878315 8223066 8561655
5150 8561655 8044564 7628588 7565662 7342951 7478743 7505789 7858020 7835581 8096851 8364027
5140 8364027 7744705 7647538 7401428 7348873 7570895 7355176 7826718 7704007 7622299 7324724
5130 7324724 7145638 7614079 7399397 6924764 7100003 7081688 7173984 7233646 7110073 7214689
5120 7214689 6744018 6982656 7026741 7227619 7260440 7069507 6769281 6824211 5897135 6127810
5110 6127810 6038358 6112948 6356123 6569593 6692957 6512044 6661526 6649059 6179419 5957105
5100 5957105 6391019 6133190 5959727 6302542 6369340 6332535 6431395 5973912 5725040 5503111
5090 5503111 6046731 6138634 5936040 5651049 5660513 5155272 5489493 5848011 5654446 5470888
5080E470888k06772M77116l65432l73243K13115M55359j28838k9057N2519P08437
5070F274092n49794K9533q47705K14328M01485l17192N9952n04084q9006l41195
5060D330414P974N07008L22681j33506k65424m82676K38699J30861j68848r9940
5050D387243m51676J04667J14232K4168K11144k2875K62098p9897j23748q2055
5040D343301N7198j43065K26531K8783K62936L9485l39242k27157K4672L07115
5030D580557j51826l70868l2662R7175p7303L02058J47829m9008k23028L16399
5020D539323J738l94266J56334j30326K4503K65384O2168m9522Q9596k66594K43460
5009D541798K43366l42688n19272k73047j05045J18471M85233k0222l06322P08935
$$ plain form
5080 5470888 5264116 5741232 5375800 5002557 5215672 5671031 5542193 5513136 5565655 6274092
5070 6274092 5724298 5753831 4906126 5120454 5521939 5204747 5264699 4760615 4671609 4330414
5060 4330414 4338388 4845396 5168077 5034571 4769147 4286471 4525170 4656031 4487183 4387243
5050 4387243 3935567 4040234 4154466 4178634 4389778 4366903 4629001 4549104 4425356 4343301
5040 4343301 4400499 4257434 4483965 4512748 4775684 4815169 4475927 4248770 4273442 4580557
5030 4580557 4428731 4057863 4025201 4122376 4045073 4347131 4494960 4445952 4222924 4539323
5020 4539323 4541061 4146795 4303129 4172803 4197306 4462690 4524858 4475336 4564932 4298338 4541798
5009 4541798 4785164 4442476 3923204 3650157 3545112 3663583 4148816 4128594 3822272 4531207
4999D531207l10328N8601n15400k61525O08409j0845j72549k53669k30910m6314
4989C396677K56159K42925M628m06453j5694O49962l93169k87662k65734k60310
4979B921329K54098L0508O31706k91651J3278l08235L69326K65016R3529M6268
4969D025172M697N5920j23360k90785J77463O01462j51309n76412r4918K37976
4959C865906k83062k58902P28511K04791K8221j87211L54371j29302M9080O31793
4949E004196J96270L25912j43410N29216k53031N04146O30933N47886P0943Q17769
4939H230830P23093L17232Q37168Q35112J626005R03820O76843Q06629l59520
4930A4597212j160049k137023j323149r77295p80659j442020p23440Q5455p78496
$$ plain form
4999 4531207 4220879 4279480 3764080 3502555 4110964 4100119 3927570 3673901 3442991 3396677
4989 3396677 3652836 3895761 3900389 3493936 3478242 4128204 3735035 3447373 3181639 2921329
4979 2921329 3175427 3205935 3837641 3545990 3559268 3251033 3620359 3885375 3978904 4025172
4969 4025172 4029869 4085789 3962429 3671644 3849107 4450569 4299260 3722848 3627930 3865906
4959 3865906 3582844 3323942 4052453 4257244 4285465 4098254 4452625 4323323 4372403 5004196
4949 5004196 5200466 5526378 5382968 5912184 5659153 6163299 6794232 7342118 7413061 8230830
4939 8230830 8953923 9271155 10108323 10943435 12569440 13473260 14150103 14956732 14597212
4930 14597212 13437163 11300140 9976991 8999696 8219037 6777017 6053577 6139032 5360536
4921E360536K06640N61449k36046p67687n83262Q9521K80362j78011K74551q6556
4911D921497l60133J24355J51447k99067Q70113P0930n05800q6986m16507J9968
4901D489817K82528n86751j23509l04732J49722P23234K08357p75675q2124N86131
4891D566998l20221J41742m387J56552j17967m03577m66658K526K3404k03653
4881C374759J5248j88994J72792K86445k80460k54570K52194P6124l05188l69743
4871B778607n18804J29108r260k44459j26724K94224O95383k98681m34006K25801
4861B491189l75693L37091K18265j33527K31550K98481j42053k69607J11975K6860
4851B794531o36432k37805M59110l78408J40780L4100J78661K7830P7669k97306
$$ plain form
4921 5360536 5567176 6128625 5892579 5124892 4541630 4631151 4911513 4733502 5008053 4921497
4911 4921497 4561364 4685719 4837166 4538099 5408212 5479142 4973342 4886356 4469849 4489817
4901 4489817 4772345 4185594 4062085 3757353 3907075 4630309 4838666 4062991 3980867 4566998
4891 4566998 4246777 4388519 4384132 4540684 4422717 4019140 3552482 3555008 3578412 3374759
4881 3374759 3390007 3201013 3373805 3660250 3379790 3125220 3377414 3453538 3148350 2778607
4871 2778607 2259803 2388911 2379651 2135192 2008468 2302692 2998075 2699394 2265388 2491189
4861 2491189 2115496 2452587 2670852 2537325 2768875 3067356 2925303 2655696 2767671 2794531
4851 2794531 2158099 1920294 2379404 2000996 2141776 2175876 2354537 2382367 2460036 2162730
4841B162730J07654M91344k52452J97096k44616j86167L65317L5088N7137j20879
4831B612252k06207L47513m64492l69524O72542M3888m33696k20689L60665j5396
4821B326856M83706N99386l98502J78510L77556J37504m88541J11629J03597o5602
4811C366099j02771j05154J75929j57904L99556M73906p8809m52755O94403K41140
4801D453640K01225Q80912J32987J08209J53586K31057L57155J131627J049681
4792H700079O39238J145867P09062J464480Q68217J45795j49251k71882j158076
4783A2093529j628407r52354j106777n29581j063920r54085j94068m05493p6434
4774E182410l61025k33471K74163j2079Q12254m12172l88102M4400J6235k2037
$$ plain form
4841 2162730 2270384 2761728 2509276 2706372 2461756 2275589 2640906 2675994 2733131 2612252
4831 2612252 2406045 2753558 2289066 1919542 2592084 2635972 2202276 1981587 2342252 2326856
4821 2326856 2810562 3409948 3011446 3189956 3567512 3705016 3216475 3328104 3431701 3366099
4811 3366099 3263328 3158174 3334103 3176199 3575755 4049661 3970852 3518097 4212500 4453640
4801 4453640 4654865 5535777 5668764 5776973 5930559 6161616 6518771 7650398 8700079
4792 8700079 9339317 10485184 11194246 12658726 13526943 13672738 13523487 13251605 12093529
4783 12093529 10465122 9512768 8405991 7876410 6812490 5858405 5664337 5258844 5182410
4774 5182410 4821385 4587914 4862077 4849998 5662252 5250080 4861978 4906378 4922613 4900576
4764D900576k25391l73610k39111K32611K26902M17625P8818N51678l32232Q3994
4754E321860m53505j46201K72220o71054n7398K2294k45213J88231L42729l52840
4744D221123j06023l17913P8174N4760m88258m69499J90871N989N59900l22956
4734C406168j30751J86535k7363L26720J52073l0900p0027l41544o8863L52535
4724C754583L68900K09102l53419P5966n4771k02228k47484J53678k85654K69782
4714C688455N36495q5897j96330L13483k25969m37555K1017K06640J66563O88830
4704D675732J22586n57985K99455P770l66464K59773O30994r8107o16722M29183
4694D786215M24607N510m26403k21051M25180P76042j98083l06009L14194R7252
$$ plain form
4764 4900576 4675185 4301575 4062464 4295075 4521977 4939602 5018420 5570098 5237866 5321860
4754 5321860 4868355 4722154 4994374 4323320 4265922 4288216 4043003 4231234 4573963 4221123
4744 4221123 4115100 3797187 3875361 3930121 3441863 2972364 3163235 3169224 3729124 3406168
4734 3406168 3275417 3461952 3434589 3761309 3913382 3882482 3812455 3470911 3402048 3754583
4724 3754583 4123483 4332585 3979166 4055132 4000361 3798133 3550649 3704327 3418673 3688455
4714 3688455 4224950 4139053 3942723 4256206 4030237 3592682 3613699 3820339 3986902 4675732
4704 4675732 4798318 4240333 4539788 4547558 4181094 4440867 5071861 4973754 4357032 4786215
4694 4786215 5210822 5216332 4789929 4568878 4994058 5770100 5572017 5266008 5580202 5677454
4684E677454J66257j72100J80313k42494O20129M42217k50694k05948O12823L05404
4674G133361R7369q2567J42903L68225R10643J61450j25514M19367K74643K88578
4664I588458j3036L7052J89389M22787L40691L58783q4501L94932Q43854K39392
4654A2317801P77210L82299N75735M21754R62940L29971Q40577J221930O16825
4645A8447042J140088J023826J129373J211385K219463J892983J523470J926386
4637C0514016K168402K530239K457234K519471L861311L974773N057040O483944
4629E9566430N791723N868088Q103788R890364J1022017Q756002J710249m372169
4621A06336492j0130015j1209866o085864l432024m29208j09282J291919L029827
$$ plain form
4684 5677454 5843711 5671611 5851924 5609430 6229559 6671776 6421082 6215134 6827957 7133361
4674 7133361 7230730 7148163 7291066 7659291 8569934 8731384 8605870 9025237 9299880 9588458
4664 9588458 9575422 9612474 9801863 10224650 10565341 10924124 10839623 11234555 12078409 12317801
4654 12317801 13095011 13477310 14053045 14474799 15437739 15767710 16608287 17830217 18447042
4645 18447042 19587130 20610956 21740329 22951714 25171177 27064160 28587630 30514016
4637 30514016 32682418 35212657 37669891 40189362 44050673 48025446 53082486 59566430
4629 59566430 65358153 71226241 79330029 89220393 100242410 108998412 110708661 106336492
4621 106336492 96206477 84996611 78910747 75478723 75049515 74940233 76232152 79261979
4613G9261979M184059M142077N357575O131430P463458P900304Q875843R823769
4605A33140494Q666978Q586194P271687O975216P627648Q846117J0637540J1325863
4597B03077737R899341P659887M253072J840301J411638K762023M212638N763177
4589B40879814N090443J501873l137444p988759j0160352r809367p042165n269498
4581B04064545m261285n047403q020612j0322651j2334921j3206491j1484363
4574A39386819q936636p570162p058939p605130q909148q565318q448892q548084
4566G3744510o783789o768898n015595m099647l630874l545517k938915k708144
4558C8253131k097370j390029k155972j845855j499494j484944j303211j897911
$$ plain form
4613 79261979 83446038 87588115 92945690 99077120 106540578 114440882 123316725 133140494
4605 133140494 141807472 150393666 157665353 164640569 172268217 181114334 191751874 203077737
4597 203077737 212977078 220636965 224890037 226730338 228141976 230903999 235116637 240879814
4589 240879814 245970257 247472130 244334686 236345927 226185575 216376208 209334043 204064545
4581 204064545 199803260 194755857 186735245 176412594 164077673 150871182 139386819
4574 139386819 130450183 122880021 115821082 108215952 99306804 90741486 82292594 73744510
4566 73744510 66960721 60191823 55176228 51076581 47445707 43900190 40961275 38253131
4558 38253131 36155761 34765732 32609760 30763905 29264411 27779467 26476256 24578345
4550B4578345j058104n14260j073173j137192q31726q04466n12588j190695m23575
4541A7032566m0374n94403n2232m35881q97890p60388o10149k84438p27160j035955
4531A1593696j02418n9527m84218l6431j25467k86444Q9535m57934l60782j020851
4521H749159L03406l48581j94316k64261o49353j50400k11670l8767j38010p3201
4511F984006P0251j51239l34962l7331M69708n43069m13035M07418L2825n91579
4501E892993m10009o43490p3275Q2295j51445J73260j61012l63078m501K97153
4491D638891k0173k36436o54189m8059m14148P97989O9684o4188r7717n5492n15068
4480C401094j22793N1373P4833j78256k87944J19858J92721K03286q43794l43999
$$ plain form
4550 24578345 23520241 23005981 21932808 20795616 19963890 19159424 18646836 17456141 17032566
4541 17032566 16992192 16397789 16345557 15909676 15011786 14251398 13641249 13356811 12629651 11593696
4531 11593696 11491278 11431751 10947533 10911102 10785635 10499191 10588726 10130792 9770010 8749159
4521 8749159 9052565 8703984 8509668 8245407 7596054 7445654 7233984 7195217 7057207 6984006
4511 6984006 7054257 6903018 6568056 6530725 7000433 6457364 6044329 6451747 6484572 5892993
4501 5892993 5482984 4839494 4766219 4848514 4697069 4870329 4709317 4346239 4341738 4638891
4491 4638891 4618718 4382282 3728093 3680034 3265886 4063875 4133559 4069371 3971654 3916162 3401094
4480 3401094 3278301 3329674 3404507 3226251 2938307 3058165 3250886 3454172 2610378 2266379
4470B266379L80192J79793Q7046m64239k30747k75469O5068O81099k8864k18548
4460B441710j21738J30289M26065M5217p53425k26024M59855j48122j51102j4200
4450B088525J23556o46375k18959N04786L49292J40043l4675n22853K28654P4779
4440B086773m06052o6566j76276r385j61256J11889O31459J4986p85692o52758
4430E87122L32390O66793k21496K62005J12919R3590j41880j92736o3429m34271
4420A001007l56140J26903j17730q4321K3301P62399M2932o14072l99841P68973
4410A153411n3171K47035k20897m63061M3758l63662O5066L24925P31796o16649
4400H48551o71186M43323P7868K7594n1068j03414m2610k8659R8565J19051k58538
$$ plain form
4470 2266379 2646571 2826364 2913410 2449171 2218424 1942955 2008023 2689122 2660258 2441710
4460 2441710 2319972 2450261 2876326 2921543 2168118 1942094 2401949 2253827 2102725 2088525
4450 2088525 2212081 1565706 1346747 1851533 2200825 2340868 2306193 1783340 2011994 2086773
4440 2086773 1680721 1614155 1437879 1428494 1267238 1379127 2010586 2025572 1239880 587122
4430 587122 919512 1586305 1364809 1626814 1739733 1833323 1691443 1498707 1435278 1001007
4420 1001007 644867 771770 654040 569719 593020 1355419 1398351 784279 384438 1153411
4410 1153411 1100240 1347275 1126378 663317 707075 343413 408479 733404 1465200 848551
4400 848551 177365 620688 698556 726150 675082 571668 529058 500399 598964 718015 459477
4389D59477k73359j53510J5544J92073N58293N7830k62277K94280l7505J28465
4379I79311l3986l20269l68843k93130J37942J69785J03562m37825k91914j3604
4369c68971p1337P39646j97942l56256J49661K99081N32375n08585l05572M85013
4359C97113K0891o8749J28447j49671M22815l54008J39287m19205M96662j7850
4349E95732k56262J09353o91161J6412P72456J2101m65237j51330K75937M38402
4339F56403k02353m06508j73248L62957r3349O51408o3058l05399k9251l2324
4329C65278n1310L93847L2515o07946k23200J61766j64399R1314Q9078Q53848
4319I40791j10139K00888k13260l68285J5351O78565m07233k6113P6324k08817
$$ plain form
4389 459477 186118 32608 48152 240225 798518 856348 594071 888351 850846 979311
4379 979311 945325 625056 256213 -36917 101025 270810 374372 -63453 -355367 -368971
4369 -368971 -440308 299338 101396 -254860 -105199 193882 726257 217672 -87900 397113
4359 397113 418004 349255 477702 328031 750846 396838 536125 116920 613582 595732
4349 595732 339470 448823 -242338 -225926 546530 558631 93394 -57936 218001 656403
4339 656403 454050 47542 -125706 237251 143902 795310 732252 426853 397602 365278
4329 365278 313968 707815 740330 132384 -90816 70950 -93449 -2135 86943 940791
4319 940791 830652 1031540 818280 449995 465346 1143911 736678 710565 786889 578072
4309E78072k3804O49517K95m60041l46182K88416K77779m95070L40404L16311
4299A125697m09454n47934J056120J23320K01265n9219j04829K26681k75064J51423
4289A488006r0829j12040J54388J61770L17040N07319l86369L12384k84847n82583
4279A484239L70546m53841Q27461J55370j81771n96838m61137K377M0674J64767
4269A351847L45232j86325j78944l57586k04447k21386J61602m2433j24049M312
4259E47823l57164j63419M15400K3993p1862n84433j85291L64496j06006N5633
4249f0830k5409Q96714k36245p27990n1129J05558K39828J31304o4211j2799M52184
4238F46975k52127m20161M61572j02036j53565K53789j21301j77649K14439j24716
$$ plain form
4309 578072 554268 1203785 1204080 744039 397857 686273 964052 468982 809386 1125697
4299 1125697 716243 168309 1224429 1347749 1549014 1489795 1384966 1611647 1336583 1488006
4289 1488006 1397177 1285137 1439525 1601295 1918335 2425654 2039285 2351669 2066822 1484239
4279 1484239 1854785 1400944 2228405 2383775 2202004 1605166 1144029 1146406 1187080 1351847
4269 1351847 1697079 1510754 1331810 974224 769777 548391 709993 667560 543511 547823
4259 547823 190659 27240 442640 466633 394771 -189662 -374953 -10457 -116463 -60830
4249 -60830 -86239 810475 574230 -153760 -204889 -99331 140497 271801 207590 194791 646975
4238 646975 394848 -25313 436259 334223 180658 434447 313146 135497 349936 225220
4228B25220l94526j89207K08861J06539J28230K10569j35566l47409L38880L97408
4218E48999M38574J17602k62429k71953n15419m14913J62003N23193P00090o5267
4208I60480j006606N036J71800j84842K78711J35277K13246m55789J13684k6105
4198B04892L49464l4781j31483o4286k87163J00721n31574M77763J22125n78J16190
4187C21290j34065K62243P42261k40186n7619K86434j62869r2333j79741j89739
4177E55676j46204m48569j53574L66816N46482M4826L66989q4255l98871N7300
4167G06616K14865m26193J29404m69730J53429r9942k83189j94366K99540O77588
4157G08022q20053J42729L01139J53361k27905P9834K40978N78810l98058j42671
$$ plain form
4228 225220 -169306 -358513 -149652 -43113 85117 295686 160120 -187289 151591 548999
4218 548999 987573 1105175 842746 570793 55374 -359539 -197536 325657 1025747 960480
4208 960480 -46126 -41090 130710 -54132 224579 359856 573102 117313 230997 204892
4198 204892 554356 519575 388092 323806 36643 137364 -394210 83553 205678 205100 321290
4187 321290 187225 449468 1191729 951543 893924 1180358 1017489 925156 745415 555676
4177 555676 409472 -39097 -192671 174145 720627 765453 1132442 1048187 649316 706616
4167 706616 921481 495288 624692 154962 308391 208449 -74740 -269106 30434 708022
4157 708022 -112031 30698 331837 485198 257293 337127 578105 1156915 758857 616186
4147F16186j92535j09724L96758j42970o12608j20624O8368l46339J62914M17545
4137A36971J69027p36202J30536J045148J92328k01451j97654k36426l1342m12551
4127a41616k95693L15236Q71148L5536n56463l18389L74938k48899m07934O22082
4117B49946p2212l39429L36935q4790K93844L85143L10603J21049k44212Q206
4107I65083n16154l46037M45905l0100j19763M54283l58064r2043J09602M00026
4097I12738J87031K33406r50685J84204O05203k6072r4605N854J25006k2877O42592
4086A801795k44550k40155o7614O26227M5277n2617O56310j0559M24206k83132
4076B655188O00159O36281j60445K47461l50667K84194O16512O96396O9350Q08088
$$ plain form
4147 616186 423651 313927 710685 567715 -44893 -165517 -97149 -443488 -280574 136971
4137 136971 305998 -430204 -299668 745480 937808 736357 538703 302277 270935 -141616
4127 -141616 -437309 -122073 749075 784611 228148 -90241 284697 35798 -372136 249946
4117 249946 177734 -161695 175240 90450 384294 769437 1080040 1201089 956877 965083
4107 965083 448929 102892 548797 518697 398934 853217 495153 403110 512712 912738
4097 912738 1099769 1333175 382490 566694 1171897 1145825 1051220 1057074 1182080 1159203 1801795
4086 1801795 1557245 1317090 1249476 1875703 1920980 1868363 2524673 2514114 2938320 2655188
4076 2655188 3255347 3891628 3731183 3978644 3627977 3912171 4528683 5225079 5294429 6102517
4066F102517M60775K92649R91967Q72627J134465J116435P41642R47082J222482
4057A3882641J281021J328070J638577K420184K361677K980446L507101L357074
4049C2756791M409808N704326N508120M123614l02922m068721p711072p923617
4041C2496327m876776l518581k723732k063312j284538j066833p42148n65178
4033A5655229j070566j006868m68513p61054r98978r94442L0459P99329m31977
4024A0752619n72804p23889m94472n43183q99469o12844o27977n8510K78727n23580
4014E974618p59572j1353k31671K11308k73612q36865m31267L60583j34194j03241
4004C764734r1518n81556k82014K58694K33545n57633k06900m04480L3824J1519
$$ plain form
4066 6102517 6563292 6855941 7847908 8720535 9855000 10971435 11713077 12660159 13882641
4057 13882641 15163662 16491732 18130309 20550493 22912170 25892616 29399717 32756791
4049 32756791 37166599 42870925 48379045 52502659 52199737 48131016 40419944 32496327
4041 32496327 27619551 24100970 21377238 19313926 18029388 16962555 16220407 15655229
4033 15655229 14584663 13577795 13109282 12348228 11349250 10354808 10385267 11184596 10752619
4024 10752619 10179815 9455926 8961454 8418271 7518802 6905958 6277981 6219471 6498198 5974618
4014 5974618 5215046 5203693 4972022 5183330 4909718 4072853 3641586 4002169 3867975 3764734
4004 3764734 3673216 3091660 2809646 3068340 3301885 2744252 2537352 2132872 2166696 2178215
3994B178215K4999n0762L88274m38783l55887M92920J06807J30925n24688N0560
3984B002580j33088J66698m90240j04727k95714l04495N49936n90460K50568k17977
3974H33081o15218O49123l67187o1742K74746k30956J14205L29409j33887J75285
3964I66859J14103m14756p3191N43917M7679l67006O3009K17371J69915n11067
3954G56833q5511J9588m65264k94317M74034J30642o24107K52051L14292K45419
3944G23660J90539n38109l39610L13205J41689k38653K44342J24050r6734j05627
3934D18752L18907K30349q95789J10864r3394k13452M03178j01910J05070R1019
3924C73594l75659j66079j45941p4304O95980J56681k73238R0186M18479k37834
$$ plain form
3994 2178215 2203214 2152452 2540726 2101943 1746056 2238976 2345783 2476708 1952020 2002580
3984 2002580 1869492 2036190 1545950 1441223 1145509 841014 1390950 800490 1051058 833081
3974 833081 217863 866986 499799 438057 712803 481847 596052 925461 791574 966859
3964 966859 1080962 666206 593015 1136932 1184611 817605 880614 1097985 1267900 756833
3954 756833 671322 690910 225646 -68671 405363 536005 -88102 163949 478241 723660
3944 723660 914199 376090 36480 349685 491374 252721 497063 621113 524379 418752
3934 418752 737659 968008 72219 183083 89689 -123763 279415 177505 282575 373594
3924 373594 -2065 -168144 -314085 -388389 307591 464272 191034 281220 699699 461865
3914D61865r7855k22519K2967j4302K75200K59624p96421j147j61520L34670K88483
3903C49045n49883j025M33878P1571n01259m50902M2792J05424K23025o1421K06764
3892a31991j22526n07674J06167L28402N39760k19110k77068l64900K35114M20055
3882F229M8069l44815n04591L71263N49925l36590n11735L43611k74130L6650
3872f16114M23201L17548n21522p7748Q9261L5691L08828o45303M21124m1877
3862c06911j53036j74882M70475M7619m31360K48571K90588k93314j81793N68246
3852H4203q7041K77556K11729n42709m0360j95099J18811L28280l32171m6179
3842b22980j06124j00404J69837K40407j57292j50399j11228k36685J56901j53371
$$ plain form
3914 461865 364010 141491 164458 150156 425356 684980 -111441 -112588 -274108 60562 349045
3903 349045 -200838 -201863 232015 303586 -197673 -648575 -605783 -500359 -277334 -338755 -131991
3892 -131991 -254517 -762191 -656024 -327622 212138 -6972 -284040 -648940 -413826 6229
3882 6229 54298 -290517 -795108 -423845 126080 -210510 -722245 -378634 -652764 -616114
3872 -616114 -192913 124635 -396887 -474635 -385374 -349683 -40855 -686158 -265034 -306911
3862 -306911 -459947 -634829 -164354 -116735 -548095 -299524 -8936 -302250 -484043 84203
3852 84203 -2838 274718 486447 -56262 -96622 -291721 -172910 155370 -176801 -222980
3842 -222980 -329104 -429508 -259671 -19264 -176556 -326955 -438183 -674868 -517967 -671338
3832f71338k62774L10099k34580M06948L26876K30167m59672J1223K65519J8021
3822e9511L47784m41260k69046o10812K34839L71519J23656j46186K41452k05452
3812d13017M52395M72181q71389l36969l5947k24499J90102K64181J21325P88652
3802D07015m4684o32479k50856j81678l4019M1177N42948l99043o94544M56138
3792g90025M88722m4387k64628J70260O4081J63852m90503J34410J026145n58596
3782a00669l96865K02954j26047J93695j81608J33355k49006R1604j68178R1754
3772e09011J00416j48273K73940l84190M05506M10383l94447j81839K31803K27391
3762C1679l46769K20183M3723K65430L59549j01449m58527K33424K23735O2644
$$ plain form
3832 -671338 -934112 -624013 -858593 -451645 -124769 105398 -354274 -343051 -77532 -59511
3822 -59511 288273 -152987 -422033 -1032845 -798006 -426487 -302831 -449017 -207565 -413017
3812 -413017 39378 511559 -359830 -696799 -732746 -957245 -767143 -502962 -381637 407015
3802 407015 362331 -270148 -521004 -702682 -736701 -695524 -152576 -551619 -1246163 -790025
3792 -790025 -301303 -345690 -610318 -440058 -375977 -212125 -702628 -568218 457927 -100669
3782 -100669 -497534 -294580 -420627 -226932 -408540 -275185 -524191 -432587 -600765 -509011
3772 -509011 -408595 -556868 -282928 -667118 -261612 148771 -245676 -427515 -195712 31679
3762 31679 -315090 -94907 -51184 214246 573795 472346 13819 247243 470978 533622
3752E33622p5822p49476j1990K00771K54608j1758J0873q13563L35567O01502
3742B74334K31931l27568L99997J07149m19001m76483n62362J6654j01358R28005
3732G1298k31005j21501O13257p24773J32032k59105Q072K56458j12780J96164
3722a71883q0623k57176j18266O61905m80897M04653K14690n86791n5539N1032
3712d18895K2043O13301J58095j86738R8349J10597m34795j04345K59792k41760
3702a24356o52975l86447M30036M70418L12574K33228r6042p98082P96185j15897
3692F8642l11417K38390j29145M31240o7209j55233N34126q7251q50694j49800
3682d78351j50115M89578N75250k0767j98755m97295K06328K02652j43391j74145
$$ plain form
3752 533622 457800 -291676 -303666 -102895 151713 139955 150828 -662735 -327168 274334
3742 274334 506265 178697 578694 685843 266842 -209641 -772003 -755349 -856707 71298
3732 71298 -159707 -281208 332049 -392724 -260692 -519797 -511725 -255267 -368047 -171883
3722 -171883 -252506 -509682 -627948 33957 -446940 -42287 172403 -414388 -469927 -418895
3712 -418895 -396852 216449 374544 187806 286155 396752 -38043 -142388 117404 -124356
3702 -124356 -777331 -1163778 -733742 -263324 49250 282478 186436 -611646 184539 68642
3692 68642 -242775 -4385 -133530 297710 230501 75268 609394 522143 -328551 -478351
3682 -478351 -628466 -138888 436362 415595 216840 -280455 -74127 128525 -14866 -189011
3672a89011j56905Q158N5115o162J57140j42657r8040J40641J79182K97861l23976
3661g8654k72662k92908K61673n5768j74169M25579o6410M73509O7306j71689
3651A15807j15342K44564p7160m81697O10674j22995p22095n59005K28638j5971
3641h94582J84476k9994M084R8306Q8182P61456Q2988o54291m5505M2984r8568
3630d60464k78931O47719m8226J52406L16835l53824j11379j89845N82387L4588
3620B91266P0398O18712n7330q50323j84948j00962k48394K19263M01071j95867
3610c7114m33541K83938L85420l69925O43330l44675n15145Q865M6327J56566
3600a75954J00617J71315j8218m39202l28056N59356j14492K87696J10726j4580
$$ plain form
3672 -189011 -345916 -337758 -282643 -288805 -131665 -274322 -372362 -231721 -52539 245322 -78654
3661 -78654 -351316 -644224 -382551 -438319 -612488 -186909 -253319 220190 287496 115807
3651 115807 465 245029 167869 -313828 296846 173851 -548244 -1107249 -878611 -894582
3641 -894582 -710106 -740100 -736016 -637710 -549528 211928 294916 -359375 -404880 -361896 -460464
3630 -460464 -739395 -91676 -139902 12504 329339 -24485 -135864 -325709 256678 291266
3620 291266 361664 980376 923046 72723 -112225 -213187 -461581 -242318 158753 -37114
3610 -37114 -470655 -186717 198703 -171222 472108 127433 -387712 -378847 -332520 -175954
3600 -175954 -75337 95978 77760 -361442 -689498 -130142 -244634 43062 153788 139208
3590A39208j62046m37588o6579n97664K37563M55775J9288L83355J59359q7816
3580D2855J55654k11063N8802L4250L72773l03387K9940l62975m0620J62393p30180
3569g91558J30478O77939J12813j42924O0073q2976k0047q8414M9852k60303k65995
3558f21062L42455L65705K32974N4947l19955O3833J71055k31096j12942L49779
3548B95693r8245l06629K04241N3667k46109K19138J87110j8413o27513q7082
3538d24142N21673M59458m15907n66980L20031M65002m06639n8583j99364J46902
3528a58549K46491N31442k85648m22638L20608J38630O9025J25848j16798k8915
3518D19496j91267J67557L74654m71303q34964k40894N82676J22614j67919j65327
$$ plain form
3590 139208 -22838 -460426 -527005 -1124669 -887106 -431331 -412043 -28688 130671 42855
3580 42855 198509 -12554 46248 80498 453271 149884 179824 -183151 -223771 -61378 -791558
3569 -791558 -661080 16859 129672 -13252 46821 -36155 -56202 -144616 -94764 -355067 -621062
3558 -621062 -278607 87098 320072 375019 55064 118897 289952 58856 -54086 295693
3548 295693 197448 -109181 95060 148727 -97382 121756 308866 290453 -337060 -424142
3538 -424142 97531 556989 141082 -425898 -105867 359135 -47504 -106087 -305451 -158549
3528 -158549 87942 619384 333736 -88902 231706 370336 439361 565209 448411 419496
3518 419496 228229 395786 770440 299137 -535827 -776721 -194045 -71431 -239350 -404677
3508d04677M23869M90185L22480J56896o7075K01074m29460p07145p4818K15449
3498A26778L8602L07061k58578j43763l25423M607Q88533j14693k2225l45633
3488A55266j39173K53604l33168k46073K01009N14938N3864l94133K22098K00582
3478D88814J01649j38733j58913j16091M53569k52769L8858J91047K74555n32803
3468C49183l1334K06907K01443k03317m46150K86605K04143k15044j98192M44205
3458E98449K94287J76129J61142j1205M54176m69131m42168K18718l67702M63632
3448A076327J21325m22010j2688n32431J82995K13776L08887M7600k21039J54611
3438I17353L07968k68140k02682M66140J43111K36415M78649J13489l8064J26098
$$ plain form
3508 -404677 19192 509377 831857 988753 921678 1122752 693292 -13853 -88671 126778
3498 126778 165380 472441 213863 70100 -255323 -250716 637817 523124 500899 155266
3488 155266 16093 269697 -63471 -309544 -108535 406403 460267 66134 288232 488814
3478 488814 590463 451730 292817 176726 630295 377526 416384 607431 881986 349183
3468 349183 317849 524756 726199 522882 76732 363337 567480 352436 154244 598449
3458 598449 892736 1068865 1230007 1218802 1672978 1203847 761679 980397 612695 1076327
3448 1076327 1197652 775642 762954 230523 413518 627294 936181 983781 762742 917353
3438 917353 1225321 957181 754499 1220639 1363750 1600165 2078814 2192303 2154239 2280337
3428B280337m02578l05357M15625L14255n20371K03463Q9494l02194p88666p0277
3418I13731M97073N08301M9879n42093l02891L02850k22611k14044m97320N62891
3408A055766M2536O8960j21715j5379j67523q3361J00147p0557n0078j36661J82180
3397H04315Q9472K14966M29862r98499k74684K30006K20947j14689p41616M03059
3387B63139l03117q9033L72960K12352j3762K08721k01646l7498k47940j58409
3377E767l4319k75256J46360M68407m26244K39854J73095K73241k75432l10083
3367a4610L81125J86725J44595N59322j67309j66783j24719n4809L72765L37453
3357A453755j2568m60116J07207L40691q67940J27111L79277J84972j9375o16477
$$ plain form
3428 2280337 1877759 1572402 1988027 2302282 1781911 1985374 2074868 1772674 984008 913731
3418 913731 1410804 1919105 1968984 1426891 1124000 1426850 1204239 990195 492875 1055766
3408 1055766 1098302 1167262 1045547 1030168 862645 779284 879431 808874 758796 622135 804315
3397 804315 893787 1108753 1538615 540116 265432 495438 716385 601696 -139920 263139
3387 263139 -39978 -129011 243949 456301 442539 651260 449614 412116 164176 5767
3377 5767 -28552 -303808 -157448 310959 -115285 124569 297664 570905 295473 -14610
3367 -14610 366515 553240 697835 1257157 1089848 923065 798346 743537 1116302 1453755
3357 1453755 1441187 981071 1088278 1428969 561029 688140 1067417 1252389 1233014 616537
3347F16537K13520J9414J21081k4868O17522l15651l44159l34518N915k40618
3337C34175O53797j41961j57421P5189p5928j84002N0742m15035K91471J79570
3327F10597j49249L9400l70956j33422n2695P9716r8928M31076j93712M3871j17324
3316H8374j9033K389L23904P8356l97617l02008L71332j00483k48687J73030M29547
3305C99104L13427o0188l46714K23612k10470O0279j87314K18729l96319j81705
3295a67559R3401J67926K3584p28267o5845l4282O65977M87981o29011O9509j14868
3284b31454j36105K05391J59138k75158k10449k6099K71862K14188l41993k27026
3274e97705L12798M12834K19768m43790J86379O36350J81360o99859Q409l89872
$$ plain form
3347 616537 830057 849471 970552 945684 1563206 1247555 903396 568878 574793 334175
3337 334175 987972 846011 688590 763779 687851 503849 554591 139556 431027 610597
3327 610597 461348 500748 129792 -3630 -56325 23391 -75537 355539 161827 205698 88374
3316 88374 69341 71730 395634 473990 76373 -225635 145697 45214 -203473 -30443 399104
3305 399104 712531 652343 305629 529241 318771 379050 191736 410465 14146 -167559
3295 -167559 -74158 93768 117352 -610915 -676760 -711042 -45065 442916 -186095 -116586 -231454
3284 -231454 -367559 -162168 -3030 -278188 -488637 -514736 -242874 -28686 -370679 -597705
3274 -597705 -284907 127927 347695 -96095 90284 726634 907994 208135 216544 -173328
3264a73328l51887J92877M63848K31079p98150j4641K09421J02346j57680k16867
3254e12982l02184M09862K44471M94848l17264m5286j0480p00398K0216j14790
3244h33987Q9421O56244k36499l55493O48977J73718l19391J04448L63332j58739
3234A32031j58260K59379j7096M13398J48168l64339k21220j39532q4879K05085
3224A72735n99608N60513M48537j0252r5788k09773j19372K39990n79855m15907
3214f08780J50017M79429N1918j62790P8103J99200K1888m1284o07785L6721L52667
3203e0696l64934q6295L13152O423r5898l30360J89088N2217O3813R3008K55245
3192D4763n2191J91694L62345n36945J56589L5324k3176q382J06721k84753K9352
$$ plain form
3264 -173328 -525215 -332338 131510 362589 -435561 -450202 -240781 -138435 -296115 -512982
3254 -512982 -815166 -405304 -160833 334015 16751 -28535 -39015 -739413 -719197 -833987
3244 -833987 -744566 -88322 -324821 -680314 -31337 142381 -177010 -72562 290770 132031
3234 132031 -26229 233150 216054 629452 777620 413281 192061 52529 -32350 172735
3224 172735 -426873 133640 582177 571925 476137 266364 146992 386982 -192873 -608780
3214 -608780 -458763 20666 72584 -90206 -12103 187097 208985 167701 -440084 -403363 -50696
3203 -50696 -415630 -501925 -188773 -182350 -278248 -608608 -419520 -367303 -303490 -210482 44763
3192 44763 -7428 184266 546611 9666 166255 201579 178403 170021 276742 -8011 21341
3181B1341o3644N5885K50633l78415O5564L5753l4380m72159o8315L28008Q8221
3170a71508N026k4530P88317j64517m20959j77743J39205j7888k57005o5043R5234
3159b71411L24347k86k2209L30743n0358j66328l87831K70052L95148l36574m3551
3148D1742J16338J01122k95827m49995M07497l15609M4597M48246J57194k54824
3138D81J23223K77897n50094n0791L88557l24686L64317K73229k28075J02243
3128C76301l25075p33011J35386M04669N17121M47749n3323q52510k93164Q6665
3118b89192r4421P28672n3224n70787J86705L51118L37591l07032l5506r9787
3108A54137l08841K42050j60575K3760o8848L43880N39298m03995k23214J87929
$$ plain form
3181 21341 -42303 13582 264215 -114200 -48636 -12883 -47263 -519422 -587737 -259729 -171508
3170 -171508 -166482 -191012 597305 432788 11829 -165914 -26709 -44597 -301602 -366645 -271411
3159 -271411 52936 52650 30441 361184 310826 144498 -243333 26719 421867 85293 41742
3148 41742 158080 259202 -36625 -486620 -79123 -394732 -350135 98111 255305 481
3138 481 123704 401601 -148493 -199284 189273 -135413 228904 502133 274058 376301
3128 376301 51226 -681785 -546399 -141730 375391 823140 769817 -82693 -375857 -289192
3118 -289192 -383613 345059 291835 -278952 -92247 258871 596462 289430 253924 154137
3108 154137 -154704 87346 -73229 -49469 -118317 225563 764861 360866 137652 325581
3098C25581M27490m92398J37080L12279L22401j70696k43267j03637l06669K19814
3088D27978M60732k65716k12411J53330n46997o73975L14763O66919J1238n4059
3078B81802j53306L65735K8967j46801O06630r8951l10113M00251j90751L71144
3068A154607m84554j39113J70334J48408k11242J6468K665m44769L2162J68338
3058D13304K79709M54577M33017j11976n55300p64443K15122N82109m23428N3870
3048E76561L57898l49318l23282j06342j76993j9759M98839K13396l36178j01766
3038B33056N6556K62460k83897j86770l58844K7209N63434R0375k42648m04471
3028b43540L2486L7921k39478R1981J72671j33414O9551r8123L42007R6694m67496
$$ plain form
3098 325581 753071 260673 397753 710032 1032433 861737 618470 514833 208164 427978
3088 427978 888710 622994 410583 563913 16916 -657059 -342296 324623 335861 281802
3078 281802 128496 494231 523198 376397 983027 884076 573963 974214 783463 1154607
3068 1154607 670053 530940 701274 849682 638440 654908 657573 212804 244966 413304
3058 413304 693013 1147590 1580607 1468631 913331 148888 364010 946119 522691 576561
3048 576561 934459 585141 261859 155517 -21476 -41235 457604 671000 334822 233056
3038 233056 289612 552072 268175 81405 -277439 -250230 313204 403579 160931 -243540
3028 -243540 -211054 -173133 -412611 -320630 -147959 -281373 -211822 -309945 32062 128756 -338740
3017c38740K81332J09583O2233K32029q5811k79517N705L03077O3403l71996l20976
3006c39678j01623L81800l20676k83235J08606L09109Q16925q1642n45478M19711
2996C63819k60562j99054j45478N60494M2265l5421l94904m88336O38418j56337
2986g5096L4364j55705m6339j19895n4374p1806J18742J81061M95222l56617q66925
2975i17368J83702L60679P38357k11134m08882K925j29344j10120l09955M07481
2965c93659j78093l11409L55891L75239j48730l00826o5947M7545l411K15542
2955d07858K57850J3802L70350J47481o14259J44134K6115J46728o08575k89115
2945h13347R02085j13254k6661j69377m37773J0448K40217j760K11948L05128
$$ plain form
3017 -338740 -57408 52175 114408 346437 260626 -18891 -13186 289891 353294 -18702 -339678
3006 -339678 -441301 -59501 -380177 -663412 -554806 -245697 571228 489586 -55892 363819
2996 363819 103257 -95797 -241275 319219 361484 326063 -68841 -557177 81241 -75096
2986 -75096 -40732 -196437 -242776 -362671 -417045 -488851 -370109 -189048 306174 -50443 -917368
2975 -917368 -733666 -372987 365370 154236 -254646 -251721 -381065 -491185 -801140 -393659
2965 -393659 -571752 -883161 -527270 -152031 -300761 -601587 -667534 -619989 -623400 -407858
2955 -407858 -150008 -136206 234144 381625 -232634 -88500 -62385 84343 -524232 -813347
2945 -813347 88738 -24516 -51177 -220554 -658327 -647879 -407662 -409422 -197474 107654
2935A07654m17908n59225P72858L70385m84075j04943J03163j17619o66479J58909
2925h37280Q94787J7520j54502R5283m20646j7531j72593N0348K57094J02355
2915a85165R9596L4956n15852J56948O10024k3641P5656n57809M82978L45574
2905E23265l28691k60111L40570k23002j5834J20819m10135P9412L02709J15754
2895B44756n42438n46480K8619O87137q8195M79662k78370j14311M37156l50728
2885d3192m35712j17026L99453K79110m60145K04083L94205P20042n02401L6801
2875D75218l84441l72360L95969l92406k92294K49529K4194k59490k63095K44377
2865e74799L68162l39341M5217k85246N59688k0310p08573O320L71924P0687K93327
$$ plain form
2935 107654 -310254 -869479 -96621 273764 -210311 -315254 -212091 -329710 -996189 -837280
2925 -837280 57507 75027 -79475 15808 -404838 -422369 -594962 -544614 -287520 -185165
2915 -185165 -85569 -50613 -566465 -409517 200507 176866 252522 -305287 177691 523265
2905 523265 194574 -65537 275033 52031 36197 157016 -253119 -173707 129002 244756
2895 244756 -297682 -844162 -815543 -128406 -216601 263061 -15309 -129620 307536 -43192
2885 -43192 -478904 -595930 -196477 82633 -377512 -173429 220776 940818 438417 475218
2875 475218 90777 -281583 114386 -278020 -570314 -320785 -296591 -556081 -819176 -574799
2865 -574799 -206637 -545978 -500761 -786007 -226319 -246629 -955202 -948882 -576958 -506271 -212944
2854b12944L44018l46666J25865k0692o01164Q7546M20382J18453n9193L14076
2844A69681J33708k60961L48346p7443J55563N7840m70351k40483j33726q7548
2834d05374K57373K79333J02734j08690p67067K74418k37091N09053L00774m7380
2824A58083m0397m12109K9815K55630j32830k82363J53613Q4529k7739m38385
2814f52153O65911J92863L93083p80714o24704P04625k28191j45474j93304Q00371
2804A32313k49586j11690j10860k18728k41105r96P28537n46839J16330M15394
2794h7230j49949q6699K08525k00521k43489J92894O00642M90113k03521l997
2784E16768q01851M1005K39652J87497L3088J6105l94095m5399N7723K57638o42098
$$ plain form
2854 -212944 131074 -215592 -89727 -110419 -711583 -624037 -203655 -85202 -144395 169681
2844 169681 303389 42428 390774 313331 468894 526734 56383 -184100 -317826 -405374
2834 -405374 -148001 131332 234066 125376 -641691 -367273 -604364 -95311 205463 158083
2824 158083 117686 -294423 -264608 -8978 -141808 -424171 -270558 -186029 -213768 -652153
2814 -652153 13758 206621 599704 -181010 -805714 -101089 -329280 -474754 -668058 132313
2804 132313 -117273 -228963 -339823 -558551 -799656 -800652 -72115 -618954 -502624 -87230
2794 -87230 -237179 -323878 -115353 -315874 -559363 -366469 234173 724286 520765 516768
2784 516768 -285083 -244078 -4426 183071 216159 232264 -161831 -207230 -149507 108131 -533967
2773e33967q4215L78299o7387J91899Q7487r6939L7766r565n68357J35646J53290
2762c76043k36984M02024K90450j17732m74033K45924J02926k37188M23447J80789
2752B03580p8962P0275n5650m47195l6780P9915M26411k43376j27881j8287o6425
2741b94375n3870r7986K22993m54299J52841N45542k89718j05790P4958J47723
2731a51981P87374J12414k90772O6816k31574j52162J5450J19731m6658J56647
2721C85285l8092j44507p80266k51820L69348k69007l30654M51920R6040M0148
2711d71605n9042L70980l23866l68069N40650O35590m07354k07295O05848n55619
2701b39782K68386R0384m74176J15491k72961J98314J10539J82568j40182j46864
$$ plain form
2773 -533967 -618182 -239883 -307270 -115371 -27884 -124823 -87057 -96622 -664979 -529333 -376043
2762 -376043 -613027 -211003 79447 -38285 -512318 -266394 -163468 -400656 22791 203580
2752 203580 124618 194893 139243 -307952 -344732 -264817 161594 -81782 -209663 -227950 -294375
2741 -294375 -348245 -446231 -223238 -677537 -524696 20846 -268872 -374662 -299704 -151981
2731 -151981 635393 747807 457035 523851 292277 140115 155565 275296 228638 385285
2721 385285 347193 202686 -577580 -829400 -460052 -729059 -1059713 -607793 -511753 -471605
2711 -471605 -530647 -159667 -483533 -851602 -310952 324638 -82716 -290011 315837 -239782
2701 -239782 28604 118988 -355188 -239697 -512658 -314344 -203805 -21237 -161419 -308283
2691c08283L34181J72207k27393j02451l50559M53313K84801n23877l30839j05261
2681g04161k7934K74481m56178j70486K78072K61211J92339M98005o16172p8458
2671e49281P68238n25617m03026N18211J47919j22378Q5808L70031m80922K06245
2661A5228j113r5121K51909j61792K55211k5969L95447m16479j38383j16542l47335
2650c84939K56566N46998m92763J9388K54417Q3173R2188k2263Q6450o32076k86980
2639d79841L78895M36977R22754o59501q08420N20242K83018q57322j42752K08459
2629a97491J17566m28330L23284K38386m97809M35240j82385q152r8741M26578
2619A28146K39799m03345q5575k34451N2583k16990K88356j33791l64447n66647
$$ plain form
2691 -308283 25898 198105 -29288 -131739 -482298 -28985 255816 -268061 -598900 -704161
2681 -704161 -732095 -457614 -913792 -1084278 -806206 -544995 -352656 145349 -470823 -549281
2671 -549281 218957 -306660 -709686 -191475 -43556 -165934 -80126 289905 -191017 15228
2661 15228 14115 -81006 170903 9111 264322 238353 633800 217321 78938 -37604 -384939
2650 -384939 -128373 418625 -74138 -54750 199667 282840 375028 352765 439215 -192861 -479841
2639 -479841 -100946 336031 1258785 599284 -209136 311106 594124 -263198 -405950 -197491
2629 -197491 -79925 -508255 -184971 53415 -444394 -9154 -191539 -199691 -298432 128146
2619 128146 367945 -35400 -120975 -355426 -302843 -519833 -231477 -365268 -729715 -1296362
2609a296362o9520J97317L81113l6068J61514M14064o7673j2001l97802p369j67910
$$ plain form
2609 -1296362 -1365882 -1168565 -787452 -823520 -662006 -247942 -315615 -327616 -725418 -732787 -900697
$$ [...]
##END NTUPLES=NMR SPECTRUM
##END=
