##TITLE=1H_DE-80H_X3
 200.13MHz, d2o
 8 sc
 
 19ns.26.2.2025
##JCAMPDX= 6.0         $$ Bruker NMR JCAMP-DX V2.0
##DATA TYPE= NMR SPECTRUM
##DATA CLASS= NTUPLES
##ORIGIN= UXNMR, Bruker Analytische Messtechnik GmbH
##OWNER= pz
$$ XWIN-NMR		Version 3.5
$$ Tue Jul  1 10:40:51 2025 Russian Standard Time (UT+4h)  Yarkov@DPX200
##.OBSERVE FREQUENCY= 200.1313
##.OBSERVE NUCLEUS= ^1H
##.ACQUISITION MODE= SIMULTANEOUS
##.ACQUISITION SCHEME= undefined
##.AVERAGES= 8
##.DIGITISER RES= 18
##SPECTROMETER/DATA SYSTEM= spect
##.PULSE SEQUENCE= zg30
##.SOLVENT NAME= CDCl3
##.SHIFT REFERENCE= (INTERNAL, CDCl3, 0, 15.5276)
##AUDIT TRAIL= $$ (NUMBER, WHEN, WHO, WHERE, WHAT)
$$ ##TITLE= Audit trail, XWIN-NMR		Version 3.5
$$ ##JCAMPDX= 5.01
$$ ##ORIGIN= Bruker BioSpin GmbH
$$ ##OWNER= Yarkov
$$ C:/Bruker/XWIN-NMR/data/yarkov2/nmr/H-C/1/pdata/1/auditp.txt
$$ ##AUDIT TRAIL=  $$ (NUMBER, WHEN, WHO, WHERE, WHAT)
(   1,<2025-07-01 10:39:58.82 +0400>,<Yarkov>,<DPX200>,
      <created by zg, POWCHK disabled, PULCHK disabled
       configuration hash MD5:
       00 E9 B6 7A A2 85 ED C7 34 08 36 98 17 FE 4E 26
       data hash MD5: 16K
       0E CD 11 96 41 30 58 86 50 29 63 E4 30 E9 B0 44>)
(   2,<2025-07-01 10:40:03.76 +0400>,<Yarkov>,<DPX200>,
      <Start of raw data processing
       efp BC_mod = 2 LB = 0.25 FT_mod = 6 PKNL = 1 PHC0 = -1350.289 PHC1 = -0.03339839 SI = 16K 
       data hash MD5: 16K
       1C BB 4C FB 2B 92 67 10 DF 69 D2 FC 70 14 99 45>)
(   3,<2025-07-01 10:40:14.20 +0400>,<Yarkov>,<DPX200>,
      <abs ABSG = 5 
       data hash MD5: 16K
       A4 7C EE 51 24 A4 75 96 80 1E BC EB F8 24 7D 04>)
$$ ##END=
$$ 
$$ hash MD5
$$ F2 8C AD 6B 4E 19 D3 E5 27 80 78 3A 6C 80 4C C0
##$RELAX= 
##$RELAX= 
##$RELAX= 
##$RELAX= 
##$RELAX= 
##$RELAX= 
$$ Bruker specific parameters
$$ --------------------------
##$DU= <C:/Bruker/XWIN-NMR>
##$EXPNO= 1
##$NAME= <H-C>
##$PROCNO= 1
##$TYPE= <nmr>
##$USER= <yarkov2>
##$AMP= (0..31)
100 100 100 100 100 100 100 100 100 100 100 100 100 100 100 100 100 100 
100 100 100 100 100 100 100 100 100 100 100 100 100 100 
##$AQSEQ= 0
##$AQ_mod= 1
##$AUNM= <au_zg>
##$AUTOPOS= <>
##$BF1= 200.13
##$BF2= 200.13
##$BF3= 200.13
##$BF4= 200.13
##$BF5= 200.13
##$BF6= 200.13
##$BF7= 200.13
##$BF8= 200.13
##$BYTORDA= 1
##$CFDGTYP= 0
##$CFRGTYP= 5
##$CHEMSTR= <none>
##$CNST= (0..31)
1 1 145 1 1 1 1 1 1 1 1 1 1 1 1 1 1 1 1 1 1 1 1 1 1 1 1 1 1 1 1 1 
##$CPDPRG= <>
##$CPDPRG1= <>
##$CPDPRG2= <>
##$CPDPRG3= <>
##$CPDPRG4= <mlev>
##$CPDPRG5= <mlev>
##$CPDPRG6= <mlev>
##$CPDPRG7= <mlev>
##$CPDPRG8= <mlev>
##$CPDPRGB= <>
##$CPDPRGT= <>
##$D= (0..31)
0 0.7 0 0 0 0 0 0 0 0 0 0.03 0 0 0 0 0 0 0 0 0 0 0 0 0 0 0 0 0 0 0 0 
##$DATE= 1751351998
##$DBL= (0..7)
120 120 120 120 120 120 120 120 
##$DBP= (0..7)
150 150 150 150 150 150 150 150 
##$DBP07= 0
##$DBPNAM0= <>
##$DBPNAM1= <>
##$DBPNAM2= <>
##$DBPNAM3= <>
##$DBPNAM4= <>
##$DBPNAM5= <>
##$DBPNAM6= <>
##$DBPNAM7= <>
##$DBPOAL= (0..7)
0.5 0.5 0.5 0.5 0.5 0.5 0.5 0.5 
##$DBPOFFS= (0..7)
0 0 0 0 0 0 0 0 
##$DE= 6
$$ [...]
##$SUBNAM3= <"">
##$SUBNAM4= <"">
##$SUBNAM5= <"">
##$SUBNAM6= <"">
##$SUBNAM7= <"">
##$SUBNAM8= <"">
##$SUBNAM9= <"">
##$SW= 18.0517328524113
##$SWIBOX= (0..15)
0 0 2 0 0 0 0 0 0 0 0 0 0 0 0 0 
##$SW_h= 3612.71676300578
##$TD= 16384
##$TD0= 1
##$TE= 0
##$TE2= 300
##$TE3= 300
##$TEG= 300
##$TL= (0..7)
0 120 120 120 120 120 120 120 
##$TP= (0..7)
150 150 150 150 150 150 150 150 
##$TP07= 0
##$TPNAME0= <>
##$TPNAME1= <>
##$TPNAME2= <>
##$TPNAME3= <>
##$TPNAME4= <>
##$TPNAME5= <>
##$TPNAME6= <>
##$TPNAME7= <>
##$TPOAL= (0..7)
0.5 0.5 0.5 0.5 0.5 0.5 0.5 0.5 
##$TPOFFS= (0..7)
0 0 0 0 0 0 0 0 
##$TUNHIN= 0
##$TUNHOUT= 0
##$TUNXOUT= 0
##$USERA1= <user>
##$USERA2= <user>
##$USERA3= <user>
##$USERA4= <user>
##$USERA5= <user>
##$V9= 5
##$VALIST= <valist>
##$VCLIST= <CCCCCCCCCCCCCCC>
##$VD= 0
##$VDLIST= <DDDDDDDDDDDDDDD>
##$VPLIST= <PPPPPPPPPPPPPPP>
##$VTLIST= <TTTTTTTTTTTTTTT>
##$WBST= 1024
##$WBSW= 4
##$XGAIN= (0..3)
0 0 0 0 
##$XL= 0
##$YL= 0
##$YMAX_a= 317024
##$YMIN_a= -314344
##$ZGOPTNS= <>
##$ZL1= 120
##$ZL2= 120
##$ZL3= 120
##$ZL4= 120
##$ABSF1= 15.5706
##$ABSF2= -2.481252
##$ABSG= 5
##$ABSL= 3
##$ALPHA= 0
##$AQORDER= 0
##$ASSFAC= 0
##$ASSFACI= 0
##$ASSFACX= 0
##$ASSWID= 0
##$AUNMP= <proc_1d>
##$AZFE= 0.1
##$AZFW= 0.1
##$BCFW= 0
##$BC_mod= 2
##$BYTORDP= 0
##$COROFFS= 0
##$CY= -3
##$DATMOD= 1
##$DC= 0
##$DFILT= <>
##$DTYPP= 0
##$F1P= 0
##$F2P= 0
##$FCOR= 1
##$FTSIZE= 16384
##$FT_mod= 6
##$GAMMA= 0
##$GB= 0
##$INTBC= 1
##$INTSCL= 3.241238e-09
##$ISEN= 128
##$LB= 0.25
##$LEV0= 0
##$LPBIN= 0
##$MAXI= 10000
##$MC2= 0
##$MEAN= 0
##$ME_mod= 0
##$MI= 1.114404
##$NCOEF= 0
##$NC_proc= -6
##$NLEV= 6
##$NOISF1= 3.799351
##$NOISF2= 2.8
##$NSP= 0
##$NTH_PI= 0
##$NZP= 0
##$OFFSET= 15.52763
##$PC= 1
##$PHC0= -1350.289
##$PHC1= -0.03339839
##$PH_mod= 1
##$PKNL= yes
##$PPARMOD= 0
##$PSCAL= 0
##$PSIGN= 0
##$REVERSE= no
##$SF= 200.129998813111
##$SI= 16384
##$SIGF1= 3
##$SIGF2= 2
##$SINO= 0.751879
##$SIOLD= 32768
##$SREGLST= <19F.Aceton>
##$SSB= 0
##$STSI= 16384
##$STSR= 0
##$SW_p= 3612.71676300578
##$SYMM= 0
##$S_DEV= 0
##$TDeff= 16384
##$TDoff= 0
##$TI= <>
##$TILT= no
##$TM1= 0
##$TM2= 0
##$TOPLEV= 0
##$USERP1= <user>
##$USERP2= <user>
##$USERP3= <user>
##$USERP4= <user>
##$USERP5= <user>
##$WDW= 1
##$XDIM= 16384
##$YMAX_p= 283803571
##$YMIN_p= -639275
$$ End of Bruker specific parameters
$$ ---------------------------------
##NTUPLES= NMR SPECTRUM
##VAR_NAME=  FREQUENCY,     SPECTRUM/REAL,   SPECTRUM/IMAG
##SYMBOL=    X,             R,               I
##VAR_TYPE=  INDEPENDENT,   DEPENDENT,       DEPENDENT
##VAR_FORM=  AFFN,          ASDF,            ASDF
##VAR_DIM=   16384,         16384,           16384
##UNITS=     HZ,            ARBITRARY UNITS, ARBITRARY UNITS
##FACTOR=    0.220516191357247, 1,           1
##FIRST=     3107.54454391021, 0,            0
##LAST=      -505.172219095571, 0,           0
##MIN=       -505.172219095571, -639275,     0
##MAX=       3107.54454391021, 283803571,    0
$$ Real data points
##PAGE= N=1
##DATA TABLE= (X++(R..R)), XYDATA
$$ [...]
8610i911M5162j8569k0923N8037l3540K0321L003k9712j8672L4866K8848l0799
$$ -9911 35251 16682 -4241 53796 20256 40577 43580 13868 -4804 30062 58910 28111
8598B8111k9687N3015j3441j8962j11226K7013J0568O3764K893j9318k979m8453
$$ 28111 -1576 51439 37998 19036 -92190 -65177 -54609 9155 12048 -7270 -10249 -58702
8586e8702N0831L2348l0285K1083n008J49350P884j07024k6205l0933j7289N9454
$$ -58702 -7871 24477 -5808 15275 10267 159617 167501 60477 34272 3339 -13950 45504
8574D5504m5177o9053J7963K5555O3876M1474J2836N837O1510l170n1897m6981
$$ 45504 327 -68726 -50763 -25208 38668 80142 92978 98815 160325 157155 105258 58277
8562E8277k196J279P767J1741o6029j5191L5123J151j0219k4955m220K8302K6841
$$ 58277 56081 57360 65127 76868 10839 -4352 30771 31922 21703 -3252 -7472 20830 47671
8549D7671l9448K267k0827L7521Q3527l1271p4818m4492j1371L3078P7145p8701
$$ 47671 8223 10490 -10337 27184 110711 79440 4622 -39870 -51241 -18163 58982 -19719
8537a9719k5772L2398j7453P3523l5285m1084L4804O184P317K7852J7994k7188
$$ -19719 -45491 -13093 -30546 42977 7692 -33392 1412 7596 14913 42765 60759 33571
8525C3571k1871j6186j472o1060Q7k9527N305K1622l884K0574l067n4861k2186
$$ 33571 11700 -4486 -5958 -67018 -66931 -96458 -91153 -69531 -73415 -52841 -55908 -110769 -132955
8512a32955P7595M3981J428o13J514j7151K0853m3392K0647j8743K6155L806q406
$$ -132955 -55360 -11379 -9951 -10564 -9050 -26201 -5348 -48740 -28093 -46836 -20681 -16875 -25281
8499b5281K6414M7837j9479j09018K4039M5183L1345K479m1515m9513M1777j779
$$ -25281 1133 48970 29491 -79527 -55488 -10305 21040 23519 -17996 -67509 -25732 -27511
8487b7511k9009M0442L5828m6195J0097L488k3208P8294l6190n7657N5511K1266
$$ -27511 -56520 -16078 19750 -26445 -16348 -12860 -36068 42226 6036 -51621 3890 25156
8475B5156l5112j5787J0241K6881K6791m1341j0709L5863j8088K6291k1483l2890
$$ 25156 -9956 -25743 -15502 11379 38170 -3171 -13880 21983 3895 30186 8703 -24187
8463b4187N1793m858q438j3146J0241J9275k5144j4216J0038n7802o867N3457
$$ -24187 27606 22748 14310 1164 11405 30680 5536 -8680 1358 -56444 -63311 -9854
8451i854j2330O9631L4886k6486j1298N442N687m870J5459o4670p398J7995k0881
$$ -9854 -22184 47447 82333 55847 44549 49991 55678 50808 66267 1597 -5801 12194 -8687
8438h687K2583l9604k4833l7512K7392M7651N4409K128n8850j1321j527J2569
$$ -8687 13896 -25708 -50541 -88053 -60661 -13010 41399 43527 -15323 -26644 -28171 -15602
8426a5602p653j04572m9275J21347M3628J17751m5129j7001k052J5988K7775M9511
$$ -15602 -23255 -127827 -177102 -55755 -12127 105624 60495 43494 41442 57430 85205 134716
8414A34716k8018j09175N0238N9410q135p3623K8265o379l7465j6766k7781L4353
$$ 134716 106698 -2477 47761 107171 99036 25413 53678 47299 9834 -6932 -34713 -360
8402c60K226k170J3713j26126J3561R3283O1071l6717O957k5437n381k5472J1089
$$ -360 1866 -304 13409 -112717 -99156 -5873 55198 18481 25438 1 -5380 -30852 -19763
8389a9763O171j5921j0277J5421K3034Q00n4125J3845K3873o491O214l8429K1450
$$ -19763 -13592 -29513 -39790 -24369 -1335 -535 -54660 -40815 -16942 -23433 -17219 -55648 -34198
8376c4198O2533m1590k9299L1066M4601J4817l3523j7995p3598j6435J9922K1805
$$ -34198 28335 -13255 -42554 -11488 33113 47930 14407 -3588 -77186 -93621 -73699 -51894
8364e1894k7674K4000O308p99N206K5565n7793O610Q2701M1439m6938l1734l6087
$$ -51894 -79568 -55568 -49260 -50059 -44853 -19288 -77081 -70471 12230 53669 6731 -25003 -61090
8351f1090j6645N4652j1646L3693M7384n8303j4392Q9261o171M768J372o5697
$$ -61090 -77735 -23083 -34729 -1036 46348 -11955 -26347 62914 56743 61511 62883 -2814
8339b814l5066m841M4278J2295l9222K1517L184p979L1359j4313j2123J6633j836
$$ -2814 -37880 -42721 1557 13852 -25370 -3853 -669 -8648 22711 8398 -3725 12908 11072
8326A1072l5805n8915Q384P3318N3904q1810K5567K7017r0011j2165N2493L3079
$$ 11072 -24733 -83648 -75264 -1946 51958 -29852 -4285 22732 -67279 -79444 -26951 6128
8314F128n285K8834m3977m0667R459Q535K5583K3420k3758r8972k8894K8161L8896
$$ 6128 843 29677 -14300 -54967 -45508 -36973 -11390 12030 -11728 -110700 -139594 -111433 -72537
8301g2537R3612n2554m4998N5613l467K7304O2439j3931n6855k0874J5611m850
$$ -72537 21075 -31479 -76477 -20864 -24331 2973 65412 51481 -5374 -26248 -10637 -15487
8289a5487O68J1062p475P8060k3344l5721k2945L0460K3365p2993O5825l6050
$$ -15487 -14819 -3757 -11232 66828 43484 7763 -15182 15278 38643 -34350 31475 -4575
8277d575o5784j3785L646K0357L9227l1368o693m6591O8429J9610K176m207K2563
$$ -4575 -70359 -84144 -80498 -60141 -20914 -52282 -58975 -105566 -37137 -17527 -15351 -19558 3005
8264C005m6323m4361M9359J4204l0742l5016o8869O6296P2084j3739N9075J2919
$$ 3005 -43318 -87679 -38320 -24116 -54858 -89874 -158743 -92447 -20363 -34102 24973 37892
8252C7892m0833K6984l6291k6855K515n5559P3213n0532J8683q195K8222n6012
$$ 37892 -2941 24043 -12248 -39103 -36588 -92147 -18934 -69466 -50783 -58978 -30756 -86768
8240h6768N1712P088Q1668o0947n2418K1811k8815N0457L5681j2784j4681N8898
$$ -86768 -35056 -27968 53700 -7247 -59665 -37854 -66669 -16212 19469 6685 -7996 50902
8228E0902J0412j09483j3554L6903J8715N719m5222k9599L4252O3287j5327p0957
$$ 50902 61314 -48169 -61723 -24820 -6105 -386 -45608 -75207 -40955 22332 7005 -63952
8216f3952J278O6118n075k2134O6570M3392n2100K0645k9700j8548k5509K5126
$$ -63952 -62674 3444 -1631 -23765 42805 86197 34097 54742 25042 6494 -19015 6111
8204F111L7320K5918r0647m4343j1046j2917P440J72582J9732J04409j03437K66649
$$ 6111 43431 69349 -21298 -65641 -76687 -89604 -82164 90418 110150 214559 111122 377771
8192C77771n75531m41515L11901Q8225J83928l7877k2873m8022P2126j5499M5961
$$ 377771 -197760 -639275 -327374 -239149 -55221 -93098 -115971 -163993 -91867 -107366 -61405
8181f1405p2498k671J166L5157n725M6489P428J0354K2829j0054l8106J22040
$$ -61405 -133903 -136574 -135408 -100251 -105976 -59487 -52059 -41705 -18876 -28930 -67036 55004
8169E5004p4932J5251L869L9401k1659o0076p4119j4730O2500Q4692l4866q453
$$ 55004 -19928 -4677 -808 38593 16934 -43142 -117261 -131991 -69491 15201 -19665 -28118
8157b8118l9993m716L8432l8729M0567m7961j4622M0617N3865m0093J521m8895
$$ -28118 -68111 -72827 -34395 -73124 -32557 -80518 -95140 -54523 -658 -40751 -39230 -88125
8145h8125l8095K7034M1077k2213o951K6957m4427l5858N1556M0022M8480k3889
$$ -88125 -126220 -99186 -58109 -80322 -87273 -60316 -104743 -140601 -89045 -49023 -543 -24432
8133b4432j9895k2747P3651o1893m525R612l5763M0720J554k559k9837O1237o452
$$ -24432 -44327 -67074 6577 -55316 -59841 -50229 -85992 -45272 -43718 -46277 -76114 -14877 -21329
8120b1329j4918K3414k1217l9096k6450M2950L3219j0140J4688l4065K1051p719
$$ -21329 -36247 -12833 -34050 -73146 -99596 -56646 -23427 -33567 -18879 -52944 -31893 -39612
8108c9612n2837N7399J04618l4656p7687K206L168P5682j8724K6830j2319r490
$$ -39612 -92449 -35050 69568 34912 -42775 -40569 -37401 38281 19557 46387 34068 24578
8096B4578m9831J1573K4215m1056k6510J6100j4429m5199L7800N3442k2112N467
$$ 24578 -25253 -13680 10535 -30521 -57031 -40931 -55360 -100559 -62759 -9317 -31429 -25962
8084b5962M2588l2559l330K8935k2630m465p746L2022K0716l6221J520j9396r238
$$ -25962 16626 -15933 -19263 9672 -12958 -17423 -25169 6853 27569 -8652 -7132 -26528 -35766
8071c5766O034K9882P6545l638k9914q2128J2777k055j34n810K3273K6843j13147
$$ -35766 -29732 150 76695 73057 43143 -38985 -26208 -28263 -28397 -34207 -10934 15909 -97238
8058i7238j5490J5089N3594l8921K274L563J9196k6567L4560K3335n085K594j3809
$$ -97238 -112728 -97639 -44045 -82966 -80692 -77129 -57933 -84500 -49940 -26605 -31690 -29096 -42905
8045d2905K3462p2824J1726j5383O4355R2451M54l6501n2659K4202k5547k349
$$ -42905 -19443 -92267 -80541 -95924 -31569 60882 61336 24835 -27824 -3622 -29169 -31518
8033c1518p976k406j8981O149O1447n4373k6819l380R187K2167l9737N0878K8727
$$ -31518 -39494 -41900 -60881 -54732 6715 -47658 -74477 -77857 -68670 -46503 -86240 -35362 -6635
8020f635L3418j7930k0314K6549n0073L0052N0847K056n1512N8137k9351p0419
$$ -6635 26783 8853 -11461 15088 -34985 -4933 45914 47970 -3542 54595 25244 -45175
8008d5175M6202J5304n6613N188J3008m1291J4323k6769o278j6172N8149k200
$$ -45175 1027 16331 -40282 -35094 -22086 -63377 -49054 -75823 -82101 -98273 -40124 -42324
7996d2324K9978P310J5960P0455p5832K5167M5976j945n2059R624j3074l1740
$$ -42324 -12346 -5036 10924 81379 5547 30714 76690 74745 22686 32310 19236 -12504
7984a2504J5452k8049k6683O543J9034k6310J9224J8216l031j5322j0132Q1355
$$ -12504 2948 -25101 -51784 -45241 -26207 -52517 -33293 -15077 -18108 -33430 -43562 37793
7972C7793N7291o7511q1687j040J36249j5768J2039K7366n835J0123M0574N1721
$$ 37793 95084 27573 -54114 -55154 81095 65327 77366 104732 98897 109020 149594 201315
7960B01315M1401m0686N8767L7129O127L6246J56106J66863J52837J83324O7089
$$ 201315 242716 202030 260797 297926 304053 340299 496405 663268 816105 999429 1066518
7949A066518m9987j63302j64190j65949o3839k5129q5646p6669j19865k8110P0002
$$ 1066518 1016531 853229 689039 523090 459251 434122 348476 271807 151942 123832 193834
7938A93834l6349k5015p380K928m2809J2477J5459K6460n4361l2565O5658J7402
$$ 193834 157485 132470 125090 128018 85209 97686 113145 139605 85244 52679 118337 135739
7926A35739l3598k2516k073O56l8981M477J4234l6895M0907N3493q0105n4539
$$ 135739 102141 79625 77552 78208 39227 43704 57938 21043 61950 115443 35338 -19201
7914a9201L4485O5408n0812j6590r39J4447l8059k0147m926J0053L6250L3651
$$ -19201 15284 80692 29880 13290 12351 26798 -11261 -31408 -36334 -26281 9969 43620
7902D3620l7457j0380Q7497k1657m6833J958K830l4506n4472M1778K9921J7227
$$ 43620 6163 -4217 83280 61623 14790 16748 19578 -14928 -69400 -27622 2299 19526
7890A9526M5269L1340j8416r4350l5571j4784j2182K4179J9752j0503j3988M019
$$ 19526 64795 96135 77719 -16631 -52202 -66986 -79168 -54989 -35237 -45740 -59728 -55709
7878e5709k2478Q292Q0197j1681m6243K5288l8679L2820n315l9996P035M2870
$$ -55709 -78187 -69895 10302 -1379 -47622 -22334 -61013 -28193 -33508 -73504 -66469 -23599
7866b3599j5388J6709j9393j7284j9209L5624n543L8715P9606j01353L5287o290
$$ -23599 -38987 -22278 -41671 -58955 -78164 -42540 -48083 -9368 70238 -31115 4172 -2118
7854b118M1568O5342p3795l4047K1462j093J0205r298r748K420l2166M4061O6547
$$ -2118 39450 104792 30997 -3050 18412 17319 27524 18226 8478 10898 -21268 22793 89340
7841H9340p9879m6165O1724L7183k1639M1538o9072N1770q8715q045M1351L2976
$$ 89340 9461 -36704 25020 62203 40564 82102 13030 64800 -23915 -31960 9391 42367
7829D2367O945k8743o3230K1258P2064J9045q785o7653o5994m350J79N1866P8414
$$ 42367 49312 20569 -42661 -21403 50661 69706 60921 -6732 -72726 -77076 -76897 -25031 53383
7816E3383L8539o4016M3757l4755N8920L8135L114m8016n9993M9579J7694l6437
$$ 53383 91922 27906 71663 36908 95828 133963 137077 89061 29068 78647 96341 59904
7804E9904J11542j88017j83688K06290l7408M2744r795R261J2666J5484n2101
$$ 59904 171446 -16571 -200259 6031 -31377 11367 1572 10833 23499 38983 -13118
7793a3118P317L3296M8616n600P6603J182l340J5785n0728j8796N7793j3758m5794
$$ -13118 -5801 27495 76111 70511 147114 148296 144956 160741 110013 91217 149010 135252 89458
7780H9458p9779Q221l1088M6750O1548j0611j01584K2610R0590M3739o4985r479
$$ 89458 9679 17900 -13188 33562 95110 84499 -17085 5525 96115 139854 74869 65390
7768F5390K7241q312P3736M2592j4421R753J1850l4694N5049l0512o6709N302
$$ 65390 92631 84319 158055 200647 186226 195979 207829 173135 228184 197672 130963 136265
7756A36265N3397l5905l0609m1986j10752K1772L8565l2756l2360P0082N8619
$$ 136265 189662 153757 123148 81162 -29590 -7818 30747 -2009 -34369 35713 94332
7745I4332K358j5842J7021O2485j3150J0329k4393m107J7708K7062J0231J8924
$$ 94332 96690 80848 97869 160354 147204 157533 133140 129033 146741 173803 184034 202958
7733B02958M2091l3265k7390j2552J7634J7555n4914q9830k749P0676o3429o6476
$$ 202958 245049 211784 184394 171842 189476 207031 152117 62287 59538 130214 66785 309
7721C09L1872O8590K4864N189m0832J5175L9534J0993J014K8283n6175J4365L2887
$$ 309 32181 100771 125635 130824 89992 105167 144701 155694 156708 184991 128816 143181 176068
7708A76068M0747J6286o6864r5079J0500M0866j2879n8881r849L3813N518K7053
$$ 176068 216815 233101 166237 71158 81658 122524 109645 50764 40915 74728 80246 107299
7696A07299o0416J219L5733J2756K6989P5858k6462J18320l1709J1396M9156r5567
$$ 107299 46883 48102 83835 96591 123580 199438 172976 291296 259587 270983 320139 224572
7684B24572p980k1129l1274K8910m3008o6374r566R487n5151j8815K1731J2979
$$ 224572 216592 195463 164189 193099 150091 83717 74151 83638 28487 9672 31403 44382
7672D4382O4854n0173L9575r257O7K3098j9018k5024M1833J5379r518l7803J447
$$ 44382 109236 59063 98638 89381 89448 112546 93528 68504 110337 125716 116198 78395 79842
7659G9842l1538N684o1434J4997R5501r8096k646P397l0431P9736O0446n2894
$$ 79842 48304 53988 -7446 7551 103052 4956 2310 9707 -20724 59012 119458 66564
7647F6564o7510K2741q622r180J5950N74J2449q8562L6230Q115K2079J05242p9977
$$ 66564 -946 21795 13173 3993 19943 20517 32966 -55596 -19366 -11251 10828 116070 36093
7634C6093m9066M8172J03654p3431J076P174l6516j2617k9544J2012P19j4313
$$ 36093 -12973 35199 138853 65422 66498 73672 37156 24539 -5005 7007 7726 -6587
7622f587K212P021J677j8521J4444N2040l9275J3832m6888J4484N9829o4166N5039
$$ -6587 -4375 2646 4323 -14198 246 52286 13011 26843 -20045 -5561 54268 -9898 45141
7609D5141k4176k2114K3194L156N0195k8645n2745k2658O276j1620n0847N6183
$$ 45141 20965 -1149 22045 25201 75396 46751 -5994 -28652 -22376 -33996 -84843 -28660
7597b8660L6408k0277L6457O417l3397j6667l94L2831j0159m77J6420n3323J1698
$$ -28660 7748 -12529 23928 30345 -3052 -19719 -20113 12718 2559 2082 18502 -34821 -23123
7584b3123l6864p393M4003O575M1085l3317J1369p1144m257Q64o1789N2718K0479
$$ -23123 -59987 -67380 -23377 -16802 24283 -9034 2335 -68809 -73066 -72202 -133991 -81273 -60794
7571f0794R1497j8632m9896k2162m2816R5229p705m8870N9196j7337K324j4915
$$ -60794 30703 12071 -37825 -59987 -102803 -7574 -15279 -64149 -4953 -22290 -19966 -34881
7559c4881K0713L614M014n6567L3053p9698K7171l3260N8845k6099L3316k121
$$ -34881 -14168 -10554 -6540 -63107 -30054 -109752 -82581 -115841 -56996 -83095 -49779 -51900
7547e1900Q696K7161j2581j5055j4544j3268n8172J7166L5930L0512j4522R328
$$ -51900 -43204 -16043 -28624 -43679 -58223 -71491 -129663 -112497 -76567 -46055 -60577 -51249
7535e1249O943l6209j6424O054l8533J2476P3027R41L768o7101O1279L4438O719
$$ -51249 -44306 -80515 -96939 -90885 -129418 -116942 -43915 -42974 -39206 -106307 -45028 -10590 -3871
7522c871M1719l6841L1942j5535o8672j4202N744k8943P3593M8091p5888o8305
$$ -3871 37848 1007 32949 17414 -51258 -65460 -59716 -88659 -15066 33025 -42863 -111168
7510a11168M2101q036K5841k4154l3835L7642Q962O788k4602j1696L8196L828
$$ -111168 -69067 -77103 -51262 -75416 -109251 -71609 -62647 -55859 -80461 -92157 -53961 -50133
7498e0133J5045l6774O0086j8760l0215n6388J7659L7151M9758j5584L047k6894
$$ -50133 -35088 -71862 -11776 -30536 -60751 -117139 -99480 -62329 -12571 -28155 -25108 -52002
7486e2002P1241J453o0115k1126L6163n7600O7019K3006p8743k0516p44L8707
$$ -52002 19239 20692 -39423 -60549 -24386 -81986 -14967 8039 -70704 -91220 -91964 -53257
7474e3257j4073m337k1044L5052j9908K5409K9036q092L258l4988l1347l9212
$$ -53257 -67330 -71667 -92711 -57659 -77567 -52158 -23122 -31214 -27956 -62944 -94291 -133503
7462a33503L8008j411K4432L5821j5845l5456L8505K1964l303J452o328K6077
$$ -133503 -95495 -96906 -72474 -36653 -52498 -87954 -49449 -27485 -30788 -29336 -35664 -9587
7450i587m9473n6925K9899K7463l2885N312j6671J7529N2937m1633K3321p220
$$ -9587 -59060 -115985 -86086 -58623 -91508 -86196 -102867 -85338 -32401 -74034 -50713 -57933
7438e7933N9749k8378m7656j9884J7411L2974p1l305K1594M4972j8775n7921m8263
$$ -57933 1816 -26562 -74218 -94102 -76691 -43717 -43788 -47093 -25499 19473 698 -57223 -105486
7425a05486j9776J9591L0942K7953L7308l8028l3162M635M3964m782o7689P060
$$ -105486 -125262 -105671 -74729 -46776 -9468 -47496 -80658 -76023 -32059 -36841 -104530 -97470
7413i7470M4497j8361j5166n573N3696K3350k6385k1310J1313m434N257K6010
$$ -97470 -52973 -71334 -86500 -92073 -38377 -15027 -41412 -62722 -51409 -55843 -50586 -24576
7401b4576K110l3230M9912K021j3878l6144J7431K9677k1172l4226K0485m6064
$$ -24576 -22466 -55696 -5784 -3763 -17641 -53785 -36354 -6677 -27849 -62075 -41590 -87654
7389h7654N2399l2389j5975n1454P322K8557Q4384j9378l1712p689N2462j2437
$$ -87654 -35255 -67644 -83619 -135073 -127751 -99194 -14810 -34188 -65900 -73589 -21127 -33564
7377c3564J1712l6593m2247O3808N372m5822L7973k5946J2444K4158o3332o398
$$ -33564 -21852 -58445 -100692 -36884 -31512 -77334 -39361 -65307 -52863 -28705 -92037 -98435
7365i8435K365k557m49M688m684J1915l1950r539L2017j0905j6810J2019J856
$$ -98435 -96070 -98627 -99076 -94388 -99072 -87157 -119107 -128646 -96629 -107534 -124344 -112325 -110469
7352a10469L5341O3761L6744j10486n940N2826J5587j9329L0712j186J2079q492
$$ -110469 -75128 -11367 25377 -85109 -91049 -38223 -22636 -41965 -11253 -12439 -360 -8852
7340h852m6047l4050L343o821q062j40N079K506M0220m349j7807M2253K9397L0935
$$ -8852 -54899 -88949 -85606 -92427 -100489 -100629 -95550 -93044 -52824 -57173 -74980 -32727 -3330 27605
7326B7605m217j07039l6457J5508m1084j1146P0834m474J20j8966K287L6478L465
$$ 27605 23388 -83651 -120108 -104600 -145684 -156830 -85996 -90470 -90350 -109316 -107029 -70551 -67086
7313f7086m0411l8086M5948O2483n92R114n3252R187J9547j5019J5048O4171o8895
$$ -67086 -107497 -145583 -99635 -37152 -37744 -28630 -81882 -72695 -53148 -68167 -53119 11052 -57843
7300e7843L6427J0228j14243O1568j8138j298J9566M796j4187k9931L7683O9711
$$ -57843 -21416 -11188 -125431 -63863 -82001 -83299 -63733 -58937 -73124 -103055 -65372 4339
7288D339m3741m9940O2620L478k1135l9964K081M9774n4117m204O357q607L6179
$$ 4339 -39402 -89342 -26722 -23244 -44379 -84343 -82262 -32488 -86605 -90809 -84452 -93059 -56880
7275e6880o2152R540q547j4737O7925l1150J997K513m8123P2656J16569q6287
$$ -56880 -119032 -109492 -118039 -132776 -64851 -96001 -94004 -91491 -139614 -66958 49611 -36676
7263c6676J5215l5926l8478P4727K3175o567k2242j1970m2732N8973j2517N1118
$$ -36676 -21461 -57387 -95865 -21138 2037 -4530 -26772 -38742 -81474 -22501 -35018 16100
7251A6100L0867l0801m6249k0538o9321P4577j3473p0613j5089L1101j7970p317
$$ 16100 46967 16166 -30083 -50621 -119942 -45365 -58838 -129451 -144540 -113439 -131409 -138726
7239a38726J9704k9242J10608p90n2851k4758R984L8939J8126l6160M3750K7627
$$ -138726 -119022 -148264 -37656 -38446 -91297 -116055 -106071 -67132 -49006 -85166 -41416 -13789
7227a3789m9355J2113J3945J9534l8495J0558P8154k0653l4888j260j5516l0816
$$ -13789 -63144 -51031 -37086 -17552 -56047 -45489 32665 12012 -22876 -24136 -39652 -70468
7215g0468K2314p028l1079P6396k2797N530Q3791l7589l1731q6844Q0373o221
$$ -70468 -48154 -55182 -86261 -9865 -32662 -27132 56659 19070 -12661 -99505 -19132 -25353
7203b5353L806J2749k8390j5940k690J0777N1627j02893m235M6134K8477M28p1104
$$ -25353 -21547 -8798 -37188 -53128 -55818 -45041 6586 -96307 -100542 -54408 -25931 -25503 -96607
7190i6607K4890L531J5073l9987K0363L915J6530P4564K8866k1409p643l8041
$$ -96607 -71717 -68186 -53113 -93100 -72737 -68822 -52292 22272 51138 29729 22086 -15955
7178a5955L5689o881K7440J8038K8103n0740p3480L3700n5111P6775n0258N45
$$ -15955 19734 12853 40293 58331 86434 35694 -37786 -4086 -59197 17578 -32680 -32135
7166c2135M9979l432J2389K1962R710j2022j7437L586K3331O4040n6317k3336
$$ -32135 17844 14412 26801 48763 58473 46451 29014 32600 55931 119971 63654 40318
7154D0318J6344N3090O9406J1322K8382L9483N775K446m6553L9013j5404j689
$$ 40318 56662 109752 179158 190480 218862 258345 264120 266566 220013 259026 243622 241933
7142B41933K1519R1535J32334L7997n810m5099J03085M2543N2313L6816J00606
$$ 241933 263452 354987 487321 525318 519508 474409 577494 620037 672350 709166 809772
7131H09772M3517J56824J57376J77994K36618L65385M59624M61617K40073O8333
$$ 809772 853289 1010113 1167489 1345483 1582101 1947486 2407110 2868727 3108800 3177133
7121C177133l83069n53658l35246l23286k37754k01109j54083r2696k2935j08860
$$ 3177133 2794064 2240406 1905160 1581874 1344120 1143011 988928 896232 873297 764437
7111G64437o0122q7797r6539k0404K8641r054r9393m1694N5972k1432m1095o2798
$$ 764437 704315 616518 519979 499575 528216 519162 419769 378075 434047 412615 371520 308722
7099C08722j33139K0889K3697M2716j035K7844j8288q1171q3477J5673M7206P1377
$$ 308722 175583 196472 220169 262885 261850 289694 271406 190235 106758 122431 169637 241014
7087B41014q713p0585k1120o1832K8262N693R719j7764L9646Q0136n8030m8828
$$ 241014 232301 161716 140596 78764 107026 112719 122438 104674 144320 224456 166426 117598
7075A17598P173J1999j2020K853O8181q3220J9758n2949k9252Q6027J4261j99
$$ 117598 124771 136770 124750 127603 195784 112564 132322 79373 50121 136148 150409 150210
7063A50210M6797j7352r2496J1276O0149J2993l936K9309L696M1326K5518j0731
$$ 150210 197007 179655 87159 98435 158584 171577 167641 196950 200646 241972 267490 256759
7051B56759R2270O3554j9860k8879m2567o0754L3638M2457M3605k1266k7667j9821
$$ 256759 349029 412583 392723 363844 321277 260523 294161 336618 380223 358957 331290 311469
7039C11469q5162j6182N5257M5806m7082j710o3921m0050L4127p700p9742K6888
$$ 311469 226307 210125 265382 311188 264106 262396 198475 158425 192552 184852 105110 131998
7027A31998R343o544o405j2938J0657J6365j064m0084j7105L3832o8152K0949
$$ 131998 141341 134797 128392 115454 126111 142476 141412 101328 84223 118055 49903 70852
7015G0852J9002L899O5635L896m2699o3740L7820K9164K9484j0228N3691J9686
$$ 70852 89854 93753 159388 163284 120585 56845 94665 123829 153313 143085 196776 216462
7003B16462J9806J05498N9226j8717k3447p043j5865P34m0152R8224L0878k5987
$$ 216462 236268 341766 400992 382275 358828 351785 335920 336654 296502 394726 425604 399617
6991C99617R1652m0842J3828p1343N20P2591m389n9064m0317m699n9422m7981
$$ 399617 491269 450427 464255 392912 393432 466023 461634 402570 362253 357554 298132 250151
6979B50151N2625m5867o1642p264j7921J430J0802M2092J8421L9105m4317o0858
$$ 250151 302776 256909 195267 188003 170082 171512 182314 224406 242827 281932 237615 176757
6967A76757k952j9145o796j3772K577K6148o2967k4240j1619J0408Q317M1357
$$ 176757 173805 154660 147864 134092 136669 162817 99850 75610 63991 74399 82716 124073
6955A24073l4308L6096Q2850j0270j6619R9665k7711k6149L7965O4052M6992K2241
$$ 124073 89765 125861 208711 198441 181822 281487 253776 227627 265592 329644 376636 398877
6943C98877m6707m1793N8926k0881K5545k3146L9798m6411j12153m2861J6405
$$ 398877 352170 310377 369303 348422 373967 350821 390619 344208 232055 189194 205599
6932B05599J5498p558n942l2944l1479j3919o0769n4296N803o154j9726l7604
$$ 205599 221097 213539 207597 174653 143174 129255 68486 14190 19993 13839 -5887 -43491
6920d3491m4375Q9976K9318q5808j8745N7790j7356j4662p240K4822Q692o117
$$ -43491 -87866 2110 31428 -54380 -73125 -15335 -32691 -47353 -54593 -29771 -21079 -27196
6908b7196l4658P2959L5923k4760l0919O8739l3416r2237J6072l1936N7032r129
$$ -27196 -61854 11105 47028 22268 -8651 60088 26672 -65565 -49493 -81429 -24397 -33526
6896c3526L1659P0462o6522k3963J4169K5763m4151o3244M8354n9798Q5260L4471
$$ -33526 -1867 68595 2073 -21890 -7721 18042 -26109 -89353 -40999 -100797 -15537 18934
6884A8934n594J5228m1333p5024N4002L0445l4714p47l630N9691q2149m2643N4802
$$ 18934 13340 28568 -12765 -87789 -33787 -3342 -38056 -38803 -42433 17258 -64891 -107534 -52732
6871e2732m6066j1087l0907N0631R6814J9657p8145K440M2216J6802L3959p0953
$$ -52732 -98798 -109885 -140792 -90161 6653 26310 -51835 -49395 -7179 9623 43582 -27371
6859b7371o5859K0699J6068m3410n171M2261L6612m5242j2915K4107J1635j9264
$$ -27371 -93230 -72531 -56463 -99873 -105044 -62783 -26171 -71413 -84328 -60221 -48586 -67850
6847f7850K6013J8211q138J9531M7366o1374j384k6370j7629J1433L2387K1573
$$ -67850 -41837 -23626 -31764 -12233 35133 -26241 -27625 -53995 -71624 -60191 -27804 -6231
6835f231j1217j36493R114J6612J485J10629m6217K5749J4287k3029m5682k889
$$ -6231 -17448 -153941 -144827 -128215 -126730 -16101 -62318 -36569 -22282 -45311 -90993 -93882
6823i3882j2665O4762l5262j8330j8407m2504k6277K7105Q6953J4645k1204J5248
$$ -93882 -106547 -41785 -77047 -95377 -113784 -156288 -182565 -155460 -68507 -53862 -75066 -59818
6811e9818L3095l1452p8414O6522J9106j4558K8249m5026K743l566L0101r492
$$ -59818 -26723 -58175 -136589 -70067 -50961 -65519 -37270 -82296 -79553 -83119 -53018 -62510
6799f2510J011l8389m488O9311k9922l3098K5978N99J7096l0901l1790k2989L3546
$$ -62510 -61499 -99888 -104376 -35065 -64987 -98085 -72107 -71508 -54412 -85313 -117103 -140092 -106546
6786a06546R6925O916k0157k6249k2425K5032N3985L2310l3963n00j5835L135
$$ -106546 -9621 -2705 -22862 -49111 -71536 -46504 7481 39791 5828 5328 -10507 -7372
6774g372O730m1691L949n7203k0011K8488J9849M248J892q372K3924M4111Q7397
$$ -7372 -642 -42333 -38384 -95587 -115598 -87110 -67261 -63013 -61121 -69493 -45569 -1458 85939
6761H5939l6091m1049N1141L8201L1898N7916J1455J00709Q8021M8637N9296J03766
$$ 85939 49848 8799 59940 98141 130039 187955 199410 300119 388140 436777 496073 599839
6749E99839j1851j06662j09149j20223m1206m1268k2810J3278j3199l4630M5740
$$ 599839 587988 481326 372177 251954 210748 169480 146670 159948 146749 112119 157859
6738A57859n6181J637j4750n0305l2470l7292m868N327m8477o131K8190M0077
$$ 157859 101678 103315 88565 38260 5790 -31502 -36370 -31043 -79520 -85651 -57461 -17384
6726a7384M1831r731p4623K0154M6754l6894N8719o9449m3075O5033l2275k969
$$ -17384 24447 14716 -59907 -39753 7001 -29893 28826 -40623 -83698 -18665 -50940 -53909
6714e3909l3883J8538J9723m6950k0885k1798P012R7956K8058Q079k9359K99l6374
$$ -53909 -87792 -69254 -49531 -96481 -117366 -139164 -132152 -34196 -6138 1941 -27418 -27119 -63493
6701f3493m4956L2666J1550J7805j4858j3780l2667K5989J8712l7471K3776L8982
$$ -63493 -108449 -75783 -64233 -46428 -61286 -75066 -107733 -81744 -63032 -100503 -76727 -37745
6689c7745l3954p310p464l6040j026M4518j494J1430j4054N7066M3403j11868
$$ -37745 -71699 -79009 -86473 -122513 -123539 -79021 -80515 -69085 -83139 -26073 17330 -94538
6677i4538j4765r826Q104N0513m3432L0524N1585l408l7221j4266K9298n6396
$$ -94538 -109303 -119129 -111025 -60512 -103944 -73420 -21835 -25243 -62464 -76730 -47432 -103828
6665a03828l8893M3473L7938m4892P5090k5432K3220j4465r8546j5687K642M428
$$ -103828 -142721 -99248 -61310 -106202 -31112 -56544 -33324 -47789 -146335 -162022 -159380 -154952
6653a54952J5386L2466M6456m866r365J9883o0330M8535m824P15l2435j4074L5060
$$ -154952 -139566 -107100 -60644 -65510 -74875 -54992 -115322 -66787 -71611 -70896 -103331 -117405 -82345
6640h2345Q3663p9342q3083O5350K7308J0557n0807P5806J0520p0673j1416R502
$$ -82345 1318 -78024 -161107 -95757 -68449 -57892 -108699 -32893 -22373 -93046 -104462 -94960
6628i4960K3703K6109M3677J0680n3717j5176N2132j00609n9866P3526n5633k1684
$$ -94960 -71257 -45148 -1471 9209 -44508 -59684 -7552 -108161 -168027 -94501 -150134 -171818
6616a71818j207M0960J5737k6551P7998K2832j3059n1418O8613o5807J4020O5241
$$ -171818 -173025 -132065 -116328 -142879 -64881 -42049 -55108 -106526 -37913 -103720 -89700 -24459
6604b4459j06075K2245L3002n215k7602M2296L7480J682j0530L3982p0491M03
$$ -24459 -130534 -108289 -75287 -80502 -108104 -65808 -28328 -26646 -37176 -3194 -73685 -73282
6592g3282n258j1372K2611j338n5888L9468j9461J0924O3341k7678j2441n6936
$$ -73282 -78540 -89912 -67301 -68639 -124527 -85059 -104520 -93596 -30255 -57933 -70374 -127310
6580a27310O2112k2654k546q9950K2185K5228j6551M1796L3631R950K804n7467
$$ -127310 -65198 -87852 -90398 -180348 -158163 -132935 -149486 -107690 -74059 -64109 -61305 -118772
6568a18772k519J9430R025J9827L520J7663l8286l7601O9222N2332p4849N2088
$$ -118772 -121291 -101861 -92836 -73009 -69489 -51826 -90112 -127713 -58491 -6159 -81008 -28920
6556b8920J4362p9715J9527N0703p7176k4959M3614K081J16j8455m713Q696j2248
$$ -28920 -14558 -94273 -74746 -24043 -101219 -126178 -82564 -80483 -80367 -98822 -103535 -94839 -107087
6543a07087L2523O2696p0232n5598M5111k7788R426l2130j7810N7994J0026Q8359
$$ -107087 -74564 -11868 -82100 -137698 -92587 -120375 -110949 -143079 -160889 -102895 -92869 -4510
6531d510K6799o7609J9278M8410j4518o6241j07327N2001N4163O478n1442N199
$$ -4510 22289 -45320 -26042 22368 7850 -58391 -165718 -113717 -59554 -53076 -104518 -99319
6519i9319l5367J2334K635J3438J3044J1236n112m469K9713m2358l1208J77M7137
$$ -99319 -134686 -122352 -119717 -106279 -93235 -81999 -87111 -91580 -61867 -104225 -135433 -135256 -88119
6506h8119J0469l0601l3327J5099R898L983P290m1569L1400J07977o3227K9779
$$ -88119 -77650 -108251 -141578 -126479 -116581 -112598 -105308 -146877 -115477 -7500 -70727 -40948
6494d0948k9534L8633L7825n9173r596K2559K567k6124j9758l3781j2422N6340
$$ -40948 -70482 -31849 5976 -53197 -62793 -40234 -37667 -63791 -83549 -117330 -129752 -73412
6482g3412k3102K2326O4459M4532k8439R607j9842m2727m7530m7151J5485o159
$$ -73412 -96514 -74188 -9729 34803 6364 15971 -3871 -46598 -94128 -141279 -125794 -131953
6470a31953O0260K0669k9600K2250l8957k6660K00j147M7877O2887J7315n5718
$$ -131953 -71693 -51024 -80624 -58374 -97331 -123991 -123791 -124938 -77061 -14174 3141 -52577
6458e2577J3315m3657j7963L9456l8842K8918K1173J6275K773K3734M3370P2676
$$ -52577 -39262 -82919 -100882 -61426 -100268 -71350 -50177 -33902 -31129 -7395 35975 108651
6446A08651l9378l6927O8125m2724o202r9353N434M809k5563J293L5207J7276
$$ 108651 69273 32346 100471 57747 51545 -47808 -42374 -37565 -63128 -61835 -26628 -9352
6434i352r6333N440J345L2870j4383Q4627Q872j16935M1333O1605K8991l5253
$$ -9352 -105685 -100245 -98900 -66030 -80413 4214 13086 -103849 -62516 -911 28080 -7173
6422g173P5857M3485M4887j8909n6690k7612J663j7721q4581M223n996K5580P955
$$ -7173 68684 112169 157056 138147 81457 53845 55508 37787 -46794 -42571 -48567 -22987 -15032
6409a5032j3435J0065k5663l1634N0503k0232J0559k5032k6706O5672M9906L7170
$$ -15032 -28467 -18402 -44065 -75699 -25196 -45428 -34869 -59901 -86607 -20935 28971 66141
6397F6141L3955k6091O0382j7398j23066k9836M7396J2892n3635N6258j9656k5064
$$ 66141 100096 74005 134387 116989 -6077 -35913 11483 24375 -29260 26998 7342 -17722
6385a7722l1739L2137j9422l2639o1180l6129N8943N4094J3286L350o870K5897
$$ -17722 -49461 -17324 -36746 -69385 -130565 -166694 -107751 -53657 -40371 -37021 -43891 -17994
6373a7994K6503r610N587p138j3781K2627J315L6922m1339j6091L6332o4782J9267
$$ -17994 8509 -1101 4486 -2652 -16433 6194 7509 44431 3092 -12999 23333 -41449 -22182
6360b2182j5752j2712k0769N102O3147o6824o923k203m554K3679k321l3252M0459
$$ -22182 -37934 -50646 -71415 -66313 -3166 -69990 -76913 -79116 -83670 -59991 -62312 -95564 -55105
6347e5105N5052j056n4381m417k5581P5505N5114m4999j8755K9623o4769m3705
$$ -55105 -53 -1109 -55490 -59907 -85488 -9983 45131 132 -18623 11000 -53769 -97474
6335i7474N4812L4802l3743K7137M2004K2303O0530n6725J5520R655n886L7381
$$ -97474 -42662 -7860 -41603 -14466 27538 49841 110371 53646 69166 78821 72935 110316
6323A10316k2811l4520p896o9162Q0995r9978L5482J7162J6067K3887l167p794
$$ 110316 87505 52985 45089 -24073 56922 -43056 -7574 9588 25655 49542 46375 38581
6311C8581m8465K4734J9332M6842L6570p7781m4442M9072M83k9710K4810p3783
$$ 38581 -9884 14850 34182 81024 117594 39813 -4629 44443 44926 15216 40026 -33757
6299c3757j7601L3512M4800l132m3517k7401K1098R9388r7241p2293N2215N9171
$$ -33757 -51358 -17846 26954 23822 -19695 -47096 -25998 73390 -23851 -96144 -43929 15242
6287A5242K4974L1858k7356m1533N8949j2626k3895k9085Q2525N7031o1534N8855
$$ 15242 40216 72074 44718 3185 62134 49508 25613 -3472 79053 136084 74550 133405
6275A33405K1152o380O7226j3541R619P351m4261K4190m884j5934q8702K7457
$$ 133405 154557 148177 215403 201862 211481 218832 174571 198761 193877 177943 89241 116698
6263A16698n6639J5138j6040j7678P9348L5633M7705o0006j0805n0546l2657O3135
$$ 116698 60059 75197 59157 41479 120827 156460 204165 144159 133354 82808 50151 113286
6251A13286J6828l5534n3310J3683k2379k1295l1830m3556j8231K2290O3896l9633
$$ 113286 130114 94580 41270 54953 32574 11279 -20551 -64107 -82338 -60048 3848 -35785
6239c5785n7680L9776k4801N0373j2239j2961L5712L0885K3401p3707l1400R5182
$$ -35785 -93465 -53689 -78490 -28117 -40356 -53317 -17605 13280 36681 -37026 -68426 26756
6227B6756l1912m0731J8686L1432q180J3100L0820l9012J615J0324M2760j0094
$$ 26756 -5156 -45887 -27201 4231 -3949 9151 39971 959 2574 12898 55658 45564
6215D5564l0283j0299L2043o1291j4313K3189O3805K7284j04513M4114P1949K736
$$ 45564 15281 4982 37025 -24266 -38579 -15390 48415 75699 -28814 15300 87249 89985
6203H9985l4323m4112M333K2229j3696M722J1911k1941n6606R085L955P729N644
$$ 89985 55662 11550 15883 38112 24416 29138 41049 19108 -37498 -28413 -24458 -16729 -11085
6190a1085O2417M0499M2994O253n4719O1801q151K4249m5421O1427J024l1252
$$ -11085 51332 91831 134825 141078 86359 148160 140009 164258 118837 180264 181288 150036
6178A50036l5279R2783M9050n1101L3289Q8209J5929n2092J3093L8902j8202O856
$$ 150036 114757 207540 256590 205489 238778 326987 342916 290824 303917 342819 324617 331473
6166C31473q6421M0312l5417L62j0079j6495K1068l2417J8287M1371l564K8751
$$ 331473 245052 285364 249947 250309 240230 223735 244803 212386 230673 272044 268480 297231
6154B97231K0658O2653M8587r906J34457K6634n7312o2351O7467k2505O2195k7400
$$ 297231 317889 380542 429129 419223 553680 580314 523002 460651 528118 505613 567808 540408
6142E40408r6751M3168Q8214M2874K1061O8608L2763j39754m0478n2177m483l1551
$$ 540408 443657 486825 575039 617913 638974 707582 740345 600591 560113 507936 503453 471902
6130D71902j8616j7602L6753k4478L2663n378k7820O9705P9321Q2163J4734M4988
$$ 471902 453286 435684 472437 447959 480622 475244 447424 517129 596450 678613 693347 738335
6118G38335O5493j0275q0001j34821k9574K5838J4081Q79l8431P3196N6506N7373
$$ 738335 803828 793553 713552 578731 549157 574995 589076 589955 551524 624720 681226 738599
6106G38599Q0640j9290n1603q2516m5792k1238J8055k345p2494K1166K7029K7468
$$ 738599 819239 799949 748346 665830 620038 598800 616855 614510 542016 563182 590211 617679
6094F17679K4483L9831k0660J9985P1505P6177J41383K5224K9325j6160O973P1078
$$ 617679 642162 681993 661333 681318 752823 829000 970383 995607 1024932 1008772 1015745 1086823
6082A086823m1344o92M3426P3875k9507p484N1295L9197p0818n5571L1200l5061
$$ 1086823 1045479 1044787 1088213 1162088 1132581 1125097 1176392 1215589 1144771 1089200 1120400 1085339
6070A085339p3164M8490j6499l1472p4593L2758o7824k977K8400L1456R2828J5445
$$ 1085339 1012175 1060665 1044166 1012694 938101 970859 903035 900058 928458 959914 1052742 1068187
6058A068187l6141K7804N9245K3296l9437J083m1771j2065l0860p4515m1141o854
$$ 1068187 1032046 1059850 1119095 1142391 1102954 1104037 1062266 1050201 1019341 944826 903685 896831
6046H96831o7058m9530n0077o4247j9602j1215l4278q7280K7425j8544l2m6596
$$ 896831 829773 780243 730166 665919 646317 635102 600824 513544 540969 522425 522393 475797
6034D75797j7015K5054N2780r1504j25433N2724L4773p4216q994o13L7173j5625
$$ 475797 458782 483836 536616 445112 319679 372403 407176 332960 323966 323353 360526 344901
6022C44901n4500m8943l5702k0629O7469N1976R503l9365j831J8213J6112R6940
$$ 344901 290401 241458 205756 185127 252596 304572 314075 274710 272879 291092 307204 404144
6010D04144L2229m0099N3640J0128o2180m7904O6835Q223l9074J6471K7241q0809
$$ 404144 436373 396274 449914 460042 397862 349958 416793 425016 385942 402413 429654 348845
5998C48845M3147o1573j0076j3002m0140N4897K1375M9324j5379M5046J28608
$$ 348845 391992 330419 320343 307341 267201 322098 343473 392797 377418 422464 551072
5987E51072N0333m5932m7341j4271o0925k164K5104n0190J13037l7343q0040j566
$$ 551072 601405 555473 508132 493861 432936 430772 455876 405686 518723 481380 401340 399774
5975C99774M6429l2734l1783n3833j9985K468m9405K7131j2297M5138O148N0022
$$ 399774 446203 413469 381686 327853 307868 310336 260931 288062 275765 320903 327051 377073
5963C77073J1273J3791K0167k596M9146l6374m0990k837L4102l0917p7589J2694
$$ 377073 388346 402137 422304 419708 468854 432480 391490 388653 422755 391838 314249 326943
5951C26943L494q9276K7549n1076J4970K827m4292Q9481O711j0038M2090R321
$$ 326943 330437 241161 268710 217634 232604 235431 191139 280620 287331 277293 319383 328704
5939C28704Q7865m1946n8109O18M5492k97o9634L7783n926j7775K4682K6570j5062
$$ 328704 416569 374623 316514 317132 362624 362327 292693 330476 324550 306775 331457 358027 342965
5926C42965L3242m419J244j0057r855K9649m7518O4702o1145L4216O4773o8972
$$ 342965 376207 371788 373032 362975 353120 382769 335251 399953 338808 373024 437797 368825
5914C68825J1725P067M1296P903n1886M796j5886L6450R5312P3653l2077m5789
$$ 368825 380550 387617 428913 436816 384930 389726 373840 410290 505602 579255 547178 501389
5902E01389p0632L399O0754m7559l664k3400l2492O193Q861j6271J780L0670J4278
$$ 501389 430757 434156 494910 447351 443687 420287 387795 393988 402849 386578 388358 419028 433306
5889D33306M0120r027j9833N6801l6242n7678N0490L8792l5080j39425J9636L5953
$$ 433306 473426 464399 444566 501367 465125 407447 457937 496729 461649 322224 341860 377813
5877C77813l8352k9828O1876O7458q7894n26O5314L1541O431k7026k8690M7535
$$ 377813 339461 309633 371509 438967 351073 350547 415861 447402 453833 426807 398117 445652
5865D45652M3974m0954J6110l700p0095J9416P6294p2071n9397j270J5215N1940
$$ 445652 489626 448672 464782 461082 390987 410403 486697 414626 355229 353959 369174 421114
5853D21114p6706l3938P0579J0378m7042N7927Q2105l0309j14139P561J4981K0866
$$ 421114 344408 310470 381049 391427 344385 402312 484417 454108 339969 347530 362511 383377
5841C83377O202J01686k0662j1376p229n1456l8274N8761j1004P4127P0213o4944
$$ 383377 389579 491265 470603 459227 451998 400542 362268 421029 410025 484152 554365 489421
5829D89421L0004K9367M0479l4105j5824K4436J3724j3962N1191M5030R5072k7055
$$ 489421 519425 548792 589271 555166 539342 563778 577502 563540 614731 659761 754833 727778
5817G27778j27331L3893o9402k5345K2735M4307J6034K5877L5809L6533N2358
$$ 727778 600447 634340 564938 539593 562328 606635 622669 648546 684355 720888 773246
5806G73246J2986L2461J04915J27552Q6426Q9695O685r988J6922p2873l0021j3599
$$ 773246 786232 818693 923608 1051160 1137586 1227281 1233966 1223978 1240900 1168027 1138006 1124407
5794A124407n5498r889M6001L0413j2005N3056k0140J0430N3655r537O1497P7814
$$ 1124407 1068909 1059020 1105021 1135434 1123429 1176485 1156345 1166775 1220430 1210893 1272390 1350204
5782A350204J54722Q1513J56577J64239R8311J87831J46657N6837p3978n5434
$$ 1350204 1504926 1586439 1743016 1907255 2005566 2193397 2340054 2396891 2322913 2267479
5772B267479j2767o3071j24426k31772p6805j4834o0410o0438p0903Q9265l0810
$$ 2267479 2254712 2191641 2067215 1835443 1758638 1743804 1683394 1622956 1552053 1641318 1610508
5761A610508n3296J01428J14477J04312J33287J77058J93066K05297J36855O7147
$$ 1610508 1557212 1658640 1773117 1877429 2010716 2187774 2380840 2586137 2722992 2790139
5751B790139R4344l4538l2411j05810r9789j11982j44039k37382j43313q577o2509
$$ 2790139 2884483 2849945 2817534 2711724 2611935 2499953 2355914 2118532 1975219 1966642 1904133
5740A904133n3036j0797l1297K4977n5576P1192O8811P7912M7328P2070J31974
$$ 1904133 1851097 1840300 1809003 1833980 1778404 1849596 1918407 1996319 2043647 2115717 2247691
5729B247691P3019O2932K2128j5928l4412m4602m6833j18034j33779n7772n3357
$$ 2247691 2320710 2383642 2405770 2389842 2355430 2310828 2263995 2145961 2012182 1954410 1901053
5718A901053k5900J7802k7781j6425n5639N2627J34388O3542J10026K08612J74752
$$ 1901053 1875153 1892955 1865174 1848749 1793110 1845737 1980125 2043667 2153693 2362305 2537057
5707B537057N8132N7858m7512n667q6588n0988p0477q3669l2989n4560l4913M3698
$$ 2537057 2595189 2653047 2605535 2599868 2513280 2462292 2391815 2308146 2275157 2220597 2185684 2229382
5695B229382k6168k1683k0270K9293Q6411J9794l9739J7397l1729j6813L9726
$$ 2229382 2203214 2181531 2161261 2190554 2276965 2296759 2257020 2274417 2242688 2225875 2265601
5684B265601K8675R7170Q9220J09702N0213Q4266J20565Q5393K27960K23045J74855
$$ 2265601 2294276 2391446 2480666 2590368 2640581 2724847 2845412 2930805 3158765 3381810 3556665
5673C556665K99209K13154J81095K35137K16142L83132N18000O04626N30946N03651
$$ 3556665 3855874 4069028 4250123 4485260 4701402 5084534 5602534 6207160 6738106 7241757
5663G241757L16766P2294L39134N52720O55082N78576L46654j55671m65478k57870
$$ 7241757 7558523 7630817 7969951 8522671 9177753 9756329 10102983 9947312 9481834 9223964
5653I223964M9927K64851M31017M35616L01651m6027m92770n90952k83128j09302
$$ 9223964 9273891 9538742 9969759 10405375 10707026 10660999 10168229 9577277 9294149 9184847
5643I184847K5662J08881J67344K19111L7531r9546m4779j2385k24532o87830
$$ 9184847 9210509 9319390 9486734 9705845 9743376 9643830 9599051 9586666 9362134 8674304
5633H674304p94075m89577l70813k78039j56995n718J65425L19529K50525N3488
$$ 8674304 7880229 7390652 7019839 6741800 6584805 6579087 6744512 7064041 7314566 7368054
5623G368054k87984n05025n61072m67833l25054k38828j76526k46445j50732k26059
$$ 7368054 7080070 6575045 6013973 5546140 5221086 4982258 4805732 4559287 4408555 4182496
5613D182496j44587q8788j49038o2931k9953R395n7787k3072K1541J31737J85502
$$ 4182496 4037909 3949121 3800083 3737152 3707199 3716594 3658807 3635735 3657276 3789013 3974515
5602C974515P3445J8914j4182M6212P4836j44079r1034j3012m4130j24217r5463
$$ 3974515 4047960 4066874 4052692 4098904 4173740 4029661 3938627 3925615 3881485 3757268 3661805
5591C661805j05724j43908k7281J66J1337K18666J33649J10149K9060Q0005P6861
$$ 3661805 3556081 3412173 3384892 3385058 3396395 3615061 3748710 3858859 3887919 3967924 4044785
5580D044785R5749Q9402J73282J13539J40134K40709J65049J42330J47023K47223
$$ 4044785 4140534 4229936 4403218 4516757 4656891 4897600 5062649 5204979 5352002 5599225
5570E599225K83960L66039M63571O18665O69615N90535L23603k7097j86279j49591
$$ 5599225 5883185 6249224 6712795 7331460 8001075 8591610 8915213 8888116 8701837 8552246
5560H552246J74684L90277K77004J4878l20413o70643o95469n73322m18709k86263
$$ 8552246 8726930 9117207 9394211 9409089 9088676 8418033 7722564 7149242 6730533 6444270
5550F444270j76030Q922J54835J74033L12077M88286O52532O91253P73467N42800
$$ 6444270 6268240 6277162 6431997 6606030 6918107 7406393 8058925 8750178 9523645 10066445
5540A0066445M3516k76313n63533k83636N1819K89423L39390K72089k0011k99053
$$ 10066445 10109961 9833648 9270115 8986479 9038298 9327721 9667111 9939200 9919189 9620136
5530I620136n54180o93214p13842n48939o43775m32555l12575k94044k51395j98603
$$ 9620136 9065956 8372742 7658900 7109961 6466186 6033631 5721056 5427012 5175617 4977014
5520D977014j59324q2439l8275M611n416K9334R8025J47525J86810R0579j27169
$$ 4977014 4817690 4735251 4696976 4701587 4696171 4725505 4823530 4971055 5157865 5248444 5121275
5509E121275k62616k41064r7436m3314o7658J2364J4901L2591Q5393J08906J77316
$$ 5121275 4858659 4617595 4520159 4476845 4409187 4421551 4436452 4469043 4554436 4663342 4840658
5498D840658J26881J00894q9454k84006k39469k55378j2094O8659L5873M9399
$$ 4840658 4967539 5068433 4978979 4694973 4455504 4200126 4188032 4256691 4292564 4341963
5488D341963l2795n7188j81619j62821j24472r8656j4291J0644m7222l8847m4416
$$ 4341963 4309168 4251980 4070361 3907540 3783068 3684412 3670121 3680765 3633543 3594696 3550280
5477C550280m1169o2207j33934j1463m2813n132M8604J2256K8692l8615P3723
$$ 3550280 3509111 3446904 3312970 3301507 3258694 3253562 3302166 3314422 3343114 3304499 3378222
5466C378222O5668J2809p944M2039l3735L8844j7484J2628n5822j43582j38768
$$ 3378222 3443890 3456699 3448755 3490794 3457059 3495903 3478419 3491047 3435225 3291643 3152875
5455C152875j38554l9859m2386l1755l0837R7288k8712n1522P3979P07k2896N1380
$$ 3152875 3014321 2974462 2932076 2900321 2869484 2966772 2938060 2886538 2960517 2961224 2938328 2989708
5443B989708L1346J20894M6960K367M1616J01767K0634J40377J13374J39976J98628
$$ 2989708 3021054 3141948 3188908 3191275 3232891 3334658 3355292 3495669 3609043 3749019 3947647
5432C947647J19826J31230J34692q3608j43293r8607K3588l5802m6042L5876N0035
$$ 3947647 4067473 4198703 4333395 4249787 4106494 4007887 4031475 3995673 3949631 3985507 4035542
5421D035542J8218L887R4404K5967O2553J04310O6198J21277J31199M7522J3800
$$ 4035542 4053760 4057647 4152051 4178018 4240571 4344881 4411079 4532356 4663555 4711077 4724877
5410D724877O9969J756J28679J11669k0287L7576J50960Q2058J72759J47737J34523
$$ 4724877 4794846 4796602 4925281 5036950 5016663 5054239 5205199 5287257 5460016 5607753 5742276
5399E742276J49840J63460K55045K62034L25820M11021N72234M57861L62274K46835
$$ 5742276 5892116 6055576 6310621 6572655 6898475 7309496 7881730 8339591 8701865 8948700
5389H948700J72339L99018N66031O36659N92994L19294j54167n72339l76418j89919
$$ 8948700 9121039 9520057 10086088 10722747 11315741 11635035 11480868 10908529 10532111 10342192
5379A0342192J7601K49326M17111M34294K20583k77669n22605m68044k91762j51062
$$ 10342192 10359793 10609119 11026230 11460524 11681107 11403438 10880833 10412789 10121027 9969965
5369I969965q5968N0819P308J06024Q5447K11046L45939N07928L57023K9430m96039
$$ 9969965 9883997 9934816 9942124 10048148 10133595 10344641 10690580 11198508 11555531 11584961 11088922
5358A1088922o91741l27820q0605K5866K54491L38001L41750L14859M5947l78129
$$ 11088922 10397181 10069361 9988756 10014622 10269113 10607114 10948864 11263723 11309670 10931541
5348A0931541o36701n17119l44071k55863j99885j01710m2342l7415j5949m348
$$ 10931541 10294840 9777721 9433650 9177787 8977902 8876192 8833850 8796435 8780486 8776138
5338H776138J4867L1547O6127Q6040J37745J41388K91419K88658L78152L52337
$$ 8776138 8791005 8822552 8888679 8974719 9112464 9253852 9545271 9833929 10212081 10564418
5328A0564418L14508L58893K15708K98913L50899L78701M07703M90553M77500
$$ 10564418 10878926 11237819 11453527 11752440 12103339 12482040 12889743 13380296 13857796
5319A3857796M96411N44343O14414P21060Q24207Q99751R35801J060820J117467
$$ 13857796 14354207 14898550 15512964 16234024 17058231 17957982 18893783 19954603 21072070
5310B1072070J420079J756485K056977K579237L362902M217998N069410N551877
$$ 21072070 22492149 24248634 26305611 28884848 32247750 36465748 41535158 47087035
5302D7087035N062855L389852J324566Q84451J125244R2324k266742l972482l524652
$$ 47087035 52149890 55539742 56864308 57748759 58874003 58966327 56699585 52727103 49202451
5293D9202451j885970q04974J73230Q41084J304402J306509J292393J576712K208651
$$ 49202451 47316481 46511507 46684737 47525821 48830223 50136732 51429125 53005837 55214488
5284E5214488L069942M192463N401979P145176R145090J1524030J3136351J3094069
$$ 55214488 58284430 62476893 67878872 75024048 84169138 95693168 108829519 121923588
5276A21923588J0211337N139939J234643O91436m92005m772558q629938p990005
$$ 121923588 132134925 137274864 138509507 139200943 138708938 133936380 125306442 117316437
5268A17316437m276599l34644K609982M891657N117898L760154M03906k220435
$$ 117316437 113039838 112705194 115315176 120206833 125324731 129084885 129488791 127268356
5260A27268356k74410L293923O459801R338779J1396891J2055378J1350533R702735
$$ 127268356 126993946 130287869 136747670 146086449 157483340 169538718 180889251 190591986
5252A90591986J2836064J9547549K2466586K1709931J3463853L187602k547321
$$ 190591986 203428050 222975599 245442185 267152116 280615969 283803571 281256250
5245B81256250p105740m868063J309765M659330J811440j041671n458230j2088869
$$ 281256250 274150510 269282447 270592212 275251542 277062982 276021311 270563081 258474212
5237B58474212j6445826j9299196j7777478j2582379r755361r594409j2435649
$$ 258474212 242028386 222729190 204951712 192369333 182613972 173019563 160583914
5230A60583914j1690595p750930l908833q46024K208657M478577N937993M644665
$$ 160583914 148893319 141142389 137233556 136387532 138596189 143074766 149012759 153657424
5222A53657424J85446m666222j1074763j1837510q131495m477822k052152q81792
$$ 153657424 153842870 149176648 138101885 126264375 118132880 113655058 111602906 110721114
5214A10721114j438307k672168m764117m890791k838993r92364j114561k125138
$$ 110721114 109282807 106610639 101846522 96955731 94116738 93124374 92009813 89884675
5206H9884675m992935o597263n022344l365763j997291p57187N62374J734290
$$ 89884675 84891740 78294477 73272133 69906370 67909079 67151892 67714266 69448556
5198F9448556J990490O25857j821201n690824o523763n171524m006381l224627
$$ 69448556 71439046 72064903 70243702 64552878 58029115 52857591 48851210 45626583
5190D5626583k886006k396435j970999j685933j444576j370777j150784j094806
$$ 45626583 42740577 40344142 38373143 36687210 35242634 33871857 32721073 31626267
5182C1626267r97151q87382p86583p80548p01065o18229o56141n62831o11612
$$ 31626267 30629116 29741734 28955151 28174603 27473538 26855309 26199168 25636337 25024725
5173B5024725n37930n05904l68812l36714k40855j81463j95079j98294j39412
$$ 25024725 24486795 23980891 23612079 23275365 23034510 22853047 22657968 22459674 22320262
5164B2320262p9974j69859j96827k9877K850P9052N3395J76505J78714K57867
$$ 22320262 22240288 22070429 21873602 21843725 21846575 21925627 21979022 22155527 22334241 22592108
5154B2592108L62716L97119L97458M32162M19204M56325M37018M05439N31614
$$ 22592108 22954824 23351943 23749401 24181563 24600767 25057092 25494110 25899549 26431163
5145B6431163O58699Q11722R98325J154085J534809J850481K259018K769163L438669
$$ 26431163 27089862 27901584 28899909 30053994 31588803 33439284 35698302 38467465 41906134
5136D1906134M377392N661209O882425P292417P477516O799144O365688P631961
$$ 41906134 46283526 51944735 58827160 66119577 73597093 80396237 86761925 94393886
5128I4393886P259079M499418k044031p599367r505812j0740280r338482o965530
$$ 94393886 101652965 106152383 104108352 96508985 87003173 76262893 66924411 59958881
5120E9958881n066235l838302k945983k247334j486977j062026o70948j67650
$$ 59958881 54892646 51054344 48108361 45861027 44374050 43312024 42641076 42473426
5112D2473426J88588M76678P81207Q05973J092505J368197K059050K942426L819582
$$ 42473426 42662014 43138692 43919899 44725872 45818377 47186574 49245624 52188050 56007632
5103E6007632M055948L400499J918257j24552j29205J655683L461118M925144
$$ 56007632 60063580 63464079 65382336 65257784 65128579 66784262 70245380 75170524
5095G5170524N410428N153536M213092L016302L738266P297352J1582429J5010158
$$ 75170524 80580952 85734488 89947580 92963882 96702148 103999500 115581929 130592087
5087A30592087J3600561Q086783k690835j4612335j5933027j1840470q258302
$$ 130592087 144192648 152279431 149588596 134976261 119043234 107202764 98944462
5080I8944462n282373k732800j58897K597641N689377R234560J2310876J3127741
$$ 98944462 93662089 90929289 90770392 93368033 99057410 108291970 120602846 133730587
5072A33730587R224677J460118j0001066j6827169j4047768q875724n694520m149646
$$ 133730587 142955264 144415382 134414316 117587147 103539379 94663655 88969135 84819489
5064H4819489l794457m382885m943370m716593l472140k255590j320969j304559
$$ 84819489 81025032 76642147 71698777 66982184 63510044 61254454 59933485 58628926
5056E8628926j583092k492073l118632k629872j942453j429564j144937r36083
$$ 58628926 57045834 54553761 51435129 48805257 46862804 45433240 44288303 43352220
5048D3352220o74959n75322m72351j89585J31997J59766L57288O83937R09994
$$ 43352220 42677261 42101939 41629588 41440003 41572000 41731766 42089054 42772991 43682985
5039D3682985J233920J698543K191128K949273L770610M874165N690033N551812
$$ 43682985 44916905 46615448 48806576 51755849 55526459 60400624 66090657 71642469
5031G1642469M528480K474059R73804J609323K835742N077209O884465Q759342
$$ 71642469 76170949 78645008 79618812 81228135 84063877 89141086 96025551 104784893
5023A04784893R249783P395422K925447l338109k457065O53681J772477q04844
$$ 104784893 114034676 121430098 124355545 121017436 118560371 119214052 120986529 120181685
5015A20181685l975783m942377m884345k419312P39486L509326N972387P288479
$$ 120181685 116205902 111263525 106379180 103959868 104699354 108208680 114181067 121469546
5007A21469546P770382O408829O333172Q027623Q938052J1461731J0443224M240726
$$ 121469546 129239928 135648757 141981929 150009552 158947604 170409335 180852559 185093285
4999A85093285o981150j4496767j1211665o468148m353012n190392n145500k670820
$$ 185093285 178112135 163615368 152403703 145935555 141582543 136392151 131246651 128575831
4991A28575831j113504j509593k703669k448785k130270l507382k150002L79960
$$ 128575831 127462327 125952734 123249065 120800280 118670010 115162628 113012626 113392586
4983A13392586J769483J439105k32831o75049j923280o097457j2161095j2508972
$$ 113392586 115162069 116601174 116368343 115693294 113770014 107672557 95511462 83002490
4975H3002490r505033p111853n764175m975830m182244l368173k965741k486258
$$ 83002490 73497457 66385604 60621429 55645599 51463355 48095182 45129441 42643183
4967D2643183k184317j983870j807504j621056j357519j164891j080108r78092
$$ 42643183 40458866 38474996 36667492 35046436 33688917 32524026 31443918 30465826
4959C0465826q90482p40896p74845q32336q58416p22976n12401m99609l35769
$$ 30465826 29575344 28834448 28059603 27227267 26368851 25645875 25133474 24633865 24298096
4950B4298096l27714l95290o10751p35298q50451r09116n98432o52572n73175
$$ 24298096 23970382 23575092 22964341 22229043 21378592 20469476 19871044 19218472 18645297
4941A8645297m49535m76933k81354k15743k24002j70689p6756O3535J21917J31574
$$ 18645297 18195762 17718829 17437475 17221732 16997730 16827041 16750285 16813820 16935737 17067311
4931A7067311K23370P9426J0486k07521k57388l80567n40211o83985o19508n25149
$$ 17067311 17290681 17370107 17380593 17173072 16915684 16535117 15994906 15310921 14691413 14166264
4921A4166264m49809l77289k79332k40617j35952j08246j8146P788P9321J94918
$$ 14166264 13716455 13339166 13059834 12819217 12683265 12575019 12556873 12564661 12643982 12838900
4911A2838900K45146K59753J10463j62832l35579m49301n01995l72764l28784
$$ 12838900 13084046 13343799 13454262 13291430 12955851 12506550 12004555 11631791 11303007
4902A1303007l57966l09987k69761k24676k00957j77801j68383j24246N0345J0631
$$ 11303007 10945041 10635054 10365293 10140617 9939660 9761859 9593476 9469230 9519575 9530206
4892I530206n8987m4965J2476L9119M2859K7413M6780J59918J46027J61842J69673
$$ 9530206 9471219 9426254 9438730 9477849 9520708 9548121 9594901 9754819 9900846 10062688 10232361
4881A0232361K52565J85023J88853O0607j7188j45827k53492k09909k50732l00361
$$ 10232361 10484926 10669949 10858802 10919409 10902221 10756394 10502902 10292993 10042261 9741900
4871I741900k33308k14404j43464r6795j62074j68586k04178j48190m1451m6017
$$ 9741900 9508592 9294188 9150724 9053929 8891855 8723269 8519091 8370901 8329450 8283433
4861H283433m5617K1080K5744O4834P1832O2029P7058Q5800Q9869J73498Q7314
$$ 8283433 8237816 8258896 8284640 8349474 8421306 8483335 8560393 8646193 8736062 8909560 8996874
4850H996874J2112n5359r882j49071k08241j62167j75723j75374j72710j16748
$$ 8996874 9008986 8953627 8943745 8794674 8586433 8424266 8248543 8073169 7900459 7783711
4840G783711j84564j23516j50640j54864k78744j51965j52874j47864j69464n7493
$$ 7783711 7599147 7475631 7324991 7170127 6891383 6739418 6586544 6438680 6269216 6211723
4830F211723k393n3087k2371j09983Q869N0654m2736o9486j31068K3131n19l6081
$$ 6211723 6209330 6156243 6133872 6023889 6032758 6083412 6040676 5971190 5840122 5863253 5862734 5826653
4818E826653q7170j76708r3405k5916k3276o9071j293q0933n9863l0068q8784
$$ 5826653 5739483 5562775 5469370 5443454 5420178 5351107 5349814 5268881 5209018 5178950 5090166
4807E090166m9620j9719L8898J039p4012L937K692K8915m5350Q407P4132j7005
$$ 5090166 5040546 5020827 5059725 5060764 4986752 4990689 4993381 5022296 4976946 4985353 5059485 5042480
4795E042480j7100R9326K5623k8697M803k0433j4262j1343M7448J7738K2584Q1517
$$ 5042480 5025380 5124706 5150329 5121632 5126435 5106002 5091740 5080397 5127845 5145583 5168167 5249684
4783E249684j1402L2163j0058N0813P9388J34501O4503J51031J62606J50049J72030
$$ 5249684 5238282 5270445 5260387 5311200 5390588 5525089 5589592 5740623 5903229 6053278 6225308
4772F225308Q3228M8134K1506L9181J06381J81607J34605J46045L03615M15826
$$ 6225308 6308536 6356670 6378176 6417357 6523738 6705345 6839950 6985995 7289610 7705436
4762G705436M57297M55407M50217L01857l954k56802k26229j14378M2435J92354
$$ 7705436 8162733 8618140 9068357 9370214 9366260 9109458 8883229 8768851 8811286 9003640
4752I003640K30494L16701M02978M75093L50208J17024l4075j61237n839J32443
$$ 9003640 9234134 9550835 9953813 10428906 10779114 10896138 10862063 10700826 10694987 10827430
4742A0827430J81053K54259J78574L19451L59820K02811R5371p0228l944K21267
$$ 10827430 11008483 11262742 11441316 11760767 12120587 12323398 12418769 12348541 12344597 12565864
4732A2565864L12104M51690N49951P28850Q14309P45442M94021L10720K09496
$$ 12565864 12877968 13329658 13879609 14608459 15422768 16168210 16662231 16972951 17182447
4723A7182447K83132N09522O64338P46983P22113P02867P66079P96065R99016
$$ 17182447 17465579 17975101 18639439 19386422 20108535 20811402 21577481 22373546 23372562
4714B3372562J102119J330918J682541J880409K039249J988947K156121K434990
$$ 23372562 24474681 25805599 27488140 29368549 31407798 33396745 35552866 37987856
4706C7987856K900918L481858M193994N341398O835837Q357200J0628262J3390491
$$ 37987856 40888774 44370632 48564626 53906024 60741861 69099061 79727323 93117814
4698I3117814J6222059J7489702J5935782R525013K41436o899258r353558o247149
$$ 93117814 109339873 126829575 142765357 152290370 152531806 145632548 136278990 130031841
4690A30031841l27926N247279J0206067J2826354J0210876K473314j0534648j8676738
$$ 130031841 129703915 134951194 145157261 157983615 168194491 170667805 160133157 141456419
4682A41456419j5569855r454490m919401j547362J731780N300294Q508209R956890
$$ 141456419 125886564 116432074 111512673 109965311 111697091 116997385 125505594 135462484
4674A35462484Q793823L862393j757753m967581m294884j509300j39716J074565
$$ 135462484 144256307 148118700 146360947 141393366 137098482 135589182 135449466 136524031
4666A36524031L110106L315879n12222n103459j1728751j7126678j5765494j1715976
$$ 136524031 139634137 142950016 142437794 137334335 125605584 108478906 92713412 80997436
4658H0997436q858798p034265n854114m835558m013443l375343k916560k705005
$$ 80997436 72138638 65104373 59250259 54414701 50401258 47025915 44109355 41404350
4650D1404350k484509k194951k000987j755731j602292j447517j239271j218560
$$ 41404350 38919841 36724890 34723903 32968172 31365880 29918363 28679092 27460532
4642B7460532j219969j064112r59939q54812q44593p20550o57801p11314p56291
$$ 27460532 26240563 25176451 24216512 23361700 22517107 21796557 21138756 20427442 19671151
4633A9671151q26108p60255o30005n88851n90635n23213n37534m81550m35731
$$ 19671151 18845043 18084788 17454783 16865932 16275297 15752084 15214550 14733000 14297269
4624A4297269l05973l22373l36773l49503l23308k58748k63655k97246l11245
$$ 14297269 13991296 13668923 13332150 12982647 12659339 12400591 12136936 11839690 11528445
4615A1528445l22992k90825l03730k55541k86291k46298k00444j70662j58205
$$ 11528445 11205453 10914628 10610898 10355357 10069066 9822768 9622324 9451662 9293457
4606I293457j05937j32963k06882j46097o9619j67000j69077j21159j06930r0564
$$ 9293457 9187520 9054557 8847675 8701578 8631959 8464959 8295882 8174723 8067793 7977229
4596G977229j88062j66497j50694j02953j84138j12386k06367q8705j65418j02251
$$ 7977229 7789167 7622670 7471976 7369023 7184885 7072499 6866132 6777427 6612009 6509758
4586F509758r3350p6211j08859n4644p6651j37394n4759j02930l5269n7478o1118
$$ 6509758 6416408 6340197 6231338 6176694 6100043 5962649 5907890 5804960 5769691 5712213 5651095
4575E651095j71442j12818j29579j30282j15986n1054o6666j51464j21315m3298
$$ 5651095 5479653 5366835 5237256 5106974 4990988 4939934 4873268 4721804 4600489 4557191
4565D557191n0385o2180m0899J8233j42409p5125k6138m051m3800l1813k2538
$$ 4557191 4506806 4444626 4403727 4421960 4279551 4204426 4178288 4174237 4130437 4098624 4076086
4554D076086k5130r0444j42330r6820N073n5865j49700M2815l7437k9701J728
$$ 4076086 4050956 3960512 3818182 3721362 3726435 3670570 3520870 3563685 3526248 3496547 3498275
4543C498275O10j1427j02417o7419m397M619r5636k4632k3351j07741L064q5478
$$ 3498275 3498885 3487458 3385041 3317622 3313225 3317844 3222208 3197576 3174225 3066484 3069548 2984070
4531B984070M4027m7401p4070K5345k2768o2067p9628rq4271M944Q3827o0298
$$ 2984070 3028097 2980696 2906626 2931971 2909203 2847136 2767508 2767499 2683228 2688172 2771999 2711701
4519B711701j26380j9563r2140J9509P916n1449j9965l7471r3515k8720n5384
$$ 2711701 2585321 2565758 2473618 2493127 2501043 2449594 2429629 2392158 2298643 2269923 2214539
4508B214539l171m7157o6787j9070n899m3817j4944l3431o9817J6202K3541n0629
$$ 2214539 2211368 2164211 2097424 2078354 2072455 2028638 2013694 1980263 1910446 1926648 1950189 1899560
4496A899560o6940k5195L0160j3167l4558j2846o1036L9749k3888n4012r0451
$$ 1899560 1832620 1807425 1837585 1824418 1789860 1777014 1715978 1755727 1731839 1677827 1587376
4485A587376l2819j5015m627l9346J4841K5014J5389L184j0765j14764p884J3333
$$ 1587376 1554557 1539542 1534915 1495569 1510410 1535424 1550813 1553997 1543232 1428468 1420584 1433917
4473A433917n7436R976l7652J4903Q18J7866q436l9053K4841J5461p7203K0097
$$ 1433917 1376481 1386457 1348805 1363708 1364526 1382392 1373956 1334903 1359744 1375205 1298002 1318099
4461A318099L025l6389j2343L6822K5136q916P285M125j0918j0129L1251j3284
$$ 1318099 1321124 1284735 1272392 1309214 1334350 1325434 1332719 1336844 1325926 1315797 1347048 1333764
4449A333764o5251o1930k9469P091L0540N3829J5953k9521J827l7222N97l0612
$$ 1333764 1268513 1206583 1177114 1184205 1214745 1268574 1284527 1255006 1256833 1219611 1220208 1189596
4437A189596q421m4833O1674O072q3026k7529N4108L1258n2788l3895j7929k8130
$$ 1189596 1181175 1136342 1198016 1204088 1121062 1093533 1147641 1178899 1126111 1092216 1074287 1046157
4425A046157m7172M2450K3233l4303j7q110q9849l4388k8831J7171L1346q023
$$ 1046157 998985 1041435 1064668 1030365 1030348 1022238 932389 898001 869170 886341 917687 909664
4413I09664L7016L5090r01K2610q2675o5780n906j0282L5555L4801M3249K8562
$$ 909664 946680 981770 980869 1003479 920804 855024 849118 838836 874391 909192 952441 981003
4401I81003j15162q2706J2424L070O9442O788l5852l2712N3063n350m516K5303
$$ 981003 865841 783135 795559 798629 868071 874859 839007 806295 859358 854008 849492 874795
4389H74795o8867L5939q808l9427j33514O405P1472N209j4517p8475P5608K0038
$$ 874795 805928 841867 833059 793632 660118 666523 737995 743204 728687 650212 725820 745858
4377G45858m399m2349P6177L3903j9279r5418m1461L4332Q8528J6453o2740L3270
$$ 745858 741459 699110 775287 809190 789911 694493 653032 687364 775892 792345 729605 762875
4365G62875k7812n2211Q642N695O4345l0001j7409r1512J3134L3351L6365k2778
$$ 762875 735063 682852 691494 697189 761534 731533 714124 622612 635746 669097 705462 682684
4353F82684k4274K9187n6174L4264K0809M6018l344k9358j9535k9000m8740J493
$$ 682684 658410 687597 631423 665687 686496 732514 729170 699812 680277 651277 602537 604030
4341F04030J3740J09502o6551l4039k4985J7463K9871j683m0464l9288l25k6870
$$ 604030 617770 727272 660721 626682 601697 619160 649031 647348 606884 567596 567271 540401
4329E40401J0024J0283r078K3268K1922J1062N861N382l633m1132J4427Q7318
$$ 540401 550425 560708 551630 574898 596820 607882 613743 619125 615492 574360 588787 676105
4317F76105J51370m9866m9908L4667l7672q0902M802O656L548P7119J8914j6076
$$ 676105 827475 777609 727701 762368 724696 643794 648596 655252 658800 735919 754833 738757
4305G38757J5328P7491N3337l1277O0040J74992l695L7620R5062J18925Q915j8673
$$ 738757 754085 831576 884913 853636 913676 1088668 1084973 1122593 1217655 1336580 1345495 1326822
4293A326822n5840j28106N5491O2460N3872M0311j7289P2585Q0973o8418j10176
$$ 1326822 1270982 1142876 1198367 1260827 1314699 1355010 1337721 1410306 1491279 1422861 1312685
4282A312685q8970l9401j8280m7817L5638M8416L8774L5906p95n8917J4940l0876
$$ 1312685 1223715 1184314 1166034 1118217 1153855 1202271 1241045 1276951 1276156 1217239 1232179 1201303
4270A201303l7121K8089k0827L901J8195M6530O658n2444j10214j32649n7355
$$ 1201303 1164182 1192271 1171444 1175345 1193540 1240070 1246728 1194284 1084070 951421 894066
4259H94066k6014k3725q2868N1492m4461o7592J9458l1191n3427k0992m1408o0996
$$ 894066 868052 844327 761459 812951 768490 700898 720356 689165 635738 614746 573338 512342
4247E12342k3631N7909L9383m1492j1810j1178k802J8040l2679j1630N7531n3241
$$ 512342 488711 546620 586003 544511 532701 521523 518721 536761 504082 492452 549983 496742
4235D96742O738L2164k5506O7171k3056L0018J5421J1542o6773q0673L8078j1521
$$ 496742 503480 535644 510138 577309 554253 584271 599692 611234 544461 463788 501866 490345
4223D90345N257M4529j5082o2569Q8251N1464j5929l325Q149N4122Q4518Q316
$$ 490345 495602 540131 525049 462480 550731 602195 586266 582941 591090 645212 729730 738046
4211G38046J08815o395R1000Q9960M8944O8075j13670j83089j08804j11137o4916
$$ 738046 846861 840466 931466 1021426 1070370 1138445 1024775 841686 732882 621745 556829
4200E56829J0216m5505j2778j7094j3828K1003J4470M793o826n2609O0720k1964
$$ 556829 567045 521540 508762 491668 477840 498843 513313 518106 511280 458671 519391 497427
4188D97427l7802n3884L5227M6444j06331M6952K3326j166m655m1145k4512K4510
$$ 497427 459625 405741 440968 487412 381081 428033 451359 450193 445538 404393 379881 404391
4176D04391o8529k2522k7975O2527J22092Q408k652j2355o3217m6487n3667J2266
$$ 404391 335862 313340 285365 347892 469984 478392 475740 463385 400168 353681 300014 312280
4164C12280P1644M9318l2243l1887M7515M3977k3538r353k0484M543n5846N9127
$$ 312280 383924 433242 400999 369112 416627 460604 437066 427713 407229 411772 355926 415053
4152D15053K8828k3696J8219J227Q961m2656Q257J2110k8909n7683K6253L0390
$$ 415053 443881 420185 438404 439631 448592 405936 414193 426303 397394 339711 365964 396354
4140C96354K1399m9535P686K8814K8057k2339l1984j7632k8571j14j7283J21160
$$ 396354 417753 368218 375904 404718 432775 410436 378452 360820 332249 332135 314852 436012
4128D36012P001q1804Q310L7318o51n79o1172O1887L4140K912r031j3601m8195
$$ 436012 443013 361209 369519 406837 406186 405607 344435 406322 440462 443374 434343 420742 372547
4115C72547j5972P443N3705m8744m1548P2832J3650K0850n0878q947q586J8895
$$ 372547 356575 364018 417723 368979 327431 400263 413913 434763 383885 374938 366352 385247
4103C85247J779l8364K6388K0659P559K5581o5515P1276j5139K2509O603o923
$$ 385247 387026 348662 375050 395709 403268 428849 363334 434610 419471 441980 448583 441660
4091D41660N572j7489m1683P5345k9685j378m030k443M562L0803k7319l3895Q3016
$$ 441660 447232 429743 388060 463405 433720 432342 428312 425869 430431 461234 433915 400020 483036
4078D83036l5059j7912L679m9298o05J1008J3221j2521O387j7873p216R350Q8661
$$ 483036 447977 430065 433744 384446 383841 394849 408070 395549 401936 384063 376847 386197 474858
4065D74858j5681n9740o187k522L4485N662p2673O3466L417K654K6037j1012N6720
$$ 474858 459177 399437 393250 390728 425213 430875 358202 421668 425085 427739 453776 442764 499484
4052D99484l2883Q0163P856P178k9099p150n4650L3302m1086O265k0343n2057
$$ 499484 466601 546764 554620 561798 532699 525549 470899 504201 463115 469380 449037 396980
4040C96980K8532n7908Q1664L5902k2101p0944k2360N7155M4230j3228L060k2437
$$ 396980 425512 367604 449268 485170 463069 392125 369765 426920 471150 457922 460982 438545
4028D38545M304J9535K9316L3668L6794m5622k3534M6286K9958o8688r295P9389
$$ 438545 442849 462384 491700 525368 562162 516540 493006 539292 569250 500562 491267 570656
4016E70656j1246M2476o617J5697L6956K765m5440K816M8401N4901J0399m6133
$$ 570656 559410 601886 595269 610966 647922 650687 605247 608063 656464 711365 721764 675631
4004F75631m3766n665R630J0501O4521L1950M5752L6162j5815M7721K8912L2013
$$ 675631 631865 626200 635830 646331 710852 742802 788554 824716 808901 856622 885534 917547
3992I17547L7861K6619l184J9395J0482N9195K7064P0368K419K2593O3234Q2461
$$ 917547 955408 982027 978843 998238 1008720 1067915 1094979 1165347 1167766 1190359 1253593 1336054
3980A336054J40858o213q978R7370R7413L6627L9018Q7606J09245N9606Q5187
$$ 1336054 1476912 1470699 1461721 1559091 1656504 1693131 1732149 1819755 1929000 1988606 2073793
3969B073793J87675J01993P1533J56695J71202J67996J79899J40846J98532J90055
$$ 2073793 2261468 2363461 2434994 2591689 2762891 2930887 3110786 3251632 3450164 3640219
3959C640219K79031K11939K39900K91428K83206L23239M00451M53573M14115N38829
$$ 3640219 3919250 4131189 4371089 4662517 4945723 5268962 5669413 6122986 6537101 7075930
3949G075930M89320N38279N14425N22592N34925N02958L94816K08696J12441J02427
$$ 7075930 7565250 8103529 8617954 9140546 9675471 10178429 10573245 10781941 10894382 10996809
3939A0996809p1152j97105k61892l66915l89326n71200n23236m68127l83981n16847
$$ 10996809 10925657 10728552 10466660 10099745 9710419 9139219 8615983 8147856 7763875 7247028
3929G247028m26495l23410m00224l79404k74331l46967k99980j58105k07113k19282
$$ 7247028 6820533 6497123 6096899 5717495 5443164 5096197 4796217 4638112 4430999 4211717
3919D211717j88972j73273j67488j75176j30971j17076j98435q0549j49295r0659
$$ 4211717 4022745 3849472 3681984 3506808 3375837 3258761 3060326 2979777 2830482 2739823
3909B739823j09210j63176p2454m5403l114j17780p6760r785j26857r9159p0264
$$ 2739823 2630613 2467437 2394983 2349580 2346466 2228686 2151926 2142141 2015284 1916125 1845861
3898A845861j5873p3638m7832l8358J9209j0221p5837m7151j03530k5872J0081
$$ 1845861 1829988 1756350 1708518 1670160 1689369 1679148 1603311 1556160 1452630 1426758 1436839
3887A436839q7713q1350m3042k2146K5353j851l8855j5378o3172n914p4489m3946
$$ 1436839 1349126 1267776 1224734 1202588 1227941 1226090 1187235 1171857 1108685 1102771 1028282 984336
3875I84336j2499K6478j0214r7218J2121j3326l0064O610J6165k9900m6005j5697
$$ 984336 971837 998315 988101 890883 903004 889678 859614 866224 882389 852489 806484 790787
3863G90787m5938k0436O4356N4603n7587l4031r1047l8665J7095k6848M2930O613
$$ 790787 744849 724413 788769 843372 785785 751754 660707 622042 639137 612289 655219 661832
3851F61832m8673l9310N143K0726j9493M1854P4108J42r4942j834J5585j5605
$$ 661832 613159 573849 578992 599718 580225 622079 696187 696329 601387 599553 615138 599533
3839E99533n6994k5677M6944l2694q989m429N9824q9334K9234j5357m6208k1205
$$ 599533 542539 516862 563806 531112 522123 517694 577518 488184 517418 502061 455853 434648
3827D34648l2101O3912p547j5669M1597O9067q1202j06596M7297K878j0735j498
$$ 434648 402547 466459 458912 443243 484840 553907 472705 366109 413406 416284 405549 404051
3815D04051J0748M7799k8307Q103n9608k5785p166L0615l6131k4110j2690L5018
$$ 404051 414799 462598 434291 442394 382786 357001 349835 380450 344319 320209 307519 342537
3803C42537p0248R4681j1903K4109K7302o1170l9949j655Q483O7482J1200r3944
$$ 342537 272289 366970 355067 379176 406478 345308 305359 303704 312187 379669 390869 296925
3791B96925k9323K4309M9998o720q371J049L66l4350J9375J5716K7507J1005o7753
$$ 296925 267602 291911 341909 335189 326818 327867 328233 293883 313258 328974 356481 367486 299733
3778B99733p1742M5699l0824O5929Q55n6575m4735P708N875N4049m1780Q2126
$$ 299733 227991 273690 242866 308795 309650 253075 208340 216048 221923 275972 234192 316318
3766C16318q269n429J3375n5603j8672K905p5850L2846K0193K4004M1961J1290
$$ 316318 308049 302620 315995 260392 241720 244625 168775 201621 221814 245818 287779 299069
3754B99069L2249N890j24296n6132P7942K8569N701j5683p994k2795l2600K9395
$$ 299069 331318 337208 212912 156780 234722 263291 268992 253309 245315 222520 189920 219315
3742B19315J167l182L7279q058j8621n7379p659N6372N9359m4034l3898l2615
$$ 219315 220482 217300 254579 246521 227900 170521 162862 219234 278593 234559 200661 168046
3730A68046J8097L2862J221m5611j1870K72N9819J5423J7282l3381n573N6219
$$ 168046 186143 219005 220226 174615 162745 163017 222836 238259 255541 222160 216587 272806
3718B72806q1462o3882J6469M8240m3717N6221j2354j9185q430J9271R0594k2697
$$ 272806 191344 127462 143931 192171 148454 204675 192321 173136 164706 183977 274571 251874
3706B51874n1240J2542K3827J4204k1429n5471m9519k7222M0547O4387k4876r4532
$$ 251874 200634 213176 237003 251207 229778 174307 124788 97566 138113 202500 177624 83092
3694H3092l1395Q7038O2554o3233L7790r115l1604M6667L455r424M8532K8147
$$ 83092 51697 138735 201289 138056 175846 166731 135127 181794 185249 175825 224357 252504
3682B52504m9063J8972j2435k0425P8677L211M4512K502o3984n3924K1308j2776
$$ 252504 203441 222413 209978 189553 268230 271441 315953 318455 254471 200547 221855 209079
3670B09079l4362n1085P6241j2329q9454Q071L3188J4111O611O4791o512p6387
$$ 209079 174717 123632 199873 187544 98090 106161 139349 153460 160071 224862 218350 141963
3658A41963J7899j4838m723j5639J7805K2253k8566J3493J1814L285K8691k636
$$ 141963 159862 145024 140301 124662 142467 164720 136154 149647 161461 164746 193437 190801
3646A90801l4373k1341N87n640k8168J01904J6762J4317j9394M000L0263p8881
$$ 190801 156428 135087 135674 130034 101866 203770 220532 234849 215455 219455 249718 170837
3634A70837q565m2628j7226M9579R73O916M6774O6280J4553m0962k4592k4873
$$ 170837 162272 119644 102418 151997 152970 159886 206660 272940 287493 246531 221939 197066
3622A97066k8846J2976K3109p2870m5284R9025L6877L183n3519j4170O405j3452
$$ 197066 168220 181196 204305 131435 86151 185176 222053 225236 171717 157547 163952 150500
3610A50500l0432Q429j3336l8258P6965O999K2130K3575R558j9623o0361J5357
$$ 150500 120068 128497 115161 76903 153868 160867 182997 206572 216130 196507 136146 151503
3598A51503J6806k7054J7485j7966l4594O5610N1432j1501m940O4667o3217J6275
$$ 151503 168309 141255 158740 140774 106180 171790 223222 211721 206781 271448 208231 224506
3586B24506M8160n0872m6492j1478N3461M5362q8704k5382M1773l5342K2271O3642
$$ 224506 272666 221794 175302 163824 217285 262647 173943 148561 190334 154992 177263 240905
3574B40905n3305Q386N8607K8977M1156j01414L9498l7713J6710N9832j4130L8000
$$ 240905 187600 195986 254593 283570 324726 223312 262810 225097 241807 301639 287509 325509
3562C25509q8802m569O3232J115l201m2573N460O6494K1037K674J7365l4466k272
$$ 325509 236707 232138 295370 296485 293284 250711 256171 322665 343702 346376 363741 329275 327003
3549C27003K23j4094k9161n3672O5176L7806p59k0533O382L6843j5109O6471r449
$$ 327003 327226 313132 283971 230299 295475 333281 332522 311989 318371 355214 340105 406576 397127
3536C97127M8439j2122K0852J829L4110Q6758K5286K8962j2450R9452Q6017J3117
$$ 397127 445566 433444 454296 456125 490235 576993 602279 631241 618791 718243 804260 817377
3524H17377P2096p752j28691k699L926L4397L3800N3962J6696P5751M5103M0109
$$ 817377 889473 881721 753030 750331 754257 788654 822454 876416 893112 968863 1013966 1054075
3512A054075m1627o4110K2535n6087K0883l0475k2905m5907r862L4748l4103N5708
$$ 1054075 1012448 948338 970873 914786 935669 905194 882289 836382 826520 861268 827165 882873
3500H82873J01715m215l147J22650P8364J01411O9092J16081J85109N1412k0107
$$ 882873 984588 980373 977226 1099876 1178240 1279651 1348743 1464824 1649933 1701345 1681238
3489A681238m2176l1987q1858n6197P77N9812N7911R6729J8821q2264j15482n4318
$$ 1681238 1639062 1607075 1525217 1469020 1469797 1529609 1587520 1684249 1703070 1620806 1505324 1451006
3477A451006P12r4069o2308q744n8626l1651L4081m1490M4819R1937N6762k2161
$$ 1451006 1451718 1357649 1295341 1286597 1227971 1196320 1230401 1188911 1233730 1325667 1382429 1360268
3465A360268j1669K3914L5448Q5121J64946N4560M9246O9861j5351j7920M53r961
$$ 1360268 1348599 1372513 1407961 1493082 1658028 1712588 1761834 1831695 1816344 1798424 1798877 1788916
3453A788916n2219J6489J54139P7567J33094J51953J21445J56695K13585J00319
$$ 1788916 1736697 1753186 1907325 1984892 2117986 2269939 2391384 2548079 2761664 2861983
3443B861983N1749j13119k80624k60186l9378M5204O5978M5975J16216J56231
$$ 2861983 2913732 2800613 2519989 2259803 2220425 2265629 2331607 2377582 2493798 2650029
3433B650029Q7061K4304o3337o3190m8243M4476O1072J33684J26319J46601J03496
$$ 2650029 2737090 2761394 2698057 2634867 2586624 2631100 2692172 2825856 2952175 3098776 3202272
3422C202272q7679j94563j47508j25716N6216J00631K27308K93713M16067M09550
$$ 3202272 3114593 2920030 2772522 2646806 2703022 2803653 3030961 3324674 3740741 4150291
3412D150291K95953P7672l38635m85271l06203j44970j79184m8602J27688J95203
$$ 4150291 4446244 4523916 4185281 3700010 3393807 3248837 3069653 3021051 3148739 3343942
3402C343942J92093Q1393m7810k34439j87969j15453K9108K28625K12361K05284
$$ 3343942 3536035 3617428 3569618 3335179 3147210 3031757 3060865 3289490 3501851 3707135
3392C707135J53172L7081k12566m59168l67756k34953j63782q1635M0828J14406
$$ 3707135 3860307 3897388 3684822 3225654 2857898 2622945 2459163 2377528 2418356 2532762
3382B532762J22849J05206O4161p5929j54747k46419j68396j07847m6532p6921
$$ 2532762 2655611 2760817 2824978 2749049 2594302 2347883 2179487 2071640 2025108 1948187
3372A948187j0783n5525P9054P0089l3067r0480r1177p3770o2304J29180Q8168
$$ 1948187 1937404 1881879 1960933 2031022 1997955 1907475 1816298 1742528 1680224 1809404 1897572
3361A897572M4899Q1985o1023k04075k06704k01526j62097m7218q0328j09645
$$ 1897572 1942471 2024456 1963433 1759358 1552654 1351128 1189031 1141813 1061485 951840
3351I51840j14543j3419j6667l5100p6379l1203J4877q3699j4194p852l6099p0879
$$ 951840 837297 823878 807211 772111 695732 664529 679406 595707 581513 573661 537562 466683
3339D66683R2935k5071k687M58m3640l6675K3729k9961l6345j5990j7144J6932
$$ 466683 559618 534547 531860 532318 488678 452003 475732 445771 409426 393436 376292 393224
3327C93224p0250Q692J5087l1895L510K4919L26N9822k8622o2634n9810j1855
$$ 393224 322974 331666 346753 314858 318368 343287 343613 403435 374813 312179 252369 240514
3315B40514M2700j291k7940n3868k935l4446P0520K1988r8071M8253L0278q1046
$$ 240514 283214 281923 253983 200115 197180 162734 233254 255242 157171 205424 235702 154656
3303A54656O754j2203L7560Q5100k4796q8702P9322l2623O4800j4145k4001o7981
$$ 154656 161410 149207 186767 271867 247071 158369 237691 205068 269868 255723 231722 163741
3291A63741m7164P2036m1218n9872J4839P604J4662m7117j0062Q4201K7719n2320
$$ 163741 116577 188613 147395 87523 102362 109966 124628 77511 67449 151650 179369 127049
3279A27049M3111j1161l1116K4295P127l5531R210J1017l9082N927n28J0088O560
$$ 127049 170160 158999 127883 152178 159305 123774 132984 144001 104919 110846 110318 120406 126966
3266A26966k1677Q763j577n3546J4084N4695q05r1138R5644n0815J4964k627j4746
$$ 126966 105289 114052 112475 58929 73013 127708 126903 35765 131409 80594 95558 92931 78185
3253G8185K0697o3003j2898K9903O9758n5000J7884R574K373j4029j4897M1367
$$ 78185 98882 35879 22981 52884 122642 67642 85526 95100 97473 83444 68547 109914
3241A09914m674n0884R776L5403l7983l1257l2158J6961L6207M1894p880k0456
$$ 109914 105240 54356 64132 99535 61552 30295 -1863 15098 51305 93199 85319 64863
3229F4863O2265L5018l1289p2000m5016M9207K4257M4366m367m5953l2287J5709
$$ 64863 127128 162146 130857 58857 13841 63048 87305 131671 127304 81351 49064 64773
3217F4773k1749m0233O0624m636j7709K9015l4767p0964j734R3722L1492m6005
$$ 64773 43024 2791 63415 58779 41070 70085 35318 -35646 -37380 56342 87834 41829
3205D1829J8478K3640m5463M8693k211l0964m9552j6779O9827j3987J5484J4253
$$ 41829 60307 83947 38484 87177 84966 54002 4450 -12329 57498 43511 58995 73248
3193G3248J2190M300m0145N7670K8094O9855o303n9755p8022l4530m4480R5716
$$ 73248 85438 89738 49593 107263 135357 205212 198909 139154 61132 26602 -17878 77838
3181G7838J0746n6789K1090J8129n1711j2398N9541j5483k0702L16M0878J2835
$$ 77838 88584 31795 52885 71014 19303 6905 66446 50963 30261 30577 71455 84290
3169H4290n0967M3328M0035o0731O287k4634o2853M0488N4617k8718l2316K2426
$$ 84290 33323 76651 116686 55955 62242 37608 -25245 15243 69860 41142 8826 31252
3157C1252J6052M4883o2804k7935K6700o175J8543j2413Q46j6854O195l9839N0901
$$ 31252 47304 92187 29383 1448 28148 21973 40516 28103 28949 12095 18290 -21549 29352
3144B9352O3180m8897n0773k1095L1971P2075J2076k3208L3209k9761n4448M8104
$$ 29352 92532 43635 -7138 -28233 3738 75813 87889 64681 97890 68129 13681 61785
3132F1785O949K3797n9495k1050K1062k3629L8560M3684r8093O761N2697n9146
$$ 61785 68734 92531 33036 11986 33048 9419 47979 91663 -6430 331 53028 -6118
3120f118m2102N8767N120J0408m2016R153J9753J6399K3127o4809r363L7768n1697
$$ -6118 -48220 10547 15667 26075 -15941 -6788 12965 29364 52491 -12318 -21681 16087 -35610
3107c5610J6628K312J946N2547k0570J21j87Q1504p057m2564m8659q5094M4336
$$ -35610 -18982 -16670 -14724 37823 17253 17374 17187 98691 91634 49070 411 -84683 -40347
3094d0347K7537O8848j3797j7219O7893N22j1875L065k8447j4587l6482k7850
$$ -40347 -12810 56038 42241 25022 92915 93437 81562 84627 56180 41593 5111 -22739
3082b2739J1806O229k0198L8640J4165j5492l4389J2061k1222m701M7235j147
$$ -22739 -10933 -4704 -24902 13738 27903 12411 -21978 -9917 -31139 -35840 11395 10248
3070A0248P4945K7025m1664q4192L4565N1732L7205K5349n08n3791n9117L4266
$$ 10248 85193 112218 70554 -13638 20927 72659 109864 135213 134705 80914 21797 56063
3058E6063K4973R96K3155q513m6950j2567j00n9437k5581O5435k3514o514M4046
$$ 56063 81036 82032 105187 96674 49724 37157 37057 -22380 -47961 17474 -6040 -12554 31492
3045C1492n734Q0660l9729O18n561l8518Q465Q4688r2491m6658k8476l2611k780
$$ 31492 25758 106418 66689 67307 61746 23228 31693 116381 23890 -22768 -51244 -83855 -86635
3032h6635N5688L8429j9477n7770J1762R2470P091j7645Q786L9482j48400l8570
$$ -86635 -30947 7482 -11995 -69765 -58003 34467 41558 23913 32699 72181 -76219 -114789
3020a14789n566O3872N2494N6375L089k5854L499o3998l0683K3813J4281L5123
$$ -114789 -120355 -56483 -3989 52386 55475 29621 33120 -30878 -61561 -37748 -23467 11656
3008A1656k3119m0286O96P4487k5580q4059J03923l351m2916J5398m4663k2645
$$ 11656 -11463 -51749 -51053 23434 -2146 -86205 17718 14367 -28549 -13151 -57814 -80459
2996h0459L6887K050n9775J07244O742k7610Q7191L660o0676M240j6524n9028
$$ -80459 -43572 -41522 -101297 5947 12689 -14921 72270 75930 15254 19494 2970 -56058
2984e6058m8780P2492m2854k3420P2179k9619K1715j3069N3094M4043N519o2574
$$ -56058 -104838 -32346 -75200 -98620 -26441 -56060 -34345 -47414 5680 49723 55242 -7332
2972g332k3774O2051K6337q5327m163O7440n8968J958k2075K2826j929n2592j5953
$$ -7332 -31106 30945 57282 -28045 -32208 35232 -23736 -21778 -43853 -21027 -22956 -75548 -91501
2959i1501n367N2636N802M1860k5876L0834L694p8138m9590l4250J1529R8789
$$ -91501 -96868 -44232 -38430 3430 -22446 8388 12082 -66056 -115646 -149896 -138367 -39578
2947c9578l7822L5009Q602l9524O5786K9215K4821n0178p7497L936J2705j9250
$$ -39578 -77400 -42391 -33789 -73313 -7527 21688 46509 -3669 -81166 -77230 -64525 -83775
2935h3775k6392M1635L7871L9990J3898j0981k1290M128N872J6759L0588l0655
$$ -83775 -110167 -68532 -30661 9329 23227 12246 -9044 -4916 956 17715 48303 17648
2923A7648P347J8023n6857j3731O6354o3409K4341J961k47O3262j5342L9682n7561
$$ 17648 24995 43018 -13839 -27570 38784 -24625 -284 1677 1430 64692 49350 89032 31471
2910C1471m5834m4638N5494K0160R4k4884P998L5119J1571J8512k8784l4783P28
$$ 31471 -14363 -59001 -3507 16653 16747 -8137 -139 34980 46551 65063 36279 1496 2224
2897B224J1159o0277R56m3115L0283J5333J4518n202N677K0256M8639j163p4249
$$ 2224 13383 -46894 -45938 -89053 -58770 -43437 -28919 -34121 -28444 -8188 40451 39288 -34961
2884c4961n999O063K9169o860j637m6526L0136L1341l6359K9871J9897j3513J6652
$$ -34961 -40960 -34897 -5728 -12588 -14225 -60751 -30615 726 -35633 -5762 14135 622 17274
2871A7274K3731j3292M957l5161J166j433n3252l8432M9296o909J6199K9139l5958
$$ 17274 41005 27713 32670 -2491 -1325 -2758 -56010 -94442 -45146 -52055 -35856 -6717 -42675
2858d2675K4362P3755o5672l6996M5451N8001p2834l037k0466k2047K3296j4924
$$ -42675 -18313 55442 -10230 -47226 -1775 56226 -16608 -19645 -40111 -62158 -38862 -53786
2846e3786P8419J1502r9925P6077O4148m9697n3334J9351p8328L9916m216O4943
$$ -53786 24633 36135 -63790 12287 76435 26738 -26596 -7245 -85573 -45657 -49873 15070
2834A5070N8446q3320n8607J8769k5960j7701j4169p319Q2831n8079J6963k3817
$$ 15070 73516 -9804 -68411 -49642 -75602 -93303 -107472 -114791 -31960 -90039 -73076 -96893
2822i6893m088j0698J1900N6449M9242j2659L4109m8880P260N8111l6301l7292
$$ -96893 -100981 -111679 -99779 -43330 5912 -6747 27362 -21518 -14258 43853 7552 -29740
2810b9740p060L0898m4402J6036N0807J0063m6870o9446J08356m4900L524j4810
$$ -29740 -36800 -5902 -50304 -34268 16539 26602 -20268 -89714 18642 -26258 -22734 -37544
2798c7544K8696k8575o2164k9810j1682N0296M873L4906L871l7049p710J4864
$$ -37544 -8848 -37423 -99587 -129397 -141079 -90783 -85910 -51004 -47133 -84182 -91892 -77028
2786g7028J323J0862N0923k4107J5187k5937n3115J9064M1479N4874l0598l8794
$$ -77028 -75705 -64843 -13920 -38027 -22840 -48777 -101892 -82828 -41349 13525 -17073 -55867
2774e5867L3476n7055M029J7790k1474K3202j6409Q5983L9311q5421p3347P9898
$$ -55867 -22391 -79446 -75417 -57627 -79101 -55899 -72308 13675 52986 -32435 -105782 -25884
2762b5884L0242k8313p5552m8372N9358P6440l0316J885O8091K572m6418J0107
$$ -25884 4358 -23955 -99507 -147879 -88521 -12081 -42397 -40512 27579 30151 -16267 -6160
2750f160O7121J376q3974o091L0410r300j6763K0707K7120l7768j0257N034L6078
$$ -6160 60961 62337 -21637 -27728 2682 -6618 -23381 -2674 24446 -13322 -23579 -18545 17533
2737A7533j7657N3620p8526j10944K6817J25507M8217m0558k6706l3397r757m8609
$$ 17533 -124 53496 -25030 -135974 -109157 16350 64567 24009 -2697 -36094 -45851 -94460
2725i4460J7456q49m680M7073L8823l1856K2505j6966P253p193k0143o686J3062
$$ -94460 -77004 -77853 -82533 -35460 3363 -28493 -5988 -22954 -15701 -22894 -43037 -49723 -36661
2712c6661P17K3356K8549M8437n8281l6340N0216q4446k3182l4402N3272n8953
$$ -36661 -35944 -12588 15961 64398 6117 -30223 19993 -64453 -87635 -122037 -68765 -127718
2700a27718J856N1341Q435o2464N1828L1281j430M8543p7556j6821L8978L0268
$$ -127718 -125862 -74521 -66086 -128550 -76722 -45441 -46871 1672 -75884 -92705 -53727 -23459
2688b3459O052M2957l7848m8540J5970k6338K1779j1787K3239K133k5779o26N445
$$ -23459 -17407 25550 -12298 -60838 -44868 -71206 -49427 -61214 -37975 -35842 -61621 -62247 -56802
2675e6802K1913P508O3393k0980j0371K8584n2019j3483m523L6274L7325j8244
$$ -56802 -34889 -27381 36012 15032 4661 33245 -18774 -32257 -36780 -506 36819 18575
2663A8575O145q9882n0835J9431P0616R92P7289o2463r8604N506K407N6792J4550
$$ 18575 24720 -65162 -115997 -96566 -25950 -24958 52331 -10132 -108736 -103230 -100823 -44031 -29481
2650b9481J137L4227l9770l4833p410M8687m2141K3778M3320j5494L7435N6756
$$ -29481 -28344 5883 -33887 -68720 -76130 -27443 -69584 -45806 -2486 -17980 19455 76211
2638G6211l9744N6581n9817r7392j5724J9403j51l1285j9341K272O6976L1868
$$ 76211 36467 93048 33231 -64161 -79885 -60482 -60633 -91918 -111259 -108987 -42011 -10143
2626a0143L4422J1700o1370m7214L9688L3293l243l9428L1138j5488l8056K5101
$$ -10143 24279 35979 -25391 -72605 -32917 376 -2867 -42295 -11157 -26645 -64701 -39600
2614c9600N7765k9845J8504k1801j4687j3268m0714j3663N7787n79K312N6810
$$ -39600 18165 -11680 6824 -14977 -29664 -42932 -83646 -97309 -39522 -40101 -37789 19021
2602A9021M5928J6012K0206p9797n1491K3855j8287j8487O7630j7804p3175Q4760
$$ 19021 64949 80961 101167 21370 -30121 -6266 -24553 -43040 24590 6786 -66389 18371
2590A8371k9943q9937Q1144L3059K7273J5802k8321o752k81P3217j23254n9374
$$ 18371 -11572 -101509 -20365 12694 39967 55769 27448 20696 20415 93632 -29622 -88996
2578h8996M9415K1510l4754j5395K0559k1420Q301j620L9877k8207M0924J14237
$$ -88996 -39581 -18071 -52825 -68220 -47661 -69081 -60780 -62400 -22523 -50730 -9806 104431
2566A04431R907o9344l0598l570J1575L1493K3260J1405k1147r849L1788L4552
$$ 104431 114338 44994 14396 10826 22401 53894 77154 88559 67412 57563 89351 123903
2554A23903M675j7397l8779N135J4784m4928j9146j7738j593j9960Q2146p9479
$$ 123903 128578 111181 72402 77537 92321 47393 28247 10509 8916 -11044 71102 -8377
2542h377k8887o893k1747J09852M2830n2193o5715N3311j0502L0976m5669K6962
$$ -8377 -37264 -44157 -65904 43948 86778 34585 -31130 22181 11679 42655 -3014 23948
2530B3948l0749l9275M2169o3511Q075J4782M823M172L1729n0025l3454J14319
$$ 23948 -6801 -46076 -3907 -67418 -59343 -44561 -39738 -35566 -3837 -53862 -87316 27003
2518B7003L5847j7465N358k9479j2559l348o016K0376n06n0103K5345j2815J4563
$$ 27003 62850 45385 50743 21264 8705 5357 -659 19717 19211 -30892 -5547 -18362 -3799
2505c799K1283M1690l4973o9181N2409K0750L0447j7247m2454J8287O5177M9717
$$ -3799 17484 59174 24201 -44980 7429 28179 58626 41379 -1075 17212 82389 132106
2493A32106k4078k6105k4568N5878J1237k6324m4011n3128O0639j4765J5358j4833
$$ 132106 108028 81923 57355 113233 124470 98146 54135 1007 61646 46881 62239 47406
2481D7406K0058N7584l9803q6696J0916K4206P1239L9492k8849j1560k9563J1319
$$ 47406 67464 125048 85245 -1451 9465 33671 104910 144402 115553 103993 74430 85749
2469H5749o686o6458Q0091L3085l7810j7716l9835L5161N5448l733k0070j463
$$ 85749 79063 12605 92696 125781 87971 70255 30420 65581 121029 117296 97226 95763
2457I5763J3563K6432n9964q6890O0419j3772J0056l1494l5216J4318P066k6584
$$ 95763 109326 135758 75794 -11096 49323 35551 45607 14113 -21103 -6785 281 -26303
2445b6303k3252M2107O839K2649Q465k221M9377l9477J574K3804j7787l3042l2064
$$ -26303 -49555 -7448 -609 22040 30505 28284 77661 38184 39758 63562 45775 12733 -19331
2432a9331K7957M2394m310k814J1789o2749P1320N0430l0796L9151K7159n4872
$$ -19331 8626 51020 46710 43896 55685 -7064 64256 114686 83890 123041 150200 95328
2420I5328L4361J0656k598k2477o8432J0399J2021j5366K6108k9424l5027N3839
$$ 95328 129689 140345 137747 115270 46838 57237 69258 53892 80000 50576 15549 69388
2408F9388k1082P808M6642k8685l5811K0800N3639L2671p375l2512j3686p3208
$$ 69388 48306 56114 102756 74071 38260 59060 112699 145370 137995 105483 91797 18589
2396A8589O2170N7932K0439m490P436k4673J783Q997N8095j8093m4938j3129p678
$$ 18589 80759 138691 159130 154640 162076 137403 139186 148183 206278 188185 143247 130118 122440
2383A22440K1617m547N048l5104M8816q3699m223N7504p955K046J6102K2634M6773
$$ 122440 144057 139510 144558 109454 158270 74571 70348 127852 119897 121943 138045 160679 207452
2370B07452P1459J2089P591l2518J7700Q215M432R871J1284l2734J01518l3225
$$ 207452 278911 291000 298591 266073 283773 291988 296420 306291 317575 284841 386359 353134
2358C53134j00141L4970m5803O0898R703k2712M7667K9272K3034J4624k6211L5827
$$ 353134 252993 287963 242160 303058 312761 290049 337716 366988 390022 404646 378435 414262
2346D14262J2067k1127K8811Q122N5885R2534m0935m9234M6276j338J7801P5045
$$ 414262 426329 405202 434013 442135 498020 590554 549619 500385 546661 545323 563124 638169
2334F38169p594J19984M5276k0861o730J4470J70465N220L8243J08799J0490R7329
$$ 638169 630575 750559 795835 774974 768244 782714 953179 958399 996642 1105441 1115931 1213260
2322A213260J09157P1207J03664J57607K35880J85311J76058J52245J32148J61089
$$ 1213260 1322417 1393624 1497288 1654895 1890775 2076086 2252144 2404389 2536537 2697626
2312B697626O4531P5883K10524K75310L37093L33233K72889K16169L04090L40520
$$ 2697626 2762157 2838040 3048564 3323874 3660967 3994200 4267089 4483258 4787348 5127868
2302E127868L86274N38623P09285R17136J200065J574858K057516K829723L483359
$$ 5127868 5514142 6052765 6762050 7679186 8879251 10454109 12511625 15341348 18824707
2293A8824707M159364L203514J381078k284204n208504m153255k716076j994188
$$ 18824707 22984071 26187585 27568663 25284459 20075955 15922700 13206624 11212436
2285A1212436j574427j288241j098312p42032n98748m22483k83685j83595l05728
$$ 11212436 9638009 8349768 7251456 6509424 5910676 5488193 5204508 5020913 4715185
2276D715185l58913l08699l94682l14565k41339k38311j15419j55751j79058j38490
$$ 4715185 4356272 4047573 3652891 3338326 3096987 2858676 2743257 2587506 2408448 2269958
2266B269958j30032j39493p2616o9094j92646q5064j4985o3220j33563q1096o3867
$$ 2269958 2139926 2000433 1927817 1858723 1666077 1581013 1566028 1502808 1369245 1288149 1224282
2255A224282k9206K1113o1888r1021J257m6246M3858m0324l6086m9622o2882J4541
$$ 1224282 1195076 1216189 1154301 1063280 1064537 1018291 1062149 1021825 985739 936117 873235 887776
2243H87776q7210o7528l4863n5387j7021k5144K7088o1779N2878K9264n6884q782
$$ 887776 800566 733038 698175 642788 625767 600623 627711 565932 618810 648074 591190 582408
2231E82408n8965k939J5532n4003l6156k068j859L6617l0549n7813p1789J7474
$$ 582408 523443 520504 536036 482033 445877 443809 441950 478567 448018 390205 318416 335890
2219C35890j8206m354j6787J9307m8406L6025j2972n8094k0740L9631j3982J9031
$$ 335890 317684 313330 296543 315850 267444 303469 290497 232403 211663 251294 237312 256343
2207B56343J7749n6296q9085O5141l3452m409O2374k6214N441L1399L6211n9024
$$ 256343 274092 217796 128711 193852 160400 155991 218365 192151 197592 228991 265202 206178
2195B06178P181L0331k4125m2740J2183J2591k8788J818l2368q472K6701M2330
$$ 206178 213359 243690 219565 176825 189008 201599 172811 174629 142261 133789 160490 202820
2183B02820L3026n0441j7229J7180n621k0217l9096q2223J8615N5117M6069k852
$$ 202820 235846 185405 168176 185356 179735 159518 120422 38199 56814 111931 158000 155148
2171A55148J8157J3731L0625k0723k2302j6075m527l2608O7533Q840o4720L9172
$$ 155148 173305 187036 217661 196938 174636 158561 154034 121426 188959 197799 133079 172251
2159A72251k6761n7576K7327K5645r923o0096k3100L2803L1452l4362q2902J2943
$$ 172251 145490 87914 115241 140886 130963 70867 47767 80570 112022 77660 -5242 7701
2147G701J03833k5511k7862N969J1492m532P6546k6930q6797n5782O989N7678
$$ 7701 111534 86023 58161 64130 75622 71090 147636 120706 33909 -21873 -14884 42794
2135D2794l2540Q496k5245J2020m9628M2654R6523q4107L1990k1192K501Q383
$$ 42794 10254 18750 -6495 5525 -44103 -1449 95074 10967 42957 21765 24266 32649
2123C2649p5884j1362k951J4640K9632m077l172J8254K7297j826j5009P40j6262
$$ 32649 -43235 -54597 -57548 -42908 -13276 -17353 -20525 -2271 25026 23200 8191 8931 -7331
2110g331J5889k1173m5969L4463n4620l2797J27377K6504j348m1384M9440p8011
$$ -7331 8558 -12615 -58584 -24121 -78741 -111538 15839 42343 40995 -389 49051 -28960
2098b8960R206J7939L101J6839l8420L5493M5101n4536J0179k0207k7004j4039
$$ -28960 -19754 -1815 1286 18125 -20295 15198 60299 5763 15942 -4265 -31269 -45308
2086d5308K6467L2790K2522m5706m5286L9949n3332K4035K7527n0601o928Q6826
$$ -45308 -18841 13949 36471 -9235 -54521 -14572 -67904 -43869 -16342 -66943 -73871 12955
2074A2955m0447j4109P4234K6608K8462m9613p8421N5522J3467K0442l4431k0997
$$ 12955 -27492 -41601 32633 59241 87703 38090 -40331 15191 28658 49100 14669 -6328
2062f328J421k2681J933k9263n4131K0110O9955K3280o8725M7675q70m2379P4802
$$ -6328 -4907 -27588 -25655 -54918 -109049 -88939 -18984 4296 -64429 -16754 -17624 -60003 14799
$$ [...]
##END NTUPLES=NMR SPECTRUM
##END=
