##TITLE=1H_DE-80H_X3
 200.13MHz, d2o
 8 sc
 
 19ns.26.2.2025
##JCAMPDX= 6.0         $$ Bruker NMR JCAMP-DX V2.0
##DATA TYPE= NMR SPECTRUM
##DATA CLASS= NTUPLES
##ORIGIN= UXNMR, Bruker Analytische Messtechnik GmbH
##OWNER= pz
$$ XWIN-NMR		Version 3.5
$$ Tue Jul  1 10:34:24 2025 Russian Standard Time (UT+4h)  Yarkov@DPX200
##.OBSERVE FREQUENCY= 200.1313
##.OBSERVE NUCLEUS= ^1H
##.ACQUISITION MODE= SIMULTANEOUS
##.ACQUISITION SCHEME= undefined
##.AVERAGES= 8
##.DIGITISER RES= 18
##SPECTROMETER/DATA SYSTEM= spect
##.PULSE SEQUENCE= zg30
##.SOLVENT NAME= CDCl3
##.SHIFT REFERENCE= (INTERNAL, CDCl3, 0, 15.5706)
##AUDIT TRAIL= $$ (NUMBER, WHEN, WHO, WHERE, WHAT)
$$ ##TITLE= Audit trail, XWIN-NMR		Version 3.5
$$ ##JCAMPDX= 5.01
$$ ##ORIGIN= Bruker BioSpin GmbH
$$ ##OWNER= Yarkov
$$ C:/Bruker/XWIN-NMR/data/yarkov2/nmr/H-C/1/pdata/1/auditp.txt
$$ ##AUDIT TRAIL=  $$ (NUMBER, WHEN, WHO, WHERE, WHAT)
(   1,<2025-07-01 10:32:59.84 +0400>,<Yarkov>,<DPX200>,
      <created by zg, POWCHK disabled, PULCHK disabled
       configuration hash MD5:
       00 E9 B6 7A A2 85 ED C7 34 08 36 98 17 FE 4E 26
       data hash MD5: 16K
       CB 35 C3 1E BA 48 82 F0 71 BF 88 87 6E 3B 3E E1>)
(   2,<2025-07-01 10:33:05.54 +0400>,<Yarkov>,<DPX200>,
      <Start of raw data processing
       efp BC_mod = 2 LB = 0.25 FT_mod = 6 PKNL = 1 PHC0 = -1355.82 PHC1 = 3.966602 SI = 16K 
       data hash MD5: 16K
       7E 2E F0 0A 63 8E 39 DF CB F3 A5 50 47 63 1E 6C>)
(   3,<2025-07-01 10:33:25.18 +0400>,<Yarkov>,<DPX200>,
      <pk PHC0 = 5.530713 PHC1 = -4 
       data hash MD5: 16K
       36 5F 19 A5 B5 B8 77 EA DE 23 70 C3 2B 2E D3 85>)
(   4,<2025-07-01 10:33:28.78 +0400>,<Yarkov>,<DPX200>,
      <abs ABSG = 5 
       data hash MD5: 16K
       53 48 07 E8 C2 C0 EA 40 52 D9 12 EA D0 C8 D8 FA>)
$$ ##END=
$$ 
$$ hash MD5
$$ FB E2 81 6D E9 A5 2D A9 5B 81 72 66 B4 2B 44 90
##$RELAX= 
##$RELAX= 
##$RELAX= 
##$RELAX= 
##$RELAX= 
##$RELAX= 
$$ Bruker specific parameters
$$ --------------------------
##$DU= <C:/Bruker/XWIN-NMR>
##$EXPNO= 1
##$NAME= <H-C>
##$PROCNO= 1
##$TYPE= <nmr>
##$USER= <yarkov2>
##$AMP= (0..31)
100 100 100 100 100 100 100 100 100 100 100 100 100 100 100 100 100 100 
100 100 100 100 100 100 100 100 100 100 100 100 100 100 
##$AQSEQ= 0
##$AQ_mod= 1
##$AUNM= <au_zg>
##$AUTOPOS= <>
##$BF1= 200.13
##$BF2= 200.13
##$BF3= 200.13
##$BF4= 200.13
##$BF5= 200.13
##$BF6= 200.13
##$BF7= 200.13
##$BF8= 200.13
##$BYTORDA= 1
##$CFDGTYP= 0
##$CFRGTYP= 5
##$CHEMSTR= <none>
##$CNST= (0..31)
1 1 145 1 1 1 1 1 1 1 1 1 1 1 1 1 1 1 1 1 1 1 1 1 1 1 1 1 1 1 1 1 
##$CPDPRG= <>
##$CPDPRG1= <>
##$CPDPRG2= <>
##$CPDPRG3= <>
##$CPDPRG4= <mlev>
##$CPDPRG5= <mlev>
##$CPDPRG6= <mlev>
##$CPDPRG7= <mlev>
##$CPDPRG8= <mlev>
##$CPDPRGB= <>
##$CPDPRGT= <>
##$D= (0..31)
0 0.7 0 0 0 0 0 0 0 0 0 0.03 0 0 0 0 0 0 0 0 0 0 0 0 0 0 0 0 0 0 0 0 
##$DATE= 1751351579
##$DBL= (0..7)
120 120 120 120 120 120 120 120 
##$DBP= (0..7)
150 150 150 150 150 150 150 150 
##$DBP07= 0
##$DBPNAM0= <>
##$DBPNAM1= <>
##$DBPNAM2= <>
$$ [...]
##$SUBNAM3= <"">
##$SUBNAM4= <"">
##$SUBNAM5= <"">
##$SUBNAM6= <"">
##$SUBNAM7= <"">
##$SUBNAM8= <"">
##$SUBNAM9= <"">
##$SW= 18.0517328524113
##$SWIBOX= (0..15)
0 0 2 0 0 0 0 0 0 0 0 0 0 0 0 0 
##$SW_h= 3612.71676300578
##$TD= 16384
##$TD0= 1
##$TE= 0
##$TE2= 300
##$TE3= 300
##$TEG= 300
##$TL= (0..7)
0 120 120 120 120 120 120 120 
##$TP= (0..7)
150 150 150 150 150 150 150 150 
##$TP07= 0
##$TPNAME0= <>
##$TPNAME1= <>
##$TPNAME2= <>
##$TPNAME3= <>
##$TPNAME4= <>
##$TPNAME5= <>
##$TPNAME6= <>
##$TPNAME7= <>
##$TPOAL= (0..7)
0.5 0.5 0.5 0.5 0.5 0.5 0.5 0.5 
##$TPOFFS= (0..7)
0 0 0 0 0 0 0 0 
##$TUNHIN= 0
##$TUNHOUT= 0
##$TUNXOUT= 0
##$USERA1= <user>
##$USERA2= <user>
##$USERA3= <user>
##$USERA4= <user>
##$USERA5= <user>
##$V9= 5
##$VALIST= <valist>
##$VCLIST= <CCCCCCCCCCCCCCC>
##$VD= 0
##$VDLIST= <DDDDDDDDDDDDDDD>
##$VPLIST= <PPPPPPPPPPPPPPP>
##$VTLIST= <TTTTTTTTTTTTTTT>
##$WBST= 1024
##$WBSW= 4
##$XGAIN= (0..3)
0 0 0 0 
##$XL= 0
##$YL= 0
##$YMAX_a= 431082
##$YMIN_a= -425532
##$ZGOPTNS= <>
##$ZL1= 120
##$ZL2= 120
##$ZL3= 120
##$ZL4= 120
##$ABSF1= 15.49678
##$ABSF2= -2.555069
##$ABSG= 5
##$ABSL= 3
##$ALPHA= 0
##$AQORDER= 0
##$ASSFAC= 0
##$ASSFACI= 0
##$ASSFACX= 0
##$ASSWID= 0
##$AUNMP= <proc_1d>
##$AZFE= 0.1
##$AZFW= 0.1
##$BCFW= 0
##$BC_mod= 2
##$BYTORDP= 0
##$COROFFS= 0
##$CY= -3
##$DATMOD= 1
##$DC= 0
##$DFILT= <>
##$DTYPP= 0
##$F1P= 0
##$F2P= 0
##$FCOR= 1
##$FTSIZE= 16384
##$FT_mod= 6
##$GAMMA= 0
##$GB= 0
##$INTBC= 1
##$INTSCL= 3.241238e-09
##$ISEN= 128
##$LB= 0.25
##$LEV0= 0
##$LPBIN= 0
##$MAXI= 10000
##$MC2= 0
##$MEAN= 0
##$ME_mod= 0
##$MI= 1.114404
##$NCOEF= 0
##$NC_proc= -6
##$NLEV= 6
##$NOISF1= 3.799351
##$NOISF2= 2.8
##$NSP= 0
##$NTH_PI= 0
##$NZP= 0
##$OFFSET= 15.5706
##$PC= 1
##$PHC0= -1350.289
##$PHC1= -0.03339791
##$PH_mod= 1
##$PKNL= yes
##$PPARMOD= 0
##$PSCAL= 0
##$PSIGN= 0
##$REVERSE= no
##$SF= 200.129990214178
##$SI= 16384
##$SIGF1= 3
##$SIGF2= 2
##$SINO= 0.751879
##$SIOLD= 32768
##$SREGLST= <19F.Aceton>
##$SSB= 0
##$STSI= 16384
##$STSR= 0
##$SW_p= 3612.71676300578
##$SYMM= 0
##$S_DEV= 0
##$TDeff= 16384
##$TDoff= 0
##$TI= <>
##$TILT= no
##$TM1= 0
##$TM2= 0
##$TOPLEV= 0
##$USERP1= <user>
##$USERP2= <user>
##$USERP3= <user>
##$USERP4= <user>
##$USERP5= <user>
##$WDW= 1
##$XDIM= 16384
##$YMAX_p= 300541285
##$YMIN_p= -478466
$$ End of Bruker specific parameters
$$ ---------------------------------
##NTUPLES= NMR SPECTRUM
##VAR_NAME=  FREQUENCY,     SPECTRUM/REAL,   SPECTRUM/IMAG
##SYMBOL=    X,             R,               I
##VAR_TYPE=  INDEPENDENT,   DEPENDENT,       DEPENDENT
##VAR_FORM=  AFFN,          ASDF,            ASDF
##VAR_DIM=   16384,         16384,           16384
##UNITS=     HZ,            ARBITRARY UNITS, ARBITRARY UNITS
##FACTOR=    0.220516191357247, 1,           1
##FIRST=     3116.14393676501, 0,            0
##LAST=      -496.572826240772, 0,           0
##MIN=       -496.572826240772, -478466,     0
##MAX=       3116.14393676501, 300541285,    0
$$ Real data points
##PAGE= N=1
##DATA TABLE= (X++(R..R)), XYDATA
$$ [...]
8541g9503Q4514M6123m2639j0850o51j7029n866k4734l1064k3753l468N7433Q0573
$$ -79503 5011 51134 8495 -2355 -3006 -20035 -25901 -50635 -81699 -105452 -108920 -51487 29086
8528B9086k1503q9275J293L9693J3373k5766P5491n839l3166N6236m9238o565
$$ 29086 7583 -81692 -80399 -40706 -27333 -53099 22392 16553 -16613 39623 -9615 -16180
8516a6180K0164q82L5522q966m0858m0462l0101M4621K6305K2486m6764L9799
$$ -16180 3984 3102 38624 29658 -11200 -51662 -81763 -37142 -10837 11649 -35115 4684
8504D684r644m7863k4658M2289L1533n0121K1779r354o0623k95Q162O7660J8831
$$ 4684 -4960 -52823 -77481 -35192 -3659 -53780 -32001 -41355 -101978 -102273 -94111 -26451 -7620
8491g620m1154o959k5229l849J02187n3989m3496L2077L274n2016k2228O7186
$$ -7620 -48774 -55733 -80962 -84811 17376 -36613 -80109 -48032 -44758 -96774 -119002 -51816
8479e1816N984l6002K8203J3354M7598m7805l1059M5649M236j1465p298o805L1217
$$ -51816 -45832 -81834 -53631 -40277 7321 -40484 -71543 -25894 -21658 -33123 -40421 -47226 -16009
8466a6009j1717k5918M8809n731m7469J2056L3806j4880M0285J3017j3176m9304
$$ -16009 -27726 -53644 -4835 -10566 -58035 -45979 -12173 -27053 13232 26249 13073 -36231
8454c6231k0608M3878M9302l5897K1654k8653l2912Q1372p967r0707L6176K8804
$$ -36231 -56839 -12961 36341 444 22098 -6555 -39467 41905 33938 -56769 -20593 8211
8442H211J2640n3693m6352N7484j326l2366O9052l5139J5631J9494m4440J3144
$$ 8211 20851 -32842 -79194 -21710 -23036 -55402 13650 -21489 -5858 13636 -30804 -17660
8430a7660l6856o600J6853k44k1288j3983k0585K3751J2180K2302L0403p8999
$$ -17660 -54516 -61116 -44263 -44507 -65795 -79778 -100363 -76612 -64432 -42130 -11727 -90726
8418i0726P304K5442O3903J5374l4194J2573M7388m1318l0510M0924n7472n4810
$$ -90726 -83422 -57980 5923 21297 -12897 -324 47064 5746 -24764 16160 -41312 -96122
8406i6122K512Q6450m6766O139J7488Q7363n5497o5987J0523k7497M9678l1066
$$ -96122 -93610 -7160 -53926 -47787 -30299 57064 1567 -64420 -53897 -81394 -31716 -62782
8394f2782k8712O0232k3505K9571K0466j6422n742L3533m910n3046Q611J5210
$$ -62782 -91494 -31262 -54767 -25196 -4730 -21152 -26894 6639 1729 -51317 -42706 -27496
8382b7496J0275j0264k0651n0601L0017n147q109O172l4370j1835P2748j53l0772
$$ -27496 -17221 -27485 -48136 -98737 -68720 -73867 -81976 -75804 -110174 -122009 -49261 -49414 -80186
8369h0186J3503j7388O423K3572K169m4878O2069P290q7424N0440J9118L295M6327
$$ -80186 -66683 -84071 -77648 -54076 -51907 -96785 -34716 -27426 -114850 -64410 -45292 -41997 4330
8356D330L0172L779j2159M0712o149m4339o7594m3485K0003M1063o871J0853k1703
$$ 4330 34502 38281 26122 66834 60685 16346 -51248 -94733 -74730 -33667 -40538 -29685 -51388
8343e1388k677L0819j8606o7282L4776N2391o272J3700L743l7932m2595j9038
$$ -51388 -54065 -23246 -41852 -109134 -74358 -21967 -28239 -14539 -10796 -48728 -91323 -110361
8331a10361O184O8368k2766L4053L1405J9297o8939j1063m5276N1736M5765o9461
$$ -110361 -104177 -35809 -58575 -24522 6883 26180 -42759 -53822 -99098 -47362 -1597 -71058
8319g1058J2420n101m5764L6540P9453k2612j4712K8975j0602l9904J7258m5327
$$ -71058 -58638 -63739 -109503 -72963 6490 -16122 -30834 -1859 -12461 -52365 -35107 -80434
8307h0434L1223k2414K1455n821k4891J06735q3267k7645O0968r3380J0762k4559
$$ -80434 -49211 -71625 -50170 -55991 -80882 25853 -57414 -85059 -24091 -117471 -106709 -131268
8295a31268O5293L9179q8736K0132m6495J05429l9610Q418o7925k605O5398q9014
$$ -131268 -65975 -26796 -115532 -95400 -141895 -36466 -76076 -67658 -135583 -138188 -72790 -161804
8283a61804M2391J344N2981P5923k6726l7062k6587K0018L0319k6272M865K5293
$$ -161804 -119413 -118069 -65088 10835 -15891 -52953 -79540 -59522 -29203 -55475 -50610 -25317
8271b5317j9136L6643n8908m8375O6983L6810k8700l9601K9191J878J0751j9718
$$ -25317 -44453 -7810 -66718 -115093 -48110 -11300 -40000 -79601 -50410 -48532 -37781 -57499
8259e7499n3112N7778M0094l358k615K611M5866m5200o00p1291k5174j3620j5006
$$ -57499 -110611 -52833 -12739 -16097 -18712 -16101 29765 -15435 -16035 -87326 -112500 -126120 -141126
8246a41126L3578N7821J8912o857m4732j8795J3674N9875O3144Q512p656k3166
$$ -141126 -107548 -49727 -30815 -37672 -82404 -101199 -87525 -27650 35494 44006 36350 13184
8234A3184k6104J9698k3770o9488J1628P3469j5462m6365n0718k1575P2803J2873
$$ 13184 -12920 6778 -16992 -86480 -74852 -1383 -16845 -63210 -113928 -135503 -62700 -49827
8222d9827m0756M0829l1673k6603O3358K2249k2726l6707J581L7409N371P701
$$ -49827 -90583 -49754 -81427 -108030 -44672 -22423 -45149 -81856 -80275 -42866 -37495 -29794
8210b9794k1774M7001O9223r0771n6789j43r651k5985O1895L1676L8143j4920
$$ -29794 -51568 -4567 64656 -26115 -82904 -83047 -92698 -118683 -56788 -25112 13031 -1889
8198a889Q5860p6487j07518q4198m601k89633K59219M95029o5006l6363j54743
$$ -1889 83971 7484 -100034 -184232 -188833 -478466 -219247 275782 210776 174413 19670
8187A9670Q971j865L8139K0444l8544j3713K1268J33L5804m2685o7874L5166n1566
$$ 19670 28641 26776 64915 85359 46815 33102 54370 54503 90307 47622 -20252 14914 -36652
8174c6652K0589L7871o5979j4141M0707p874M7834K0546j5553l7618K893l9141
$$ -36652 -16063 21808 -44171 -58312 -17605 -25479 22355 42901 27348 -10270 -7377 -46518
8162d6518n2263k968O4013l87n2912Q9131m0917l8352K9321R0281r288j9285k6050
$$ -46518 -98781 -101749 -37736 -38123 -91035 -1904 -42821 -81173 -51852 38429 29141 9856 -16194
8149a6194n18o0716J6791L4670K5548p8884j5983R2347m679N1625n5542l0378
$$ -16194 -16712 -77428 -60637 -25967 -419 -79303 -95286 -2939 -7618 44007 -11535 -41913
8137d1913K567k2102L2652L0061j4416r6666k865K0508m1563N0653P4839r73K600
$$ -41913 -39346 -61448 -28796 1265 -13151 -109817 -112682 -92174 -133737 -83084 -8245 -9218 -6618
8124f618k0575n0961o8833K8236N1455j2705N2762j7505R535J7728m6952M378
$$ -6618 -27193 -78154 -146987 -118751 -67296 -80001 -27239 -44744 -35209 -17481 -64433 -60055
8112f0055J9761m9838K9J3390j6951M3336P121k2565j3275L7179j601P161J5321
$$ -60055 -40294 -90132 -90103 -76713 -93664 -50328 -43207 -65772 -79047 -41868 -43469 -36308 -20987
8099b0987p37j5152k2217M3271k0695J3825o29k3634m9541K9626j8920J3105P5926
$$ -20987 -21724 -36876 -59093 -15822 -36517 -22692 -23321 -46955 -96496 -66870 -85790 -72685 3241
8086C241l0753J3396N5103n2758j9698K3054k605J0728O6533k9212n454P0965
$$ 3241 -27512 -14116 40987 -11771 -31469 -8415 -11020 -292 66241 37029 31575 102540
8074A02540j15375m0101M1575J8535l7010M773R4704j7548Q968j6289l8801q6536
$$ 102540 -12835 -52936 -11361 7174 -29836 -25063 69641 52093 61061 44772 5971 -80565
8062h0565J6038N7761j8054n411K929j0601n9878O5486J4628n9199L047j4070
$$ -80565 -64527 -6766 -24820 -30231 -27302 -37903 -97781 -32295 -17667 -76866 -73819 -87889
8050h7889M6096M2581L0400q4553m3105L1217R628n704N7061J00404n3617j08140
$$ -87889 -41793 788 31188 -53365 -96470 -65253 -55625 -61329 -4268 96136 42519 -65621
8038f5621j955R5268j4626j12972k6154P8778N825N4011j7949J6829m6590N7966
$$ -65621 -67576 27692 13066 -99906 -126060 -47282 -41457 12554 -5395 11434 -35156 22810
8026B2810J4991l0392k9481J5504J1164k0035m1684J6834N569o331N1121K1919
$$ 22810 37801 7409 -22072 -6568 4596 -15439 -57123 -40289 -34720 -41051 10070 31989
8014C1989l4557j1708o7610K7096M8200q2401M4189p969j835N3496J120k4467
$$ 31989 -2568 -14276 -81886 -54790 -6590 -88991 -44802 -52771 -54606 -1110 10 -24457
8002b4457l3253k6686K1277p202R8546j8839J4975m1035m1512o2871O0676j3203
$$ -24457 -57710 -84396 -63119 -70321 28225 9386 24361 -16674 -58186 -121057 -60381 -73584
7990g3584o721j5797K5330P2979p370j8805k1419m3603L5214Q389j2473O2963
$$ -73584 -80305 -96102 -70772 2207 -5163 -23968 -45387 -88990 -53776 -45387 -57860 5103
7978E103j59l2436K7488N4114j0064r970J5924m8059o722L17l5751K4912K9789
$$ 5103 4944 -27492 -4 54110 44046 34076 50000 1941 -4781 -4464 -40215 -15303 14486
7965A4486K2165R885l1145P134K8190O5327m2037m9046p299O0821K4131r7411
$$ 14486 36651 46536 15391 22525 50715 116042 74005 24959 17660 78481 102612 5201
7953E201J7220J2619L0521o5212K0465L5556m553l0693M0557k0993K9361O466
$$ 5201 22421 35040 65561 349 20814 56370 51817 21124 61681 40688 70049 76515
7941G6515n585M7649l9006m1862M2668Q4784l5260K4401P1823K424N9775o5564
$$ 76515 70930 118579 79573 37711 80379 165163 129903 154304 226127 228551 288326 222762
7929B22762K251m0899m2125j5530p3575K363j3040K7439N9446j9419j3372o6841
$$ 222762 225013 184114 141989 126459 52884 55247 42207 69646 129092 109673 96301 29460
7917B9460l8923M4605K1442l7438o424K989m8841L2384J3730j279L3593J5961
$$ 29460 -9463 35142 56584 19146 12722 15711 -33130 -746 12984 11705 45298 61259
7905F1259L034n738l7874r4407o388Q1259N9206n2184J1528J8324k161L6544K9753
$$ 61259 64293 58555 20681 -73726 -80114 1145 60351 8167 19695 38019 35858 72402 102155
7892A02155j3712L5398j281M493m1126j4826k5047k3577K3345k1596L5935j6765
$$ 102155 88443 123841 122560 127053 85927 71101 46054 22477 45822 24226 60161 43396
7880D3396m7839L8220p407n1890m3635O4084J6937o4665N1300O1307K6843r1045
$$ 43396 -4443 33777 26370 -25520 -69155 -5071 11866 -52799 -1499 59808 86651 -4394
7868d394M1190o0225o3146l420k4598L0012N0104j0683k8932j5489K4689K0922
$$ -4394 36796 -23429 -86575 -89995 -114593 -84581 -34477 -45160 -74092 -89581 -64892 -43970
7856d3970K3722l3086m2396P8807M3687j05392p30K9724k4068J2812K895Q9486
$$ -43970 -20248 -53334 -95730 -16923 26764 -78628 -79358 -49634 -73702 -60890 -57995 31491
7844C1491j7833j13605K0128N5193K3074k9174N4446j5665q6155k3032K1716M1854
$$ 31491 13658 -99947 -79819 -24626 -1552 -30726 23720 8055 -78100 -101132 -79416 -37562
7832c7562J5275P615M5607L3687j09989R182r44l3332j2702Q130Q8423n247m5495
$$ -37562 -22287 -14672 30935 64622 -45367 -36185 -37129 -70461 -83163 -75033 13390 8143 -37352
7819c7352j2500Q0L6566j3779n3680J8103m8837P1478J34526K11418r9984j23653
$$ -37352 -49852 -49772 -13206 -26985 -80665 -62562 -111399 -39921 94605 306023 206039 82386
7807H2386m0237l2963L7347k2062K1335q4562m152L1059L7538K5913K4237J6419
$$ 82386 42149 9186 46533 24471 45806 -38756 -42908 -11849 25689 51602 75839 92258
7795I2258j1226k295K6618J4788p6267k3942R324J8822j3495O2966L149m0990
$$ 92258 81032 78737 105355 120143 43876 19934 29258 48080 34585 97551 100700 59710
7783E9710j9250M563K1607J614l9925L3038K9461l0142Q1448j0794K5354M869
$$ 59710 40460 45023 66630 68244 28319 61357 90818 60676 142124 131330 156684 161553
7771A61553O2247m160J86j612l5687o953l479J08594J3645L7526L5451j1335q3482
$$ 161553 223800 219640 219826 218214 182527 175574 172095 280689 294334 331860 367311 355976 272494
7758B72494R932L1608l5635j9209l8045n3902K5104K7532N8565J9663n149J0588
$$ 272494 282426 314034 278399 259190 221145 167243 192347 219879 278444 298107 292958 303546
7746C03546L0098p9933J378J05770q4436J8891K5l3997K6537J14789J017j9437
$$ 303546 333644 253711 255089 360859 276423 295314 295339 261342 287879 402668 403685 384248
7734C84248j8403J3820j8252j7498o7389j6565K4071Q7999K4864q345r7376n0295
$$ 384248 365845 379665 361413 343915 276526 259961 284032 372031 396895 388550 291174 240879
7722B40879L4331N1987K6504K0351N891m3039N9106L5l8306L9238n0944N5838
$$ 240879 275210 327197 353701 374052 379943 336904 396010 396045 357739 396977 346033 401871
7710D01871L0579O5645J5725M91J2138j00993K9668L8326q986o0990o016j7141
$$ 401871 432450 498095 513820 514311 526449 425456 455124 493450 484464 423474 417458 400317
7698D00317K5556K7950K823P713J2277K3989l3859k8747m5465j0967L9459M674
$$ 400317 425873 453823 456646 464359 476636 500625 466766 438019 392554 381587 421046 425720
7686D25720P1432O6904k5495k2450q8756J1131O2209p7461N8416R1216J7258n9718
$$ 425720 497152 564056 538561 516111 427355 438486 500695 423234 481650 572866 590124 530406
7674E30406p2802m7335L5157P2960j3684o1675K8670L2828m4882o67n0846L9641
$$ 530406 457604 410269 445426 518386 504702 443027 471697 504525 459643 458976 408130 447771
7662D47771L8026R540J4757O166r597l0822n7577l967K6047m0784L3749l4195
$$ 447771 485797 495337 510094 516260 506663 475841 418264 414297 440344 399560 433309 399114
7650C99114J3621l4024R1138m4852j03079K8835O3435k2260n6746O2703M8415
$$ 399114 412735 378711 469849 424997 321918 350753 414188 391928 335182 397885 446300
7639D46300K421Q284l0228K6667O9175o1678m1455N3878K4588n142l0194q4536
$$ 446300 448721 457005 426777 453444 522619 460941 419486 473364 497952 492810 462616 378080
7627C78080m1345p1615N1742O7574k7403J9236N654n7944J0414j1350j9359K1569
$$ 378080 336735 265120 316862 384436 357033 376269 381923 323979 334393 323043 303684 325253
7615C25253K9902j5270n5353j9019m0682L7172N7953l5195k1079L1255m7889k5514
$$ 325253 355155 339885 284532 265513 224831 262003 319956 284761 263682 294937 247048 221534
7603B21534M7322k7583m2892N851m1039j909m5559R239m3045L0504P295M6467
$$ 221534 268856 241273 198381 204232 163193 161284 115725 124964 81919 112423 119718 166185
7591A66185k8491n1534K5098P5864p1759k5234J02921r2281J02374l6487n8869
$$ 166185 137694 86160 111258 187122 115363 90129 193050 100769 203143 166656 107787
7580A07787L5504k9847o238M90n3900m1630l679M8838N1820L237l3106j17312
$$ 107787 143291 113444 107206 107696 53796 12166 8487 57325 109145 112382 79276 -38036
7568c8036j3111P6698J7446N7602J4260k7426L221k546l9138J9379L1470n5527
$$ -38036 -51147 25551 42997 100599 114859 87433 90654 88108 48970 68349 99819 44292
7556D4292k3329Q907P6367L806q438l3352o4358q755k3814J3060K8817K2548L2257
$$ 44292 20963 29870 106237 110043 101605 68253 3895 -4860 -28674 -15614 13203 35751 68008
7543F8008k0226j14268j4515O1838K4709M4912J9477n8121l719o4123K8759J9594
$$ 68008 47782 -66486 -81001 -19163 5546 50458 69935 11814 8095 -56028 -27269 -7675
7531g675P730j7131o292j9436J9418L4259j7701j1681M3506p614m943m8588l0657
$$ -7675 55 -17076 -23368 -42804 -23386 10873 -6828 -18509 24997 17383 12440 -36148 -66805
7518f6805N8308p775l0728n6109L3474m332M8433Q5562m0582j5066N5382n2546
$$ -66805 -8497 -16272 -47000 -103109 -69635 -73967 -25534 60028 19446 4380 59762 7216
7506G216j1232k1272j6249L1737N8417q4945k5622K4383K5726J8933J1372k7798
$$ 7216 -4016 -25288 -41537 -9800 48617 -36328 -61950 -37567 -11841 7092 18464 -9334
7494i334N9695L972j04054K3318j2756l2414l1437K3080K3670L9020K7705q9510
$$ -9334 50361 54333 -49721 -26403 -39159 -71573 -103010 -79930 -56260 -17240 10465 -79045
7482g9045J3008K0104k0586J7214p021P7288l5644L5302n8704l2162M680L4921
$$ -79045 -66037 -45933 -66519 -49305 -56326 20962 -14682 20620 -38084 -70246 -65566 -30645
7470c0645k2966l7634m200J2882K1452M1920J3035J9288n9344o5336L5444M8029
$$ -30645 -53611 -91245 -95445 -82563 -61111 -19191 -6156 13132 -46212 -111548 -76104 -28075
7458b8075k1681j7143M013l368L7922o1212j6023J47016m3131k8998j9293r1546
$$ -28075 -49756 -66899 -62886 -66254 -28332 -89544 -105567 41449 -1682 -30680 -49973 -141519
7446a41519N1190L1344P0590k142j0321j7895P0670L647l5796j6418k3804L4488
$$ -141519 -90329 -58985 11605 9463 -858 -18753 51917 55564 19768 3350 -20454 14034
7434A4034J5790l3220m7530J08264K9300j6263j1290m6374m2559l1538j4894N7602
$$ 14034 29824 -3396 -50926 57338 86638 70375 59085 12711 -29848 -61386 -76280 -18678
7422a8678K6615o7081L2398j8185J1978l6575L2688L0141l4242j2530L9153L8440
$$ -18678 7937 -59144 -26746 -44931 -32953 -69528 -36840 -6699 -40941 -53471 -14318 24122
7410B4122N352J4743M3342q3015m4884K655r732L3345L9567l4134l731l1521n7271
$$ 24122 29474 44217 87559 4544 -40340 -37685 -47417 -14072 25495 -8639 -12370 -43891 -101162
7397a01162N7996k596N819K5123m2750K8176k4025k343k4268m7942P1941M8823
$$ -101162 -43166 -45762 -39943 -14820 -57570 -29394 -53419 -55762 -80030 -127972 -56031 -7208
7385g208L1948p009n8196r522j9664N3379M1169j01125J5567K0930M5046j3721
$$ -7208 24740 17731 -40465 -49987 -69651 -16272 24897 -76228 -60661 -39731 5315 -8406
7373h406k9081o0268l767Q2460J6060k5326J5094P9690p4062n8809K6941K9708
$$ -8406 -37487 -97755 -101522 -19062 -3002 -28328 -13234 66456 -7606 -66415 -39474 -9766
7361i766r790n4186j4847O7309l1011K2894M570k4167l9870l7267M5882K9792
$$ -9766 -19556 -73742 -88589 -21280 -52291 -29397 -24827 -48994 -88864 -126131 -80249 -50457
7349e0457r743j6126K4739l1537K5673o165M7796k2117r7022M0554L1462Q961
$$ -50457 -60200 -76326 -51587 -83124 -57451 -63616 -15820 -37937 -134959 -94405 -62943 -53982
7337e3982N3632k7238K7536J3134l1797m051l6788M1960l9018M7166K3858k6359
$$ -53982 -350 -27588 -52 13082 -18715 -22766 -59554 -17594 -56612 -9446 14412 -11947
7325a1947p7901J3887K6428P1434j9078m0878N3585n5485Q78N5652R431n3811
$$ -11947 -89848 -75961 -49533 21901 2823 -38055 15530 -39955 -39077 16575 26006 -27805
7313b7805R643M1168M7963q5327n4776J0528N6666o4924k8024L9402j1421M1233
$$ -27805 -18162 23006 70969 -14358 -69134 -58606 -1940 -66864 -94888 -55486 -66907 -25674
7301b5674M1932k0582M459Q798n5903K5150J3426n8705K7210l9058l5106L4164
$$ -25674 16258 -4324 135 8933 -46970 -21820 -8394 -67099 -39889 -78947 -114053 -79889
7289g9889k542l2967L6547K3186P2289Q53m8530J474L3876r641m0759N7063l7966
$$ -79889 -82431 -115398 -78851 -55665 16624 17477 -31053 -29579 4297 -5344 -46103 10960 -27006
7276b7006R146L9400k5487J3906m1926j0541n79m619o2158q480R2736M3754k7842
$$ -27006 -17860 21540 -3947 9959 -31967 -42508 -43087 -47706 -109864 -118344 -25608 18146 -9696
7263i696k3044o622J03862m2290l5255R23r786N8593J03116o1060n3463N1026
$$ -9696 -32740 -39362 64500 22210 -13045 -12122 -21908 36685 139801 78741 25278 76304
7251G6304j00030K5848L1978J6833k9769k6831L2947M0585o2377l0216L3787K2579
$$ 76304 -23726 2122 34100 50933 21164 -5667 27280 67865 5488 -24728 9059 31638
7239C1638M979J031k2802l5399J5997j9547L3046L4772l1393N7590J8827n0131
$$ 31638 36617 37648 14846 -20553 -4556 -24103 8943 43715 12322 69912 88739 38608
7227C8608k2894J3882l1805R720k6729j6006j5555l6688M8469N4066P6629J6778
$$ 38608 15714 29596 -2209 7511 -19218 -35224 -50779 -87467 -38998 15068 91697 108475
7215A08475m7114m9972k8360M7663N224O652p4526l5741J12527J7347m0809J1788
$$ 108475 61361 11389 -16971 30692 35916 42568 -31958 -67699 44828 62175 21366 33154
7203C3154K440j580N416l3859j1075m512P3625k2662l2853m3898J1962K0945m6959
$$ 33154 35594 34014 39430 5571 -5504 -10016 63609 40947 8094 -35804 -23842 -2897 -49856
7190d9856L1098k6009j9516J0580L3320k9872K197M8422l5445L1202L8529l5748
$$ -49856 -18758 -44767 -64283 -53703 -20383 -50255 -48058 364 -35081 -3879 34650 -1098
7178a098j8434P8702O528j0633m5510l2359J2609k7283n6844j7797R7602n5827
$$ -1098 -19532 59170 65698 55065 9555 -22804 -10195 -37478 -94322 -112119 -14517 -70344
7166g0344q392K0850L4440k2707K9381K8675K3718J965j4330l1447O6623p761
$$ -70344 -78736 -57886 -23446 -46153 -16772 11903 35621 37586 23256 -8191 58432 50671
7154E0671n897M935k1336n657K2918J3992j7737j9110P800M3685K3775m3924k5582
$$ 50671 44774 49709 28373 22716 45634 59626 41889 22779 30579 74264 98039 54115 28533
7141B8533l6895M0354R212j6350L5234m4254j2222K3066Q715q564J24085J1423
$$ 28533 -8362 31992 41204 24854 60088 15834 3612 26678 35393 26829 150914 162337
7129A62337n6075L7235K780l6988J15232J315P7597L0261m1766q8606R5546N8193
$$ 162337 106262 143497 146277 109289 224521 225836 303433 333694 291928 203322 298868 357061
7117C57061l1798R3416J23627Q7568k4911J36124R0708K9103J77104K18010K05373
$$ 357061 325263 418679 542306 629874 604963 741087 831795 860898 1038002 1256012 1461385
7106A461385K28259K81304K56864L43901K92502L15638O19631N57908q515m05106
$$ 1461385 1689644 1970948 2227812 2571713 2864215 3179853 3799484 4357392 4348877 3943771
7096C943771l35415j01950l21295m99635l10749j61613j44780j71867n3707o1413
$$ 3943771 3608356 3506406 3185111 2685476 2374727 2213114 2068334 1896467 1842760 1781347
7086A781347j52794n2985M7498j6768L4103J0806L657j1795m2265o7205j05942
$$ 1781347 1628553 1575568 1623066 1606298 1640401 1651207 1654864 1643069 1600804 1533599 1427657
7075A427657r671m845j8810J1989j1568q347q2173m3916n4929k5871r2418o7701
$$ 1427657 1417986 1413141 1394331 1406320 1394752 1386405 1304232 1260316 1205387 1179516 1087098 1019397
7063A019397Q2167k2700n4928k7310j39460q1005r256q0835Q3794o414q9689J2065
$$ 1019397 1101564 1078864 1023936 996626 857166 776161 766905 686070 769864 763450 673761 685826
7051F85826p2222m3658p358K1752o5801n4327l5451m7214M808M418j5215j8634
$$ 685826 613604 569946 562588 584340 518539 464212 428761 381547 386355 390773 375558 356924
7039C56924q97L2082k8277k9479K4742J2710l9072K7617N5869m4893J0448l1566
$$ 356924 356027 388109 359832 330353 355095 367805 328733 356350 412219 367326 377774 346208
7027C46208k6077L3522J547n602K3813M2914K3773o9636K5595P0464n1546m0343
$$ 346208 320131 353653 355200 349598 373411 416325 440098 370462 396057 466521 414975 374632
7015C74632Q5253P3154p710P026J7970K1577M7785J5955K0737m4500J4237M0976
$$ 374632 459885 533039 525329 532355 550325 571902 619687 635642 656379 611879 626116 667092
7003F67092P9863K8926K0024j7486L9294j4477O9229m2104L0691Q6674O566K903
$$ 667092 746955 775881 795905 778419 817713 803236 872465 830361 861052 947726 954292 957195
6991I57195l9621k7482r5666L782K1371j3170j4400k0735l6347k8894m7371n4670
$$ 957195 917574 890092 794426 798208 819579 806409 792009 771274 734927 706033 658662 603992
6979F03992o6054L4907m9878N3264M7329n8478r2026Q094J3772l4379l9359L3557
$$ 603992 537938 572845 522967 576231 623560 565082 473056 481150 494922 460543 421184 454741
6967D54741r3506p443O0572J3847k4681l3482q004N9834m6326K3994J09457m7629
$$ 454741 361235 353792 414364 428211 403530 370048 362044 421878 375552 399546 509003 461374
6955D61374p70N3606O6800j3355Q765N959l0507O6353J6580p937J8709M0706J10515
$$ 461374 460604 514210 581010 567655 576420 582379 551872 618225 634805 626868 645577 686283 796798
6942G96798J4559K3333O5010N7844N7369k1061l0914q148l8563K9306Q707P7235
$$ 796798 811357 834690 899700 957544 1014913 993852 962938 954790 916227 945533 954240 1031475
6930A031475k7590k1050L8164p4231K254O955p9133l1034l7734L5698N2226p4606
$$ 1031475 1003885 982835 1020999 946768 949022 955977 876844 845810 808076 843774 896000 821394
6918H21394p880m5377l0304L521k883k7516j9174l1854k5553o455l6163m529L133
$$ 821394 813514 768137 737833 741354 738471 710955 691781 659927 634374 627919 591756 587227 590360
6905E90360j5226N6878k5322l4663P9671L7851M1118k3039M9229M3377k7738k8695
$$ 590360 575134 632012 606690 572027 651698 689549 730667 707628 756857 800234 772496 743801
6893G43801J2386J1564K509P6750J5903n0807m3745P3974k9403l3985J08123m3767
$$ 743801 756187 767751 770260 847010 862913 812106 768361 842335 812932 778947 887070 843303
6881H43303p786j193R436l4980J312n6798k8032l6810n09m6173r0567o3240l9917
$$ 843303 835517 834324 843760 808780 810092 753294 725262 688452 687943 641770 551203 487963 448046
6868D48046L0111n4481k2485l5261j7884J1904j2093k0290M0620n4116k4255k8205
$$ 448046 478157 423676 401191 365930 348046 359950 347857 327567 368187 314071 289816 261611
6856B61611N6887L2790m8426q1198K4247n134K448k281j2981O894n791m7509l5727
$$ 261611 318498 351288 302862 221664 245911 240777 243225 240944 227963 234857 229066 181557 145830
6843A45830l1432N9804K3786r3111q574j824l0948R895K7766O3579J9570p0393
$$ 145830 114398 174202 197988 104877 96303 94479 63531 73426 101192 164771 184341 113948
6831A13948R482j5627j8617L5077l5225q3869J6277R3468o7866j6194R496r337
$$ 113948 123430 107803 89186 124263 89038 5169 21446 114914 47048 30854 40350 31013
6819C1013Q0002o3995K9751L8172J7494l4800o8406Q481R13M202L4254j4701n893
$$ 31013 111015 47020 76771 114943 132437 97637 29231 37712 38625 42827 77081 62380 56487
6806E6487o485M2203J3523j8993o8114L3085L8552N0701p8640L7987o9677j4499
$$ 56487 50002 92205 105728 86735 18621 51706 90258 140959 62319 100306 30629 16130
6794A6130J8483k0812j9402m619Q3261K641R977k6424N784L2989m9467l8623J721
$$ 16130 34613 13801 -5601 -10220 73041 75682 85659 59235 65019 98008 48541 9918 11639
6781A1639K7644j9750k266j5833J9842M1901P66N8677L6203l8138j05391n0967
$$ 11639 39283 19533 17267 1434 21276 63177 63943 122620 158823 120685 15294 -35673
6769c5673O1940O7534r3967j2207J1992j0822k555N8750J2230n0865p1576M4237
$$ -35673 26267 93801 -166 -12373 -381 -11203 -13758 44992 57222 6357 -65219 -20982
6757b0982k1187O8990M8534N4168q074n2531j679q126l5716J5930p449k687j0495
$$ -20982 -42169 26821 75355 129523 121449 68918 67239 59113 23397 39327 31878 29191 18696
6744A8696L3638M5418k6880k2544L1085o9614n8257R5634R383L7780O4404O2817
$$ 18696 52334 97752 70872 48328 79413 9799 -48458 47176 56559 94339 158743 221560
6732B21560n1243l2641J2339J8282j9332L0358N8069m1048j0481p2508l6949J5816
$$ 221560 170317 137676 150015 168297 148965 179323 237392 196344 185863 113355 76406 92222
6720I2222K6514j4027k497o493j07466j4849N4210J4206j2875L643m165q697m0373
$$ 92222 118736 104709 102212 95719 -11747 -26596 27614 41820 28945 32588 28423 19726 -20647
6707b0647P5118L8535m4255J658J4301k0593k3663M3930o2092l1553P104R664
$$ -20647 54471 93006 48751 50409 64710 44117 20454 64384 2292 -29261 -22157 -12493
6695a2493L8204K1696j703m2906N7119K9758p5531m2445k0655M4347N5825k9486
$$ -12493 25711 47407 45704 2798 59917 89675 14144 -28301 -48956 -4609 51216 21730
6683B1730L0078L2707m7847o0302J4269l421n6149K5162N3563K9609j5532p463
$$ 21730 51808 84515 36668 -23634 -9365 -12786 -68935 -43773 9790 39399 23867 16404
6671A6404L9525j6209k9493K224m1299L5157K6357k8686j1268j9231k481p001
$$ 16404 55929 39720 10227 12451 -28848 6309 32666 3980 -7288 -26519 -29000 -36001
6659c6001M140Q142N4730L6165m6076q402L020J6390J2828k37M0985k4502J5606
$$ -36001 -31861 -23719 31011 67176 21100 12698 15718 32108 44936 44699 85684 61182 76788
6646G6788m3858k8619K6914l0480R282j8016K7859L8874l4927k1053p1185K6839
$$ 76788 32930 4311 31225 745 10027 -7989 19870 58744 23817 2764 -68421 -41582
6634d1582M8643p4764l5871N7018N303J6095k092q6810N1587R6484P941j5461
$$ -41582 7061 -67703 -103574 -46556 -41253 -25158 -27250 -114060 -62473 34011 41952 26491
6622B6491l7737N532J7758l3144j9820K128J8592O0772l4775M4383n831m4401
$$ 26491 -11246 -5714 12044 -21100 -40920 -38792 -20200 40572 5797 50180 44349 -52
6610e2j6208o199J2988j6918K889l5968l305j8849m079P6358L1441k0775O402
$$ -52 -16260 -22459 -9471 -26389 -23500 -59468 -62773 -81622 -85701 -9343 22098 1323 7725
6597G725K8408J5674n5217N237j3458M3028j6576R164k9797r082J9677j1646M6544
$$ 7725 36133 51807 -3410 1827 -11631 31397 14821 23985 -5812 -14894 4783 -6863 39681
6584C9681J6257m0529P9047N615m6975l0456L1303K5546q7138q731l1073J3512
$$ 39681 55938 15409 94456 100071 53096 22640 53943 79489 -7649 -16380 -47453 -33941
6572c3941K4883L4336J1491q887k7185k166j2453j7648j475l6956N2053O946K820
$$ -33941 -9058 25278 36769 27882 697 -1469 -13922 -31570 -33045 -70001 -17948 -11002 -8182
6559h182J6894L46N1191J9790m1682r0620n2676J5876L7943M6038L0454p2k5015
$$ -8182 8712 9058 60249 80039 38357 -52263 -104939 -89063 -51120 -5082 25372 25300 285
6546B85k7248J2424L4167l8695k3588L0992j4293K296K0424m3881k3063L5305
$$ 285 -26963 -14539 19628 -19067 -42655 -11663 -25956 -23660 -3236 -47117 -70180 -34875
6534c4875k1646O9080J6237o6906l0877L1688j5000m4795P2595J6621j1002Q0822
$$ -34875 -56521 12559 28796 -38110 -68987 -37299 -52299 -97094 -24499 -7878 -18880 61942
6522F1942L7331J583m2156L6101p9154K3477L5772m2357m994L4721j5535k1744
$$ 61942 99273 100856 58700 94801 15647 39124 74896 32539 27545 62266 46731 24987
6510B4987j873m4951L0651J05522k1893l3455l9216j9446L4645k2836k9410l766
$$ 24987 23114 -21837 8814 114336 92443 58988 19772 326 34971 12135 -17275 -21041
6498b1041L4365L727N0767M916k2477n924j9418k1763M2003O0974k9063Q283J095
$$ -21041 13324 17051 67818 72734 50257 44333 24915 3152 45155 106129 77066 85349 86444
6485H6444j02575q3327L543O0413j8864L2263l297M8183L139J3959L2510l1623
$$ 86444 -16131 -99458 -95915 -35502 -54366 -22103 -25400 22783 25922 39881 72391 40768
6473D0768K5911n085n6485m171j7667J0054Q4472j1480m3926P498M6109M098o5535
$$ 40768 66679 61594 5109 938 -16729 -6675 77797 66317 22391 29889 75998 80096 14561
6460A4561k3375L1395J4409l6142N4207K7859k5589J64J6029m511m6119j4466
$$ 14561 -8814 22581 36990 848 55055 82914 57325 57489 73518 69007 22888 8422
6448H422J6187Q5581j5208m2112N3031k5210n6747n8632J36391J3783L199n0563
$$ 8422 24609 110190 94982 52870 105901 80691 23944 -34688 101703 115486 118685 68122
6436F8122K5000O3131j6589j4850p0612M1001M3426k94M74m1497k0561n2880K0393
$$ 68122 93122 156253 139664 124814 54202 95203 138629 138335 138809 97312 76751 23871 44264
6423D4264J729k9499K6998n1051K3450K5198k6514N1718M0639q8222P9809n1110
$$ 44264 45993 16494 43492 -7559 15891 41089 14575 66293 106932 18710 98519 47409
6411D7409o5494J45634l4187M0485k3032p4932q573L029N0448J669j2424j7944
$$ 47409 -18085 127549 93362 133847 110815 35883 27310 30339 80787 82456 70032 52088
6399E2088P0385O6460m7962j214J7562p0049k0059l618J0638k6303N2616J6186
$$ 52088 122473 188933 140971 139757 157319 87270 67211 63593 74231 47928 100544 116730
6387A16730K4745k3748M5983P237l0556l3521K016P0400n5487l8072M7263p7610
$$ 116730 141475 117727 163710 170947 140391 106870 108886 179286 123799 85727 132990 55380
6375E5380j186r040N617K2240M7909Q1553l9927l5722K075j8870j2926P9413k5780
$$ 55380 54194 45154 50771 73011 120920 202473 162546 126824 128899 110029 97103 176516 150736
6362A50736l9463l0067K2839R3969M7201j9225r5927j13087L7439K2707L7069
$$ 150736 111273 81206 104045 198014 245215 225990 130063 16976 54415 77122 114191
6351A14191M3671j4993n788K8716l9470l6525l0638J4378J0185K3164K7819l1984
$$ 114191 157862 142869 137081 165797 126327 89802 59164 73542 83727 106891 134710 102726
6339A02726K9465L3767j1954o6333P071l9087L434l6733L9750j4777k6673Q8642
$$ 102726 132191 165958 154004 87671 94742 55655 59089 22356 62106 47329 20656 109298
6327A09298K9283j8596m7773N112P43m4680K5988p733k6827K3541M6833o4064
$$ 109298 138581 119985 72212 77324 78067 33387 59375 51642 24815 48356 95189 31125
6315C1125j5913P253m5498O3877L348Q544l905l5679k7789J4199P2295R309k613
$$ 31125 15212 22465 -23033 40844 44192 52736 48831 13152 -14637 -438 71857 81166 78553
6302G8553L6226m4124J2851Q59J8202o950r071n7492n023J5448l2997L8296p28
$$ 78553 114779 70655 83506 84365 102567 95617 86546 29054 24031 39479 6482 44778 44050
6289D4050K8432K6141o4534K208l25k8384K2145j5726M6078N155L5034k3850l2782
$$ 44050 72482 98623 34089 36297 35972 7588 29733 14007 60085 65240 100274 76424 43642
6276D3642L7218P421O5153J3217l9126M4617k1798K0568k5679k6650Q624k1177
$$ 43642 80860 88281 153434 166651 127525 172142 150344 170912 145233 118583 127207 106030
6264A06030j1350j1138J522K4835j1797j9172J6561n6956o4961M1357L4664J6976
$$ 106030 94680 83542 85064 109899 98102 78930 95491 38535 -26426 14931 49595 66571
6252F6571L1558m9307M6861l5732k1758J0394K8658M7359k4552M5912l519O347
$$ 66571 98129 48822 95683 59951 38193 48587 77245 124604 100052 145964 142445 148792
6240A48792J5318j2725J9816N2207p5q1933R195L9819n412k0048J7057o6570L2778
$$ 148792 164110 151385 171201 223408 223333 141400 150595 190414 185002 164954 182011 115441 148219
6227A48219j1636k8531M087Q4483N598l2066l9842l2467N3437k310m5429K0978
$$ 148219 136583 108052 112139 196622 202220 170154 130312 97845 151282 148972 103543 124521
6215A24521M3382o0461L3609N1229n6016k260M34l009R197M8582J9912m9808j4820
$$ 124521 167903 107442 141051 192280 136264 134004 134438 131429 140626 189208 209120 159312 144492
6202A44492K392J5874J6326L076j14134K0904N0285K2717p6247j7930R2053k4876
$$ 144492 146884 162758 179084 182160 68026 88930 139215 161932 85685 67755 159808 134932
6190A34932O2978l1510l4199n688M0223k0779m2585j0162n207M06L7570K7356
$$ 134932 197910 166400 132201 126513 166736 145957 103372 93210 88003 88409 125979 153335
6178A53335l3651m1518O3948m7445L0672P9741m3422J7997r818K5374J2861p5080
$$ 153335 119684 78166 142114 94669 125341 205082 161660 179657 169839 195213 208074 132994
6166A32994J4474K4953K6253J1689m2485P480o3746N5120M0244L4552j5494l7908
$$ 132994 147468 172421 198674 210363 167878 175358 111612 166732 206976 241528 226034 188126
6154A88126j5226O5264l8538m4724P4666L4418l4223l515j9760L5571k3085R240
$$ 188126 172900 238164 199626 154902 229568 263986 229763 226248 206488 242059 218974 228214
6142B28214j5343M126K7686M8417K2297k4758K1007j6078M4948J6636k8620K3232
$$ 228214 212871 216997 244683 293100 315397 290639 311646 295568 340516 357152 328532 351764
6130C51764o7112K6721l3813O9181K5740j7293J01645J2468o5464m5514O2035
$$ 351764 284652 311373 277560 346741 372481 355188 456833 469301 403837 358323 420358
6119D20358L1876l192M3877P0352q0529p4502P7608L1601q6320K9928R7093K844
$$ 420358 452234 449042 492919 563271 482742 408240 485848 517449 431129 461057 558150 560994
6107E60994n0921K9663J7252j812l9239j9545O2877O2077J9122J4918M8152p93
$$ 560994 510073 539736 556988 555176 515937 496392 559269 621346 640468 655386 703538 702745
6095G02745L4149J4900l2097J8948N0157J1156q457K5285K3035K3301K7945O916
$$ 702745 736894 751794 719697 738645 788802 799958 791501 816786 839821 863122 891067 897983
6083H97983o4752j6597K2073P3019o6179k8028K8603L0087L735l2673K4148M2721
$$ 897983 833231 816634 838707 911726 845547 817519 846122 876209 879944 847271 871419 914140
6071I14140N2973n790j5624J7477Q4216K2276N921P1400M9005j0396Q1114Q1464
$$ 914140 967113 961323 945699 963176 1047392 1069668 1075589 1146989 1195994 1185598 1266712 1348176
6059A348176l7253P6877m1760q7226Q1787R3724L3516j8494O2957l2902k2918
$$ 1348176 1310923 1387800 1346040 1258814 1340601 1434325 1467841 1449347 1512304 1479402 1456484
6048A456484p384J6055J7140K5651P1011k2768N9347J462M3309P4249P5951N8952
$$ 1456484 1449100 1465155 1482295 1507946 1578957 1556189 1615536 1616998 1660307 1734556 1810507 1869459
6036A869459O2723M3703k183Q1559J30278L2675R5253M2186R7156L6011P6081
$$ 1869459 1932182 1975885 1973702 2055261 2185539 2218214 2313467 2355653 2452809 2488820 2564901
6025B564901M9660Q720P3098P5827O6824N8999Q053j6400j696L4516L8775p101
$$ 2564901 2614561 2623281 2696379 2772206 2839030 2898029 2906082 2889682 2887986 2922502 2961277 2954176
6013B954176L9840o3150k7254J3991k5106J8777J7629K7473M527m5733M3564q0084
$$ 2954176 2994016 2930866 2903612 2917603 2892497 2911274 2928903 2956376 2960903 2915170 2958734 2878650
6001B878650l6949o3053l2276l0063J5932M5651K1691n8497o8467l2106n9242
$$ 2878650 2841701 2778648 2746372 2716309 2732241 2777892 2799583 2741086 2672619 2640513 2581271
5990B581271o7497r245l5251J138n5368q0112n7680q5116n6548j29427j23635
$$ 2581271 2513774 2504529 2469278 2470416 2415048 2334936 2277256 2192140 2135592 2006165 1882530
5979A882530j10436m9249M7208n8079j08353j3503p5504l9125n1120n0198k2044
$$ 1882530 1772094 1722845 1770053 1711974 1603621 1590118 1514614 1475489 1424369 1374171 1352127
5968A352127n2834r3373j00821N960N4912r5685K5995k9453j509k4115k1527p0330
$$ 1352127 1299293 1205920 1105099 1111059 1165971 1070286 1096281 1066828 1065319 1041204 1019677 949347
5956I49347k929K4630n305o3495j00682M6371k1559o000l3941m285K2859m6517
$$ 949347 946418 971048 965743 902248 801566 847937 826378 820378 786437 782152 805011 758494
5944G58494l9770M5550m1651L2917M7025p3100m1879O3154M1046M9952o7888J8471
$$ 758494 718724 764274 722623 755540 802565 729465 687586 750740 791786 841738 773850 792321
5932G92321j06m5896N0041M3336k6621r1205n3247J1686l2234p59J4265r873m6179
$$ 792321 792215 746319 796360 839696 813075 721870 668623 680309 648075 647316 661581 651708 605529
5919F05529p8134L286Q5500N246o4341p586J7193j0439m4777P6883M2875J4963
$$ 605529 527395 530681 616181 621427 557086 549500 566693 556254 511477 588360 631235 646198
5907F46198j3430l3663m00L732J5983J1727k5543o9292m0088k0733O5444j4251
$$ 646198 632768 599105 598705 602437 618420 630147 604604 535312 495224 474491 539935 525684
5895E25684L0967M8782j3766j4890J5147k0536r7781r750J20713J1664n1692P9812
$$ 525684 556651 605433 591667 576777 591924 571388 473607 463857 584570 596234 544542 624354
5883F24354M3775j096K1409J03458j904J4655J308K7403L1259l0321J7063l3035
$$ 624354 668129 667033 688442 791900 789996 804651 805959 833362 864621 834300 851363 818328
5871H18328l8947j0991k8895M1351L3438n1430l2875L4527K6668M0366K1126k6943
$$ 818328 779381 768390 739495 780846 814284 762854 729979 764506 791174 831540 852666 825723
5859H25723R6690m1480l2884R629N0496M5340k312K7928L8987l7302l7234j2550
$$ 825723 922413 880933 848049 857678 908174 953514 951202 979130 1018117 980815 943581 931031
5847I31031m7460J6845K2831k8279l2729o782q1347k8702r868N3175M7473m834
$$ 931031 883571 900416 923247 894968 862239 855457 774110 745408 735540 788715 836188 831354
5835H31354o9083k9521l0270K1418K9328r566j003l206N8885Q016J7708K7580
$$ 831354 762271 732750 702480 723898 753226 743660 742657 739451 798336 806352 824060 851640
5823H51640o0963K4718K7366M8827j7521o9755j6944J4469J9463R510j1352l1992
$$ 851640 790677 815395 842761 891588 874067 804312 787368 801837 821300 830810 819458 787466
5811G87466j5458L2544n603J4052J6020j2597l4948J2986l3411J3100M1960l3116
$$ 787466 772008 804552 798949 813001 829021 816424 781476 794462 761051 774151 816111 782995
5799G82995o3013Q8270M702o3357q5921K5359R7794m397j0926J1038M92l2809
$$ 782995 719982 808252 812954 749597 663676 689035 786829 782432 771506 782544 783036 750227
5787G50227J9843J2520O9347m8717j1530J4096K8666k7639j2814k8137N7305R6773
$$ 750227 770070 782590 851937 803220 791690 805786 834452 806813 793999 765862 823167 919940
5775I19940m8891o5098k0255l3796N3815P242n6454K5414J18175N6576m4709m18
$$ 919940 871049 805951 785696 751900 805715 812957 756503 781917 900092 956668 911959 911541
5763I11541L3910m7684O1670M2762l3765l3223l276M3261r052o21L4338o5420
$$ 911541 945451 897767 959437 1002199 968434 935211 931935 975196 966144 965523 999861 934441
5751I34441M0045j93j8103k1883l3051Q944Q512L3553l0672N4177P8412J702L3965
$$ 934441 974486 974293 956190 934307 901256 910200 918712 952265 921593 975770 1054182 1055884 1089849
5738A089849l5758N1258L0153K3474Q0487R833l3632K9646r844M5550K9795l4721
$$ 1089849 1054091 1105349 1135502 1158976 1239463 1249296 1215664 1245310 1235466 1281016 1310811 1276090
5726A276090n5721k720l3842m87J32377k6993p3269L3292K5778L5250J3993M0878
$$ 1276090 1220369 1217649 1183807 1183320 1315697 1288704 1215435 1248727 1274505 1309755 1323748 1364626
5714A364626j9552p9261P1956J0946j3301m0348L5867O9238k9230M8952Q5119
$$ 1364626 1345074 1265813 1337769 1348715 1335414 1295066 1330933 1400171 1370941 1419893 1505012
5703A505012j02365J196l6864k516l2860N6105J5658J1544l892M3593j7180k1463
$$ 1505012 1402647 1403843 1366979 1364463 1331603 1387708 1403366 1414910 1411018 1454611 1437431 1415968
5691A415968O1784M5930l5107N0728J174L7193Q374n5493p613Q7089O3143L3705
$$ 1415968 1477752 1523682 1488575 1539303 1540477 1577670 1586044 1530551 1522938 1610027 1673170 1706875
5679A706875J9459O0891R27R3708J0181n6802L3862J1912R5723P2283P9996Q4477
$$ 1706875 1726334 1787225 1788152 1881860 1892041 1835239 1869101 1881013 1976736 2049019 2129015 2213492
5667B213492J60450N0319N1431P3208O1716N4063J4646l9784N8915Q7885J13878
$$ 2213492 2373942 2424261 2475692 2548900 2610616 2664679 2679325 2639541 2698456 2786341 2900219
5656B900219L1562L9814L4944K6500k479N3836Q5812q823o1939N6986p0195k7064
$$ 2900219 2931781 2971595 3006539 3033039 3030560 3084396 3170208 3161385 3099446 3156432 3086237 3059173
5644C059173J15829L4302M6249M3293n0475j10023m6824L1144J06591Q2274Q9629
$$ 3059173 3175002 3209304 3255553 3298846 3248371 3138348 3091524 3122668 3229259 3311533 3401162
5633C401162R4233J9846J02503J00200R9840J54566L9890K1334K12948K30643
$$ 3401162 3495395 3515241 3617744 3717944 3817784 3972350 4012240 4033574 4246522 4477165
5623D477165J72280K35986L16637J79481J83939K40750J64291J09535K95278K55303
$$ 4477165 4649445 4885431 5202068 5381549 5565488 5806238 5970529 6080064 6375342 6630645
5613F630645K78895L33489L21170J29021J11084J19723K20562K91014K56936L56291
$$ 6630645 6909540 7243029 7564199 7693220 7804304 7924027 8144589 8435603 8692539 9048830
5603I048830L71598M05723L80719L50608M87941M87094N03913N10409N43339Q56723
$$ 9048830 9420428 9826151 10206870 10557478 11045419 11532513 12036426 12546835 13090174 13946897
5593A3946897J020587P90921P9758m11644m80872m40603n61551q50047q69633
$$ 13946897 14967484 15758405 15838163 15426519 14945647 14505044 13943493 13093446 12223813
5584A2223813n08686m19218j19614L1723J14221K44003L24024L30174M45782M55541
$$ 12223813 11715127 11295909 11176295 11208018 11322239 11566242 11890266 12220440 12666222 13121763
5574A3121763O08198Q82779J041157J273113J233685N31775m97372o62718m81486
$$ 13121763 13729961 14612740 15653897 16927010 18160695 18692470 18195098 17532380 17050894
5565A7050894o06198r28319r66029o23707l71969j63234j53533j6030J21589J70110
$$ 17050894 16444696 15516377 14550348 13926641 13554672 13391438 13237905 13221875 13343464 13513574
5555A3513574L10299N33195O63873R28795J067687J417095J738985J954187K332582
$$ 13513574 13823873 14357068 15020941 15949736 17017423 18434518 20173503 22127690 24460272
5546B4460272K487300K456984K485061K795245L280162M120156M839920L583383
$$ 24460272 26947572 29404556 31889617 34684862 37965024 42085180 46925100 50508483
5538E0508483N36091j835232k077435j630821k213722l048331k638141j493749
$$ 50508483 51044574 49209342 47131907 45501086 43287364 40239033 37600892 36107143
5530C6107143m53896K87303Q33532J374584J754800K215869K605203K825991K913790
$$ 36107143 35653247 35940550 36774082 38148666 39903466 42119335 44724538 47550529 50464319
5521E0464319L233656L856898M782041N733682N745441K894957p86699k213445
$$ 50464319 53697975 57554873 62336914 68070596 73816037 76710994 75924295 73710850
5513G3710850k055442k850700m524725m959777m059153k866942j595838n55139
$$ 73710850 71655408 68804708 64279983 59320206 55261053 52394111 50798273 50243134
5505E0243134j84581m89210j047083j562487k013680j843448j526611j355973
$$ 50243134 50058553 49569343 48522260 46959773 44946093 43102645 41576034 40220061
5497D0220061r88081n52549l75770k31430q6145J45526N62811R93566J148732
$$ 40220061 39231980 38679431 38303661 38072231 37986086 38131612 38694423 39687989 40836721
5488D0836721R72641O30900P2282o42835j073212j213300j102880m80353K12445
$$ 40836721 41809362 42440262 42512544 41869709 40796497 39583197 38480317 37999964 38212409
5479C8212409N53976J05797p08528j611598k149137k329775k112683j720481j492436
$$ 38212409 38766385 38872182 38163654 36552056 34402919 32073144 29960461 28239980 26747544
5470B6747544j264885j004764q00597n56395n20460m20747l87581l17594l00481
$$ 26747544 25482659 24477895 23677298 23120903 22600443 22179696 21792115 21474521 21174040
5461B1174040l00089j76727k20357k49794k94248k99501k39689j63073j09634
$$ 21174040 20873951 20697224 20476867 20227073 19932825 19633324 19393635 19230562 19120928
5452A9120928r434j28280l37262n19135m25739m71721l92118k78542k18585j42204
$$ 19120928 19111494 18983214 18645952 18126817 17701078 17229357 16837239 16558697 16340112 16197908
5442A6197908j66470n6403M4738o1590l036j4797J84876J50858J17108l2615j64919
$$ 16197908 16031438 15975035 16019773 15958183 15955147 15940350 16125226 16276084 16393192 16360577 16195658
5431A6195658k87387l20669l54744k33568J5185J41847l2167k59675m75900o90512
$$ 16195658 15908271 15587602 15232858 14999290 15014475 15156322 15124155 14864480 14388580 13698068
5421A3698068p15088o88093n63532m77440l49049k69224l62077k37075j53779
$$ 13698068 12982980 12294887 11731355 11253915 10904866 10635642 10273565 10036490 9882711
5412I882711k32023p6983k28149l11131l10954k16115k00362k88444j77995j74886
$$ 9882711 9650688 9573705 9345556 9034425 8723471 8507356 8306994 8018550 7840555 7665669
5402G665669j48586j33294j55239r9099j19784j41965r8957l2665j17855n4101
$$ 7665669 7517083 7383789 7228550 7129451 7009667 6867702 6768745 6736080 6618225 6564124
5392F564124j18487m9593q0668r1892q4033q7734l0968N733p0138J4777p8k5875
$$ 6564124 6445637 6396044 6315376 6223484 6139451 6051717 6020749 6026482 5956344 5971121 5971043 5945168
5380E945168J2130k1087j16205O335N3062N2026j1607L3608O1794M5298j3764
$$ 5945168 5957298 5936211 5820006 5826341 5879403 5931429 5919822 5953430 6015224 6060522 6046758
5369F046758K8881M9460J02375K8801Q8846J30294j7884n7974j5952J7763L5154
$$ 6046758 6075639 6125099 6227474 6256275 6345121 6475415 6457531 6399557 6383605 6401368 6436522
5358F436522J03979r863M9570O1467O7488N6944O3055Q7795J25639J31189J20809
$$ 6436522 6540501 6530638 6580208 6641675 6709163 6766107 6829162 6916957 7042596 7173785 7294594
5347G294594J20333J14850J09091P1874J10483J12360K8224J36037J2961m7151
$$ 7294594 7414927 7529777 7638868 7710742 7821225 7933585 7961809 8097846 8110807 8063656
5337H063656Q2824M2907R4419J19215j6614O3190P7974K5417J5598r0388j24486
$$ 8063656 8146480 8189387 8283806 8403021 8386407 8449597 8527571 8552988 8568586 8478198 8353712
5326H353712K9037k838N0802J32835J27705P8307j8758m6879R2181L4482k2233
$$ 8353712 8382749 8379911 8430713 8563548 8691253 8769560 8750802 8703923 8796104 8830586 8808353
5315H808353P758O194R0367L3412q7286n5813J5183L5267P2433O1632J51659P3099
$$ 8808353 8816111 8822305 8912672 8946084 8858798 8802985 8818168 8853435 8925868 8987500 9139159 9212258
5303I212258j1697p1061q3597J4726J04420J46217J32463P4915Q5757M6922J27176
$$ 9212258 9200561 9129500 9045903 9060629 9165049 9311266 9443729 9518644 9604401 9651323 9778499
5292I778499J48388J32536J99282K04502K70884K17135K22041J81455K09206K21191
$$ 9778499 9926887 10059423 10258705 10463207 10734091 10951226 11173267 11354722 11563928 11785119
5282A1785119K99365L34429L23099L37199L55423L09188L29557N17208O00786
$$ 11785119 12084484 12418913 12742012 13079211 13434634 13743822 14073379 14590587 15191373
5273A5191373O92132Q55607R04293J125016J198762J096924J166036J377831J396264
$$ 15191373 15883505 16739112 17643405 18768421 19967183 21064107 22230143 23607974 25004238
5264B5004238J393202J318504J366188J605416J650683J737681K054359K401140
$$ 25004238 26397440 27715944 29082132 30687548 32338231 34075912 36130271 38531411
5256C8531411K159368J803365K196040K432836K050354J375813J684271K514706
$$ 38531411 40690779 42494144 44690184 47123020 49173374 50549187 52233458 54748164
5248E4748164K695618K576387K407343K359924K649519L193278L089369L039179
$$ 54748164 57443782 60020169 62427512 64787436 67436955 70630233 73719602 76758781
5240G6758781K587233K246678K591738K752582L144888L583454M406250N424289
$$ 76758781 79346014 81592692 84184430 86937012 90081900 93665354 98071604 103495893
5232A03495893O275817O699486N732233N127453O270969N745978L586973L334136
$$ 103495893 109771710 116471196 122203429 127330882 133601851 139347829 142934802 146268938
5224A46268938N137955O210790O925240O071288M885773M316634L531111L413996
$$ 146268938 151406893 157617683 164542923 170614211 175499984 179816618 183347729 186761725
5216A86761725L917061M399278N168286N439695M842718M015163M621026N834856
$$ 186761725 190678786 195078064 200246350 205686045 210528763 214543926 219164952 224999808
5208B24999808N526748N975758O606155P105209O477060O863248O497606O527439
$$ 224999808 230526556 236502314 243108469 250213678 256690738 263553986 270051592 276579031
5200B76579031P306164O605767K102217k318182k243280m07984L830393O437227
$$ 276579031 283885195 290490962 292593179 290274997 288031717 287623733 291454126 297891353
5192B97891353K649932l867074q074103j0417108j0268425p380460m538971m168143
$$ 297891353 300541285 296674211 288600108 278183000 267914575 260534115 255995144 251827001
5184B51827001m402279n986525q344844q949929r014920p678722o562005o277341
$$ 251827001 247424722 241438197 233093353 224143424 215128504 207449782 200887777 194610436
5176A94610436n010622l360994j604054j839667m223690n343647n877930n494869
$$ 194610436 189599814 186238820 184634766 182795099 178571409 173227762 167349832 161854963
5168A61854963l544611k455162l530750l940231m114164n282898n665744m665117
$$ 161854963 158310352 155855190 152324440 148384209 144270045 138987147 133321403 128656286
5160A28656286l799656l211644l166537l166856l908278m488529l639358m212068
$$ 128656286 124856630 121644986 118478449 115311593 111403315 106914786 103275428 99063360
5152I9063360n123785m363708l098577k077783j722669k409966l530217m026849
$$ 99063360 93939575 89575867 86477290 84399507 82676838 80266872 76736655 72709806
5144G2709806l563827l185446k774313k493512k173865j918164j679385j514796
$$ 72709806 69145979 65960533 63186220 60692708 58518843 56600679 54921294 53406498
5136E3406498j515426j225495r83612p96162p58566o64074n17771l70145k93106
$$ 53406498 51891072 50665577 49681965 48885803 48127237 47463163 46945392 46575247 46282141
5127D6282141l50342m6400J7498K52399M16377O88343R97477J479417K024484
$$ 46282141 45931799 45885399 45902897 46155296 46571673 47260016 48257493 49736910 51761394
5118E1761394K718624L543449M160590M717147N715551O885407P715677Q757990
$$ 51761394 54480018 58023467 62184057 66901204 72616755 79502162 87217839 95975829
5110I5975829R111419P826098O897654Q314501P938899K663852l953086p600905
$$ 95975829 105087248 112913346 119811000 128125501 136064400 138728252 134775166 127174261
5102A27174261q417952q916780r564247r732343q438447o311936m881237l743508
$$ 127174261 118756309 109839529 100275282 90542939 82104492 75792556 70911319 67167811
5094F7167811k713317k092556j578843j229890p81633n28042j98239l2457M60794
$$ 67167811 64454494 62361938 60783095 59553205 58771572 58243530 58045291 58012834 58473628
5085E8473628P58084P42547R29211J293626J961470K707183L918324M253714L770348
$$ 58473628 59231712 59974259 60903470 62197096 64158566 66865749 70784073 75037787 78808135
5076G8808135L391995L771689N094104O143283O601537P185795P945398Q600421
$$ 78808135 82200130 85971819 91065923 97209206 103810743 110996538 118941936 127542357
5068A27542357R099195J1180605J1980524L638832o852000q062843m268035n044032
$$ 127542357 136641552 147822157 159802681 163441513 156589513 148526670 144258635 139214603
5060A39214603o777665m412727j095902P87055O88519J442213L841559N950268
$$ 139214603 132436938 128024211 126928309 127715364 128403883 129846096 133687655 139637923
5052A39637923Q856058Q204138o06615p715727p200892o351536j0100940j2543374
$$ 139637923 148493981 156698119 156091504 148375777 141174885 134823349 124722409 112179035
5044A12179035j0422650q157734o676055n317963l836734l416651m068291m147082
$$ 112179035 101756385 93598651 86922596 81604633 77767899 74351248 70282957 66135875
5036F6135875l433193l330754l382134k966016k477660k090008j782934j668222
$$ 66135875 62702682 59371928 55989794 53023778 50546118 48456110 46673176 45004954
5028D5004954j535542j312947j112464r42306o60896l22332j42979J73873M02367
$$ 45004954 43469412 42156465 41044001 40101695 39440799 39118467 38975488 39149361 39551728
5019C9551728O55625J172435J392698J572831K051441K426014L067997L430928
$$ 39551728 40207353 41379788 42772486 44345317 46396758 48822772 51890769 55321697
5011E5321697J768967l08022j122744j123042k004696l147186l161279k446481
$$ 55321697 57090664 56782642 55659898 54536856 52532160 49384974 46223695 43777214
5003D3777214j828306j581810j234401p65440l05392J07092M70525O81415J110177
$$ 43777214 41948908 40367098 39132697 38367257 38061865 38168957 38639482 39320897 40431074
4994D0431074J335682J586462J831941J627014J407342K011207K161780K388284
$$ 40431074 41766756 43353218 45185159 46812173 48219515 50230722 52392502 54780786
4986E4780786K734780K527351K412816K905511L579476M651008N858527M519892
$$ 54780786 57515566 60042917 62455733 65361244 68940720 73591728 79450255 83970147
4978H3970147L718214N059100L676308K850399L578933M313996N558538N895231
$$ 83970147 87688361 92747461 96423769 99274168 102853101 107167097 112725635 118620866
4970A18620866L644613O53340m89242J569199L556908M505789L106403J900535
$$ 118620866 122265479 122918819 122429577 123998776 127555684 132061473 135167876 137068411
4962A37068411J104014N50662K107488L852682L958866L129578L308783L004943
$$ 137068411 138172425 138723087 140830575 144683257 148642123 151771701 155080484 158085427
4954A58085427J72110j724238j236690R35889L831205K467781j560891m327303
$$ 158085427 158257537 156533299 155296609 156232498 160063703 162531484 160970593 156643290
4946A56643290n432185m481947l505183k575164j795230k328826l425401l898299
$$ 156643290 151211105 146729158 143223975 140648811 138853581 136524755 133099354 129201055
4938A29201055k410868j510217k726885l245844k857185m732362n165315m230529
$$ 129201055 126790187 125279970 122553085 119307241 116450056 111717694 106552379 102321850
4930A02321850l688105l076045k213184l046129m782702n938165n204278m314889
$$ 102321850 98633745 95557700 93344516 90298387 85515685 79577520 74373242 70058353
4922G0058353l750422l113464k656585k164122j970554j824037j602727j476359
$$ 70058353 66307931 63194467 60537882 58373760 56403206 54579169 52976442 51500083
4914E1500083j256866r72479p65178p01742m83843l75720r2312L54163M11068
$$ 51500083 50243217 49270738 48505560 47803818 47319975 46944255 46851943 47206106 47617174
4905D7617174L04661N33046R8803j26975j91061m52994j55178N49515P95382P57886
$$ 47617174 47921835 48454881 48553684 48426709 48235648 47782654 47627476 48176991 48972373 49730259
4895D9730259K33831k93461q24920q26204k79872q658O21310N85383P40872R79448
$$ 49730259 49964090 49670629 48845709 48019505 47739633 47730975 48352285 48937668 49678540 50657988
4885E0657988Q45731N37047M50367M01058J1421R9095J47334m69170o44521m68054
$$ 50657988 51503719 52040766 52491133 52892191 52903612 53002707 53150041 52680871 52036350 51568296
4875E1568296o75209o06731r74802j570007j804099j909814j421437r50081l40132
$$ 51568296 50893087 50286356 49311554 47741547 45937448 44027634 42606197 41656116 41315984
4866D1315984m30872l58245l02147r88735j101477j094574j359324p98062j69128
$$ 41315984 40885112 40526867 40224720 39235985 38134508 37039934 35680610 34882548 34713420
4857C4713420j07918l41281r37978j434569j952612j960639j622400j405446j231705
$$ 34713420 34605502 34264221 33326243 31891674 29939062 27978423 26356023 24950577 23718872
4848B3718872j158060q96877q54693q10552o82197o54738o66452n85647n60313
$$ 23718872 22560812 21663935 20809242 19998690 19316493 18661755 17995303 17409656 16849343
4839A6849343m17724m44111m23353m18603k68333l29477k89739k34862k60273
$$ 16849343 16431619 15987508 15564155 15145552 14877219 14547742 14258003 14023141 13762868
4830A3762868k31345k20629j80695k62098k87605k01592k28330k21946k21926
$$ 13762868 13531523 13310894 13130199 12868101 12580496 12378904 12150574 11928628 11706702
4821A1706702j34945m9915j62831j98769p2559j09882r9110n2028r6421o9572
$$ 11706702 11571757 11521842 11359011 11160242 11087683 10977801 10878691 10826663 10730242 10660670
4811A0660670j12207q5146o7374j48809j01804l6600p0078l3103q2608j51993
$$ 10660670 10548463 10463317 10395943 10247134 10145330 10108730 10038652 10005549 9922941 9770948
4801I770948q4820m5353o5984n0427n8603o5747L2562j7221J9496J0432p1704
$$ 9770948 9686128 9640775 9574791 9524364 9465761 9400014 9432576 9415355 9434851 9445283 9373579
4790I373579n0172K0908j5894R349j37300q1061m4093n5186k8233m9999o1403
$$ 9373579 9323407 9344315 9328421 9337770 9200470 9119409 9075316 9020130 8991897 8941898 8880495
4779H880495j19863o4822j29466j50947j16295K4724L3036j07906k7388K59p9690
$$ 8880495 8760632 8695810 8566344 8415397 8299102 8323826 8356862 8248956 8221568 8221827 8142137
4768H142137p6907q1231j4871j8628N1908M4895L7586Q420L8070K5461M5749L7415
$$ 8142137 8065230 7983999 7969128 7950500 8002408 8047303 8084889 8093309 8131379 8156840 8202589 8240004
4756H240004P5368M6723J43585K29762M6189O3445J29962k1646P8994J9769P8554
$$ 8240004 8315372 8362095 8505680 8735442 8781631 8845076 8975038 8953392 9032386 9052155 9130709
4745I130709R2252P5369R8532J74876J46088L14974L70085L13276M04433N57359
$$ 9130709 9222961 9298330 9396862 9571738 9717826 10032800 10402885 10716161 11120594 11677953
4735A1677953N93155O76373P49336Q60495Q96492Q42386P87743P28299Q54162
$$ 11677953 12271108 12947481 13696817 14557312 15453804 16296190 17083933 17812232 18666394
4726A8666394J103991J358427J410515J572930J736017J924888K271537K182102
$$ 18666394 19770385 21128812 22539327 24112257 25848274 27773162 30044699 32226801
4718C2226801J716074J285303P75342L56504L42880R58653J799241K095535J987564
$$ 32226801 33942875 35228178 36003520 36360024 36702904 37661557 39460798 41556333 43543897
4709D3543897J389915O13150o3056k82097m08752p16892o81217j73978P08201
$$ 43543897 44933812 45546962 45483906 45201809 44793057 44076165 43394948 43220970 43929171
4700D3929171J438337J625845R69350J63161m96050o96436q01512q98132p33438
$$ 43929171 45367508 46993353 47962703 48125864 47629814 46933378 46131866 45233734 44500296
4691D4500296n6935O75479J038689R47926N85861Q5586k71513l85717m90368q71095
$$ 44500296 44443361 45118840 46157529 47105455 47691316 47776902 47505389 47119672 46629304 45758209
4681D5758209q62013l48996M50913J036159J052665O07985K72597L49069P10288
$$ 45758209 44896196 44547200 44998113 46034272 47086937 47694922 47967519 48316588 49026876
4672D9026876J307241K066386K697572L004974L117194L185472L301086M142162
$$ 49026876 50334117 52400503 55098075 58103049 61220243 64405715 67706801 71848963
4664G1848963M768697N612426O485786P064691Q373017R795535Q643564O967836
$$ 71848963 76617660 82230086 88715872 95780563 104153580 113949115 122592679 129560515
4656A29560515M272523K234737J725369L157348N584223P066227O887096N857388
$$ 129560515 133833038 136067775 137793144 140950492 146534715 153600942 160488038 166345426
4648A66345426J446788k224203j944659n555462m822170n05472L095403L819926
$$ 166345426 167792214 165568011 163623352 158067890 153245720 152740248 155835651 159655577
4640A59655577J747882j975080l005257o23255j74404m87561o78119j604747k121587
$$ 159655577 161403459 159428379 156423122 155799867 155625463 155137902 154459783 152855036 150733449
4631A50733449p6920J190432J780666J388896J75020j920447n346653o449025
$$ 150733449 150656529 151846961 153627627 155016523 155191543 153271096 147924443 141475418
4623A41475418q152453p589318m947077l108684l542998n713410p752960q828758
$$ 141475418 133322965 125733647 120786570 117677886 114134888 108421478 100668518 91839760
4615I1839760p702553o435286n477972m732111m201342l671734l379853l024795
$$ 91839760 84137207 77701921 72223949 67491838 63290496 59618762 56238909 53214114
4607E3214114k719405k361679k160058k047305j955183j848761j756310j570445
$$ 53214114 50494709 48133030 45972972 43925667 41970484 40121723 38365413 36794968
4599C6794968j518657j493917j284297j254306j343344j192771j060852j096822
$$ 36794968 35276311 33782394 32498097 31243791 29900447 28707676 27646824 26550002
4591B6550002r27103q47036q29825q46098p12417p70753q50022o98112n40270
$$ 26550002 25622899 24775863 23946038 23099940 22387523 21616770 20766748 20068636 19528366
4582A9528366n92282o31736o02506m97726n48351m08416m07086l65826m43208
$$ 19528366 18936084 18304348 17701842 17204116 16655765 16247349 15840263 15474437 15031229
4573A5031229m09328m61054l95100m66738l81309l05354k90742l48209k65804
$$ 15031229 14621901 14160847 13765747 13299009 12917700 12612346 12321604 11973395 11707591
4564A1707591j98469k42507k96451k42904j97707j47926k43939j93709j62660
$$ 11707591 11509122 11266615 10970164 10727260 10529553 10381627 10137688 9943979 9781319
4555I781319j49585j68793j68507j08958k25236k32605p3158j15641k43746j48958
$$ 9781319 9631734 9462941 9294434 9185476 8960240 8727635 8654477 8538836 8295090 8146132
4545H146132n8260j72023j31414q3029j47013j34264j99584j65783o7205j03842
$$ 8146132 8087872 7915849 7784435 7701406 7554393 7420129 7220545 7054762 6987557 6883715
4535F883715j09431q0091j03819q7917j20631j57798j30222l6974j70793q7940
$$ 6883715 6774284 6694193 6590374 6502457 6381826 6224028 6093806 6056832 5886039 5798099
4525E798099p9627p5454n7303j50226j49067l9184n3339j75893r1816j27792j2363
$$ 5798099 5718472 5643018 5585715 5435489 5286422 5247238 5193899 5018006 4926190 4798398 4786035
4514D786035q8830o4179j06619n5170o2064j25733j4511p1082n2891r7369m3907
$$ 4786035 4697205 4633026 4526407 4471237 4409173 4283440 4268929 4197847 4144956 4047587 4003680
4503D003680r4803M3748J6551j07520o1975n8622j5506j32558j05622J6799p5806
$$ 4003680 3908877 3952625 3969176 3861656 3799681 3741059 3725553 3592995 3487373 3504172 3428366
4492C428366m1646m4644l1400n5124p2789q4145q5288m1051n5581Q637J4600p5836
$$ 3428366 3386720 3342076 3310676 3255552 3182763 3098618 3013330 2972279 2916698 2925335 2939935 2864099
4480B864099L9130q8414r6530k1480l317q9898n1769j4719m6363n6545J1950n0824
$$ 2864099 2903229 2814815 2718285 2696805 2693488 2603590 2551821 2537102 2490739 2434194 2446144 2395320
4468B395320r3931p953q5860j29187J9818L6796k1731n9962j7685j8280p4139
$$ 2395320 2301389 2293436 2207576 2078389 2098207 2135003 2113272 2053310 2035625 2017345 1943206
4457A943206M7560k308r5001q4732l9808k8406m9171l8750p7628j7350o8455M1324
$$ 1943206 1990766 1988458 1893457 1808725 1768917 1740511 1691340 1652590 1574962 1557612 1489157 1530481
4445A530481p6064o7379O0274o1277m2875k1766n3734n5563l0195n6894k8322
$$ 1530481 1454417 1387038 1447312 1386035 1343160 1321394 1267660 1212097 1181902 1125008 1096686
4434A096686J6312N47J3719j8225o7593j7109N5913m592l9737j0745j1896l0602
$$ 1096686 1112998 1113545 1127264 1109039 1041446 1024337 1080250 1075658 1035921 1025176 1013280 982678
4422I82678n451j3217l4950M3677j01632m9477K9239M6913q9574l7083O298o5686
$$ 982678 977227 964010 929060 972737 871105 821628 850867 897780 808206 771123 777421 711735
4410G11735Q200k2550Q7019l3707q2353L9554k6965J111QK1542J481J5695n0762
$$ 711735 719935 697385 784404 750697 668344 707898 680933 682044 682052 703594 705075 720770 670008
4397F70008m5845j5554J700R86J4998k7654k4644M3272J481l6619K9448p3920
$$ 670008 624163 608609 610309 611295 626293 598639 573995 617267 618748 582129 611577 537657
4385E37657r5935l4973O3581L9418L562J4431K6256L2222p2178k5140Q6195n6874
$$ 537657 441722 406749 470330 509748 513310 527741 553997 586219 514041 488901 575096 518222
4373E18222m2886L002k9455L1311n5565O635K1096N461M412j2513l1398j9969
$$ 518222 475336 478338 448883 480194 424629 431264 452360 457821 462233 449720 418322 398353
4361C98353r0124L7257L4710k2311k5766Q342J1042n0079k6517m069k203O4727
$$ 398353 308229 345486 380196 357885 332119 340461 351503 301424 274907 270838 268635 333362
4349C33362N1462M2579m0100K192j2486M8929N3086j5662m9468L899M2259m3421
$$ 333362 384824 427403 387303 389495 377009 425938 479024 463362 413894 417793 460052 416631
4337D16631J9168m9478J8781l882k1369o517L9527l9385K5539R415j871P074L4353
$$ 416631 435799 386321 405102 401220 379851 373334 412861 373476 399015 408430 406559 413633 447986
4324D47986k7668L7310K1730k3446N1073l913k7711N2882J7079m5710N841k4403
$$ 447986 420318 457628 479358 455912 506985 503072 475361 528243 545322 499612 505453 481050
4312D81050N0291m3866n8551P2143M1562L934l7634j1562J5290K9352J1408m5787
$$ 481050 531341 487475 428924 501067 542629 546563 508929 497367 512657 542009 553417 507630
4300E07630m0776r043O5522O5113n5586j3624j8931o0452j5394l8163k145O580
$$ 507630 466854 457811 523333 588446 532860 519236 500305 439853 424459 386296 384151 390731
4288C90731K1945P1697j7242k6591m561R0197O3292j03119k0142n597L8162M0463
$$ 390731 412676 484373 467131 440540 435979 526176 589468 486349 466207 460610 498772 539235
4276E39235o6015L8108j9882j04043n681J4844K7419P5487Q9692o2762n0606L0750
$$ 539235 473220 511328 491446 387403 381722 396566 423985 499472 589164 526402 475796 506546
4264E06546M1304L7681N7966m3381M5627J68732P9583k6405M3017M81o4105J2629
$$ 506546 547850 585531 643497 600116 645743 814475 894058 867653 910670 911151 847046 859675
4252H59675Q433J19773O7971m3788k3881Q3425j3770l2949J868J042Q6902J1007
$$ 859675 868108 987881 1055852 1012064 988183 1071608 1057838 1024889 1026757 1027799 1114701 1125708
4240A125708j3571p8405K5960o512o5555N0479J5902K0576j2797K3150k4683J4207
$$ 1125708 1112137 1033732 1059692 1053180 987625 1038104 1054006 1074582 1061785 1084935 1060252 1074459
4228A074459O5174o0161K20n2685l6169l6048r816p7305K1849n025n1190N955
$$ 1074459 1139633 1079472 1079692 1027007 990838 954790 944974 867669 889518 884493 833303 839258
4216H39258m7346j11942j12324N0217P7734j2432p6068J6721l0196n2532K2726
$$ 839258 791912 679970 567646 617863 695597 683165 607097 623818 593622 541090 563816
4205E63816M9215l8236k2425l6630r4820P1902K8750q7017p7924J5384r707K4369
$$ 563816 613031 574795 552370 515740 420920 492822 521572 434555 356631 372015 362308 386677
4193C86677j0937M2456j246J7036M67K9405k3036k373R704J4043o806M911O4557
$$ 386677 375740 418196 416950 433986 434453 463858 440822 438449 448153 462196 455390 460301 524858
4180E24858q5965N1688j0456m687N6084J4934p7198K1485Q4408l9135m0476N1452
$$ 524858 438893 490581 480125 475438 531522 546456 469258 490743 575151 536016 495540 546992
4168E46992O5736L3376L8888K8658K3738k2288P18J5435o9476K4231Q5097L8611
$$ 546992 612728 646104 684992 713650 737388 715100 715818 731253 661777 686008 771105 809716
4156H09716o305m204l6737j6693p2418q1085P0837P2052j0978k7988n4191N9189
$$ 809716 803411 799207 762470 745777 673359 592274 663111 735163 724185 696197 642006 701195
4144G01195N7542J6949k3556L7661m9960p711m0571J8264K6949J5698m4335p253
$$ 701195 758737 775686 752130 789791 739831 732120 691549 709813 736762 752460 708125 700872
4132G00872n700K015N773l4352O9536J053K8614J1178o9945p1087M3831M3755
$$ 700872 695172 697187 702960 668608 738144 739197 767811 778989 709044 637957 681788 725543
4120G25543M6086l4924l484L4497K0281j1069o1325J5505M8094L3195o1272P5145
$$ 725543 771629 736705 733221 767718 787999 776930 715605 731110 779204 812399 751127 826272
4108H26272O4351J8326J8882p5415l9530Q1016Q0j3024J8909l348N2679L1453
$$ 826272 890623 908949 927831 852416 812886 893902 893982 880958 899867 896519 949198 980651
4096I80651J5815K1208j9335j2590J0493m1855N8306k9720Q1613M3630q046n0891
$$ 980651 996466 1017674 998339 985749 996242 954387 1012693 982973 1064586 1108216 1100170 1049279
4084A049279j1962P3222R9671O8259M9693M6509J9798J08451k0684J1561R3911
$$ 1049279 1037317 1110539 1210210 1278469 1328162 1374671 1394469 1502920 1482236 1493797 1587708
4073A587708Q3181R2010J50022M6101j0143J43356R7630J24169J81076P9679K4582
$$ 1587708 1670889 1762899 1912921 1959022 1948879 2092235 2189865 2314034 2495110 2574789 2599371
4062B599371N2464J56799M9469J22398J55576Q6622Q6140J22646J05856J11901
$$ 2599371 2651835 2808634 2858103 2980501 3136077 3222699 3308839 3431485 3537341 3649242
4052C649242J74434R7088J69390J16117J11597Q6934K26377R1781J52947R7533
$$ 3649242 3823676 3920764 4090154 4206271 4317868 4404802 4631179 4722960 4875907 4973440
4042D973440J430M881N6207j9237r9856k9420j14308q1915j03044j08687r9267
$$ 4973440 4974870 4979751 5035958 5016721 4916865 4887445 4773137 4691222 4588178 4479491 4380224
4031D380224o2112m1016r7648p9126k2316r4120n7388K825N3450r0189q7052m0436
$$ 4380224 4318112 4277096 4179448 4100322 4078006 3983886 3926498 3929323 3982773 3892584 3805532 3765096
4019C765096o5838m2580j2390Q054p3089N408r135j28484j3261o8997j60063q6995
$$ 3765096 3699258 3656678 3644288 3652342 3579253 3584661 3575526 3447042 3433781 3364784 3204721 3117726
4007C117726r4443j50524j72125p8392j04330j37897r9006o1413q7529q3801q1143
$$ 3117726 3023283 2872759 2700634 2622242 2517912 2380015 2281009 2219596 2132067 2048266 1967123
3996A967123p0471j42494j24521m1195m2182j15116o6960p3979p6525R620l7700
$$ 1967123 1896652 1754158 1629637 1588442 1546260 1431144 1364184 1290205 1213680 1223300 1185600
3985A185600o1923j23210n0933J6367n7797m0784R405j13578j04846J2164P70
$$ 1185600 1123677 1000467 949534 965901 908104 867320 876725 763147 658301 670465 671235
3974F71235k0180o025P036K3162l6185j5287J3444p9446n1710N434j8966j7457
$$ 671235 651055 645030 652066 675228 639043 623756 637200 557754 506044 511478 492512 475055
3962D75055j3104J3173R358p4167j6504J7544k6465N7300L0559n1171j7520P2951
$$ 475055 461951 475124 484482 410315 393811 411355 384890 442190 472749 421578 404058 477009
3950D77009j3279n4592m6883m3567p2461Q899J5908l5182M8077Q594J2723O9523
$$ 477009 463730 409138 362255 318688 246227 255126 271034 235852 283929 292523 305246 374769
3938C74769l1240k6648n8781J0476m3599R099M2142l786j3253L0073J7002m5277
$$ 374769 343529 316881 258100 268576 224977 234076 276218 272432 259179 289252 306254 260977
3926B60977k1364l2939N9200k3674l9647L5037r7666K1225L6997K3740M61o0083
$$ 260977 239613 206674 265874 242200 202553 237590 139924 161149 198146 221886 222347 162264
3914A62264M5692l9085K6114m2450l6941l705j4372L3558n4701l0237O4046J4263
$$ 162264 207956 168871 194985 152535 115594 111889 97517 131075 76374 46137 110183 124446
3902A24446K0304J1618m534m9255m6100L3998K3969K9697O144p622M3489j1950
$$ 124446 144750 156368 151834 102579 56479 90477 114446 144143 150287 142665 186154 174204
3890A74204o9342p878k3029l1193O2056P204m366k8334R604O4692m2412o1819
$$ 174204 104862 96984 73955 42762 104818 112022 107656 79322 88926 153618 111206 49387
3878D9387L7733L3252J7478n53o2264j937n3110l2987L543L5990J6345k3588o4896
$$ 49387 87120 120372 137850 137297 75033 73096 19986 -13001 -9458 26532 42877 19289 -45607
3865d5607k3310J9802L3349O2847N5906m2588k2534K4400o8694o7004O825J7438
$$ -45607 -68917 -49115 -15766 47081 102987 60399 37865 62265 -6429 -73433 -66608 -49170
3853d9170N0939j3077J5812J9405K5793N2165k3084l4135p9214m6372J2697l100
$$ -49170 1769 -11308 4504 23909 49702 101867 78783 44648 -34566 -80938 -68241 -71341
3841g1341J5238L4976L195L5204J0098j4971l6872P47l5200J8799M8042l0569
$$ -71341 -56103 -21127 -17932 17272 27370 12399 -24473 -23726 -58926 -40127 7915 -22654
3829b2654j1241L6288q1323j8803L7456K8834j7316L8384m9861L9653K7098j3688
$$ -22654 -33895 2393 -78930 -97733 -60277 -31443 -48759 -10375 -60236 -20583 6515 -7173
3817g173k7344j1068k9928N4778r772r6498O2049K7025Q683J9168L81m7226q961
$$ -7173 -34517 -45585 -75513 -20735 -30507 -127005 -64956 -37931 -29248 -10080 -9699 -56925 -65886
3804f5886k7799M1075N6338l0404K0998k2380r4948l5799O7584O3258J5132j9525
$$ -65886 -93685 -52610 3728 -26676 -5678 -28058 -123006 -158805 -91221 -27963 -12831 -32356
3792c2356J4489k8803j3688K9687m7802L604L1336m7551O1275K2858m8515j9158
$$ -32356 -17867 -46670 -60358 -30671 -78473 -74869 -43533 -91084 -29809 -6951 -55466 -74624
3780g4624j5182M655m8337L7583M2660L5956K4545k7056l8718l8225m6105L3435
$$ -74624 -89806 -85151 -133488 -95905 -53245 -17289 7256 -19800 -58518 -96743 -142848 -109413
3768a09413N2039J8479o0256L6787J6150q190l1247k7974L1656N8324j9448L9920
$$ -109413 -57374 -38895 -99151 -62364 -46214 -54404 -85651 -113625 -81969 -23645 -43093 -3173
3756c173l97J4721m5711o4157J0591L4372l0110o1121O1730J2417k4202M649j2328
$$ -3173 -3570 11151 -34560 -98717 -88126 -53754 -83864 -144985 -83255 -70838 -95040 -90391 -102719
3743a02719L2620O3367L1835l5980l5808l5773n1422n903N3738l2556l7793L1930
$$ -102719 -70099 -6732 25103 -10877 -46685 -82458 -133880 -139783 -86045 -118601 -156394 -124464
3731a24464P0354M5063l3074Q387N4261l1186Q075m3182n0461N5011N7262l1966
$$ -124464 -54110 -9047 -42121 -33734 20527 -10659 -2584 -45766 -96227 -41216 16046 -15920
3719a5920l5246P134o336j3081k7841M0212m8412j9680M8337J537k9129Q262j4928
$$ -15920 -51166 -44032 -50368 -63449 -91290 -51078 -99490 -119170 -70833 -69296 -98425 -90163 -105091
3706a05091O0025L6377m8505l9921O0187N9201j20394O9073L6075k2011n7462
$$ -105091 -45066 -8689 -57194 -97115 -36928 22273 -98121 -29048 7027 -14984 -72446
3695g2446m160M0018j4184L4546k3372o813l802L5404j2927K744q6923m9801Q1572
$$ -72446 -76606 -36588 -50772 -16226 -39598 -46411 -50213 -14809 -27736 -24992 -111915 -161716 -80144
3682h0144P5170m1300L8773l3862P316n5802j146M4021m6431M4838L0710K0903
$$ -80144 -4974 -46274 -7501 -41363 -34047 -89849 -90995 -46974 -93405 -48567 -17857 3046
3670C046K7924m919M8985o5859o9984K1803r671j954L4136j3635n5964m5474N8688
$$ 3046 30970 26051 75036 9177 -60807 -39004 -48675 -50629 -16493 -30128 -86092 -131566 -72878
3657g2878P1030n7935L6278l5902L5009K5883k8795j6749K0556L5353N9485K267
$$ -72878 -1848 -59783 -23505 -59407 -24398 1485 -27310 -44059 -23503 11850 71335 73602
3645G3602j25234J5021L4641J1823o096N5694N3425n8355O660K9024p1550m7565
$$ 73602 -51632 -36611 -1970 9853 3757 59451 112876 54521 61181 90205 18655 -28910
3633b8910j2812L553M0168o0165J5779M3926K3491J0228j1807l7812j362j4827
$$ -28910 -41722 -38169 1999 -58166 -42387 1539 25030 35258 23451 -14361 -15723 -30550
3621c0550N354P2224j3012k822J2543l1755j3054M990O4154m7898P319l977j3018
$$ -30550 -25196 47028 34016 31194 43737 11982 -1072 3918 68072 20174 27493 23516 10498
3608A0498j708m9439M1785J1521k4886J4947M7272o6006l8454L4818O3958k7355
$$ 10498 8790 -40649 1136 12657 -12229 2718 49990 -16016 -54470 -19652 44306 16951
3596A6951j3098K2465k5216k9888n218J6280n130j449J4059j6809K4795J1490
$$ 16951 3853 26318 1102 -28786 -34004 -17724 -22854 -24303 -10244 -27053 -2258 9232
3584I232N4946k0878j8171L6342l3987k7859L130J746Q5996J3445m9652k9703
$$ 9232 64178 43300 25129 61471 27484 -375 2755 4501 90497 103942 54290 24587
3572B4587m6604M23J3851j1454q989L2194j2795r8280M2805M0419K9828M9618
$$ 24587 -22017 -21594 -7743 -19197 -28186 4008 -8787 -107067 -64262 -23843 5985 55603
3560E5603n7373J00095l638l9314K5501n4388N8250L15N7701j7207o8148J8796
$$ 55603 -1770 98325 94687 55373 80874 26486 84736 85051 142752 125545 57397 76193
3548G6193n9452o5793l6890Q7755O6174O4627J3693m0263o2664r700L5534J4085
$$ 76193 16741 -49052 -85942 1813 67987 132614 146307 106044 43380 33680 69214 83299
3536H3299l8658l16K7520J4475K2537P146m3998K6463j1756k8968L3869K8122
$$ 83299 44641 44325 71845 86320 108857 116003 72005 98468 86712 57744 91613 119735
3524A19735m5463M8250k9867J1569o6744M1263O8961o6886J12174j2085m328M3531
$$ 119735 74272 122522 92655 104224 37480 78743 147704 80818 192992 180907 176579 220110
3512B20110k4092j7957k0259K1910L966Q680n4186k0142P9258m458j9947N6596
$$ 220110 196018 178061 157802 179712 183678 192358 138172 118030 197288 192830 172883 229479
3500B29479O8379K4761K8592k2184l7779l8590l1451O8000O1931J1784l4958Q1731
$$ 229479 297858 322619 351211 329027 291248 252658 221207 289207 351138 362922 327964 409695
3488D09695M7834K3656N1172N4693k3651j5133N7864O985O7695j0623P1008N1218
$$ 409695 457529 481185 532357 587050 563399 548266 606130 613115 680810 670187 741195 792413
3476G92413l3090k2368P9559Q4379P6435J3986J5167J45746J30329L065L9808
$$ 792413 759323 736955 816514 900893 977328 991314 1006481 1152227 1282556 1285621 1325429
3465A325429o3984M217p269L8002J11699J000o7761L129k6212k6083K692L2634
$$ 1325429 1261445 1265662 1258393 1296395 1408094 1409094 1341333 1344462 1318250 1292167 1294859 1327493
3453A327493J2143J038k0582N7969P4710O3360M9480k8437Q2041P923J1825J07408
$$ 1327493 1339636 1340674 1320092 1378061 1452771 1516131 1565611 1537174 1619215 1627138 1638963 1746371
3441A746371J05057J2720J3457J44108R7706J9070L3693Q0660M7867n8601j4398
$$ 1746371 1851428 1864148 1877605 2021713 2119419 2138489 2172182 2252842 2300709 2242108 2227710
3430B227710J2406N075J54653Q1144q6084n1332r5856q0847j4415l3384q4106
$$ 2227710 2240116 2245191 2399844 2480988 2394904 2343572 2247716 2166869 2152454 2119070 2034964
3419B034964j5942l8389O8427J415n6171O2842O0828K5237M7661M3745N4465J09924
$$ 2034964 2019022 1980633 2049060 2050475 1994304 2057146 2117974 2143211 2190872 2234617 2289082 2399006
3407B399006J21522R0248J75874J17951J71076J47353R9174L7340L4384J98867
$$ 2399006 2520528 2610776 2786650 2904601 3075677 3223030 3322204 3359544 3393928 3592795
3397C592795J30578J77935K48221J39413N6775J11829K08022J45963J92957L9770
$$ 3592795 3723373 3901308 4149529 4288942 4345717 4457546 4665568 4811531 5004488 5044258
3387E044258Q4878J30930M672k1414q8582K384J5159J88493J91325R5375q0227
$$ 5044258 5129136 5260066 5264738 5243324 5154742 5157126 5172285 5360778 5552103 5647478 5567251
3376E567251j79891k13227j38083L1073J06387P0289O6690Q7259P0948P1490M7435
$$ 5567251 5387360 5174133 5036050 5067123 5173510 5243799 5310489 5397748 5468696 5540186 5587621
3365E587621J50156K58080K38737J89576R7987K87383L48342L68676L76282J05131
$$ 5587621 5737777 5995857 6234594 6424170 6522157 6809540 7157882 7526558 7902840 8007971
3355H007971O0695J79068o3429k13450j19145j40586k2185K37718J97261p2899
$$ 8007971 8068666 8247734 8184305 7970855 7851710 7711124 7688939 7926657 8123918 8051019
3345H051019m91837n83286n27398m06123j97891j23530j08517j69188k42117j62524
$$ 8051019 7559182 6975896 6448498 6042375 5844484 5720954 5612437 5443249 5201132 5038608
3335E038608q4332j44939J5511l2770M7022l562p6724P608L3171J00481J07956
$$ 5038608 4954276 4809337 4824848 4792078 4839100 4835538 4758814 4766422 4799593 4900074 5008030
3324E008030q0000l8560o7018p6347j17954j18144p7048k7829N1251J4022r9948
$$ 5008030 4928030 4889470 4822452 4746105 4628151 4510007 4432959 4405130 4456381 4470403 4370455
3313D370455l68914l66265k74098k20207j99091j54397j77720j19837j04571j83983
$$ 4370455 4001541 3635276 3361178 3140971 2941880 2787483 2609763 2489926 2385355 2201372
3303B201372j21790j13663r5562j22001r9240l5886r4657m2827n6548j06084o4225
$$ 2201372 2079582 1965919 1870357 1748356 1649116 1613230 1518573 1475746 1419198 1313114 1248889
3292A248889M5489l156j59270n3586k6519n7805L2020q2836q7926j7172J7055
$$ 1248889 1294378 1291222 1131952 1078366 1051847 994042 1026062 943226 855300 838128 855183
3281H55183l5598k598j3573p0884k4445J1915J3373o0150j09337m7977R0330M9143
$$ 855183 819585 816987 803414 732530 708085 720000 733373 673223 563886 515909 606239 655382
3269F55382j6829o8590o245j0481m2638m5287M856j5236k8203k043J4296P2222
$$ 655382 638553 569963 563718 553237 510599 465312 470168 454932 426729 424686 438982 511204
3257E11204r1973K1147m6663p1265j6220l0206P6546M5970m2253m7360l924p7265
$$ 511204 419231 440378 393715 322450 306230 276024 352570 398540 356287 308927 305003 227738
3245B27738J0975P60Q6154J1210j9163m4857j8616M4321k7168R258p5280j2477
$$ 227738 238713 239473 325627 336837 317674 272817 254201 298522 271354 280612 205332 192855
3233A92855Q2225r3752N5742N6546m6868o4863m8983K7286l7472O797k2014J2013
$$ 192855 275080 181328 237070 293616 246748 181885 132902 160188 122716 129513 107499 119512
3221A19512K0773o6510K3015N5118r042j5687k0039R365j8226l8252J6998r484
$$ 119512 140285 73775 96790 151908 142866 127179 107140 116505 98279 60027 77025 67541
3209F7541N6630n8691J7874Q2534l0217J9436j614m0321o0543k1984j6971O4932
$$ 67541 124171 65480 83354 165888 135671 155107 153493 113172 52629 30645 13674 78606
3197G8606m4288M3369J9488n1952K7601K7077o6552o297L4719q579K5690J308
$$ 78606 34318 77687 97175 45223 72824 99901 33349 27052 61771 53192 78882 80190
3185H0190n4933n3207J7013K7349q0794M6169K7719K9497K0110l0047l2104J3008
$$ 80190 25257 -27950 -10937 16412 -64382 -18213 9506 39003 59113 29066 -3038 9970
3173I970M0842L7230k427l9396j4746p856N1522k9908J3418K1996K6684j4913
$$ 9970 50812 88042 85615 46219 31473 23617 75139 45231 58649 80645 107329 92416
3161I2416o9855o6227N7258M0966k3219o2862L5141J7673m9453R875P162L4197
$$ 92416 22561 -43666 13592 54558 31339 -31523 3618 21291 -28162 -18287 -11125 23072
3149B3072j9634k3491l5805L9680Q883J7358L7835k7585K0993k7674l7775L2704
$$ 23072 3438 -20053 -55858 -16178 -7295 10063 47898 20313 41306 13632 -24143 8561
3137H561O8533M4323m9575n8909O645J882r5094J4915R0972M8128o5901n624j651
$$ 8561 77094 121417 71842 12933 19578 21460 -73634 -58719 32253 80381 14480 8856 7205
3124G205m965K0049O670M3335M5121j03249r199m262j05246L2403K9657M0405
$$ 7205 2240 22289 28959 72294 117415 14166 4967 705 -104541 -72138 -42481 -2076
3112b076L3451J2747l059K9796m116k5755n1215M8430k3666n8824j8023L2574
$$ -2076 31375 44122 41063 70859 66743 40988 -10227 38203 14537 -44287 -62310 -29736
3100b9736j4358R489l9439O7904Q1469m4189n5231J736Q852K1025L8786r824j8591
$$ -29736 -44094 -34605 -74044 -6140 75329 31140 -24091 -22355 -13503 7522 46308 36484 17893
3087A7893j4966m104l2252M4073j1507j9891l1203J4724L5554k4984n889P465
$$ 17893 2927 -1177 -33429 10644 -863 -20754 -51957 -37233 -1679 -26663 -32552 -25087
3075b5087m8966K3881L3762L1720l1951m021P4971M3457N1774L895m5820m2126
$$ -25087 -74053 -50172 -16410 15310 -16641 -20662 54309 97766 149540 153435 107615 65489
3063F5489K169l0891M6263k8931l0052K2257o544J3122N328L2399k9447L5322
$$ 65489 67658 36767 83030 54099 24047 46304 39760 52882 58210 90609 61162 96484
3051I6484o1341m0958M316n1282P914k8251P4834p109k8540K7466L8581l9643
$$ 96484 35143 -5815 -1499 -52781 -44867 -73118 1716 -5393 -33933 -6467 32114 -7529
3039g529K5129r086r289l2099k0969P4086O2901o2468J108q67J2971P7897j06751
$$ -7529 17600 8514 -775 -32874 -53843 20243 83144 20676 21784 20917 33888 111785 5034
3026E034k7723j0851K4744J2162K8501r945p42M4835l1678l0974l1038N8938O2739
$$ 5034 -22689 -33540 -8796 3366 31867 21922 21180 66015 34337 3363 -27675 31263 94002
3013I4002q7352l7221k0285l519K2735k626J2737K7006K010n2734L0677j8173
$$ 94002 6650 -30571 -50856 -54375 -31640 -34266 -21529 5477 7487 -45247 -14570 -32743
3001c2743n0930M5787K3202l4469n672K4306J0710n7628p3146R1328R7423j6441
$$ -32743 -83673 -37886 -14684 -49153 -54825 -30519 -19809 -77437 -150583 -59255 38168 21727
2989B1727l4980L6989n4220l3093K8837m6955Q21K6842K898j1838J3483Q920J6978
$$ 21727 -13253 23736 -30484 -63577 -34740 -81695 -80874 -54032 -51134 -62972 -49489 -40569 -23591
2976b3591o337K0745k8917l3733J7792k8435R955j3057L933k5285n47Q972M1435
$$ -23591 -29928 -9183 -38100 -71833 -54041 -82476 -72521 -85578 -81645 -106930 -107477 -98505 -57070
2963e7070k9413m1724L4405Q301l643K2064P824J892N7642l8543K481O5121o0217
$$ -57070 -86483 -128207 -93802 -85501 -89144 -67080 -59256 -57364 278 -38265 -35784 29337 -30880
2950c0880k9629M9012j3827j7704j6171Q951J5951k3998J7033q270r096l1409
$$ -30880 -60509 -11497 -25324 -43028 -59199 -50248 -34297 -58295 -41262 -49532 -58628 -90037
2938i0037j8406O5382n73k8310N2294n5730l486j1333J2512j4198n3846j7556
$$ -90037 -108443 -43061 -43634 -71944 -19650 -75380 -78866 -90199 -77687 -91885 -145731 -163287
2926a63287J11711m1277m4755J0210j6741M7924R57j5640M8469r804l0144N2977
$$ -163287 -51576 -92853 -137608 -127398 -144139 -96215 -95258 -110898 -62429 -72233 -102377 -49400
2914d9400k8239K0174L6610J6943J890J8901l9131K2946L6947N858k1693o5776
$$ -49400 -77639 -57465 -20855 -3912 -2022 16879 -22252 694 37641 43499 21806 -43970
2902d3970J4326J312l3598N3405j471l3343j8580k4928L5157L0008J0183J8724
$$ -43970 -29644 -28332 -61930 -8525 -9996 -43339 -61919 -86847 -51690 -21682 -11499 7225
2890G225j1904k8943K0976l4302o2845J5416o8642l4314J10459M6633n7203M2010
$$ 7225 -4679 -33622 -12646 -46948 -109793 -94377 -163019 -197333 -86874 -40241 -97444 -55434
2878e5434M746k2246L8940l0723l5651M8668m7319P5820j5498n6972o5158K2867
$$ -55434 -50688 -72934 -33994 -64717 -100368 -51700 -99019 -23199 -38697 -95669 -160827 -137960
2866a37960N5749K2844K9784l048j4792M808O4375j02055j06515L3170O0768j6527
$$ -137960 -82211 -59367 -29583 -32631 -47423 -42615 21760 -80295 -186810 -153640 -92872 -109399
2854a09399J655O8529k1945j3464l2678K9784j262R310K4638K461K4592l8382
$$ -109399 -107744 -39215 -61160 -74624 -107302 -77518 -78780 -69470 -44832 -42371 -17779 -56161
2842e6161p246j8017M6140J9882n971m9129m5843N763o426K2588K2549l7568K4478
$$ -56161 -63407 -81424 -35284 -15402 -21373 -70502 -116345 -110582 -117008 -94420 -71871 -109439 -84961
2829h4961j164r290L213J9886j9470N11L7784M0195K4833l1128j866m1152k4949
$$ -84961 -86125 -95415 -92202 -72316 -91786 -91275 -53491 -13296 11537 -19591 -21457 -62609 -87558
2816h7558J3128j096M966l5249J8416O8822J1885o6163P584j602M2122o060o6909
$$ -87558 -74430 -75526 -70560 -105809 -87393 -18571 -6686 -72849 -65265 -66867 -24745 -30805 -97714
2803i7714k9213m8190Q0921K6122M5760M0234J6459j26328n0023R3228N2236n6360
$$ -97714 -126927 -175117 -94196 -68074 -22314 17920 34379 -91949 -141972 -48744 3492 -52868
2791e2868m420K3712m3724M6422j9153M0156l3l4225j8201M5440J6691m4777O2913
$$ -52868 -57288 -33576 -77300 -30878 -50031 -9875 -9908 -44133 -62334 -16894 -203 -44980 17933
2778A7933K5558n8636l5182J5119K8642R7101k2938q1997r881m7133r711m304
$$ 17933 43491 -15145 -50327 -35208 -6566 90535 67597 -14400 -24281 -71414 -81125 -85429
2766h5429k7579n4867O9538K4111j5595l0808J8777N6517n0465O4591M2586j15511
$$ -85429 -113008 -167875 -98337 -74226 -89821 -120629 -101852 -45335 -95800 -31209 11377 -104134
2754a04134J1911N7755m7701j4376M2651N5300n6102o3367j4489M1725K2335o066
$$ -104134 -92223 -34468 -82169 -96545 -53894 1406 -54696 -118063 -132552 -90827 -68492 -74558
2742g4558N253j4792M2767m384J772Q422K2568j4454j2251k1563j045l3989m2761
$$ -74558 -69305 -84097 -41330 -45714 -43942 -35520 -12952 -27406 -39657 -61220 -62265 -96254 -139015
2729a39015L8359N409K8917K6261j8937J8234R4556n1665o6431k3271n9691M5874
$$ -139015 -100656 -95247 -66330 -40069 -59006 -40772 53784 2119 -64312 -87583 -147274 -101400
2717a01400M6439M0162j1093K3286J5674K7705o3882l2344M548j2790P201J965
$$ -101400 -54961 -14799 -25892 -2606 13068 40773 -23109 -55453 -50905 -63695 -56494 -54529
2705e4529k8916K7555N2490k9733J5733K5244n178J16P771n4060k7579o135k4615
$$ -54529 -83445 -55890 -3400 -33133 -17400 7844 2666 2782 10553 -43507 -71086 -77221 -101836
2692a01836M3855Q650m0947R990N6603q0260j4016J24296m9008m6671k7686j0164
$$ -101836 -57981 -49331 -90278 -80288 -23685 -103945 -117961 6335 -42673 -89344 -117030 -127194
2680a27194L9619N5569K2431j1192K590K3456l5245q2126J5626J20527L7224n6931
$$ -127194 -87575 -32006 -9575 -20767 -18177 5279 -29966 -112092 -96466 24061 61285 4354
2668D354j4565k3755k0714K662K7511K3723n8713k0247j0923L7779M2218n4562
$$ 4354 -10211 -33966 -54680 -52018 -24507 -784 -59497 -79744 -90667 -52888 -10670 -65232
2656f5232m5984j373L3310O2109M6773l4128K0052L2139n0984N3k8738L7383l263
$$ -65232 -111216 -112589 -79279 -17170 29603 -4525 15527 47666 -3318 -3265 -32003 5380 2117
2643B117J8663n9281j1628m570K6038L7955K2423m1221J1722j5158n6440j6383
$$ 2117 20780 -38501 -50129 -54699 -28661 9294 31717 -9504 2218 -12940 -69380 -85763
2631h5763K4240O0305q0968K1312K7331m4223K9890r283K5326l4665l3483p820
$$ -85763 -61523 -1218 -82186 -60874 -33543 -77766 -47876 -57159 -31833 -66498 -99981 -107801
2619a07801L7827M3036o0436n004j9056j526P7728L0172n8273j0391k9948J1442
$$ -107801 -69974 -26938 -87374 -92378 -111434 -112960 -35232 -5060 -63333 -73724 -103672 -92230
2607i2230M0779L2021J8496l0828m9115Q3116J8840m6380p354n277L2627j2078
$$ -92230 -51451 -19430 -934 -31762 -80877 2239 21079 -25301 -32655 -37932 -5305 -17383
2595a7383J6042J4822k3075J6121n1676l1394R0040k8783J7452k5149l8882J0481
$$ -17383 -1341 13481 -9594 6527 -45149 -76543 13497 -15286 2166 -22983 -61865 -51384
2583e1384k6685P5001J4742l3660K6838J0398m7250m0979j2375L7929l260l8299
$$ -51384 -78069 -3068 11674 -21986 4852 15250 -32000 -72979 -85354 -47425 -50685 -88984
2571h8984j7450K6536J344k7823p87J9012K2674O4274n6806l3885J2026K8294
$$ -88984 -106434 -79898 -78554 -106377 -107164 -88152 -65478 -1204 -58010 -91895 -79869 -51575
2559e1575Q0397o900n9837K7889K063M4911p3190l5900Q7773J3302m4145K2367
$$ -51575 28822 21922 -37915 -10026 -7963 36948 -36242 -72142 15631 28933 -15212 7155
2547G155K5790o4074k2160N4387K8782n8345j8834M4412K1886j0162J8881O56
$$ 7155 32945 -31129 -53289 1098 29880 -28465 -47299 -2887 18999 8837 27718 28374
2535B8374r9061k4587O4172L7442m5366M729j858K3439N1699K7913j2235j1295
$$ 28374 -70687 -95274 -31102 6340 -39026 -34297 -36155 -12716 38983 66896 54661 43366
2523D3366l0344J8379n3413m5292Q8633N5005m4037m5441L9520L4845J3294j6716
$$ 43366 13022 31401 -22012 -67304 21329 76334 32297 -13144 26376 61221 74515 57799
2511E7799l893q9796N2523K1490l0385j1103K1828l6265n279M7713j5608n9917
$$ 57799 53906 -35890 16633 38123 7738 -3365 18463 -17802 -23081 24632 9024 -50893
2499e0893J6070l8768L022L7080L057M1892N0979O381o8002n306m1517O064L9431
$$ -50893 -34823 -73591 -70569 -33489 -30432 11460 62439 68820 818 -4488 -46005 -39941 -510
2486e10J2224m5952j8422J5999k6098Q764M4491J7752K6882M7134k4868o1221
$$ -510 11714 -34238 -52660 -36661 -62759 -53995 -9504 8248 35130 82264 57396 -3825
2474c825j7885L0109o1679j4636k506k9520l344M4770J5342l7390N6513k4003
$$ -3825 -21710 8399 -53280 -67916 -70422 -99942 -103286 -58516 -43174 -80564 -24051 -48054
2462d8054Q1409K5005j07007j5008p725N3857k4778L6366K6254k0981q0403K7062
$$ -48054 33355 58360 -48647 -63655 -71380 -17523 -42301 -5935 20319 -662 -81065 -54003
2450e4003M9180M7137k6138o0285Q0754L5668K3771K2628j1168p8121o1635K9944
$$ -54003 -4823 42314 16176 -44109 36645 72313 96084 118712 107544 29423 -32212 -2268
2438b268O0477m8372o5159n0375R2318k1293m5121J2535J3874K6661O0352L8093
$$ -2268 58209 9837 -55322 -105697 -13379 -34672 -79793 -67258 -53384 -26723 33629 71722
2426G1722p1954k6375K61N892O513Q811J4803j2694n2301K3573m1349K0247P2989
$$ 71722 -232 -26607 -26346 -20454 -13941 -5130 9673 -3021 -55322 -31749 -73098 -52851 20138
2413B0138m2881r440j6445o1552K6381M9462M1535l8331p6732N9679O4074n0598
$$ 20138 -22743 -32183 -48628 -110180 -83799 -34337 7198 -31133 -107865 -48186 15888 -34710
2401c4710Q3356K9440j2371m7974Q683k1356k6780L9635r996j1762j4681N3259
$$ -34710 48646 78086 65715 17741 26424 5068 -21712 17923 7927 -3835 -18516 34743
2389C4743m4075J9345j1739l4107L4024o2172j1803Q0095j9636M2341M2527j7306
$$ 34743 -9332 10013 -1726 -35833 -1809 -63981 -75784 4311 -15325 27016 69543 52237
2377E2237n4488P1795q126l5413L3985n0618l591O9152o332k3166J5247j7646
$$ 52237 -2251 69544 61418 26005 59990 9372 5781 74933 68601 45435 60682 43036
2365D3036K9449j5429l1787M3088L2479P886r2767L9237j585k4612K8205Q1230
$$ 43036 72485 57056 25269 68357 100836 108722 15955 55192 53607 28995 57200 138430
2353A38430k359n5260n0283L7928P1958l1802j3528k0200L168p488l7065K6954
$$ 138430 136071 80811 30528 68456 140414 108612 95084 74884 78052 70564 33499 60453
2341F0453J0732j6575R775j0876p862k0825K1503M8301L0722o8625P7385N334
$$ 60453 71185 54610 64385 53509 45647 24822 46325 94626 125348 56723 134108 139442
2329A39442j7451o2722j8894L6931L2839J199o074J3359m2817m189L1970N9351
$$ 139442 121991 59269 40375 77306 110145 111344 105270 118629 75812 71623 103593 162944
2317A62944L5142o2927m8636P8086P2520m4743l2331l6524o86J5495R3023m5611
$$ 162944 198086 135159 86523 164609 237129 192386 160055 123531 122845 138340 231363 185752
2305A85752j4579M3653M5626k2418m2221L7555j0813P6388N3981J9528k689J2698
$$ 185752 171173 214826 260452 238034 195813 233368 222555 298943 352924 372452 369763 382461
2293C82461O978J00925N9419O3571R2088O6863R3015M8287K5844j97J16411R2470
$$ 382461 389439 490364 549783 613354 705442 772305 865320 913607 939451 939254 1055665 1148135
2281A148135O0641J47108K1358o181O1035o1590O2841J25544J82001J56322K09095
$$ 1148135 1208776 1355884 1377242 1371061 1432096 1370506 1433347 1558891 1740892 1897214 2106309
2270B106309K39707K62184K79835L77744L91713L62233L30871J53289L05795J85566
$$ 2106309 2346016 2608200 2888035 3265779 3657492 4019725 4350596 4503885 4809680 4995246
2260D995246K87137M80392L42380L42216M59021O72405R36948J09080K63570j94603
$$ 4995246 5282383 5762775 6105155 6447371 6906392 7578797 8515745 8624825 8888395 8693792
2250H693792p63895l89137j02596K24991Q9166l16329r26409r79563o26289n17169
$$ 8693792 7929897 7540760 7438164 7663155 7752321 7435992 6509583 5530020 4903731 4386562
2240D386562m57826l29825l14987k36217l02866k30279j10849j37487j34419j07780
$$ 4386562 3928736 3598911 3283924 3047707 2744841 2514562 2403713 2266226 2131807 2024027
2230B024027n8974j55165j20850q5504j43628j36401n8162m6023j49597m9206
$$ 2024027 1965053 1809888 1689038 1603534 1459906 1323505 1265343 1219320 1069723 1020517
2220A020517p5118J8211m6189p2968k5761M658j7112j02259k6541r273l1114k3383
$$ 1020517 945399 963610 917421 844453 818692 823350 806238 703979 677438 668165 637051 613668
2208F13668K9518O100j13845o0092l0211j0966R22K8917p6126m2811Q1209o3050
$$ 613668 643186 649286 535441 475349 445138 434172 435094 464011 387885 345074 426283 363233
2196C63233j8297r7149K0065N1430L099l2201j146o8431J9794j7251p7194N488
$$ 363233 344936 247787 267852 319282 322381 290180 289034 220603 240397 223146 145952 151440
2184A51440k2779K5583K9245R629o7759J7369n8089N0371j5843p090j9248K9837
$$ 151440 128661 154244 183489 193118 125359 142728 84639 135010 119167 112077 92829 122666
2172A22666k444m8622j5770J05111K1339m9758p5486J6401J9435J5927L5298n4912
$$ 122666 120222 71600 55830 160941 182280 132522 57036 73437 92872 108799 144097 89185
2160H9185r118o580j4977n625K0392j1632K6760l8895J3905L0479K1100l0010
$$ 89185 80067 73487 58510 52885 73277 61645 88405 49510 63415 93894 114994 84984
2148H4984o3101K0076K0853n4173N5302N6593Q132m2785k7192o117m1712P3547
$$ 84984 21883 41959 62812 8639 63941 120534 128666 85881 58689 52572 10860 84407
2136H4407n0204j208m4781o289J4857K8646O771M7976L8707o180k3453o2539K7398
$$ 84407 34203 32995 -11786 -18075 -3218 25428 32199 80175 118882 112702 89249 26710 54108
2123E4108J8860n124o5600K2418M0661r135o9620L7725N8164m6338l6268r1590
$$ 54108 72968 67844 2244 24662 65323 56188 -13432 24293 82457 36119 -149 -91739
2111i1739k2097O2813Q3866M8113L7281r323n6372m4338L0780L1042m4888p343
$$ -91739 -113836 -51023 32843 80956 118237 108914 52542 8204 38984 70026 25138 17795
2099A7795r314k9035Q669M9k2431P7588n971J4888L6303P946o4824j0141J7572
$$ 17795 8481 -20554 -11885 -11836 -34267 43321 37350 52238 88541 96487 31663 21522 39094
2086C9094J2820k7136J6798j4033k6699n0895M0574l3813k1023P294j090K7513
$$ 39094 51914 24778 41576 27543 844 -50051 -9477 -43290 -64313 -57019 -58109 -30596
2074c0596O137M1490p4506p1688Q2079N4053M0197l1262o2905k5638L5331J7603
$$ -30596 -24459 17031 -57475 -129163 -47084 6969 47166 15904 -47001 -72639 -37308 -19705
2062a9705Q143Q909j1517l9747j02812P2606M7739M3124j8635j4277q113K5086
$$ -19705 -11562 -2653 -14170 -53917 -156729 -84123 -36384 6740 -11895 -26172 -34285 -9199
2050i199L4631j1692j3551J1154K5961m6221K9044n702n2825k0139K7128N610
$$ -9199 25432 13740 189 11343 37304 -8917 20127 14425 -38400 -58539 -31411 -25801
2038b5801N1122O5602j18188M1286J2883J3222m4012q7912k857K0094K3896K3517
$$ -25801 25321 90923 -27265 14021 26904 40126 -3886 -91798 -94655 -74561 -50665 -27148
2026b7148Q8274L144P629m3378m7943p684P531L1049K6337l841P950j074j0913
$$ -27148 61126 64270 71899 28521 -19422 -27106 -19575 11474 37811 33970 41920 40846 29933
2013B9933l6791k7808Q240j8160M4004j2544L7080j8790q4182Q6019J3469n1783
$$ 29933 -6858 -34666 -26426 -44586 -582 -13126 23954 5164 -79018 7001 20470 -31313
2001c1313Q9051k0926r5267L33N9237n135K4351J7821k7711k1784l9403J02027
$$ -31313 57738 36812 -58455 -58122 1115 -4020 20331 38152 10441 -11343 -50746 51281
$$ [...]
##END NTUPLES=NMR SPECTRUM
##END=
