##TITLE=1H_DE-80H_X3
 200.13MHz, d2o
 8 sc
 
 19ns.26.2.2025
##JCAMPDX= 6.0         $$ Bruker NMR JCAMP-DX V2.0
##DATA TYPE= NMR SPECTRUM
##DATA CLASS= NTUPLES
##ORIGIN= UXNMR, Bruker Analytische Messtechnik GmbH
##OWNER= pz
$$ XWIN-NMR		Version 3.5
$$ Thu Jul 31 10:53:54 2025 Russian Standard Time (UT+4h)  Yarkov@DPX200
##.OBSERVE FREQUENCY= 200.1313
##.OBSERVE NUCLEUS= ^1H
##.ACQUISITION MODE= SIMULTANEOUS
##.ACQUISITION SCHEME= undefined
##.AVERAGES= 8
##.DIGITISER RES= 18
##SPECTROMETER/DATA SYSTEM= spect
##.PULSE SEQUENCE= zg30
##.SOLVENT NAME= CDCl3
##.SHIFT REFERENCE= (INTERNAL, CDCl3, 0, 15.4351)
##AUDIT TRAIL= $$ (NUMBER, WHEN, WHO, WHERE, WHAT)
$$ ##TITLE= Audit trail, XWIN-NMR		Version 3.5
$$ ##JCAMPDX= 5.01
$$ ##ORIGIN= Bruker BioSpin GmbH
$$ ##OWNER= Yarkov
$$ C:/Bruker/XWIN-NMR/data/yarkov2/nmr/H-C/1/pdata/1/auditp.txt
$$ ##AUDIT TRAIL=  $$ (NUMBER, WHEN, WHO, WHERE, WHAT)
(   1,<2025-07-31 10:53:11.07 +0400>,<Yarkov>,<DPX200>,
      <created by zg, POWCHK disabled, PULCHK disabled
       configuration hash MD5:
       00 E9 B6 7A A2 85 ED C7 34 08 36 98 17 FE 4E 26
       data hash MD5: 16K
       97 64 5A 32 1C 3B CF F9 25 3B D3 E5 C6 10 CD 04>)
(   2,<2025-07-31 10:53:15.92 +0400>,<Yarkov>,<DPX200>,
      <Start of raw data processing
       efp BC_mod = 2 LB = 0.25 FT_mod = 6 PKNL = 1 PHC0 = -1362.596 PHC1 = 17.79091 SI = 16K 
       data hash MD5: 16K
       12 C2 9E FD 21 80 F9 52 A6 E0 A3 B4 F3 0B D1 71>)
$$ ##END=
$$ 
$$ hash MD5
$$ 5B E1 B8 46 BC F8 CE 23 04 57 44 33 C5 7B 96 20
##$RELAX= 
##$RELAX= 
##$RELAX= 
##$RELAX= 
##$RELAX= 
##$RELAX= 
$$ Bruker specific parameters
$$ --------------------------
##$DU= <C:/Bruker/XWIN-NMR>
##$EXPNO= 1
##$NAME= <H-C>
##$PROCNO= 1
##$TYPE= <nmr>
##$USER= <yarkov2>
##$AMP= (0..31)
100 100 100 100 100 100 100 100 100 100 100 100 100 100 100 100 100 100 
100 100 100 100 100 100 100 100 100 100 100 100 100 100 
##$AQSEQ= 0
##$AQ_mod= 1
##$AUNM= <au_zg>
##$AUTOPOS= <>
##$BF1= 200.13
##$BF2= 200.13
##$BF3= 200.13
##$BF4= 200.13
##$BF5= 200.13
##$BF6= 200.13
##$BF7= 200.13
##$BF8= 200.13
##$BYTORDA= 1
##$CFDGTYP= 0
##$CFRGTYP= 5
##$CHEMSTR= <none>
##$CNST= (0..31)
1 1 145 1 1 1 1 1 1 1 1 1 1 1 1 1 1 1 1 1 1 1 1 1 1 1 1 1 1 1 1 1 
##$CPDPRG= <>
##$CPDPRG1= <>
##$CPDPRG2= <>
##$CPDPRG3= <>
##$CPDPRG4= <mlev>
##$CPDPRG5= <mlev>
##$CPDPRG6= <mlev>
##$CPDPRG7= <mlev>
##$CPDPRG8= <mlev>
##$CPDPRGB= <>
##$CPDPRGT= <>
##$D= (0..31)
0 0.7 0 0 0 0 0 0 0 0 0 0.03 0 0 0 0 0 0 0 0 0 0 0 0 0 0 0 0 0 0 0 0 
##$DATE= 1753944790
##$DBL= (0..7)
120 120 120 120 120 120 120 120 
##$DBP= (0..7)
150 150 150 150 150 150 150 150 
##$DBP07= 0
##$DBPNAM0= <>
##$DBPNAM1= <>
##$DBPNAM2= <>
##$DBPNAM3= <>
##$DBPNAM4= <>
##$DBPNAM5= <>
##$DBPNAM6= <>
##$DBPNAM7= <>
##$DBPOAL= (0..7)
0.5 0.5 0.5 0.5 0.5 0.5 0.5 0.5 
##$DBPOFFS= (0..7)
0 0 0 0 0 0 0 0 
##$DE= 6
##$DECBNUC= <off>
##$DECIM= 32
##$DECNUC= <off>
##$DECSTAT= 4
##$DIGMOD= 1
##$DIGTYP= 9
##$DL= (0..7)
0 120 120 120 120 120 120 120 
##$DP= (0..7)
$$ [...]
##$SUBNAM2= <"">
##$SUBNAM3= <"">
##$SUBNAM4= <"">
##$SUBNAM5= <"">
##$SUBNAM6= <"">
##$SUBNAM7= <"">
##$SUBNAM8= <"">
##$SUBNAM9= <"">
##$SW= 18.0517328524113
##$SWIBOX= (0..15)
0 0 2 0 0 0 0 0 0 0 0 0 0 0 0 0 
##$SW_h= 3612.71676300578
##$TD= 16384
##$TD0= 1
##$TE= 0
##$TE2= 300
##$TE3= 300
##$TEG= 300
##$TL= (0..7)
0 120 120 120 120 120 120 120 
##$TP= (0..7)
150 150 150 150 150 150 150 150 
##$TP07= 0
##$TPNAME0= <>
##$TPNAME1= <>
##$TPNAME2= <>
##$TPNAME3= <>
##$TPNAME4= <>
##$TPNAME5= <>
##$TPNAME6= <>
##$TPNAME7= <>
##$TPOAL= (0..7)
0.5 0.5 0.5 0.5 0.5 0.5 0.5 0.5 
##$TPOFFS= (0..7)
0 0 0 0 0 0 0 0 
##$TUNHIN= 0
##$TUNHOUT= 0
##$TUNXOUT= 0
##$USERA1= <user>
##$USERA2= <user>
##$USERA3= <user>
##$USERA4= <user>
##$USERA5= <user>
##$V9= 5
##$VALIST= <valist>
##$VCLIST= <CCCCCCCCCCCCCCC>
##$VD= 0
##$VDLIST= <DDDDDDDDDDDDDDD>
##$VPLIST= <PPPPPPPPPPPPPPP>
##$VTLIST= <TTTTTTTTTTTTTTT>
##$WBST= 1024
##$WBSW= 4
##$XGAIN= (0..3)
0 0 0 0 
##$XL= 0
##$YL= 0
##$YMAX_a= 60067
##$YMIN_a= -43252
##$ZGOPTNS= <>
##$ZL1= 120
##$ZL2= 120
##$ZL3= 120
##$ZL4= 120
##$ABSF1= 0
##$ABSF2= 0
##$ABSG= 0
##$ABSL= 0
##$ALPHA= 0
##$AQORDER= 0
##$ASSFAC= 0
##$ASSFACI= 0
##$ASSFACX= 0
##$ASSWID= 0
##$AUNMP= <proc_1d>
##$AZFE= 0.1
##$AZFW= 0.1
##$BCFW= 0
##$BC_mod= 2
##$BYTORDP= 0
##$COROFFS= 0
##$CY= -3
##$DATMOD= 1
##$DC= 0
##$DFILT= <>
##$DTYPP= 0
##$F1P= 0
##$F2P= 0
##$FCOR= 1
##$FTSIZE= 16384
##$FT_mod= 6
##$GAMMA= 0
##$GB= 0
##$INTBC= 1
##$INTSCL= 3.241238e-09
##$ISEN= 128
##$LB= 0.25
##$LEV0= 0
##$LPBIN= 0
##$MAXI= 10000
##$MC2= 0
##$MEAN= 0
##$ME_mod= 0
##$MI= 1.114404
##$NCOEF= 0
##$NC_proc= -9
##$NLEV= 6
##$NOISF1= 3.799351
##$NOISF2= 2.8
##$NSP= 0
##$NTH_PI= 0
##$NZP= 0
##$OFFSET= 15.43508
##$PC= 1
##$PHC0= -1362.596
##$PHC1= 17.79091
##$PH_mod= 1
##$PKNL= yes
##$PPARMOD= 0
##$PSCAL= 0
##$PSIGN= 0
##$REVERSE= no
##$SF= 200.130017335926
##$SI= 16384
##$SIGF1= 3
##$SIGF2= 2
##$SINO= 0.751879
##$SIOLD= 32768
##$SREGLST= <19F.Aceton>
##$SSB= 0
##$STSI= 16384
##$STSR= 0
##$SW_p= 3612.71676300578
##$SYMM= 0
##$S_DEV= 0
##$TDeff= 16384
##$TDoff= 0
##$TI= <>
##$TILT= no
##$TM1= 0
##$TM2= 0
##$TOPLEV= 0
##$USERP1= <user>
##$USERP2= <user>
##$USERP3= <user>
##$USERP4= <user>
##$USERP5= <user>
##$WDW= 1
##$XDIM= 16384
##$YMAX_p= 484042613
##$YMIN_p= -2853039
$$ End of Bruker specific parameters
$$ ---------------------------------
##NTUPLES= NMR SPECTRUM
##VAR_NAME=  FREQUENCY,     SPECTRUM/REAL,   SPECTRUM/IMAG
##SYMBOL=    X,             R,               I
##VAR_TYPE=  INDEPENDENT,   DEPENDENT,       DEPENDENT
##VAR_FORM=  AFFN,          ASDF,            ASDF
##VAR_DIM=   16384,         16384,           16384
##UNITS=     HZ,            ARBITRARY UNITS, ARBITRARY UNITS
##FACTOR=    0.220516191357247, 1,           1
##FIRST=     3089.02274284309, 0,            0
##LAST=      -523.694020162695, 0,           0
##MIN=       -523.694020162695, -2853039,    0
##MAX=       3089.02274284309, 484042613,    0
$$ Real data points
##PAGE= N=1
##DATA TABLE= (X++(R..R)), XYDATA
$$ [...]
12078D53844J36434K10310P2452K31771k17277j06879j42158R727j81264p7819
12068C89141J15232K49113k04932O6307p986q7793O5283j88968J16963N3419J99028
12057G64807k9696L0461p2794M2787M8877J25900P8866j28931j48455q0069K4990
12046F56743J60995l6278k36463K19364J40638R0922j0373N6452k13402l20422
12036E08176J92232K54486J21145l16941l17667J1262L6739Q7660J15957P3232
12026G66281m4450O6091J50136m1341m02990J69264O1046j88776J1170N6509Q3076
12015F86016L44826o8492k59320j0239l8539L7068K12142j17882j00240k5920
12005F59420j64331J13155J24484m8761q3695K6913L7616Q8841k38133P942R7958
$$ y = [453844, 590278, 800588, 873040, 1104811, 887534, 780655, 638497, 648224, 466960, 389141, 504373, 753486, 548554, 614861, 606875, 519082, 584365, 395397, 512360, 565779, 764807, 735111, 765572, 692778, 735565, 784442, 910342, 989208, 860277, 711822, 631753, 656743, 817738, 781460, 544997, 764361, 904999, 995921, 985548, 1042000, 828598, 508176, 700408, 954894, 1076039, 759098, 441431, 452693, 489432, 577092, 693049, 766281, 721831, 787922, 938058, 896717, 493727, 662991, 724037, 535261, 546431, 602940, 686016, 1030842, 962350, 703030, 692791, 654252, 691320, 903462, 785580, 685340, 659420, 495089, 608244, 732728, 683967, 600272, 627185, 664801, 753642, 515509, 523451, 621409]
11994F21409m6843k4316j526Q4376K9558Q1738o6086m5879R2642K9744o7372R2616
11982G80061j7577j49529j2611J93813r806k01397m2616J72714q0941J17993N2812
11971H02916p6990K1894k11063K0627p9534l5083j1732K21615k02319K15658J14688
11960G80677j477J43591K71808m8402j2651j82158k74934J12372J65597J24693
11950A079116J92277j15371j97669J07913K9817o5691l06059K11942J27264j10904
11940I52635j57620j24437j44001M1355K51994p1276j96725J65220J29968j99120
11930F47993L1417N6297q6565k06663k94684L04946J79819j63170q9918J77773
11920E57245R1432J84137J81698k44682j27401n596o1361J22821J24088j64262
$$ y = [621409, 574566, 550250, 548724, 633100, 662658, 744396, 678310, 632431, 725073, 754817, 687445, 780061, 762484, 612955, 600344, 794157, 784351, 582954, 540338, 713052, 632111, 750104, 802916, 725926, 747820, 536757, 557384, 477850, 442767, 431035, 652650, 450331, 665989, 780677, 779200, 922791, 1194599, 1146197, 1133546, 951388, 676454, 788826, 954423, 1079116, 1271393, 1156022, 958353, 1066266, 1096083, 1030392, 724333, 936275, 1063539, 952635, 795015, 670578, 526577, 567932, 819926, 748650, 551925, 717145, 847113, 647993, 679410, 735707, 649142, 442479, 147795, 452741, 632560, 469390, 379472, 557245, 648677, 832814, 1014512, 769830, 642429, 636833, 575472, 698293, 822381, 658119]
11910F58119K8870R0768j6800J21191j15171j47235J46428L8163j94098J89659
11900G99894k74769M6875m360n7842J92863n5483J0844k40880K07045q443L5765
11889F51509J40243J2442J33389j71889k99955J78714J02709K445j60521j05569
11879D83517j10519K21575Q0152L6587J33716j86161k1157R1436j89819N2730
11869E92057J34759j06462j10940J40714r0257j1529K8989O9502j23318n5750
11859D67765M4760k05227k07939K19381K42003j2307J27638J6394k9924k04254
11849D58290k5209J88427K75202P6275j40377q2085r4254J42775R2937l53845
11839E38136j34933N0565K17955K13525L32526R5902r5238L158j93602j69095
$$ y = [658119, 686989, 777757, 760957, 882148, 766977, 619742, 766170, 804333, 610235, 799894, 525125, 572000, 567640, 509798, 702661, 647178, 658022, 417142, 624187, 615744, 651509, 791752, 804194, 937583, 765694, 465739, 644453, 747162, 749607, 589086, 483517, 372998, 594573, 674725, 711312, 845028, 658867, 637710, 729146, 539327, 592057, 726816, 620354, 509414, 650128, 559871, 548342, 577331, 646833, 523515, 467765, 512525, 307298, 99359, 318740, 560743, 548436, 676074, 692468, 662544, 458290, 433081, 621508, 896710, 972985, 832608, 750523, 656269, 799044, 891981, 538136, 403203, 453768, 671723, 885248, 1217774, 1313676, 1218438, 1221596, 1027994, 858899]
11829H58899K21974j6017q6658J06085l22231k60994M2271J16555O8034j65712
11819E62206p0553o6610m2607k1035L35174j6352J20621p2279j8925K29510O564
11808I45714r1593P5635k7498j74582P5512J88583j82187j93002L14802j16970
11798H14414k50696J41527j9983J63960p8201j07909J14403P5861J0130k46934
11788F16572Q8245n3649r2310N511K4525L67377L1098j10860N7957k3064j85632
11777G25770P1818J06740j23935N7107j56927q1592j37318J23887K2726n833Q1851
11766F84294Q8287K9491q8954J46503j05629J29964R4273r8088j36255J19026
11756H62912k2868J24382O8885j82987k54507J71128N791M0858J77763j81556
$$ y = [858899, 1080873, 1064856, 978198, 1084283, 762052, 501058, 543329, 659884, 727918, 562206, 491653, 425043, 382436, 361401, 696575, 680223, 800844, 728565, 709640, 939150, 945714, 854121, 929756, 902258, 727676, 803188, 991771, 809584, 616582, 931384, 814414, 563718, 705245, 685262, 849222, 771021, 663112, 777515, 853376, 863506, 616572, 704817, 651168, 558858, 564369, 588894, 956271, 987369, 876509, 934466, 911402, 725770, 797588, 904328, 780393, 837500, 680573, 598981, 461663, 585550, 608276, 602443, 684294, 772581, 802072, 713118, 859621, 753992, 883956, 978229, 880141, 743886, 862912, 840044, 964426, 1033311, 850324, 595817, 766945, 772736, 813594, 991357, 809801]
11746H09801J13903J5276l4820L2433Q9775J71567o5248k00050J9381J7222j86347
11735G82893j40365K88367Q5138n7998m2624n6701j86415J11605L7303j54589
11725F66614l77859O7016M1164R4647m6431K15845p8057j11271L99911j31314
11715G40265p7339p5049K94190j5540j00545k43589K77681P4556k75806J70006
11705G68830j43099j69110J56116J15375j08550K422j4731J75457j06341k36045
11695D40324j5612M24249K38754j08084j2963l6865q0473j71545l61546K63734
11685E79973n0593r115J60372j24021J50121L82392j15040j54234Q7153k069l23437
11674E81502N076l3906l01768J8651J20664K91897J60170m8303M3635j14687j18415
$$ y = [809801, 923704, 938980, 904160, 936593, 1026368, 1197935, 1132687, 932637, 952018, 969240, 782893, 642528, 930895, 1016033, 958035, 915411, 858710, 672295, 783900, 821203, 666614, 288755, 355771, 396935, 491582, 445151, 660996, 582939, 471668, 871579, 740265, 662926, 587877, 882067, 866527, 765982, 522393, 800074, 874630, 598824, 768830, 625731, 456621, 612737, 728112, 619562, 621984, 607253, 782710, 676369, 440324, 424712, 848961, 1087715, 979631, 966668, 929803, 849330, 677785, 316239, 579973, 529380, 520265, 680637, 556616, 706737, 1089129, 974089, 819855, 907008, 904939, 581502, 586578, 552672, 250904, 269555, 390219, 682116, 842286, 793983, 837618, 722931, 604516]
11663F04516k5292J46411j7860k7374L7956K739L76703J8141j14497n4602q5912
11652H60929j21761r0833j04798j04952K15704J19820m5398K7644j66509r6363
11642D93483k4017P9318L3629L03105j53127j88585j2978l96K36629J56534p8413
11631H45182L74977l8877l14071N890p7448j31765j49026R2946M3027m3993l33413
11620B73429L55742M5610k37855n4100J80167K66234j84444j9098O5351K83j04347
11609E86972K09066J63456n9681q6306j13485j72439J29614K01461k11173L8216
11599F85701J78068j84212J17101K3563J06930p6376n7221l18137l4538J60710
11589F01589m666R3119M0216O9076K71068j04511j43097L6875J30O2964J97193
$$ y = [604516, 579224, 725635, 707775, 680401, 718357, 721096, 1097799, 1115940, 1001443, 946841, 860929, 739168, 648335, 543537, 438585, 654289, 774109, 728711, 756355, 589846, 493483, 469466, 548784, 582413, 885518, 732391, 543806, 530828, 530432, 767061, 923595, 845182, 1220159, 1181282, 867211, 873101, 795653, 663888, 514862, 607808, 650835, 606842, 273429, 629171, 674781, 436926, 382826, 562993, 829227, 644783, 625685, 691036, 691319, 586972, 796038, 959494, 899813, 813507, 700022, 527583, 657197, 858658, 647485, 685701, 863769, 679557, 796658, 820221, 927151, 850775, 793554, 475417, 440879, 601589, 596923, 690042, 730258, 799334, 1070402, 965891, 822794, 859669, 859799, 922763, 1119956]
11578A119956p6060M822k49578l17563K49993O6684k66568K17058M5263k20094
11568E73913K62306J0339J22692K6070j49936q6092j72465j14049J03579L5797
11558F12154K9934P2124Q5042k88971n1221K33366j3096K35155J86199k44274
11548H56412j94380r9447J96533M1601O6884m7834r8940K63742J17254j71684
11538I30141n8197q1650k35692J58129j03342M17468l2308k57932J44400M1501
11528I22518j6145o5215N5204j62367R0729k4047J69418R0053k85789k70710J96642
11517G00291N0151k481J15086j9965j47407o4736l1929J11150j6521n4811m125
11506F34703Q3290j26902M8666M6720j40192O8971Q2229q7671J19743L82473j98951
$$ y = [1119956, 1043896, 1048718, 799140, 481577, 731570, 798254, 531686, 748744, 794007, 573913, 836219, 846558, 969250, 995320, 845384, 759292, 586827, 472778, 576357, 612154, 642088, 714212, 799254, 510283, 459062, 692428, 679332, 914487, 1100686, 856412, 662032, 562585, 759118, 800719, 867603, 819769, 720829, 984571, 1101825, 930141, 871944, 790294, 554602, 712731, 609389, 1026857, 994549, 736617, 881017, 922518, 906373, 841158, 896362, 733995, 824724, 800677, 970095, 1060148, 774359, 503649, 700291, 750442, 747961, 863047, 843082, 695675, 630939, 599010, 710160, 693639, 638828, 634703, 717993, 591091, 639757, 686477, 546285, 615256, 697485, 609814, 729557, 1112030, 913079]
11495I13079R552K2898j73123J50297j3546m0465M9134o0568K14261k2343k08212
11484H40964K18538j83176j19807O4852j57389K30482j02508J46270J02836o6600
11474I74462K21748n3262j43658q0687j12352j13043J08035j35606j3139K31081
11464H83579j45945q1443J99018j4502j50660l20404M05338K74958O3697j04786
11454A008850p9718k5523Q4076l1801l4506r5962K3691L734J27311K18907p5202
11443A123857J68778k39705r0108P4280r0977j7308j58007j65356M16495o6759
11433I55190j55933j20198Q9519L4872J14505J84100j27819q5324k61589J72358
11423G99681J09061p5008P9183M7231Q9457p6697l04658K29266J72323l2777l69407
$$ y = [913079, 922631, 945529, 772406, 922703, 909157, 868692, 917826, 857258, 1071519, 1049176, 840964, 1059502, 876326, 756519, 821371, 663982, 894464, 791956, 938226, 1041062, 974462, 1196210, 1142948, 999290, 918603, 806251, 693208, 801243, 665637, 652498, 883579, 737634, 656191, 855209, 840707, 690047, 369643, 774981, 1049939, 1113636, 1008850, 929132, 903609, 987685, 955884, 921378, 825416, 849107, 852841, 980152, 1199059, 1123857, 1292635, 1052930, 962822, 1037102, 946125, 928817, 770810, 605454, 1021949, 955190, 799257, 679059, 768578, 803450, 917955, 1102055, 974236, 888912, 627323, 799681, 908742, 833734, 912917, 960148, 1049605, 972908, 668250, 897516, 1069839, 1037062, 667655]
11412F67655M2751K17561L52718n8016n47055J64772n1205j14806j51208M05880
11402I29047J55147m65098O0709K30048j15181L22205J9375l08522j02444R4140
11392H19426m3362N2143J1997o9831o9504J69438k2969r5686l2381K7524J76978
11381I23773Q9548J19166j43492q6987K37105K50118l78176j8551L04334j90223
11371A106615o2424m5060P6886J05623k36497j33401n2667K08986n6621j0656
11361I00784M0047k34344N2841j9955M3303J96993J31952j31941K5577K000j20360
11350H86897L3592J67623o901m665j02197L8287k06260j51378N7687K78919L8145
11339A029749l4566N9587j57321j68282J23438J13796K21964k20241j42491n1824
$$ y = [667655, 710406, 927967, 1280685, 1222669, 675614, 840386, 789181, 674375, 523167, 929047, 1084194, 619096, 679805, 909853, 794672, 1116877, 1136252, 827730, 725286, 819426, 776064, 828207, 840204, 770373, 700869, 870307, 847338, 751652, 719271, 746795, 923773, 1013321, 1132487, 988995, 902008, 1139113, 1389231, 1011055, 992504, 1296838, 1106615, 1044191, 999131, 1076017, 1181640, 945143, 811742, 759075, 968061, 911440, 900784, 940831, 706487, 759328, 739373, 782676, 979669, 1111621, 979680, 1005257, 1007257, 886897, 920489, 1088112, 1081211, 1076546, 974349, 1012636, 806376, 654998, 712685, 991604, 1029749, 995183, 1054770, 897449, 729167, 852605, 966401, 1188365, 968124, 825633, 773809]
11329G73809R1419K8725l28618L0906j13783j41644K75985M6125p5140k3845K16875
11318G80814R3270o9429r6226j86812J42973K537J34646o838K3848j34459J51379
11307H35703q8653K43342o1708n6914j20219N9346N8630m337k95641R9138r3848
11296E74839j80864k7338r2573m2642K09441J38269K89768N0018Q0618K57756
11286A257292o6702R2751k10880j07043k36897n5950j82042K26111P8962r7490
11276F98112o6314J19696K10187q9029k86953j28851J93735J22084r6384K64759
11266I41042J52017k14651J01564o4435Q6946m3135P8546j37890j65874j37618
11256E96512J98771K09060j22284M1543J07587K88902l07140p8998k2724J8505
$$ y = [773809, 865228, 893953, 565335, 596241, 482458, 340814, 616799, 662924, 587784, 563939, 780814, 874084, 804655, 708429, 521617, 664590, 667127, 801773, 794935, 818783, 684324, 835703, 747050, 990392, 928684, 871770, 751551, 810897, 869527, 865190, 569549, 668687, 574839, 393975, 366637, 274064, 231422, 440863, 579132, 868900, 918918, 999536, 1257292, 1190590, 1283341, 1072461, 965418, 728521, 672571, 490529, 716640, 795602, 698112, 631798, 751494, 961681, 872652, 585699, 456848, 650583, 772667, 676283, 941042, 1093059, 878408, 979972, 915537, 1002483, 959348, 1037894, 900004, 734130, 596512, 795283, 1004343, 882059, 923602, 1031189, 1320091, 1012951, 933953, 911229, 929734]
11246I29734J54044R4689k63239L36107o4743j25961O8279j13440j07987j43486
11236G63997p8848J89238K25479n2358N6885J0751R575k40619j67092L56055o4458
11225A008605p4240k173k02582K43770k97346L6584K51228r9728j89218L03157
11215I78057J40500j13475P891k1717k83057j18379K603L3893J91394K34693k90716
11204G61687J17723K6134P158j16727Q6593L71169j40075l05568k86599M13667
11194I35162M4260k30897P2639j6554K62486N2632j25152J20990Q5804p9084k6220
11183A096066K65377k54176P487J87502K8800m1460O7665l55154q6979J83355
11173A098483k3901k6876J47562k03144J27572J45861j63964N3305l723Q3424
$$ y = [929734, 1083778, 1178467, 915228, 1251335, 1186592, 1060631, 1128910, 1015470, 907483, 763997, 685149, 874387, 1099866, 1047508, 1104393, 1115144, 1124719, 884100, 717008, 1073063, 1008605, 934365, 932192, 729610, 973380, 676034, 712618, 963846, 864118, 674900, 978057, 1118557, 1005082, 1012973, 991256, 708199, 589820, 592423, 626316, 817710, 1052403, 761687, 879410, 905544, 912702, 795975, 882568, 1253737, 1113662, 808094, 521495, 935162, 979422, 748525, 821164, 804610, 1067096, 1119728, 994576, 1115566, 1201370, 1122286, 1096066, 1361443, 1107267, 1114754, 1302256, 1331056, 1289596, 1357261, 1002107, 915128, 1098483, 1074582, 1047706, 1195268, 992124, 1119696, 1265557, 1101593, 1154898, 1151175, 1234599]
11163A234599o3612r3806r3845j40670l7728M31R032L40082q4582J82440m4002
11152A208339k21643k33692K24996j29914j5785J47501k83339J29187J37620K24440
11142A187710J00414j00190j06885r236K36112P4743j49431K12039Q6202k67642
11132A263836K45207n5849j01518J34487j3433O1176k9583J635l01136P9742l8341
11121A246223L1042k26993P3735J43802k12281O9320j18060k84527R8182J9691
11111H40134J93601k52048J47275j77802N7143j77836P0197J73465j48925L8923
11101G64127K66447K7032j35641j143N9668R9375m9231J69778j77484j25852j02239
11090G94837j05848n9231N3935J5041M12766r9822L2988J71231l58303j20187
$$ y = [1234599, 1170987, 1077181, 983336, 842666, 804938, 805369, 814401, 1154483, 1069901, 1252341, 1208339, 986696, 753004, 978000, 848086, 832301, 979802, 696463, 825650, 963270, 1187710, 1288124, 1187934, 1081049, 1071813, 1307925, 1382668, 1233237, 1445276, 1531478, 1263836, 1509043, 1453194, 1351676, 1486163, 1472730, 1533906, 1504323, 1505958, 1204822, 1284564, 1246223, 1277265, 1050272, 1124007, 1267809, 1055528, 1124848, 1006788, 722261, 820443, 840134, 1033735, 781687, 928962, 751160, 808303, 630467, 700664, 874129, 725204, 764127, 1030574, 1057606, 921965, 920822, 980490, 1079865, 1030634, 1200412, 1022928, 897076, 794837, 688989, 629758, 683693, 698734, 1111500, 1011678, 1044666, 1215897, 857594, 737407]
11080G37407j5027K91994M4274n5606K458k39443Q5580J44435j21223j18860O2286
11069H18275J70248O9374k37684m1168P7204L38280P0572j39878j96214q3400
11059H45609L0117l6099k10148P0650K35377K56510J33708j41488j61407k15695
11049H07134M753J85795r7927j26418k01601J40356O0888O2261K31889J93484
11039A260614r94l24789J3630J12600j91643j09234r4930n9150K82805M794J307
11028H95010J14359L3768K26909O5286j71044m90145N9717n700j06412J54278
11018G76026L0012K63367J8131J23435j64317q6203J85554K46394p4564l7489
11008A280346k37386j823J20953k93807J13516j65043J81325J1429J33738l41890
$$ y = [737407, 722380, 1014374, 1058648, 1003042, 1005500, 766057, 851637, 996072, 874849, 755989, 818275, 988523, 1057897, 820213, 779045, 856249, 1194529, 1265101, 1125223, 929009, 845609, 875726, 839627, 629479, 700129, 935506, 1192016, 1325724, 1184236, 1022829, 807134, 811887, 997682, 899755, 773337, 571736, 712092, 772980, 835241, 1067130, 1260614, 1259620, 934831, 948461, 1061061, 869418, 760184, 665254, 606104, 888909, 893703, 895010, 1009369, 1043137, 1270046, 1335332, 1164288, 674143, 733860, 728160, 621748, 776026, 806038, 1069405, 1087536, 1210971, 1046654, 960451, 1146005, 1392399, 1317835, 1280346, 1042960, 1041137, 1162090, 868283, 981799, 816756, 998081, 1009510, 1143248, 801358]
10998H01358j1627M2130J02629J85921J88679j85905k23165j91321J13841J37955
10988I60495J74710J93863l80602P0468L83372k51478l25858L34290J11378l95555
10978H75083j23324N9473j5492q7957O9046K6856r5574J88530N3779L0717q6627
10967H94510M3570J48141J39683k26488j86609j69727J34173J99070j9786r6059
10957H60478J35797q8577j61153K70944q1090j76596J16122l7445L27303j6561
10947A149222r5057N2052j15610n2750M0216K45811j58845Q047j71511r63J20131
10936A020743K4731J21969j49082j84553n5896J14856m3600p2533l95345J8077
10926C99367M17857K85668J838J98310j48057r5409m1855n2550K5772J92877n35393
$$ y = [801358, 789731, 831861, 934490, 1120411, 1309090, 1123185, 900020, 708699, 822540, 960495, 1135205, 1329068, 948466, 1018934, 1402306, 1150828, 824970, 1159260, 1270638, 875083, 751759, 811232, 795740, 707783, 776829, 803685, 708111, 896641, 950420, 981137, 894510, 938080, 1086221, 1225904, 999416, 812807, 643080, 777253, 976323, 956537, 860478, 996275, 907698, 746545, 1017489, 936399, 759803, 875925, 838480, 1165783, 1149222, 1054165, 1106217, 990607, 937857, 978073, 1223884, 1065039, 1073086, 901575, 900612, 1020743, 1045474, 1167443, 1018361, 833808, 777912, 892768, 849168, 776635, 381290, 399367, 817224, 1102892, 1104730, 1303040, 1154983, 1059574, 1017719, 965169, 990941, 1183818, 648425]
10915F48425P3663K46729L01768j23390m44478p6405K7336k19696K50314K85554
10905I69820j59354J5708O5168p9992K23004j11716p9219J81931q775J76656K49902
10894A443133J14330k50871J25521k3056l11680K4320n7114n6319k1016L9526
10884A026774l4819o6188R6515J09434O3450j02960k21398k27486J43356j90649
10874E96029q6927n8082J80698J82455n5664k7583J3651J4978L14494L9738k52100
10863H61687j03384N16918J64327m43682k97483j07030K21542J24945K84034k0927
10853A200947l14521P3455j20555L7077n631K96734R4141j16668J16618j5961
10843A245636j79301J00975p7364J23761J76783j10399j51098N6353J4647J56444
$$ y = [648425, 722088, 968817, 1270585, 1147195, 702717, 626312, 653648, 433952, 684266, 969820, 810466, 826174, 891342, 811350, 1034354, 922638, 843419, 1025350, 1016575, 1193231, 1443133, 1557463, 1306592, 1432113, 1409057, 1097377, 1121697, 1064583, 1008264, 987248, 1026774, 991955, 925767, 1022282, 1131716, 1195166, 1092206, 870808, 643322, 786678, 596029, 509102, 451020, 631718, 814173, 758509, 730926, 744577, 759555, 1074049, 1113787, 861687, 758303, 1275221, 1439548, 995866, 698383, 591353, 812895, 937840, 1221874, 1200947, 886426, 959881, 839326, 876403, 870772, 1167506, 1261647, 1144979, 1261597, 1245636, 1066335, 1167310, 1089946, 1213707, 1390490, 1280091, 1128993, 1185346, 1199993, 1356437]
10833A356437L8039p4461k31867j390n215j2597r1080K6077J45720j67516l0745
10822I51402q2907l1242P4274P79m5934K34202N0310J27534r2787l19773J45230
10811A011088k3552J28496o4622R0226O871k06156J06926k51549J62071Q7905
10801A047704O3250r5010j48404L42709O8420j46996k18887o62J95064J65729
10791A272917l38050p6073J60304K11156J60166K5866k64284k33946L5354p4194
10781H79216j93401o4981J21588J62020K73286J04224n2255l9042j48379j45594
10771H96682j69856O2190L9544K99392K16852k81116J57j83487J62606L70574
10761A413538O8798O2732k64081m09217K34141l6406J8521K16471r0399p5120
$$ y = [1356437, 1394476, 1320015, 1088148, 1086758, 1081543, 1068946, 977866, 1003943, 1149663, 982147, 951402, 868495, 837253, 911527, 912306, 866372, 1100574, 1150884, 1278418, 1185631, 865858, 1011088, 987536, 1116032, 1051410, 1141636, 1148507, 942351, 1049277, 797728, 959799, 1047704, 1110954, 1015944, 867540, 1210249, 1278669, 1131673, 912786, 912124, 1107188, 1272917, 934867, 858794, 1019098, 1230254, 1390420, 1416286, 1152002, 918056, 953410, 879216, 685815, 620834, 742422, 904442, 1177728, 1281952, 1229697, 1190655, 1042276, 896682, 726826, 789016, 828560, 1127952, 1344804, 1063688, 1063845, 880358, 1042964, 1413538, 1482336, 1545068, 1280987, 871770, 1105911, 1069505, 1088026, 1304497, 1214098, 1138978]
10751A138978j55054j2694J56112J98708q179J99819j46982k13045O4505K4427
10741A246595O5069n9275r314j3668j98853J15472N8192j95369P9732l00449P4646
10730H62778J46441m6150J36739M9162k98525J78777o2689O4796L58334j94022
10720A195641l25805J73775O9811J31235L5595J2725l12594R2733o4374M3860
10710A052602J44871m9189N8640r4960Q9366j61328N0662J28431l6122j0203M6044
10699A218814k6446j06199Q6756j07204j04574J36113J29361J04700j94356j16957
10689A020008J87915K25508L24681m57217j20951j1665J25979K4314k13848o0652
10679A044072m1885K22907n5991p6827J84034J73249K1633l14122k67165K2841
$$ y = [1138978, 983924, 971230, 1127342, 1326050, 1317871, 1517690, 1370708, 1157663, 1222168, 1246595, 1311664, 1252389, 1243075, 1229407, 1030554, 1146026, 1204218, 1008849, 1088581, 788132, 862778, 1009219, 963069, 1099808, 1148970, 850445, 1029222, 966533, 1031329, 1389663, 1195641, 869836, 1043611, 1113422, 1244657, 1280252, 1292977, 980383, 1073116, 1008742, 1052602, 1197473, 1148284, 1206924, 1111964, 1201330, 1040002, 1090664, 1219095, 1182973, 1172770, 1218814, 1192368, 1086169, 1172925, 1065721, 961147, 1097260, 1226621, 1331321, 1136965, 1020008, 1207923, 1433431, 1758112, 1300895, 1179944, 1168279, 1294258, 1318572, 1104724, 1044072, 1002187, 1225094, 1169103, 1092276, 1276310, 1449559, 1471192, 1157070, 889905, 912746]
10669I12746J63639K57673o1857j39509R2558P0951N2646l07321j36442J3836
10659I18920l4947J18896J14575J34937j26283j00083M3577J02326P3952j37158
10649A108712l3689J28527J35949j06511k61510n2038J84123P1178j53668J22699
10639A143772k23507J77483o1038K09176m08063j61532K59708j46049M930J08110
10629I02990k2020k73834J25807K70822o9830p446k41469K50081K43155L8281
10619A216537l14554J45881k7252N8324k5766P0868K6882k19781J53205J05537
10609A189881j13499k97751J15706K44182j28683P5639j8140Q1K7266p8608J44099
10598A160173l11716K58687K16704j18656J8377N3856r6749K04404q8541m04804
$$ y = [912746, 1076385, 1334058, 1272201, 1132692, 1225250, 1296201, 1348847, 1041526, 905084, 918920, 883973, 1002869, 1117444, 1252381, 1126098, 1026015, 1069592, 1171918, 1245870, 1108712, 1075023, 1203550, 1339499, 1232988, 971478, 919440, 1103563, 1174741, 1021073, 1143772, 920265, 1097748, 1036710, 1245886, 837823, 676291, 935999, 789950, 794880, 902990, 880970, 607136, 732943, 1003765, 933935, 926489, 685020, 935101, 1178256, 1216537, 901983, 1047864, 1020612, 1078936, 1053170, 1124038, 1150920, 931139, 1084344, 1189881, 1076382, 778631, 894337, 1138519, 1009836, 1085475, 1067335, 1067416, 1094682, 1016074, 1160173, 848457, 1107144, 1323848, 1205192, 1223569, 1277425, 1180676, 1385080, 1296539, 891735]
10588H91735J55054L33336J26661k16002j64725J08765l821j6804L5225j15978
10578A133446m2104k80373L42955J26220l5725J84159j79485p6831j81057j18633
10568H72572p3676K53773J20090K06246k13429J02429Q1556k39656j08028j27903
10558H73974L82247j08674J72737J30142j06690j30522l53307L3370N7387K42875
10548A193539n205j97130l67925R3147J90673q6837L63533K81274k61574k82065
10538I21430J81677J45842p007J20527J91826k71952l42036J87678Q3691k42183
10528I69493J08535J67638j5433k35382l9P2573K8600J06092p0239m4619o2433
10517A024786K95019J20756j45954r323j18848j12434J03080l12806J5462n8391
$$ y = [891735, 1046789, 1380125, 1506786, 1290784, 1126059, 1234824, 1231003, 1214199, 1249424, 1133446, 1091342, 810969, 1153924, 1280144, 1244419, 1428578, 1249093, 1172262, 991205, 872572, 798896, 1052669, 1172759, 1379005, 1165576, 1268005, 1349561, 1109905, 1001877, 873974, 1256221, 1147547, 1320284, 1450426, 1343736, 1213214, 859907, 893277, 950664, 1193539, 1188334, 991204, 623279, 716426, 907099, 820262, 1183795, 1465069, 1203495, 921430, 1103107, 1248949, 1241942, 1362469, 1554295, 1282343, 940307, 1127985, 1211676, 969493, 1078028, 1245666, 1230233, 994851, 994812, 1067385, 1095985, 1202077, 1131838, 1087219, 1024786, 1319805, 1440561, 1294607, 1285284, 1166436, 1054002, 1157082, 844276, 859738, 801347]
10507H01347M16206K15603j26272j96817Q8678K80000j144j67732J20117m4179
10497A385807K14319k5843k46919q955n3993k23206k6550M7720J7926L51354j32598
10486A299062J09553J65077K0894j04268n9679j53586R9282K9475O7845p668k72665
10475A193322P6591K33431j37096j09339R1785j48188Q2736N5159j72863M4999
10465A210537L20311j63486k7581p1932j91183n9609K14416j73498O181J31087
10455A195243J2144J92084j01739l8660Q3944k931j37762J70116N2570K9848q6401
10444A368456J12360o5050l40153J22196n8122j11414J85155J09375J25089p3473
10434A374419K07829k1836l49790j33485J28497K70406Q953k24517L39211K70872
$$ y = [801347, 1217553, 1433156, 1306884, 1110067, 1198745, 1478745, 1477601, 1309869, 1429986, 1385807, 1600126, 1574283, 1327364, 1318409, 1264416, 1041210, 1014660, 1062380, 1080306, 1431660, 1299062, 1408615, 1573692, 1594586, 1490318, 1430639, 1277053, 1376335, 1405810, 1473655, 1465987, 1193322, 1269913, 1503344, 1366248, 1256909, 1348694, 1200506, 1283242, 1338401, 1165538, 1210537, 1530848, 1367362, 1339781, 1267849, 1076666, 1017057, 1231473, 1057975, 1064156, 1195243, 1207387, 1399471, 1297732, 1259072, 1343016, 1340085, 1202323, 1372439, 1425009, 1454857, 1368456, 1480816, 1415766, 1075613, 1197809, 1139687, 1028273, 1213428, 1322803, 1447892, 1374419, 1582248, 1560412, 1210622, 1077137, 1205634, 1476040, 1484993, 1260476, 1599687, 1870559]
10424A870559j63523l469k71510j14460J08215J41032j86005j87186J21786k16978
10414A098461N0082J36411k78786j00026K19103J98180j56205J15652M9702k37422
10404A095152K04232k4745L5439j47993O4977J08586R5617j22075r0763p3189
10394A145238j26603l14731M5254o5457K52062J5714O1963L45931L2044j88580
10384A202835K9334K49924n8579j93393j75523J35928O8359K81873J09283k51275
10374A398766N5581J08119k3323k39525k50221J99981L94415o6985P206N6626
10364A640640j90264J35167L9421j50389J43898N0755l16063k13705J08056K60386
10354A507902k5234k6770j01248k23246K56273J04629j52925l5959J22206J53853
$$ y = [1870559, 1707036, 1703567, 1432057, 1317597, 1425812, 1566844, 1380839, 1193653, 1315439, 1098461, 1148543, 1284954, 1006168, 906142, 1125245, 1323425, 1167220, 1282872, 1332574, 1095152, 1299384, 1274639, 1310078, 1162085, 1227062, 1335648, 1431265, 1309190, 1218427, 1145238, 1018635, 703904, 749158, 683701, 935763, 951477, 1013440, 1359371, 1391415, 1202835, 1232169, 1482093, 1423514, 1230121, 1054598, 1190526, 1258885, 1540758, 1650041, 1398766, 1454347, 1562466, 1539143, 1299618, 1049397, 1249378, 1643793, 1576808, 1584014, 1640640, 1450376, 1585543, 1624964, 1474575, 1618473, 1669228, 1353165, 1139460, 1247516, 1507902, 1482668, 1455898, 1354650, 1131404, 1387677, 1492306, 1339381, 1303422, 1425628, 1579481]
10344A579481J33313k0276K7275r7102L6421J36003j29926p7071j05778K62510
10334A744850L37508m60387k30131J51463N5670P4655r5974N2150k10853q5640
10324A333311p5466J83831J87013J34041O6556J39733l16148m06447P8604M42556
10314A767584j06028q6882r2456j08670P6932K3317k14946o740J28447J58274
10304A538832J06236k58630j75553K90502J60200r5160k38594K37289j37746j42600
10294A284776J29369J93975Q0146m20083J44718J86880o4335K5139j0020j0123
10284A540442N4676O0688L27266n4796l18207J57641L0074J51841L17837k32857
10274B034605j74773L00106r853j7414N6483L7654J71959O168k42705k30028k24974
$$ y = [1579481, 1712794, 1692518, 1719793, 1622691, 1659112, 1795115, 1665189, 1588118, 1482340, 1744850, 2082358, 1621971, 1391840, 1543303, 1598973, 1673628, 1577654, 1629804, 1418951, 1333311, 1257845, 1441676, 1628689, 1762730, 1829286, 1969019, 1652871, 1246424, 1325028, 1767584, 1661556, 1574674, 1482218, 1373548, 1450480, 1473797, 1258851, 1252111, 1380558, 1538832, 1645068, 1386438, 1210885, 1501387, 1661587, 1566427, 1327833, 1565122, 1427376, 1284776, 1414145, 1608120, 1688266, 1268183, 1412901, 1599781, 1535446, 1560585, 1550565, 1540442, 1595118, 1655806, 1983072, 1928276, 1610069, 1767710, 1797784, 1949625, 2267462, 2034605, 1859832, 2159938, 2150085, 2132671, 2189154, 2226808, 2398767, 2404935, 2162230, 1932202, 1707228]
10263A707228K28826J12618K5962p207R38m1308k87330j29835N7257O459N214
10252A678822J5963J88792l54819j54370J17859L49583P6747j29317m7710O6108
10242A807658O3849K0013J78615k08448M29938j62137P3836r0799m6292k1854
10232B044379K4984M8563J34859r3678k8252j56417j48404R2456k71871L3650
10222A680269J86712j76574J45761J00955L1539j83965J31350M9552j32881P5601
10212A908319m7909j9722j40207j66094j17765J58170R1466j14615J24783j68308
10202A508118K02483J42725O5368R6281l14099J9582q3473M8872L54159M1797
10192B081813k4983k3067k33495k8744l1865j59002L14369o3306K5288M7175r7765
$$ y = [1707228, 1936054, 2048672, 2074634, 2067427, 2068365, 2027057, 1739727, 1609892, 1667149, 1673608, 1678822, 1694785, 1883577, 1528758, 1374388, 1492247, 1841830, 1918577, 1789260, 1741550, 1807658, 1871507, 1891520, 2070135, 1861687, 2291625, 2129488, 2203324, 2112525, 2066233, 2044379, 2069363, 2117926, 2252785, 2159107, 2130855, 1974438, 1826034, 1918490, 1646619, 1680269, 1866981, 1690407, 1836168, 1937123, 1968662, 1784697, 1916047, 1965599, 1832718, 1908319, 1860410, 1840688, 1700481, 1534387, 1416622, 1574792, 1666258, 1551643, 1676426, 1508118, 1710601, 1853326, 1918694, 2014975, 1700876, 1720458, 1636985, 1685857, 2040016, 2081813, 2056830, 2033763, 1800268, 1771524, 1739659, 1580657, 1895026, 1831720, 1857008, 1904183, 1806418]
10181A806418p2131J79595k81924J24400j77512p4881K93194J45689n5690L6092
10171A923250q0798j24139J13916M22949R7571l51988J29820J16241Q2776n4744
10161B274854k52753k43947K77828j01957m5298k24154J32443J31518m8350J2838
10151A913022K82518k11662j39237M8393K00813J03503J04529k10311j07987l3812
10141A949769R8797K56723K37814j28671k25868n4011M4137K7069J60884P0738
10131B437381j58659J70847J22785M7163l49429j84690M26911j6345j97694j85298
10121B112972J34463n121K16825j30164L169r5596j61807J99937K81449n4070
10111B502057j5102K46526k04583l24642l1105J99500l1708M3619Q0042P2399
$$ y = [1806418, 1734287, 1913882, 1631958, 1756358, 1578846, 1503965, 1797159, 1942848, 1887158, 1923250, 1842452, 1718313, 1832229, 2255178, 2352749, 2000761, 2130581, 2246822, 2329598, 2274854, 2022101, 1778154, 2055982, 1954025, 1908727, 1684573, 1817016, 1948534, 1900184, 1913022, 2195540, 1983878, 1844641, 1893034, 2093847, 2197350, 2301879, 2091568, 1983581, 1949769, 2048566, 2305289, 2543103, 2414432, 2188564, 2134553, 2178690, 2205759, 2366643, 2437381, 2278722, 2449569, 2572354, 2619517, 2270088, 2085398, 2512309, 2495964, 2298270, 2112972, 2247435, 2242314, 2459139, 2328975, 2332144, 2236548, 2074741, 2274678, 2556127, 2502057, 2486955, 2733481, 2528898, 2204256, 2173151, 2372651, 2340943, 2384562, 2464604, 2537003]
10101B537003Q7149L27049J33567k24668J17938K49104l26101J93970L98739k79433
10091C214317M5827J85871O9951j23468l15213J26089k82014r0113K0067j30804
10081B720510J87738K83921k26379k21343L0000j06233L17614j51801j14418J0385
10071B729994K20958m2954m40879J85027J40438N3811n1183J15571J24585K04095
10061C239463J21797O8041J13238J92232k39034N6357j3512r5383Q1993k37950
10051C287242l12490L09862j21139k49764j40615l2597L25541K81592l04920L9312
10041C082024J59534j23978l59220q0921K69557J91818N0066J48644j35256K68410
10031C470678j01581n2592J89069j05830J73513k19638k7710J91039M1982q4276
$$ y = [2537003, 2624152, 2951201, 3084768, 2860100, 2978038, 3227142, 2901041, 3095011, 3493750, 3214317, 3260144, 3446015, 3515966, 3392498, 3077285, 3203374, 2921360, 2831247, 2851314, 2720510, 2908248, 3192169, 2965790, 2744447, 2774447, 2668214, 2985828, 2834027, 2719609, 2729994, 2950952, 2907998, 2467119, 2652146, 2792584, 2846395, 2795212, 2910783, 3035368, 3239463, 3361260, 3429301, 3542539, 3734771, 3495737, 3552094, 3538582, 3443199, 3525192, 3287242, 2974752, 3284614, 3163475, 2913711, 2773096, 2740499, 3066040, 3347632, 3042712, 3082024, 3241558, 3117580, 2758360, 2677439, 2946996, 3138814, 3188880, 3337524, 3202268, 3470678, 3369097, 3316505, 3505574, 3399744, 3573257, 3353619, 3325909, 3516948, 3558930, 3474654]
10021C474654R5169K1762K56869L2184l041J76695Q7938P3287P42037L96246L78591
10010E732391M6348J32913M10795M29752K4965j3523P0603j96853n43801o51909
10000E441681j68735j11283k24738l16288j23694l68971n42679m4304j9688l4605
9990C486696N1449j81080q1003l7824R6915J08183J5617N8145j85169j48739o3444
9979C119746J89401k23312J98305K27320q9495k41660j06054L06647j52165J28752
9969C357485J71386o3109l5296l255L8236k9086J25306O1215m6700L16871J37634
9958D030687l93984k17061Q7953p9014N105J3919R5344j50828l7097l8228L46576
9947C663372j43558k73299L9331N6632J44824j22030o5062n2631J44547j42080
$$ y = [3474654, 3569823, 3591585, 3848454, 3880638, 3877597, 4054292, 4142230, 4215517, 4957554, 5353800, 5732391, 5778739, 5911652, 6322447, 6752199, 6777164, 6763641, 6834244, 6637391, 6093590, 5441681, 5272946, 5161663, 4936925, 4620637, 4496943, 4127972, 3585293, 3540989, 3521301, 3486696, 3538145, 3357065, 3276062, 3238238, 3335153, 3443336, 3458953, 3517098, 3331929, 3183190, 3119746, 3309147, 3085835, 3284140, 3511460, 3421965, 3180305, 3074251, 3380898, 3228733, 3357485, 3528871, 3465762, 3430466, 3427211, 3465447, 3436361, 3561667, 3622882, 3576182, 3893053, 4030687, 3636703, 3419642, 3507595, 3428581, 3433686, 3447605, 3542949, 3392121, 3355024, 3316796, 3663372, 3519814, 3246515, 3285846, 3342478, 3487302, 3365272, 3300210, 3247579, 3392126, 3250046]
9937C250046J80319J15297J63184N4736n858j42788j17494J97747m2930J81304
9927C833563m31167J010L24904J29316l4538k18656q351J31241J06117j64749
9917C668690N2617J559J51167j61991J84561K35296J73226j81014k10067O086
9907C920130N0191L7585l14421M7610L49011L05710j5961k77126q0901K6525Q3514
9896D131867q6373k02758j53048Q1437K00690J13960k2501m4716J60192J97519
9886D376269j166N022R4121l28122K42099n0992K5512j4953O0067K38162R3430
9875D739449K5552K15570p4145k12479J12888p7416K89107R4174j28776l08404
9865D675520Q8370J32323k09291R2342j57505l797J07218L6643J58492J70087
$$ y = [3250046, 3430365, 3545662, 3708846, 3763582, 3757724, 3614936, 3497442, 3695189, 3652259, 3833563, 3402396, 3403406, 3728310, 3857626, 3823088, 3604432, 3596081, 3727322, 3833439, 3668690, 3721307, 3722866, 3874033, 3712042, 3896603, 4131899, 4305125, 4124111, 3914044, 3920130, 3970321, 4007906, 3693485, 3741095, 4090106, 4395816, 4379855, 4102729, 4021828, 4048353, 4131867, 4045494, 3842736, 3689688, 3771125, 3971815, 4085775, 4063274, 4018558, 4178750, 4376269, 4375103, 4380125, 4474246, 4146124, 4388223, 4337231, 4362743, 4347790, 4407857, 4646019, 4739449, 4765001, 4980571, 4906426, 4693947, 4806835, 4729419, 5018526, 5112700, 4983924, 4675520, 4763890, 4896213, 4686922, 4779264, 4621759, 4617962, 4725180, 4761823, 4920315, 5090402]
9855E090402P0132p5979O3997m7329l8503J42872P6313Q8572K7047l5719j94479
9844E167326J60365N1379K39172L13077J10971K12851m2361k7426k08567L0691
9834F007478J08993k4071L80470j97597j39847K40020o4550j80948L14352K38872
9824F683172M6977l9571J67561j06792L460o2153K15208L97810J17523N8737j6555
9813G465377Q0780Q3094N39884j38549O1452K82283J73367k02693J31733l3465
9803H443263K04727K32540L5443J02289J01211O6644J64034K64680K43135L50534
9793A0208500J43387J30332L62066K96062J52394M36960K18843K65204L43916
9784A2557664L86119L57246J391L29900M59225N58714M90375M64449K96032O62489
$$ y = [5090402, 5160534, 5084555, 5148552, 5101223, 5062720, 5205592, 5281905, 5370477, 5397524, 5361805, 5167326, 5327691, 5379070, 5618242, 5931319, 6042290, 6255141, 6212780, 6185354, 5976787, 6007478, 6116471, 6092400, 6472870, 6275273, 6135426, 6375446, 6310896, 6129948, 6444300, 6683172, 6730149, 6690578, 6858139, 6751347, 6754807, 6692654, 6907862, 7305672, 7423195, 7481932, 7465377, 7546157, 7629251, 8169135, 8030586, 8092038, 8374321, 8547688, 8344995, 8476728, 8443263, 8647990, 8880530, 8915973, 9018262, 9119473, 9186117, 9350151, 9614831, 9857966, 10208500, 10351887, 10482219, 10844285, 11140347, 11292741, 11729701, 11948544, 12213748, 12557664, 12943783, 13301029, 13302420, 13632320, 14091545, 14650259, 15140634, 15605083, 15901115, 16563604]
9774A6563604N47611O96934Q18730Q12843P09938N90730O55181J095005J195782
9765B3686358Q00321R63908N04154R55524J047418Q52111O72313Q42057J121012
9756C1445176J235880J107567J282347J602073J690447K042374K335526K513814
9748D5255204K735953L644947M128124M744639N232771O151323P073908Q604963
9740H7571832J0186438J1907640J3914461J4400972J4798830J3379513Q231481
9733A74391167N462299O170020K534450m397599j0244842j3088287j0699122r277048
9725A40851038j4119551j5472190j1333599p772453n377192l353192k195882p73596
9717H0453383k00080M07619J417702K140048K965803K531030L120784L811805
$$ y = [16563604, 17111215, 17808149, 18626879, 19439722, 20149660, 20740390, 21395571, 22490576, 23686358, 24486679, 25450587, 25954741, 26910265, 27957683, 28809794, 29482107, 30324164, 31445176, 32681056, 33788623, 35070970, 36673043, 38363490, 40405864, 42741390, 45255204, 47991157, 51636104, 55764228, 60508867, 65741638, 71892961, 78966869, 87571832, 97758270, 109665910, 123580371, 137981343, 152780173, 166159686, 174391167, 179853466, 186023486, 188557936, 184160337, 173915495, 160827208, 150128086, 140851038, 126731487, 111259297, 99925698, 92153245, 86776053, 83422861, 81226979, 80453383, 80253303, 80660922, 82078624, 84218672, 87184475, 89715505, 92836289, 96648094]
9709I6648094M214693M639085N336304O570871Q376640R886077J1633438J3270411
9701A60575613J3507579J1966261O718100M353664M832571L946146m370456j6297404
9693A85232074j8133856j3526483j0956473j5616796j8414701j4412299j0216871
9686H3954595p711897n744872l989916l017996k218883j965951j153944q47703
9678E7303433l27526m91961m75493j335564j889549j844205j704814k438613k417827
9669D4377881k319271l237038k183007k170728k617596k367506k137232j805860
9661B5539643j512443j096698q81244p74663r39961n07110n72714n49773n00743
9652A8204294q3862j32180n10464l0026l77298l62908o10302o40429l80478n45401
$$ y = [96648094, 100862787, 105501872, 110838176, 117409047, 125785687, 135671764, 147305202, 160575613, 174083192, 186049453, 192767553, 197121217, 201953788, 205899934, 201529478, 185232074, 167098218, 153571735, 142615262, 126998466, 108583765, 94171466, 83954595, 76242698, 70497826, 66507910, 63489914, 61271031, 59305080, 58151136, 57303433, 56975907, 56483946, 56008453, 54672889, 52783340, 50939135, 49234321, 46795708, 44377881, 42058610, 38821572, 36638565, 34467837, 31850241, 29482735, 27345503, 25539643, 24027200, 22930502, 22049258, 21274595, 20334634, 19827524, 19254810, 18705037, 18204294, 18120432, 17988252, 17477788, 17447762, 17070464, 16707556, 16097254, 15456825, 15076347, 14530946]
9642A4530946m23554n22267j40131j72194k10104k50800R1912J36204J25821m09
9632A3165424m87206M4983m27364n78194j47451N600l88206j65056J3100J74937
9622A1210567J37911K12647n1050k27535k57628n3965k95263j40914r1536j32936
9612A0310298K33095j35609j68221j5257n1700N11922K04714N1913K19960n0945
9602A1110170m30609j33941k57434k64596l15084j12291r5820m71872l33315j19246
9592H575962P6937k54213j33319n769K51872j57553m23301j6902L2830K5555p9239
9581G892860p3148k23596K1796O8919k16951r5582j64503j16487J93715K5146
9571G312169N361j03591k67354j97756P6070J02233j98285j71076J0475J19888
$$ y = [14530946, 14107392, 13585125, 13444994, 13272800, 13062696, 12811896, 12903808, 13040012, 13165833, 13165424, 12678218, 12723201, 12295837, 11717643, 11570192, 11575792, 11187586, 11022530, 11035630, 11210567, 11348478, 11561125, 11510075, 11282540, 11024912, 10970947, 10675684, 10534770, 10443234, 10310298, 10543393, 10407784, 10239563, 10224306, 10172606, 10684528, 10889242, 10941155, 11161115, 11110170, 10679561, 10545620, 10288186, 10023590, 9708506, 9596215, 9500395, 9028523, 8695208, 8575962, 8652899, 8398686, 8265367, 8259598, 8511470, 8353917, 7930616, 7913714, 7946544, 7972099, 7892860, 7819712, 7596116, 7617912, 7686831, 7469880, 7374298, 7209795, 7093308, 7287023, 7312169, 7317530, 7213939, 6946585, 6748829, 6824899, 6927132, 6728847, 6557771, 6568246, 6688134]
9561F688134l5021m3806M8836k46749j58071q0945j76085j59370p95j08712j62413
9550E565003L11370J45037l0139j21207k24929R4420J31460q0853r516P138J9103
9539E806887r1176K59340j59353m2841R3259R1916j253K85550N57271m3226k71303
9528F485071L66252k7013J85227R7244n62003l37775k17449J43574J47002j40032
9518F140098k86348j07609j44263J25907k19176K0588K77226P5730J6898j96382
9508E702669J20401Q1266o6012j13559M6232j73823R194P0360K02117Q7194K01312
9497F167351J00362J44448K87058K60572l814q7037L22999l25812M1893P7123
9487F985143j96135m82806l47882M08657N0153k85318j60264R8486j62656m01845
$$ y = [6688134, 6653113, 6609307, 6658143, 6411394, 6253323, 6172378, 5996293, 5836923, 5836128, 5727416, 5565003, 5876373, 6021410, 5991271, 5870064, 5645135, 5739555, 5871015, 5790162, 5780646, 5787784, 5806887, 5715711, 5975051, 5815698, 5772857, 5866116, 5958032, 5956779, 6242329, 6799600, 6756374, 6485071, 6851323, 6824310, 7009537, 7106781, 6544778, 6207003, 5989554, 6133128, 6280130, 6140098, 5853750, 5746141, 5601878, 5727785, 5508609, 5529197, 5806423, 5882153, 5899051, 5702669, 5823070, 5904336, 5838324, 5724765, 5770997, 5597174, 5606368, 5676728, 5878845, 5966039, 6167351, 6267713, 6412161, 6699219, 6959791, 6955977, 6868940, 7191939, 6866127, 6908020, 6985143, 6789008, 6306202, 5958320, 6366977, 6417130, 6131812, 5971548, 6070034, 5907378, 5505533]
9477E505533J11046m8928j93742M4070o2506k9346j98203k20142P1700K91021
9467E270503J62742p6044J94449L66748l5374l24072l02207q524J12001K87111
9457E647333l05439k36731j33950o8806m1681J99025R9390k9243p028k58698J49603
9446E013775J40031J39083J33974j24343j72878k3660J69380J46847l60650M1821
9436E103380L43477J88692k52700Q8494n3776n0027K20644J83400L0463K24716
9426F026763j27253m34896K58385K24413N1886K36075N591k5829l1091J38571
9416F322615J81168J38232K65312J80568j02586L6628J33112J18976J46368J34261
9406G554654j21631p0147J74939J32137K48867N37639R6626K03669L24073J08785
$$ y = [5505533, 5616579, 5567651, 5373909, 5417979, 5355473, 5326127, 5127924, 4907782, 4979482, 5270503, 5433245, 5357201, 5551650, 5918398, 5883024, 5558952, 5256745, 5248221, 5360222, 5647333, 5341894, 5105163, 4971213, 4902407, 4860726, 5059751, 5159141, 5129898, 5122870, 4864172, 5013775, 5153806, 5292889, 5426863, 5302520, 5129642, 5105982, 5275362, 5422209, 5061559, 5103380, 5446857, 5635549, 5382849, 5471343, 5417567, 5367540, 5588184, 5771584, 5802047, 6026763, 5899510, 5464614, 5722999, 5947412, 5999298, 6235373, 6240964, 6215135, 6184044, 6322615, 6503783, 6642015, 6907327, 7087895, 6985309, 7021937, 7155049, 7274025, 7420393, 7554654, 7433023, 7362876, 7537815, 7669952, 7918819, 8456458, 8553084, 8756753, 9080826, 9189611]
9396I189611L08737M09165L94452M47373M00895P11498M72845N42810O98386J051627
9386A4627399J211097J225399J217682R92021O78832Q18102K54779M77911R2892
9377B1596114j005454q19974j043266r70098r51386j148403j066641n32684p29570
9368A3328638j87643l03160j15745k82819L6411J26549p8547L4908j51658J55075
9358A2562009K00923J98382L32306O43180N19930N64614J030412Q28038Q23554
9349A7703348J239800J747793J886523J927721J239195R30443N60345N71136p2552
9340B7733752r04884j468680j467897j496071j627389j591961j452945j100242
9332A6623683o62701n17779m25725k43678l08102o70908n83511j13709k23920
$$ y = [9189611, 9498348, 9907513, 10301965, 10749338, 11150233, 11861731, 12334576, 12877386, 13575772, 14627399, 15838496, 17063895, 18281577, 19273598, 19952430, 20770532, 21025311, 21503222, 21596114, 20590660, 19770686, 18727420, 17757322, 16805936, 15657533, 14590892, 14058208, 13328638, 13140995, 12837835, 12722090, 12439271, 12475682, 12602231, 12523684, 12558592, 12406934, 12562009, 12762932, 12961314, 13293620, 13936800, 14456730, 15021344, 16051756, 16879794, 17703348, 18943148, 20690941, 22577464, 24505185, 25744380, 26674823, 27235168, 27806304, 27733752, 26828868, 25360188, 23892291, 22396220, 20768831, 19176870, 17723925, 16623683, 15960982, 15443203, 15017478, 14773800, 14465698, 13794790, 13211279, 13097570, 12873650]
9323A2873650l45200l47720j15834j13515n70150j43578m49943N9516N3057P7986
9313A0978269K52686l27904k02514k24007K29670l61350J62172M71546m8951m34211
9303A0495406J49050L0770q5055K02371P387R7778K91004L93696j16618K4373
9293A1490162J26388j13550Q0494J01049j22531j53654K759J71055m1880l0095
9283A1510197K19599p7340m2397l55947j78J64161J39667N6672M40459O2130L2015
9272A2149038M1221M3839K21548m0279J03296L10284K95089l6187J43951K15455
9262A3447255k462J94134J44826N45229P8741o3646J24887j49735K87475K05884
9252A4812588K04178L33671J66754m0492K87401K49722L93239N15474J63757J25538
$$ y = [12873650, 12528450, 12180730, 12064896, 11951381, 11381231, 11237653, 10787710, 10847226, 10900283, 10978269, 11230955, 10903051, 10700537, 10476530, 10706200, 10344850, 10507022, 10978568, 10929617, 10495406, 10644456, 10675226, 10590171, 10792542, 10799929, 10897707, 11188711, 11582407, 11465789, 11490162, 11616550, 11503000, 11583494, 11684543, 11562012, 11408358, 11411117, 11582172, 11540292, 11510197, 11729796, 11652456, 11610059, 11254112, 11253934, 11418095, 11557762, 11614434, 12054893, 12117023, 12149038, 12190259, 12234098, 12455646, 12415367, 12518663, 12828947, 13124036, 13087849, 13231800, 13447255, 13444793, 13638927, 13783753, 14328982, 14407723, 14344077, 14468964, 14319229, 14606704, 14812588, 15016766, 15350437, 15517191, 15476699, 15764100, 16013822, 16407061, 16922535, 17086292, 17211830]
9242A7211830K07467J56788O24874N12704K96043K86472L18886M63181N69991
9233B0648236N34533K66727M44460O54948O90849M67012O83709Q23538Q60563
9224B6074575R35363P60655J192506J072542R72675J309192J628208J955947J899418
9215C7801081K268288K899641K664765K362495J805291J054398N92304P36955
9207E2185218J028543Q84746l350q10910q30945K60756M14721P74696P18794Q80732
9197E5503001J395804J942746J937280K195959L031986K695530L246926L269953
9189G5219185L699727M162431M443147M808981N513692O721965P568866Q782207
9181A20920201R743246J1456631J3808343J5781986J7721276J7803931J6531221
$$ y = [17211830, 17419297, 17576085, 18200959, 18713663, 19009706, 19296178, 19615064, 20078245, 20648236, 21182769, 21449496, 21893956, 22548904, 23239753, 23706765, 24390474, 25214012, 26074575, 27009938, 27770593, 28963099, 30035641, 31008316, 32317508, 33945716, 35901663, 37801081, 40069369, 42969010, 45633775, 47996270, 49801561, 50855959, 51448263, 52185218, 53213761, 54098507, 54095157, 53284247, 52453302, 52714058, 53128779, 53903475, 54622269, 55503001, 56898805, 58841551, 60778831, 62974790, 66006776, 68702306, 71949232, 75219185, 78918912, 83081343, 87524490, 92333471, 97847163, 104569128, 112137994, 120920201, 130663447, 142120078, 155928421, 171710407, 189431683, 207235614, 223766835]
9174B23766835J3295883N182728K62374J985234M785421N366642O58430n389481
9166B49914066l737202L743002J0193221J4238179J5582647J5211347J3691334
9159C18836594J0984417O369371L571024L968967O190555Q438401J5064085K4937305
9151C98360719K9396253K7888460K1319336P077845p252391j9348027k2929437
9144D34512758k6929904l7975447m9308782m7713450l5646511k7315629k0300978
9137A89322057j5442329j1996008j0369583q757048q489153o978639n342527m267735
9129A17679035m019299l227631k481970k371114k406672k356960k677819l134601
9121I5002969l984614n199136n017311m500966m844356m427154l669318k951773
$$ y = [223766835, 237062718, 242245446, 242507820, 244493054, 249278475, 254645117, 255303547, 249914066, 246176864, 249919866, 260113087, 274351266, 289933913, 305145260, 318836594, 329821011, 336190382, 339761406, 343730373, 349920928, 358359329, 373423414, 398360719, 427756972, 455645432, 476964768, 484042613, 476790222, 457442195, 434512758, 407582854, 369607407, 320298625, 272585175, 236938664, 209623035, 189322057, 173879728, 161883720, 151514137, 142757089, 134267936, 127289297, 121946770, 117679035, 113659736, 110432105, 107950135, 105579021, 103172349, 100815389, 98137570, 95002969, 91018355, 85819219, 80801908, 76300942, 71456586, 67029432, 63360114, 60408341]
9113F0408341k317356k109307k223580j664752j480925j130848r08130o86097
9105D7887346l09313l91036J31722k16004r84670n17859k61635l42823n55026
9096D4440702r10375j440729j353260j086084j033348q47633q01164p78985p28605
9087C5460519o0150J97896L86248O80276O53625N59495L4721J43940n06806n37012
9077C7012752m50146L870L47050N64048J021995O16319L80263K78851m4940n57121
9067C9172941l45068o07515j460609j761526j198135j517366j078708o52604j35377
9058C0416033j78599J28279M63865O79868K37195k22909r5656n78687j332140
9049B9517249j345062j089641q89172p47368j82732j95968Q5122j97626J8085
$$ y = [60408341, 58090985, 55981678, 53758098, 52093346, 50612421, 49481573, 48573443, 47887346, 47578033, 47186997, 47318719, 47102715, 46118045, 45600186, 45338551, 44995728, 44440702, 43530327, 42089598, 40736338, 39650254, 38616906, 37769273, 36968109, 36189124, 35460519, 35400369, 35598265, 35984513, 36664789, 37318414, 37877909, 37912630, 38056570, 37549764, 37012752, 36562606, 36566476, 36913526, 37477574, 38499569, 39115888, 39496151, 39775002, 39730062, 39172941, 38827873, 38220358, 36759749, 34998223, 33800088, 32282722, 31204014, 30551410, 30416033, 30237434, 30365713, 30829578, 31509446, 31746641, 31523732, 31428076, 30849389, 29517249, 28172187, 27082546, 26193374, 25446006, 25263274, 25067306, 25152428, 24954802, 24972887]
9040B4972887L20559J40907J24722K94735J74550K1301P71676Q79371R27331J091830
9030B9719869R09708J294410J475025J787651J538575J530801J413527J346850
9022D1016416R52092n94563j398554o70147k48695N94860J132057P66011J342873
9013D2892350J369549K170262K350535K747701K726449K466277K357843K997544
9005F2078510L643120L486119L637657M578583N277402P219083Q979636R649975
8997A08550085Q216765N024608m657751j0873859p911898m104208j782399K28832
8989I2690175K125710M228387O287535O877546N965235L060552k878499q657784
8981A09698857o907034l196925o32152J110339K761775M406106N685382O583946
$$ y = [24972887, 25293446, 25434353, 25559075, 25853810, 26028360, 26049661, 26821337, 27700708, 28628039, 29719869, 30629577, 31923987, 33399012, 35186663, 36725238, 38256039, 39669566, 41016416, 41968508, 41373945, 39975391, 39305244, 39056549, 39651409, 40783466, 41549477, 42892350, 44261899, 46432161, 48782696, 51530397, 54256846, 56723123, 59080966, 62078510, 65721630, 69207749, 72845406, 77423989, 82701391, 89920474, 98900110, 108550085, 116766850, 121791458, 117133707, 106259848, 98347950, 94243742, 92461343, 92690175, 94815885, 99044272, 105331807, 112209353, 118174588, 121235140, 118356641, 109698857, 102791823, 99594898, 98962746, 100073085, 102834860, 107240966, 112926348, 119510294]
8973A19510294O782158N336721L358473k325632o459010m073054n33061K052921
8965A23649810N526947P999300J0558867R899136Q375339K18261r569819j2656784
8957A44001057j4901045j1551359o927141l892377j807711O35647K441554K851397
8949A10850022L157108J208555n489526q818304o090880l327356o85778J082597
8941I1886438K311919L277670L807330M143496K665267m98924o430997p432704
8933I3729495m595783k085980J42004K422669M007072N461816P283414P588279
8925A13952986N140172K587829o195903j3032890j0766284j1652280j2085995
8918F7947635q778472o130739m775762m141808l588812k907361k245622k014614
$$ y = [119510294, 126292452, 131629173, 134987646, 132662014, 126203004, 122129950, 121596889, 123649810, 129176757, 137176057, 147734924, 157634060, 166009399, 166227660, 156657841, 144001057, 129100012, 117548653, 110621512, 106729135, 104921424, 105557071, 107998625, 110850022, 114007130, 115215685, 109726159, 100907855, 94816975, 91489619, 90803841, 91886438, 94198357, 97476027, 101283357, 105426853, 108092120, 107593196, 101162199, 93729495, 89133712, 87047732, 87189736, 89612405, 93619477, 99081293, 106364707, 113952986, 119093158, 121680987, 115485084, 102452194, 91685910, 80033630, 67947635, 59169163, 53038424, 48262662, 44120854, 40532042, 37624681, 35379059, 33364445]
8910C3364445j585017j081423r98567r15434m97971p60761l65911j81236p94831
8901B6183294m00766m34031n36041m12539q67827j360277n87991p61052p03457
8892B0119313o97215p52083r48279j538697j436787p37770o10516p42104o11118
8883A2044744l21828m36950n11122K4834k39603l08926r284l24187j80910k68461
8873I468307J03097j024321k89760J03955l41766j44206K01921J34055J7649j99089
8863H029842n4014m41184j88541j34747r3278m72093j32201O9650k92186k08482
8853F082766n07947q9993l0530j95134k42749j20003L6735K48760l38907k73174
8843D569824R6099Q1340j14851J57000K04685p4229k45693j30948k16259J07772
$$ y = [33364445, 31779428, 30698005, 29699438, 28784004, 28286033, 27525272, 27159361, 26978125, 26183294, 25782528, 25348497, 24812456, 24399917, 23532090, 22171813, 21583822, 20822770, 20119313, 19422098, 18670015, 17721736, 16183039, 14746252, 14008482, 13397966, 12655862, 12044744, 11722916, 11285966, 10774844, 10799678, 10560075, 10251149, 10241865, 9917678, 9736768, 9468307, 9571404, 8547083, 8257323, 8361278, 8019512, 7875306, 8077227, 8211282, 8228931, 8029842, 7975828, 7534644, 7346103, 7211356, 7118078, 6645985, 6513784, 6583434, 6291248, 6082766, 5574819, 5484826, 5454296, 5259162, 5016413, 4896410, 4933145, 5181905, 4842998, 4569824, 4665923, 4747263, 4632412, 4789412, 4994097, 4919868, 4674175, 4543227, 4326968, 4434740]
8833D434740k6943J27500j2181m00304p3361j79932L2243J2719l09110J29394
8823C734765k9855q0684l10534k9723j82035J00689k3223O7294K17301R0021j7921
8812C536095M6511k99516j18538J85513r1905O4593K93814M08925J67230J76465
8802D369187l5629j93619o2581N835j82052K1393l67542l81780n1616j59665k32226
8791B729705k98550o2223O2740m28931Q373K04981r5866j08032k48541N1205K8132
8780A842993k5200r8608L59827o643j90302k06858J92776m9483L10039Q1109M3431
8769B253081J3829K74228K28048n6834l1754n9470m9372O7000J11246m18434j00289
8758B231279k33224k18804m26510l8443j84003j07717K77002Q0670j71425j28321
$$ y = [4434740, 4407797, 4535297, 4523116, 4122812, 4049451, 3869519, 3901762, 3914481, 3605371, 3734765, 3704910, 3624226, 3313692, 3283969, 3101934, 3202623, 3179400, 3246694, 3463995, 3554016, 3536095, 3582606, 3283090, 3164552, 3350065, 3258160, 3322753, 3616567, 4025492, 4192722, 4369187, 4333558, 4139939, 4077358, 4083193, 3901141, 3922534, 3554992, 3173212, 3121596, 2961931, 2729705, 2431155, 2368932, 2431672, 2002741, 2011114, 2216095, 2120229, 2012197, 1763656, 1814861, 1842993, 1817793, 1719185, 2079012, 2072369, 1882067, 1675209, 1867985, 1818502, 2128541, 2209650, 2253081, 2266910, 2541138, 2769186, 2712352, 2680598, 2621128, 2571756, 2638756, 2750002, 2331568, 2231279, 1998055, 1779251, 1352741, 1314298, 1130295, 1022578, 1299580, 1380250, 1208825, 1080504]
8748A080504n5112o7847l9486q7115k01875M3735K02582J18435r9774l0683M3821
8737I07185j24274k55205K44077P9981J91144J71278k9369m90367R8973J45250
8727I38673k26340J13907J93784r1617k48038J08378P3590m8186J39422j81151
8717G72422m79936J16572M2111k11863J11537J47103j08707o0844J67917j13311
8707C83001O9926j06872K52506K5884M6770k37845K40183M6496k37618Q9333j40509
8696D31255J12648K8955q1030o4742j9164q8653N2800j83585J68238l8611o7025
8685B51086K51747k3020k91126J24281N861J2743J45967j01788r1988p6954Q2019
8674B88828j2822l14976J56242J88618L8593l42332J56757J41124o2467J03682
$$ y = [1080504, 1025392, 957545, 918059, 830944, 629069, 672804, 875386, 993821, 894047, 863364, 907185, 782911, 527706, 771783, 851764, 1042908, 1214186, 1184817, 694450, 793423, 938673, 712333, 826240, 1020024, 928407, 680369, 788747, 862337, 814151, 953573, 772422, 292486, 409058, 451169, 239306, 350843, 497946, 389239, 328395, 496312, 383001, 452927, 346055, 598561, 624445, 671215, 433370, 673553, 720049, 482431, 571764, 431255, 543903, 572858, 491828, 427086, 407922, 319269, 372069, 188484, 356722, 318111, 251086, 502833, 479813, 188687, 312968, 318829, 331572, 477539, 375751, 283763, 206809, 288828, 276006, -38970, 117272, 305890, 344483, 2151, 158908, 300032, 237565, 341247]
8664C41247J63008k79119k06199O5326R5379q7998P1134k63991j62787K84521
8654B0521K16106J79610k12616L0424K20624Q2238J07621o8772n2231m563K12787
8643G31749J2474P5316L1085p069K88503r1000l99018n6346O8276j25367L74480
8632I03083j33080r3906R6307K08806k14884O2797l6429j23544k24614k87860
8622A56676J82244L63931k6747k91650l49927M5770K49502J58626Q6057j52415
8612D22067Q5946J1679L39720K3720j01195r2234j84292j29954K20039J68414
8602G63910N69m0655r8628l4127k7298k0291K05094J72198j55946j93620j27125
8591D44081j8741N7741j11799J68674n0837l0127n657M15j96454O9402N03186
$$ y = [341247, 504255, 225136, 18937, 84263, 179642, 91644, 162778, -101213, -264000, 20521, 236627, 416237, 203621, 234045, 454669, 536907, 644528, 575756, 523525, 518962, 731749, 744223, 819539, 850624, 843555, 1132058, 1041058, 642040, 585694, 653970, 528603, 903083, 770003, 676097, 772404, 981210, 766326, 829123, 792694, 669150, 444536, 156676, 338920, 702851, 676104, 384454, 34527, 80297, 329799, 488425, 574482, 422067, 508013, 519692, 859412, 883132, 781937, 689703, 505411, 375457, 595496, 763910, 764479, 723824, 625196, 591069, 563771, 543480, 748574, 920772, 764826, 571206, 444081, 425340, 483081, 371282, 539956, 489119, 458992, 453335, 453750, 257296, 326698, 829884]
8580H29884Q56264k65391o95938J3551j25543J70751k45846L2174j74831J15371
8570E10446J46324j76556o6367N7644m9908j12775L6139r4029K11432o8400k53916
8559A40034l0253N3570K9586k3283j31016R6650J00434m2671r9073j33558o0029
8548i9609J71065K691n5656j66751j63601K53859J60189l1221m9143m6631m2299
8537f7107R4541q3251K32116l2101l54061P6366J47431j10202K10464J4234J26750
8526B55180j6345l10125K3994l70905M938L44943k09963p9696J73348K36335j27808
8515g6104J86450k54662R249K6486j33092M4361J40390o6751M3810M2785j10658
8504a47736K39711J82701j67277j5316m6095J76955k70346k41737J14526K5002
$$ y = [829884, 1686148, 1420757, 724819, 738370, 612827, 783578, 537732, 569906, 395075, 510446, 656770, 480214, 413847, 471491, 421583, 308808, 344947, 250918, 462350, 393950, 140034, 109781, 163351, 192937, 169654, 38638, 135288, 235722, 193051, 93978, -39580, -99609, 71456, 74147, 18491, -148260, -311861, -58002, 102187, 70966, 21823, -24808, -67107, 27434, -55817, 176299, 144198, -209863, -133497, 13934, -96268, 114196, 128430, 255180, 238835, -71290, -47296, -418201, -413263, -68320, -278283, -357979, -184631, 51704, -76104, 110346, -144316, -135067, -108581, -241673, -197312, -56922, -123673, -79863, -37078, -147736, 91975, 274676, 107399, 92083, 45988, 222943, -47403, -289140, -174614, -149612]
8494a49612o4136l50331k7021K84683J11785O533K32667m58772M7001K17334o3712
8483b13581j47692j80656J03446J79661n35R471k44298O5189M6694N6066J02366
8472b23869r3452q6923J94414K89695k7766j54101N5416l0227n536p6043J65784
8461G392P4938k53112l82071L25711J54695p1113J05757j2937R7384j06249p8869
8450a38474K00050j4714l25310R4451J50894M6006O6074j21476k9587k01630l6011
8439c09727L82721j7426q0210n2218n3228O0710k04846L66396Q5548l78915R5238
8428a05957N3932M0870L957l1986R0926j03927k43236O2901k36099r8992M40328
8417a27283Q2724J98128k67570j246J12468L8364j91826m6828J29322k75136r3743
$$ y = [-149612, -213748, -564079, -591100, -306417, -194632, -188099, 44568, -414204, -367203, -149869, -213581, -361273, -541929, -438483, -258822, -259357, -249886, -494184, -428995, -382301, -326235, -223869, -317321, -404244, -209830, 79865, 52099, -102002, -46586, -76813, -82349, -158392, 7392, 82330, -170782, -552853, -227142, -72447, -143560, -37803, -50740, 46644, -59605, -138474, 61576, 46862, -278448, -183997, -33103, 12903, 78977, -42499, -72086, -273716, -309727, 72994, 55568, -24642, -76860, -130088, -69378, -274224, 92172, 177720, -201195, -105957, -52025, -11155, -7198, -39184, 51742, -52185, -295421, -232520, -468619, -567611, -127283, -44559, 153569, -114001, -115247, -2779, 35585, -156241, -203069, -73747, -348883, -442626]
8406d42626L21641K19261k67879j30506M11318j09424k10930j2618P2817J19953
8396b8993R0269k53234k71482J99990q6509j1424K6612L48727j21075j83391Q5269
8385b05241J1878j4210J89547o5282j4829j80486j4677j4893o1435k90862J70696
8374d89794K07566K77391J13512N0109k70942r2758j60127o1616K9805K9853J45741
8363b21260R2604m5283K56431k35750p6145J10666j19316l1386J56423n1497l16037
8352d80550K83861J0325N3415j91739r835J90334K0271k16708k7880K79568L8379
8341e0559k37395J01774L18573l9871p2284k60850R0362O6142k23331L10043j2050
8330i446j79136j24203J28143k58005P8984K52039K81658j45454l13481N2545
$$ y = [-442626, -120985, 98276, -169603, -300109, 111209, 1785, -209145, -221763, -148946, -28993, 61276, -191958, -463440, -263450, -349959, -361383, -334771, 13956, -107119, -290510, -205241, -193363, -207573, -18026, -83308, -98137, -278623, -293300, -308193, -369628, -660490, -489794, -282228, -4837, 108675, 158784, -112158, -204916, -365043, -426659, -396854, -367001, -221260, -128656, -173939, 82492, -153258, -229403, -118737, -238053, -269439, -113016, -164513, -480550, -196689, -186364, -132949, -324688, -334523, -144189, -123918, -340626, -368506, -88938, -50559, -287954, -186180, 132393, 92522, 20238, -240612, -150250, -84108, -307439, 2604, -9446, -188582, -312785, -184642, -442647, -363663, -111624, 170034, 24580, -288901, -236356]
8320b36356L913j41459J69215M58n3908N1489J27618K30550k14049l42918J28265
8309b77182j7847J40225l0563o950m8414q3591J1299K2919J40819j37653R5689
8298a91249r0468K0521p1774J43517j68284l69223K2368L15274n7634q4270J42899
8287c88323m24508K37417J80130n5523J66112L5243o0251J89301J42736k57196
8277b34862Q0854o1169q4792Q1153J31313j1546j32651n3793j91233L90769j52624
8266b38581j94079K109k90213N2959P6595M21929J47146k2904l29392L4971J12440
8255b27020k45570j13363R1087K071j18875L60463J52809N8490j64691j43255
8245c47854j95327l8881K1737j09754J02964K27931K79935n0269Q5174j5308n6928
$$ y = [-236356, -232443, -373902, -204687, -204229, -258137, -206648, -79030, 151520, -62529, -405447, -277182, -295029, -154804, -185367, -192317, -240731, -324322, -313023, -290104, -149285, -286938, -191249, -281717, -261196, -332970, -189453, -357737, -726960, -704592, -389318, -446952, -531222, -388323, -812831, -575414, -395284, -450807, -284695, -249452, -309703, -120402, 22334, -234862, -154008, -215177, -299969, -218816, -87503, -99049, -231700, -285493, -476726, -85957, -238581, -432660, -430551, -720764, -667805, -591210, -169281, -22135, -45039, -374431, -339460, -227020, -472590, -585953, -494866, -492795, -611670, -251207, -98398, -39908, -204599, -347854, -543181, -582062, -560325, -670079, -567115, -339184, -59249, -109518, -24344, -39652, -96580]
8234i6580m67476J54833r7742J44016K85336j35925M1142J03398p2956j29572
8224b71526J43508k15152J24961P19k41355r2599L47970K34546j90764K68802
8214A09110r454q3748j6513j29018K08682J36637L26362m28528k27770k54372
8204c68612J3747j38931Q0500R3701P2525M30685J48157Q5072q8049p40982L09582
8193a02605j804698r45736K560645P99025l6312m21858n4426R136J53763l36378
8183a79444L55721j11919k56555K41949l95043K64429M07526l20828N2065J16047
8173A73948L4256R0910l7356r7433J8978k5268N5676K4220l35520L5751o414J54993
8161H6741J79664j80646j54438O4473j27263J36525K95530J50141j46206l98391
$$ y = [-96580, -564056, -409223, -506965, -362949, -77613, -213538, -172396, -68998, -141954, -271526, -128018, -343170, -218209, -217490, -458845, -551444, -203474, 31072, -159692, 109110, 99656, 15908, -605, -129623, 79059, 215696, 542058, 113530, -114240, -368612, -354865, -493796, -413296, -319595, -247070, 183615, 331772, 416844, 328795, -412187, -102605, -1907303, -2853039, -292394, 506631, 470319, 48461, -5965, 3171, 156934, -179444, 176277, 64358, -192197, 49752, -345291, -80862, 326664, 5836, 57901, 173948, 208204, 299114, 261758, 164325, 183303, 158035, 213711, 237931, -97589, -61838, -68252, 86741, 266405, 85759, -68679, -4206, -131469, 5056, 300586, 450727, 304521, -93870]
8151i3870n1094o5531K39591j46618j17801M03115j24501j14875R1354L79004
8141C98774j77407k35954o2485J27709j6723r6040P7777j14850K12240j11581
8131A460n0936J35771K49281k74142q1974K5455R637j17552r7236m586L70070
8120A65248p3177k64542K33865L3939n1963q8986K58280j59179J15337r0658j43633
8109f5469k5377L4599J68521P3196j22426k59678m8291L1837L98365J55817j12838
8098B28256Q3293q6885p170j21005Q6176o6862n7812l7290J12494j37357j63174
8087a67336K52201R206K3516q6548N9450n8042J10428j32740k32337J53291J2783
8076e6128L4230j2596J3973m9096k255R4534p8224k19820m1747J08076k45Q2705
$$ y = [-93870, -144964, -210495, 29096, -117522, -235323, 167792, 43291, -71584, 19770, 398774, 221367, -14587, -77072, 50637, 33914, -62126, 15651, -99199, 113041, 1460, -49476, 86295, 335576, 61434, -20540, 4915, 14552, -103000, -200236, -204822, 165248, 92071, -172471, 61394, 95333, 43370, -45616, 212664, 53485, 168822, 78164, -65469, -90846, -56247, 112274, 185470, 63044, -196634, -244925, -213088, 185277, 341094, 228256, 311549, 224664, 217494, 96489, 182665, 115803, 57991, 20701, 133195, -4162, -167336, 84865, 94071, 117587, 31039, 90489, 32447, 142875, 10135, -222202, -68911, -56128, -21898, -34494, -20521, -69617, -71872, 22662, -55562, -275382, -317129, -209053, -209298, -126593]
8064a26593N979L260Q7728p1586J94980k7690L00112k90389k60267J98431j43915
8053a29950Q2502j88701Q2584K9944J61110j45875O7867R8943n5402j00534K53379
8042A55867n6952j48249j11882p122N8730P1419J20786Q5357j48785n485r4358
8031h0674J9619J39045K13784J67248k53678q0629j56808j43202k38273L11606
8021a01962J55166k30139J7598N09577j03730k032L6724k43687j53123M4697K23926
8010A53015M30102L3106j00692n23890r2159K05603J14891j27723K1516j70750
8000e6981Q5069Q8497k25207j85006O7934K10532k15891K49853j01216n8604J34021
7989f999J06659k16477J93014M4225j12374j65717p5436K88820j20759j61713
$$ y = [-126593, -120614, -117354, -29626, -101212, 93768, 66078, 366190, 75801, -184466, 13965, -129950, -47448, -236149, -153565, -123621, 37489, -108386, -40519, 58424, 3022, -97512, 155867, 98915, -49334, -161216, -168338, -109608, -38189, 82597, 167954, 19169, 13684, -80674, -61055, 77990, 291774, 459022, 205344, 124715, -32093, -175295, -413568, -101962, 53204, -176935, -159337, 350240, 246510, 244478, 281202, 37515, -115608, -70911, 153015, 583117, 616223, 515531, -8359, -100518, 105085, 219976, 92253, 113769, -56981, 28088, 116585, -108622, -293628, -225694, -15162, -231053, 18800, -82416, -141020, -6999, 99660, -116817, 76197, 120422, 8048, -157669, -233105, 55715, -65044, -226757]
7979b26757j56118K11150J28874J34777n0452j83256r010J14233J0004j34374
7969a60929o1380K50898k05643j31861k5308L4535J63161j86156K23990K01155
7959A02462q6424j87932o7735K47287K88885k51179j3622k28875L72780n881k85314
7948a15548L49340O7290k39743K4435P8575j92796Q1013J25157M6257k50567n0961
7937g7548M2380j95574K7596J56566k8213R2888q2018j35820K59354J11049j78866
7926h206L37360L6633j05595p2209m3254P2033j41352N5324p2703J91495j19090
7915A30436k16214K23717K20829j02498k23696j34604M67779r1143k26554L2933
7905H0985J82013j03070N3150k39079K14791J90578O8831m0780q7780J60427J3650
$$ y = [-226757, -382875, -171725, -42851, 91926, 41474, -141782, -150792, -36559, -26555, -160929, -222309, 28589, -177054, -308915, -334223, -299688, -136527, -322683, -98693, 102462, 16038, -171894, -239629, 7658, 296543, 45364, 31742, -197133, 175647, 169766, -115548, 233792, 301082, 61339, 85774, 164349, -28447, 52566, 177723, 223980, -26587, -77548, -35168, -230742, -203146, -46580, -74793, 18095, -63923, -199743, 59611, 170660, -8206, 329154, 365787, 260192, 187983, 144729, 216762, 75410, 130734, 58031, 249526, 130436, -85778, 137939, 358768, 256270, 32574, -102030, 365749, 274606, 48052, 80985, 262998, 159928, 213078, -26001, 188790, 379368, 448199, 407419, 319639, 480066, 493716]
7894D93716j01730k7742j204P7967k09562k477K67400J4106k31377k3967L7760
7883B92890j26643j41640K4855P1178Q6514l13659J82179K88400j10364j30888
7873A22822k5148j62465N1668J04551l14691J55655K50389R0834p3509P0562k46283
7862B4385k47587J71464l4962l06155L84187q5893L3289P5320K07227k1745J89957
7851C89487n33163K47994j56251J47449j0901j8312P23L20269J48514l08714Q4186
7840C11281k52729M4243L9818J32208K24043n8927M3845k13261r0373J86189J31124
7829D97461o945K87606k60498l08080Q6637J37208J61520p1960o9431N0990l10423
7818A94085j99657J19576J27302K8392o9447M0851L7765k2173o8795l92383j07122
$$ y = [493716, 391986, 364244, 363040, 441007, 231445, 228968, 496368, 510474, 279097, 255130, 292890, 166247, 24607, 49462, 120640, 207154, -106505, 75674, 364074, 253710, 122822, 97674, -64791, -13123, 91428, -223263, -67608, 182781, 273615, 200106, 270668, 24385, -223202, -51738, -86700, -392855, -8668, -94561, -61272, 14048, 221275, 199530, 389487, -143676, 104318, -51933, 95516, 84615, 66303, 67026, 387295, 535809, 227095, 311281, 58552, 102795, 142613, 274821, 498864, 439937, 483782, 270521, 180148, 366337, 497461, 490516, 778122, 517624, 209544, 296181, 433389, 594909, 522949, 453518, 504508, 194085, -5572, 114004, 241306, 269698, 200251, 241102, 278867, 256694, 187899, -204484, -311606]
7807c11606n59964J28392r98215J872906K165512j422873J41985k31180o7887
7798G17070j75793R3897j85492p0810k52135r8007n9249J3594r8038K05779j00403
7787i587Q6431Q9651j60800N4511J23510k43519J67354j57575p5410J95032J85126
7776B54724L9102l5601m2877R4570N7943J87757J28441j31695k56507k4239P9387
7765C51005m297k8451Q9282p2292k21996P9071J25407Q5067L05634k82882O0686
7754D86234P7727j07560l5905N690j80046k692n3916k5379J20645J46616K07329
7743F38743j33580K6353J59935M0291j63660O1620j12992j65497L9426p6480l7678
7732B76481J43481q5403j30628J32153K12120j69057J88459n6207k5755j37922
$$ y = [-311606, -871570, -743178, -1741393, 131513, 2297025, 874152, 1016137, 784957, 717070, 541277, 635174, 449682, 378872, 126737, 28730, -30519, -16925, -114963, 90816, -9587, 76844, 166495, 5695, 60206, 183716, -59803, 107551, -50024, -125434, 69598, 254724, 293826, 258225, 215348, 309918, 367861, 555618, 684059, 552364, 295857, 271618, 351005, 346708, 318257, 407539, 335247, 113251, 192322, 317729, 402796, 708430, 425548, 486234, 563961, 456401, 420496, 426186, 246140, 243448, 189532, 164153, 284798, 431414, 638743, 505163, 531516, 691451, 731742, 568082, 629702, 516710, 351213, 390639, 314159, 276481, 419962, 334559, 203931, 336084, 548204, 379147, 567606, 511399, 485644, 347722]
7722C47722J76289K6517j75654j96260k16611J51021K06694P1276J01815k41351
7712B51458k2820L09805j27057q1291j89345j11967K11871Q8294J68823J1972
7702E09743l71363j4039K83249J90777M3155r2263j67326j02826J30819K67109
7692F77035r4817L7327j23545m55833J73191O989J24277j0028J48609K27011k1799
7681F88417R4164J32664l88572k97617K09077K91285N9002q3860J9125k97605
7671D26080k97982K07311J28000p4427P119J88222j7187p5177j24383K9896Q5036
7660D82508K13985J93183j33521k139j39762j68026k0028M8557l1172r3302J19448
7649D69731k05555J08216J18060J44658J75504j4689p0457N2226J45879k1356
$$ y = [347722, 524011, 550528, 374874, 178614, -37997, 113024, 319718, 390994, 492809, 251458, 228638, 538443, 411386, 330095, 140750, 28783, 240654, 328948, 497771, 509743, 138380, 124341, 407590, 598367, 641522, 549259, 381933, 279107, 409926, 677035, 582218, 619545, 496000, 40167, 213358, 220347, 344624, 334596, 483205, 710216, 688417, 782581, 915245, 526673, 229056, 438133, 729418, 788420, 704560, 723685, 426080, 128098, 335409, 463409, 388982, 396101, 584323, 567136, 491959, 367576, 397472, 482508, 696493, 889676, 756155, 754016, 614254, 446228, 426200, 474757, 443585, 350283, 469731, 264176, 372392, 490452, 635110, 810614, 795925, 725468, 777694, 923573, 902217]
7639I02217m48484P2383K89242j91300J02209J77959j14845k48289L3461k3803
7629E50750K04369l2151j66144j32925p3900K78288O0376J76066l5714m2322l1738
7618G54955k08633O1448Q3101K05905J32210p806j21499k14765M81193n5360O2501
7607A173250K37325l65502r4222k8948k10836j53316L67302K03416K20960J23302
7597A472731p0566j31362k25006K3013K44391J41414J21466l79997j4583K07364
7587A388865L57933k0531P7711K66823J84951j12956o189L8387K72843N05588
7577B953425n8129r3877k5929l9755Q6447o9725L13128N1341K0067n177J87958
7566C319774L63290R8593N0726Q2381L70441L38222M44586O45920N64999M38538
$$ y = [902217, 453733, 526116, 815358, 624058, 726267, 904226, 789381, 541092, 574553, 550750, 755119, 722968, 556824, 423899, 349999, 628287, 688663, 864729, 829015, 786693, 754955, 546322, 607770, 690871, 896776, 1028986, 1021180, 899681, 684916, 1166109, 1110749, 1173250, 1410575, 1045073, 950851, 921903, 711067, 557751, 925053, 1128469, 1349429, 1472731, 1402165, 1270803, 1045797, 1068810, 1313201, 1454615, 1576081, 1196084, 1181501, 1388865, 1746798, 1726267, 1803978, 2070801, 2255752, 2142796, 2136607, 2174994, 2447837, 2953425, 2895296, 2801419, 2775490, 2735735, 2822182, 2752457, 3065585, 3116926, 3136993, 3131816, 3319774, 3683064, 3781657, 3832383, 3914764, 4285205, 4623427, 5068013, 5713933, 6278932, 6717470]
7556F717470L35848P44625J095827P61383J715850J500190J651064K220788K621486
7547A9364531K461145J390775L66142j431561l047024l408517k826742j761036
7539A1107713q41457q97689o77559m19361n13981l80615k60983R9058K97293O751
7529G519170J44593J18974O60995N99801P42633O80685J042578J091484J504285
7520A4105198K073893J980354J971629J677128J95330q34463k365758l599335
7512A5203976k765236k116698j498515j287005o40951k40910p09103n72566l77476
7503D995516n07267m73287k96969j01650j04410p2210m9439l91851m65096K457
7493B535794j47579n0583j67517L7106Q2541k66461l33012K32111L42224j14307
$$ y = [6717470, 7053318, 7797943, 8893770, 9655153, 11371003, 12871193, 14522257, 16743045, 19364531, 21825676, 23216451, 23582593, 22151032, 19104008, 15695491, 12868749, 11107713, 10266256, 9368567, 8691008, 8271647, 7757666, 7377051, 7116068, 7215126, 7512419, 7519170, 7663763, 7782737, 8443732, 9043533, 9786166, 10466851, 11509429, 12600913, 14105198, 16179091, 18159445, 20131074, 21808202, 22003532, 21169069, 18803311, 15203976, 12438740, 10322042, 8823527, 7536522, 6895571, 6654661, 5945558, 5372992, 4995516, 4488249, 4014962, 3717993, 3616343, 3511933, 3439723, 3390284, 2998433, 2533337, 2535794, 2388215, 2337632, 2170115, 2207221, 2289762, 2023301, 1690289, 1922400, 2264624, 2150317]
7483B150317k45814J1886j02247P4437L1248n1443r3642k93309J9301J08205K4731
7472A633670j56201j05550J01908j89450j39262j49569K0131L1685l849j23009
7462I20504J4596k9576o8248O0804R8214M1922J42557K4983j61355l6726o6594
7451I41081q6010k5689J32740P0870j76824Q6297l25289J22955Q0364j44708n7320
7440F18467J65220p2421M1397M0382K5891N2667J34612n6409p1850k6302j3589
7429H38065K5168P7908j4660q1349Q3355L0371j66034M4558j28471j08003K91620
7418H92528k9523j59095N5457O8890m54717m7328J68753j00787K91147j129J8102
7407G02298m4779j54532J94363l8796m370R2841m9932k04384J61478j14059K84391
$$ y = [2150317, 1904503, 1916389, 1814142, 1888579, 1919827, 1868384, 1774742, 1481433, 1500734, 1608939, 1633670, 1477469, 1371919, 1473827, 1284377, 1145115, 995546, 1015677, 1047362, 1043513, 920504, 935100, 905524, 837276, 898080, 996294, 1038216, 1180773, 1205756, 1044401, 1007675, 941081, 855071, 829382, 962122, 1032992, 856168, 942465, 617176, 740131, 820495, 675787, 618467, 783687, 711266, 752663, 793045, 818936, 871603, 1006215, 949806, 877956, 851654, 838065, 863233, 941141, 926481, 845132, 928487, 958858, 792824, 837382, 708911, 600908, 892528, 863005, 703910, 759367, 828257, 373540, 326212, 494965, 394178, 685325, 684196, 702298, 657519, 502987, 697350, 658554, 654184, 747025, 697093, 492709, 654187, 540128, 824519]
7396H24519L5005k10003j38820M0113m2039K04019N8515J36916j94123q6913K3936
7385F51125N5875q7079k7968L09980j05047J00472p4005k83619J43639l9040q9762
7374E54571J53627J27323l85479Q5016l1984J8427j02893q7821p2203P0081J18444
7363D47109J31445J34935l04972J06610K09517j42952J02545j81061J32748m7201
7353E88723k56860L40327K2042K3727K62517k9742R7230Q0188k24781n5085N2675
7342I00961J0222L7410o5540o0111j06056k84661J378K83565J38504K38488q8474
7331A005686j80967j11462j60942q0824j8918n2133j93335J26722q8085l2865
7321B12877J26103J61625L5339J49151o4220J37109R4953m49145q6569N19560
$$ y = [824519, 859524, 649521, 510701, 550814, 508775, 712794, 771309, 908225, 714102, 627189, 651125, 707000, 619921, 591953, 901933, 796886, 897358, 823353, 539734, 683373, 644333, 554571, 708198, 835521, 450042, 535058, 503074, 521501, 418608, 330787, 258584, 328665, 447109, 578554, 713489, 408517, 515127, 724644, 581692, 684237, 503176, 635924, 588723, 331863, 672190, 694232, 717959, 980476, 950734, 1047964, 1128152, 903371, 848286, 900961, 911183, 948593, 883053, 822942, 716886, 432225, 433603, 717168, 855672, 1094160, 1005686, 824719, 713257, 552315, 471491, 452573, 400440, 207105, 333827, 245742, 212877, 338980, 500605, 535944, 685095, 620875, 757984, 852937, 403792, 317223, 836783]
7311H36783j90601k96216J32554L34236K18038m09361R8049J56805j28319j47991
7301F03977r8994K23713J8633o6255k67032J10761M1631J0976o5696Q1231K66477
7290H59422q1856j63763p4522L19216J29749l4276K08232j10070J66722L3867
7280A252721l07533n9112J71076K68664j31402j60667j14225k13709R2183Q6907
7270H84903J79542l00604J00588L0167j98761K04023Q4091r9170K74370M124j65048
7259I98225L7352p9337n5091J77150J84166j84571O9278j990j20705K11813N5107
7248A291397J09492K80663n9172n5320L8756n0418J89671R4289L1427L76325J41604
7237B388714j2857k33730l86631K48530L63717J08353k68059j50050K42484K01204
$$ y = [836783, 646182, 349966, 482520, 816756, 1034794, 625433, 723482, 880287, 751968, 603977, 504983, 728696, 747329, 681074, 414042, 524803, 566434, 577410, 511714, 592945, 859422, 777566, 613803, 539281, 858497, 988246, 953970, 1162202, 1052132, 1218854, 1252721, 945188, 886076, 1057152, 1325816, 1194414, 1033747, 919522, 705813, 797996, 884903, 1064445, 763841, 864429, 894596, 695835, 899858, 983949, 884779, 1159149, 1163273, 998225, 1035577, 956240, 901149, 1078299, 1262465, 1077894, 1147172, 1145182, 1024477, 1236290, 1291397, 1400889, 1681552, 1622380, 1567060, 1605816, 1555398, 1745069, 1839358, 1870785, 2247110, 2388714, 2375857, 2142127, 1755496, 2004026, 2367743, 2476096, 2208037, 2057987, 2300471, 2501675]
7227B501675k64566J01525j85397k21754M0843k68031K23591j17022r085J50242
7217A952021j88375k92533k25548K22111o5977m7862j19148N4234K48915M3146
7207A580984N5606l9220o9838j07971n6748j23352q0167J4165K57734J08726k51204
7196A288715j92347p1514n6887O1697J84159k6094l15464K2466P6210L93083J2118
7185A376142M9178N6697L3495j527j60926k36046K11032p4430j23212j19329j53948
7174H57126J91540L05064k66000J02320K66972k53919j07323Q4795K38728q0084
7164A339219m6832l801J04708k2807J13365r7422J98549J50853P6141j38755l62157
7153A311061J26803P7615L77625n7968J3371l2k82805J27820K96028O4156j62349
$$ y = [2501675, 2237109, 2338634, 2153237, 1931483, 1972326, 1704295, 1927886, 1810864, 1801779, 1952021, 1763646, 1471113, 1245565, 1467676, 1401699, 1353837, 1234689, 1288923, 1537838, 1580984, 1636590, 1597370, 1527532, 1419561, 1362813, 1239461, 1159294, 1173459, 1431193, 1539919, 1288715, 1096368, 1024854, 967967, 1029664, 1213823, 1187729, 872265, 894731, 970941, 1364024, 1376142, 1425320, 1482017, 1515512, 1513985, 1353059, 1117013, 1328045, 1253615, 1130403, 1011074, 857126, 1048666, 1353730, 1087730, 1190050, 1457022, 1203103, 1095780, 1180575, 1419303, 1339219, 1292387, 1288586, 1393294, 1370487, 1483852, 1386430, 1584979, 1735832, 1811973, 1673218, 1311061, 1437864, 1515479, 1893104, 1835136, 1848507, 1848475, 1565670, 1693490, 1989518, 2053674, 1891325]
7142A891325l81949K38515O110j41798J33399k07785j5040K35131N2469K68691
7132B079068k12232j68778J21442K126k17388k05133K91433J32013L03080j37338
7122A988293k70743L0174K60366M5773l11773J86650n7514k00424n3053K22918
7112A840667K07206J68775j53003K73212j8542m49397j6154j0805L69012O7335
7102B278306m1790k9722j28469o5100q1365J04562J40051j11915n3921L22008
7092B332645K76322k17405N5596O4016j12598J11769J14955Q4254L38185J9928
7082C067667l25898j02199J21413p1836K28710j89935m12050L4697L44656R5580
7072B790805j78166K2070j7641l4134O3544r6691j00145j14845K39815K38035
$$ y = [1891325, 1509376, 1747891, 1754001, 1612203, 1745602, 1537817, 1522777, 1757908, 1810377, 2079068, 1866836, 1698058, 1819500, 1821626, 1604238, 1399105, 1690538, 1822551, 2125631, 1988293, 1717550, 1747724, 2008090, 2053863, 1742090, 1928740, 1871226, 1670802, 1617749, 1840667, 2047873, 2216648, 2063645, 2336857, 2318315, 1868918, 1852764, 1841959, 2210971, 2278306, 2236516, 2206794, 2078325, 2013225, 1931860, 2036422, 2176473, 2064558, 2010637, 2332645, 2608967, 2391562, 2447158, 2511174, 2398576, 2510345, 2625300, 2709554, 3047739, 3067667, 2741769, 2639570, 2760983, 2689147, 2917857, 2727922, 2315872, 2350569, 2695225, 2790805, 2612639, 2634709, 2617068, 2582934, 2646478, 2549787, 2449642, 2334797, 2574612, 2812647]
7062B812647j84256n1520o5441O5244N26590n81712j98749j07183l6279l6332
7052B143009M54513L849Q6996K72358m3010n0947j09004P8424p9490J26334j6547
7041B866485J82910q1575M8480L3504K73237L5983k07112l8963N735K95763K94699
7030C709146o1797r2021J27885J45339J83375j98471j77291L31354q7823j30074
7020C749622O5645k4137L6725K9053M0459L51849P9432k1067J48182r5328K29012
7009D589447O9898l13582R2904N67570P8833J365j45913j09695J79405L45403
6999E355635J75303q6951J53309L40268N1809l4830K53861r7066J05347J14924
6989F331609Q4682K05484L4454J36365J3523O3923N51427L50228j3049M9827J74799
$$ y = [2812647, 2628391, 2576871, 2511430, 2576674, 3103264, 2521552, 2322803, 2215620, 2179341, 2143009, 2597522, 2601371, 2688367, 2960725, 2917715, 2866768, 2757764, 2836188, 2756698, 2883032, 2866485, 3049395, 2967820, 3016300, 3049804, 3323041, 3359024, 3151912, 3112949, 3118684, 3414447, 3709146, 3647349, 3555328, 3683213, 3828552, 4011927, 3813456, 3636165, 3967519, 3879696, 3749622, 3815267, 3791130, 3827855, 3856908, 3897367, 4249216, 4328648, 4307581, 4455763, 4360435, 4589447, 4659345, 4345763, 4438667, 5006237, 5085070, 5086435, 4940522, 4830827, 5010232, 5355635, 5530938, 5443987, 5597296, 5937564, 5989373, 5954543, 6208404, 6111338, 6216685, 6331609, 6416291, 6621775, 6656229, 6792594, 6806117, 6870040, 7421467, 7771695, 7758646, 7808473, 7983272]
6978G983272J09933K12604M3311M37733M01893J94850J0419O68610L35320r3241
6968A0304704N46044M76321O22916N07932O19667P78451N03941L94385L48727
6959A5103088P64177M96861P44688N44497Q81503J024090R68179J098980R21759
6950B2547822J289460J708815J586627J780393J494579J550651J356249J068129
6942C4382725Q86232J096897J784156K209982K688221K882214K919652K788524
6934E1638603L196145L526203L506471L888714M418194N243013O573751P422992
6926H9414086R044607J1224683J3788954J7829265K2632167K5964238K6421099
6919B16319099K2992754J6537674N351807l520402m090011P48089K890703k141087
$$ y = [7983272, 8093205, 8305809, 8349120, 8786853, 9188746, 9383596, 9394015, 10062625, 10397945, 10304704, 10850748, 11327069, 11949985, 12457917, 13077584, 13856035, 14359976, 14754361, 15103088, 15867265, 16364126, 17108814, 17653311, 18534814, 19558904, 20527083, 21626063, 22547822, 23837282, 25546097, 27132724, 28913117, 30407696, 31958347, 33314596, 34382725, 35268957, 36365854, 38150010, 40359992, 43048213, 45930427, 48850079, 51638603, 54834748, 58360951, 61867422, 65756136, 70174330, 75417343, 81991094, 89414086, 98458693, 109683376, 123472330, 141301595, 163933762, 189898000, 216319099, 239311853, 255849527, 261201334, 257680932, 253590921, 254339010, 257229713, 255088626]
6911B55088626n307046L29691P206859Q748092N383154k550826j2802695j6892781
6903B39203074j4194825j1343522j5785808k4989794k6688150k1135823j5768537
6896A09296615j2500199r965375q068299o840903n732872m836825m545242l776541
6888E3030359l316823l433020k892867k504494k534943k110545k224779j806704
6880C2206184j631159j279087j701649j450301j387296j323030j179464j157266
6872B1096932n95112j042803j030160n72115j089994o83118n65364m22898l14350
6863A4781018p36321m68776o67397l53906l02072m23630m88867n00702k92745
6854A0546602l49732k45829j55901p86541r9502p5285m07450j65225l44184l47178
$$ y = [255088626, 249781580, 250111271, 257318130, 266066222, 271449376, 268898550, 256095855, 239203074, 225008249, 213664727, 197878919, 172889125, 146200975, 125065152, 109296615, 96796416, 86831041, 78762742, 71921839, 66188967, 61352142, 56806900, 53030359, 49713536, 46280516, 43387649, 40883155, 38348212, 36237667, 34012888, 32206184, 30575025, 29295938, 27594289, 26143988, 24756692, 23433662, 22254198, 21096932, 20501820, 19459017, 18428857, 17856742, 16766748, 16083630, 15518266, 15095368, 14781018, 14044697, 13575921, 12908524, 12554618, 12252546, 11828916, 11340049, 10839347, 10546602, 10196870, 9951041, 9795140, 9008599, 8909097, 8833812, 8426362, 8261137, 7916953, 7569775]
6844G569775K23881l32210k38450n2525m36210M6333m0201l9312o1031m26392
6834F213658k87129k96462n4469j5635k67081L1180j92633k47503O3607k90034
6824D657499j77424J3029j08177M4448j13594r4749j41070j82311J25310j21047
6814C901914o9414k10331j02321O7074K23747l95870J73541K34098l44218j15569
6804C362651J31121o1751j7147l63349K8442J6793j61792J04014O4018j61735
6794B941265k68552J8055R9403K16136j70607k05597O9043j20459j21740L6380
6784B493327K5313J59642N3899k51818O7325J59688l63840R1065N8805l6825L6169
6773B492750k69310O0796j82884k67161j79271p6449M88871P781j83420k12740
$$ y = [7569775, 7793656, 7461446, 7222996, 7170471, 6734261, 6780594, 6740393, 6701081, 6640050, 6213658, 5926529, 5630067, 5575598, 5559963, 5292882, 5324062, 5131429, 4883926, 4947533, 4657499, 4480075, 4493104, 4384927, 4429375, 4315781, 4221032, 4079962, 3897651, 4022961, 3901914, 3832500, 3622169, 3519848, 3586922, 3810669, 3414799, 3588340, 3822438, 3478220, 3362651, 3493772, 3432021, 3414874, 3051525, 3079967, 3096760, 2934968, 3038982, 3103000, 2941265, 2672713, 2690768, 2790171, 3006307, 2835700, 2630103, 2699146, 2578687, 2456947, 2493327, 2518640, 2678282, 2732181, 2480363, 2547688, 2707376, 2343536, 2434601, 2493406, 2456581, 2492750, 2223440, 2284236, 2101352, 1834191, 1654920, 1578471, 2067342, 2075123, 1891703, 1678963]
6763A678963J12903J22202o8396k68438K39365L094J6072j26172j69237o9183
6753A471173L85985N8351k02412k50155N3491n4014r1164N2924k0766j16028J02050
6742A389435j35985J63840Q7286K9260k11958j44542k4319k77847J00074j23717
6732H51527m8991p3215K0883R6177L20252L6245m139k86395j31207J42909J01212
6721A025258J30629k02182n2836J22389r6496J03955q826J05585N0999q2694k41299
6710H54482R3571J90050K397j53360O5311K0595j56911m6149n7025p5743P58K34836
6698I72812k91103J688Q3146l42649j82017K31857j37973J61428k6723o04Q1947
6687E51809m2598j26048L8498J72007l27854J60528K79328j28986r2812k0474
$$ y = [1678963, 1791866, 1914068, 1845672, 1577234, 1816599, 1819693, 1835765, 1709593, 1540356, 1471173, 1857158, 1915509, 1713097, 1462942, 1516433, 1462419, 1371255, 1424179, 1403413, 1287385, 1389435, 1253450, 1417290, 1504576, 1533836, 1321878, 1177336, 1153017, 875170, 975244, 851527, 802536, 729321, 750204, 846381, 1166633, 1202878, 1198739, 912344, 781137, 924046, 1025258, 1155887, 953705, 900869, 1023258, 926762, 1030717, 1021891, 1127476, 1178475, 1095781, 854482, 948053, 1138103, 1140500, 987140, 1052451, 1073046, 916135, 869986, 812961, 737218, 737976, 972812, 681709, 683397, 766543, 423894, 241877, 473734, 335761, 497189, 470466, 469862, 551809, 509211, 383163, 421661, 593668, 265814, 426342, 705670, 576684, 483872, 463398]
6677D63398R3979L37236k11310k74731J0622n4909K22402K22896l06960j02353
6667D00270r8208N2115J73558Q6397j90135R6111p3729o4034L60919l3028m985
6656G05251J49884L1248l58430k02076J13487Q5439M3708k44747J36962M2380
6646E03106j65178K50450J92416j64182Q2424n6260O4422k43k15426P6243j30220
6635D37552k5453J1661l1010J69540n9239O5362n0185j1974K9884q0478J72509
6624F28169R5239J08597p4834j47642j77120M8180K23417J07928j53159j37633
6614E21142J75961n9881L6220L81209O1181m9463R6313O0410M1838j07391j50488
6603A007051L9130l7164j15775p2742K97018N67175J90129J72292r0041k3296
$$ y = [463398, 557377, 894613, 683303, 408572, 419194, 364285, 586687, 809583, 502623, 400270, 302062, 354177, 527735, 614132, 423997, 520108, 446379, 382345, 743264, 710236, 705251, 855135, 886383, 527953, 325877, 439364, 524803, 568511, 323764, 460726, 503106, 337928, 588378, 780794, 616612, 699036, 642776, 707198, 706955, 491529, 567772, 437552, 412099, 423760, 392750, 562290, 503051, 568413, 518228, 506254, 536138, 455660, 628169, 723408, 832005, 757171, 609529, 432409, 480589, 704006, 811934, 658775, 521142, 697103, 637222, 673442, 1054651, 1115832, 1066369, 1162682, 1223092, 1264930, 1157539, 1007051, 1046181, 1009017, 893242, 820500, 1117518, 1684693, 1874822, 2047114, 1957073, 1933777]
6593A933777q5843k15385K6022J74280o6004j19144J41779Q5949k03621J17612
6583A789422q3746r557N9573k08225j30712k48008M3983j58079k8844J55451j52174
6572A029084k71103j07911k0564q7935j50415J71264J98074o6596r8377o1905
6562E33616k41244r688L59614R595n1663j40072j44148k16573K47326P7728p9986
6551C44505J12115k90973r3481M67764J47660o6695r4717p9664p402r1114j97412
6540A50586O7046J65059j480J03772j61802J68083m0222J38894p6241j58671m1152
6529C13872J6285j11272J4313J66331l57598J11164o7575P3939J86744j21016
6519B25187j09269J26903q4197L0513m0524j01773J67934K57896J70645k54497
$$ y = [1933777, 1847934, 1632549, 1658571, 1832851, 1766847, 1647703, 1789482, 1875431, 1671810, 1789422, 1705676, 1696119, 1755692, 1547467, 1416755, 1168747, 1212730, 1054651, 1025807, 1181258, 1029084, 757981, 650070, 629506, 541571, 391156, 562420, 760494, 693898, 595521, 533616, 292372, 282684, 642298, 651893, 600230, 460158, 316010, 99437, 346763, 424491, 344505, 456620, 165647, 72166, 539930, 687590, 620895, 526178, 446514, 439112, 347998, 150586, 217632, 382691, 381211, 484983, 323181, 491264, 451042, 589936, 513695, 355024, 313872, 330157, 218885, 233198, 399529, 41931, 153095, 85520, 159459, 346203, 225187, 115918, 242821, 158624, 189137, 148613, 46840, 214774, 472670, 643315, 388818]
6509C88818j6476L138r4035K2233K68223j31224M5741l30141m6547o3043M11401
6498D58088m1363l671n4861K4136j12801j82412l17344J83816J72739K01894K62311
6487E90532m3526k29058k28995K19618Q524R5709m9288l4547j2556R2873k34242
6476A75044j06345j65110N007K77473J24009j37439K6745P3474j93752k25202
6466a46096R3172r2579l448J52843K03838J07364r5333J18875j17630r0067L83132
6455E14071j41392l58196L23312K83526j40907j32950r1408O4483q6013r7527
6445A36999j60301k9261M5719L2631o4422P9845k36036R1387M26296O0456l95035
6434a1722J57075N211P9807l9348p6953j2700K29986K1495m99332L13339L49007
$$ y = [388818, 372342, 375480, 281445, 303678, 571901, 440677, 486418, 156277, 109730, 46687, 458088, 416725, 413054, 358193, 382329, 269528, 87116, -230228, -46412, 126327, 328221, 590532, 547006, 317948, 88953, 308571, 317095, 412804, 363516, 328969, 316413, 409286, 175044, 68699, -96411, -91404, 186069, 310078, 172639, 199384, 272858, 79106, -146096, -52924, -145503, -148951, 3892, 207730, 315094, 219761, 338636, 221006, 130939, 514071, 372679, 14483, 337795, 621321, 480414, 347464, 256056, 320539, 234526, 136999, -23302, -52563, -6844, 25787, -38635, 41210, -194826, -103439, 322857, 383313, -11722, 145353, 150564, 230371, 191023, 114070, 101370, 331356, 352851, -146481, 166858, 515865]
6423E15865J66909n7285j89357k52402M3864j00529O3267J87157K9012j68905
6413B37596J35183O9063l04152j64206J84015L79662K4830k83692k42124R5496
6403A31671K25454P7898k12226L818K3045j29447K76533j4560m0753j48620M3249
6392B36062J49882l3778K27814j85875l7760j55347P5898J73849J9428r0367M1764
6381D21570l7475j75738j90172J34502J34834M5781l2820K81156j31206j06899
6371C43533O0687p7894j26560P7125m634k35944o7530K43765K603l10033j62557
6360b57439L24708J32279J01150K13948l12560O2490J66132Q893q5013J80007
6350E34595K88963K7148m78820j33121Q4562J85504k2967k232j58800l3699n2602
$$ y = [515865, 682774, 625489, 436132, 183730, 227594, 127065, 190332, 377489, 406501, 237596, 372779, 441842, 137690, -26516, 157499, 537161, 561991, 278299, 36175, 131671, 357125, 435023, 222797, 226615, 249660, 120213, 396746, 382186, 341433, 192813, 236062, 385944, 352166, 579980, 394105, 356345, 200998, 276896, 450745, 470173, 379806, 421570, 384095, 208357, 18185, 152687, 287521, 333302, 300482, 581638, 450432, 343533, 404220, 326326, 199766, 276891, 272257, 36313, -31217, 212548, 215151, -94882, -257439, 67269, 199548, 300698, 514646, 202086, 264576, 430708, 439601, 354588, 534595, 823558, 850706, 371886, 238765, 323327, 508831, 485864, 483632, 324832, 291133, 238531]
6339B38531n2771P4557J38497j91349K35005p5068j8557j06925J3138k80219j84295
6328b09456O9015n4455L40918K19705J4606j61653j37273j90025K53941J54710
6318C00033J78427l24679L6228Q6057M605j10047p0069K71569k39547J82551J11529
6307D26657o7618R5154K879J29207n2106m7832k67417k34479n4976J10539K82812
6296C22820j0679K09127M0284l03851M0748k54141K99100O8029l52258J24087
6286A83266Q0519O7047P5206J22433m4533r0312q0848J13662L3541l74748j94354
6275a09121K55595k8143J0852K02647R0524M3641Q2997m8561m8398n0150J62080
6264E63963j80544j78421N6408K7683J08800L79460J88254k28644q0790K17515
$$ y = [238531, 185760, 260317, 398814, 207465, 442470, 367402, 348845, 241920, 255058, -25161, -209456, -140441, -194896, 146022, 365727, 380333, 218680, 81407, -108618, 145323, 300033, 478460, 153781, 190009, 276066, 280671, 170624, 100555, 372124, 132577, 315128, 426657, 359039, 454193, 457072, 586279, 534173, 486341, 218924, -15555, -70531, 40008, 322820, 312141, 521268, 561552, 257701, 298449, 44308, 343408, 411437, 59179, 183266, 263785, 330832, 406038, 528471, 483938, 393626, 312778, 426440, 459981, 85233, -109121, 146474, 118331, 129183, 331830, 422354, 465995, 548992, 500431, 452033, 401883, 563963, 383419, 204998, 261406, 289089, 397889, 777349, 965603, 736959, 656169, 873684]
6254H73684q7184j2878k67293K93355J13748n0288r4165l1161L4964J68284J3866
6243I54932j39734q9356o3645K54062k0365j2394n3699m9711K64005o090l66720
6232F71285k24310j85944L84873l4538j22339k87932P1161K63412j47772J6621
6222D04517N4095K20298r9750l23353J74045J57981P9252k56154n90J6346k17323
6211B09364n4066J03567P7296j110K4112j12120j99170J27122J20595j01201P9232
6200B73621j52891K48596L16511l45426k16327J40489r3303p200J58327k51024
6190G1373K47964J83301j54288J4474N5287j64727R8044o1065m6450n0674j11175
6179H2064K55802j79984j79576K37959j8620m4285k24479J53763L25641q380k82240
$$ y = [873684, 786500, 773622, 506329, 799684, 913432, 863144, 768979, 737818, 772782, 941066, 954932, 815198, 725842, 662197, 916259, 895894, 883500, 829801, 780090, 1044095, 1038005, 671285, 446975, 261031, 645904, 611366, 489027, 201095, 272256, 535668, 387896, 404517, 458612, 678910, 579160, 255807, 429852, 587833, 667085, 410931, 410341, 426687, 209364, 155298, 258865, 336161, 335051, 359163, 247043, 47873, 174995, 295590, 194389, 273621, 120730, 369326, 685837, 340411, 124084, 264573, 171270, 164070, 322397, 71373, 319337, 502638, 348350, 362824, 418111, 253384, 351428, 290363, 243913, 193239, 82064, 337866, 157882, -21694, 216265, 197645, 153360, -71119, 82644, 408285, 399905, 117665]
6168A17665K10421j11675J19702K8589m5613j7934K65800j1113L0653j82476k34287
6157A69732K08855M0945N7027j049k86129P8729M14497k29137k31033J3725J34922
$$ y = [117665, 328086, 216411, 336113, 364702, 319089, 301155, 566955, 555842, 586495, 404019, 169732, 378587, 419532, 476559, 475510, 189381, 268110, 682607, 453470, 222437, 236162, 371084]
$$ [...]
##END NTUPLES=NMR SPECTRUM
##END=
