##TITLE=1H_DE-80H_X3
 200.13MHz, d2o
 8 sc
 
 19ns.26.2.2025
##JCAMPDX= 6.0         $$ Bruker NMR JCAMP-DX V2.0
##DATA TYPE= NMR SPECTRUM
##DATA CLASS= NTUPLES
##ORIGIN= UXNMR, Bruker Analytische Messtechnik GmbH
##OWNER= pz
$$ XWIN-NMR		Version 3.5
$$ Mon Mar 16 10:48:59 2026 Russian Standard Time (UT+4h)  Yarkov@DPX200
##.OBSERVE FREQUENCY= 200.1313
##.OBSERVE NUCLEUS= ^1H
##.ACQUISITION MODE= SIMULTANEOUS
##.ACQUISITION SCHEME= undefined
##.AVERAGES= 8
##.DIGITISER RES= 18
##SPECTROMETER/DATA SYSTEM= spect
##.PULSE SEQUENCE= zg30
##.SOLVENT NAME= DMSO
##.SHIFT REFERENCE= (INTERNAL, DMSO, 0, 15.4549)
##AUDIT TRAIL= $$ (NUMBER, WHEN, WHO, WHERE, WHAT)
$$ ##TITLE= Audit trail, XWIN-NMR		Version 3.5
$$ ##JCAMPDX= 5.01
$$ ##ORIGIN= Bruker BioSpin GmbH
$$ ##OWNER= Yarkov
$$ C:/Bruker/XWIN-NMR/data/yarkov2/nmr/H-C/1/pdata/1/auditp.txt
$$ ##AUDIT TRAIL=  $$ (NUMBER, WHEN, WHO, WHERE, WHAT)
(   1,<2026-03-16 10:47:16.34 +0400>,<Yarkov>,<DPX200>,
      <created by zg, POWCHK disabled, PULCHK disabled
       configuration hash MD5:
       00 E9 B6 7A A2 85 ED C7 34 08 36 98 17 FE 4E 26
       data hash MD5: 16K
       32 CF 51 C9 20 C4 DD 48 37 73 94 F9 FA 67 A9 97>)
(   2,<2026-03-16 10:47:22.45 +0400>,<Yarkov>,<DPX200>,
      <Start of raw data processing
       efp BC_mod = 2 LB = 0.25 FT_mod = 6 PKNL = 1 PHC0 = -5299.148 PHC1 = 6.821927 SI = 16K 
       data hash MD5: 16K
       F0 1D 4C 44 31 D3 FE DB CD D4 37 A6 F2 45 0C 50>)
$$ ##END=
$$ 
$$ hash MD5
$$ 75 3C BF F8 EE 2E AD 2A 4F 01 DD F5 4D 8A 47 47
##$RELAX= 
##$RELAX= 
##$RELAX= 
##$RELAX= 
##$RELAX= 
##$RELAX= 
$$ Bruker specific parameters
$$ --------------------------
##$DU= <C:/Bruker/XWIN-NMR>
##$EXPNO= 1
##$NAME= <H-C>
##$PROCNO= 1
##$TYPE= <nmr>
##$USER= <yarkov2>
##$AMP= (0..31)
100 100 100 100 100 100 100 100 100 100 100 100 100 100 100 100 100 100 
100 100 100 100 100 100 100 100 100 100 100 100 100 100 
##$AQSEQ= 0
##$AQ_mod= 1
##$AUNM= <au_zg>
##$AUTOPOS= <>
##$BF1= 200.13
##$BF2= 200.13
##$BF3= 200.13
##$BF4= 200.13
##$BF5= 200.13
##$BF6= 200.13
##$BF7= 200.13
##$BF8= 200.13
##$BYTORDA= 1
##$CFDGTYP= 0
##$CFRGTYP= 5
##$CHEMSTR= <none>
##$CNST= (0..31)
1 1 145 1 1 1 1 1 1 1 1 1 1 1 1 1 1 1 1 1 1 1 1 1 1 1 1 1 1 1 1 1 
##$CPDPRG= <>
##$CPDPRG1= <>
##$CPDPRG2= <>
##$CPDPRG3= <>
##$CPDPRG4= <mlev>
##$CPDPRG5= <mlev>
##$CPDPRG6= <mlev>
##$CPDPRG7= <mlev>
##$CPDPRG8= <mlev>
##$CPDPRGB= <>
##$CPDPRGT= <>
##$D= (0..31)
0 0.7 0 0 0 0 0 0 0 0 0 0.03 0 0 0 0 0 0 0 0 0 0 0 0 0 0 0 0 0 0 0 0 
##$DATE= 1773643635
##$DBL= (0..7)
120 120 120 120 120 120 120 120 
##$DBP= (0..7)
150 150 150 150 150 150 150 150 
##$DBP07= 0
##$DBPNAM0= <>
##$DBPNAM1= <>
##$DBPNAM2= <>
##$DBPNAM3= <>
##$DBPNAM4= <>
##$DBPNAM5= <>
##$DBPNAM6= <>
##$DBPNAM7= <>
##$DBPOAL= (0..7)
0.5 0.5 0.5 0.5 0.5 0.5 0.5 0.5 
##$DBPOFFS= (0..7)
0 0 0 0 0 0 0 0 
##$DE= 6
##$DECBNUC= <off>
##$DECIM= 32
##$DECNUC= <off>
##$DECSTAT= 4
##$DIGMOD= 1
##$DIGTYP= 9
##$DL= (0..7)
0 120 120 120 120 120 120 120 
##$DP= (0..7)
$$ [...]
##$SUBNAM2= <"">
##$SUBNAM3= <"">
##$SUBNAM4= <"">
##$SUBNAM5= <"">
##$SUBNAM6= <"">
##$SUBNAM7= <"">
##$SUBNAM8= <"">
##$SUBNAM9= <"">
##$SW= 18.0517328524113
##$SWIBOX= (0..15)
0 0 2 0 0 0 0 0 0 0 0 0 0 0 0 0 
##$SW_h= 3612.71676300578
##$TD= 16384
##$TD0= 1
##$TE= 0
##$TE2= 300
##$TE3= 300
##$TEG= 300
##$TL= (0..7)
0 120 120 120 120 120 120 120 
##$TP= (0..7)
150 150 150 150 150 150 150 150 
##$TP07= 0
##$TPNAME0= <>
##$TPNAME1= <>
##$TPNAME2= <>
##$TPNAME3= <>
##$TPNAME4= <>
##$TPNAME5= <>
##$TPNAME6= <>
##$TPNAME7= <>
##$TPOAL= (0..7)
0.5 0.5 0.5 0.5 0.5 0.5 0.5 0.5 
##$TPOFFS= (0..7)
0 0 0 0 0 0 0 0 
##$TUNHIN= 0
##$TUNHOUT= 0
##$TUNXOUT= 0
##$USERA1= <user>
##$USERA2= <user>
##$USERA3= <user>
##$USERA4= <user>
##$USERA5= <user>
##$V9= 5
##$VALIST= <valist>
##$VCLIST= <CCCCCCCCCCCCCCC>
##$VD= 0
##$VDLIST= <DDDDDDDDDDDDDDD>
##$VPLIST= <PPPPPPPPPPPPPPP>
##$VTLIST= <TTTTTTTTTTTTTTT>
##$WBST= 1024
##$WBSW= 4
##$XGAIN= (0..3)
0 0 0 0 
##$XL= 0
##$YL= 0
##$YMAX_a= 309394
##$YMIN_a= -244334
##$ZGOPTNS= <>
##$ZL1= 120
##$ZL2= 120
##$ZL3= 120
##$ZL4= 120
##$ABSF1= 0
##$ABSF2= 0
##$ABSG= 0
##$ABSL= 0
##$ALPHA= 0
##$AQORDER= 0
##$ASSFAC= 0
##$ASSFACI= 0
##$ASSFACX= 0
##$ASSWID= 0
##$AUNMP= <proc_1d>
##$AZFE= 0.1
##$AZFW= 0.1
##$BCFW= 0
##$BC_mod= 2
##$BYTORDP= 0
##$COROFFS= 0
##$CY= -3
##$DATMOD= 1
##$DC= 0
##$DFILT= <>
##$DTYPP= 0
##$F1P= 0
##$F2P= 0
##$FCOR= 1
##$FTSIZE= 16384
##$FT_mod= 6
##$GAMMA= 0
##$GB= 0
##$INTBC= 1
##$INTSCL= 3.241238e-09
##$ISEN= 128
##$LB= 0.25
##$LEV0= 0
##$LPBIN= 0
##$MAXI= 10000
##$MC2= 0
##$MEAN= 0
##$ME_mod= 0
##$MI= 1.114404
##$NCOEF= 0
##$NC_proc= -7
##$NLEV= 6
##$NOISF1= 3.799351
##$NOISF2= 2.8
##$NSP= 0
##$NTH_PI= 0
##$NZP= 0
##$OFFSET= 15.45491
##$PC= 1
##$PHC0= -5299.148
##$PHC1= 6.821927
##$PH_mod= 1
##$PKNL= yes
##$PPARMOD= 0
##$PSCAL= 0
##$PSIGN= 0
##$REVERSE= no
##$SF= 200.130013365902
##$SI= 16384
##$SIGF1= 3
##$SIGF2= 2
##$SINO= 0.751879
##$SIOLD= 32768
##$SREGLST= <19F.Aceton>
##$SSB= 0
##$STSI= 16384
##$STSR= 0
##$SW_p= 3612.71676300578
##$SYMM= 0
##$S_DEV= 0
##$TDeff= 16384
##$TDoff= 0
##$TI= <>
##$TILT= no
##$TM1= 0
##$TM2= 0
##$TOPLEV= 0
##$USERP1= <user>
##$USERP2= <user>
##$USERP3= <user>
##$USERP4= <user>
##$USERP5= <user>
##$WDW= 1
##$XDIM= 16384
##$YMAX_p= 285551566
##$YMIN_p= -1252178
$$ End of Bruker specific parameters
$$ ---------------------------------
##NTUPLES= NMR SPECTRUM
##VAR_NAME=  FREQUENCY,     SPECTRUM/REAL,   SPECTRUM/IMAG
##SYMBOL=    X,             R,               I
##VAR_TYPE=  INDEPENDENT,   DEPENDENT,       DEPENDENT
##VAR_FORM=  AFFN,          ASDF,            ASDF
##VAR_DIM=   16384,         16384,           16384
##UNITS=     HZ,            ARBITRARY UNITS, ARBITRARY UNITS
##FACTOR=    0.220516191357247, 1,           1
##FIRST=     3092.99140056906, 0,            0
##LAST=      -519.72536243672, 0,            0
##MIN=       -519.72536243672, -1252178,     0
##MAX=       3092.99140056906, 285551566,    0
$$ Real data points
##PAGE= N=1
##DATA TABLE= (X++(R..R)), XYDATA
$$ [...]
9843 -210892 -372492 -316010 -216313 -209408 -306843 -284022 -245533 -268683 -311118 -313982 -136750 -94113
9831 -94113 -314148 -275586 -182644 -167980 -328089 -273425 -232314 -235559 -304329 -147841 -109121
9820 -109121 -106605 5569 -119288 -183484 -302836 -252777 -211344 -208266 -183581 -206158 -283992
9809 -283992 -144519 -200512 -286253 -271460 -326921 -365642 -361589 -383833 -361420 -267367 -188571 -149514
9797 -149514 -125872 -159297 -202589 -197772 -198908 -395768 -471197 -463771 -389491 -313038 -344081 -266031
9785 -266031 -277718 -279020 -293438 -254478 -263091 -202831 -246698 -269173 -254288 -197292 -97032 -53660
9773 -53660 -110923 -229134 -256708 3311 42808 43107 59162 -68646 -271681 -219777 -97692
9762 -97692 4811 -22604 -92714 -85118 -110258 -22097 -45767 -59767 20380 -79133 -129994 -112601
9750 -112601 -63650 -11976 -8757 -93138 -61907 -75783 -110819 -87627 -133705 -28132 -133684
9739 -133684 -143897 -52818 -25711 -89232 -163801 -21285 14811 -44929 -32310 -64291 -109201
9728 -109201 -120785 -15443 -85244 -39151 -106496 -18476 104360 12491 51075 51209 145156 186039
9716 186039 91724 243377 243605 317905 261932 243912 377373 280070 326370 399932 359668 305987
9704 305987 339873 315874 309447 276787 284320 348785 406127 388766 321683 426789 665575 613781
9692 613781 542782 584571 409970 337107 371695 519943 694524 805213 918640 884749 904133
9681 904133 869569 745494 786113 963059 1051411 1121853 1060998 1073543 1364882 1513090 1618655
9670 1618655 1787290 1839073 1900262 2084944 2105414 2292939 2570838 2686564 3058709 3515134
9660 3515134 3830846 4294676 4690578 5086732 5743744 6574178 7698848 9046432 10653829
9651 10653829 13693208 19308627 31966363 54060551 77226057 86270647 85694224 81289730
9643 81289730 69107366 54391336 41135699 31080963 23946603 19005785 15038528 11705398
9635 11705398 9757377 8445771 7200197 6308265 5669708 5144226 4718940 4421908 4169774
9626 4169774 3879259 3568404 3418997 3274773 3211940 3178288 2951279 2818711 2565066 2201465
9616 2201465 2140080 2080029 2014532 1972702 1890076 1699353 1632757 1429408 1186954 1040337 1158423
9605 1158423 1221156 1311543 1367527 1394796 1449163 1336128 1255936 1307288 1434238 1457554 1465519
9594 1465519 1342898 1260597 1451441 1453430 1320986 1401752 1463714 1305932 1231421 1061673 979432
9583 979432 921245 658930 636980 608193 640505 618979 499460 553113 571762 552889 391564
9572 391564 327161 430910 415196 520985 609190 481556 482468 623864 705206 668251 768425
9561 768425 1034558 1682527 2500934 3415401 3632414 3331921 3065350 2670474 2086047 1471777
9551 1471777 1258292 849240 654005 564102 633971 597161 440266 441793 311398 263108 258337
9540 258337 262757 342332 212907 125559 13133 33142 170678 130178 -38014 -132095 -151708
9529 -151708 -125405 -159019 -143785 -187860 -178664 57009 83431 -18206 -85426 -190668 -115151
9518 -115151 -125181 -186004 -160444 -55613 3466 -50594 76566 180967 93430 88823 174923
9507 174923 134164 20412 -74075 24592 -27158 -37311 16012 -19888 -90645 29372 36145
9496 36145 22059 88636 122770 110406 132342 176863 257559 183562 230544 242463 91456 17621
9484 17621 65333 177438 63440 -1901 -21301 3286 16070 20072 -41574 -52153 -171580
9473 -171580 -254985 -248695 -232514 -170381 -193367 -251187 -320649 -357316 -340845 -274832 -172651 -134032
9461 -134032 -224236 -160662 -104655 -201573 -137887 -257990 -334927 -212402 -224384 -216337 -203307
9450 -203307 -142592 -143160 -148616 -141639 -120217 -84690 -200238 -94141 -145527 -153403 -270264 -247209
9438 -247209 -54787 -63802 -113137 -292859 -263700 -129988 -187964 -209234 -202931 -215882 -259999
9427 -259999 -384061 -265649 -274392 -177809 -115994 -269345 -214099 -244770 -141403 -219336 -198777
9416 -198777 -247152 -205481 -31864 117045 95918 202649 206499 286181 254828 89705 122742
9405 122742 27775 89310 48501 19419 227601 314140 523883 575087 468738 339992 101153
9394 101153 62841 123300 91611 -141731 -103932 42124 8086 -109166 -63945 61759 86744
9383 86744 -45104 -129485 -206569 -115327 -103459 -46957 -33253 -33140 -131289 -66507 85099 82869
9371 82869 -13128 123969 235971 243761 263384 378362 237710 132737 120040 173021 127672
9360 127672 218218 330776 287757 328515 270818 229010 130751 34418 -16868 9140 58354
9349 58354 -2354 45307 -1732 -140174 -157366 -14615 27058 -48064 -46283 -228905 -209026
9338 -209026 -177514 -210517 -162867 -156561 -187699 -187190 -128513 -215336 -117458 28593 22814 -123999
9326 -123999 -208886 20295 -1341 -166254 -261328 -218545 -150774 -22283 -21277 -20620 20106 518
9314 518 90937 100957 236592 412795 441270 403246 336366 398400 283918 256693 284263 226837
9302 226837 164527 52284 87348 20323 7020 -42196 -82102 -119831 -94048 188756 265300
9291 265300 264430 356094 291519 210531 243066 286847 331103 330634 355744 396582 277869 193028
9279 193028 193133 160986 73127 55456 82566 199257 361515 359686 332458 515998 468422 464242
9267 464242 487254 368670 393126 273404 219918 278953 427958 336555 430887 249778 274260
9256 274260 268153 185828 206304 256925 296383 402463 451275 397508 484584 566616 444688
9245 444688 195472 150870 210255 202662 156624 150962 196860 145277 19005 117152 243557
9234 243557 260273 152000 52128 -41948 -53457 137331 131812 116364 109447 177603 187552 83560
9222 83560 44934 125634 167963 241414 129884 97159 88448 229347 227461 130443 227981 170832
9210 170832 337139 197097 292060 341392 243816 163534 215448 219048 273380 407782 461191
9199 461191 498621 440181 497595 545054 650291 671739 580764 699939 805255 819944 836918
9188 836918 862516 855848 819287 783623 849978 799427 689428 635888 718844 685814 600773 564579
9176 564579 677035 769814 860471 1013550 876576 753375 873082 763493 701975 497211
9166 497211 646430 571594 621476 669762 716125 829433 779669 833099 842969 921961 1114339
9155 1114339 1451760 1662589 1802715 2001157 2205277 2052212 2033104 1884176 1716742 1536193
9145 1536193 1440358 1271975 1138075 1064014 953246 965029 968372 886631 859233 930464 1013686
9134 1013686 1019831 1002849 1009803 1003935 907123 795355 775643 823887 841631 718894 811022 905993
9122 905993 792679 729789 845115 871210 897169 934208 996200 891694 777710 824965 857766
9111 857766 876042 943549 1087839 1000822 1045056 1143343 1145464 1149260 985283 998722 1111997
9100 1111997 1069190 978098 888983 918266 899149 891608 729983 801801 825310 811986 789911
9089 789911 846845 899781 943699 1057288 1175285 1120051 1163357 1235563 1331587 1391991 1463031
9078 1463031 1596055 1637867 1609270 1844392 2029933 2062864 2100052 2081539 2167531 2201877 2007673
9067 2007673 1919610 1964242 1878137 1821035 1955827 2004387 1930371 1966954 1995295 2088832 2163710
9056 2163710 2079490 1870048 1870977 1756106 1781048 1783772 1736491 1661348 1769266 1704615 1798022
9045 1798022 1845169 1904146 1975951 2118590 2187001 2296820 2356543 2342112 2396904 2331050 2295671
9034 2295671 2461397 2601197 2519004 2461045 2412106 2696521 2853772 2948795 3028182 3128917
9024 3128917 3213618 3144395 3097987 3129246 3088592 3131028 3235422 3254686 3368979 3318979 3455413
9013 3455413 3536730 3525936 3620269 3558724 3516708 3614705 3633707 3622926 3599317 3734865 3921442
9002 3921442 3888324 3852044 3930733 4082697 4142204 4197710 4341218 4509151 4633091 4632097 4591211
8991 4591211 4654428 4671520 4776142 4873274 5072601 5158958 5196448 5208962 5193689 5133434 5224876
8980 5224876 5399493 5458949 5577231 5866852 6135163 6348592 6423705 6535592 6756286 7060548
8970 7060548 7211513 7491026 7789441 8053682 8482859 8906674 9347925 9699894 10166293 10831404
8960 10831404 11427978 12181449 12950258 14010284 15517190 17331230 20003566 23973742 30264953
8951 30264953 39806365 52583731 66547406 78686184 86513352 87884866 83505580 75693506
8943 75693506 66150973 56456550 47933041 41129981 36024963 32371698 30133207 29130440
8935 29130440 29296529 30842548 34155759 40262592 50349133 63737610 77124492 87853889
8927 87853889 93851861 93006171 86808243 77983452 67829519 57873238 49280653 42642254
8919 42642254 37914111 34722707 32607917 31772631 32392926 34352706 38057148 44602162
8911 44602162 55340456 70255992 86347826 100190128 108942220 109796276 103930186 94185229
8903 94185229 82119264 70064922 59462311 51196843 45025503 40525597 37725369 36200194
8895 36200194 36049637 37875410 41605965 48693751 60187597 75205912 90057694 101712546
8887 101712546 107756754 105908609 97848390 86531388 73569331 61044191 50262655
8880 50262655 41838161 35090311 29953818 26129218 23036680 20776569 19214866 18074094
8872 18074094 17149495 16404516 15735475 15388404 15545283 16196336 16934511 17701426 18126743
8863 18126743 17847688 17197969 16316585 15033803 13983805 13072741 12443250 11893929 11340681
8854 11340681 10882595 10564015 10355304 10289655 10306604 10465216 11056410 12098428 13520415
8845 13520415 14911595 15968501 16346902 15931161 15057304 13780044 12581207 11547151 10771588
8836 10771588 10048836 9429632 8972731 8838736 8940381 9009632 9349910 10065673 11411438
8827 11411438 12928529 14410791 15392012 15870922 15553968 14659305 13646187 12383652 11425696
8818 11425696 10631184 10005610 9530380 9070296 8766468 8590013 8556771 8671812 8892878 9385819
8808 9385819 10356572 11885900 13346508 14582832 15220624 15106463 14274564 13097535 11773597
8799 11773597 10464498 9296159 8313777 7668518 7195347 6977756 6849603 6714629 6600968
8790 6600968 6337980 6226728 6108024 5962294 5918484 6100002 5981127 6002080 6235053 6286821
8780 6286821 6249482 6294294 6282301 6280177 6121408 6146455 6271494 6283123 6213822 6347564 6469161
8769 6469161 6643309 6854356 7168864 7741122 8462409 9297250 10125659 11022245 11709334 12152355
8759 12152355 11944186 11468795 10952087 10448973 9860317 9326901 8942441 8712762 8617481 8622087
8749 8622087 8660168 8905981 9235691 9689849 10399252 11399909 12581787 13370905 13892784
8740 13892784 14085251 13977433 13692865 13012473 12398674 11928431 11723058 11513600 11415978 11626771
8730 11626771 11804968 12146591 12927773 13694417 14858315 16302280 18023595 20017024 21824929
8721 21824929 23306778 24522503 25324362 26037303 26912945 28252432 30356797 33828706 39608709
8712 39608709 48758915 61624139 77149937 92287531 104094755 109723274 109108425 104290497
8704 104290497 97313701 90230496 85530677 85388533 90789178 100970987 112668953 122235606
8696 122235606 126648638 123850719 114901733 102168344 87955204 74036672 62117005
8689 62117005 52488905 44902025 39116134 34719698 31414562 29136386 27621829 26350457
8681 26350457 25597965 25054090 24809273 24792304 24990256 25424495 26137162 27234887 29067620
8672 29067620 31692769 35489119 41169697 50345870 63524646 79836055 96131505 109447261
8664 109447261 116639548 116492108 110987584 102443822 93314296 86346878 84192491 88217611
8656 88217611 98010152 110548306 121638892 128169634 127568108 119819266 107523706 92843321
8648 92843321 77972740 64822489 54048145 45423930 38546566 33393593 29345732 26150405
8640 26150405 23550053 21565997 20236020 18917767 17776420 16900495 15982895 15296127 14764814
8631 14764814 14117489 13870799 13693384 13343051 13404884 13762259 14287436 15051215 15974607 16944808
8621 16944808 17313398 17176559 16844446 16231111 15542191 14809185 14537327 14396384 14721933
8612 14721933 15280120 15920058 16394374 16426943 16125628 15462855 14497561 13407887 12332055
8603 12332055 11383930 10658323 9997130 9406917 9020074 8789050 8594794 8384519 8152506
8594 8152506 8030135 8051376 8029213 8109106 8409747 9137681 10709868 13270397 15507000 15822807
8584 15822807 15367863 14708736 13151081 11549733 10548778 9607283 8837560 8180307 7687866
8575 7687866 7421963 7308479 7118543 7065687 7067320 6840940 6997698 7247145 7322191 7555924
8565 7555924 7847863 8064148 8116055 8048400 8250382 8311270 8570287 8812298 8907867 9208523
8555 9208523 9538277 10235879 10756247 11262357 11975107 12738367 13641912 14858034 16227178
8546 16227178 18044638 20653649 25006436 31653771 41052021 51205123 58666723 62110217
8538 62110217 61807847 58430914 53024045 47498991 43230384 40967334 41635860 45449781
8530 45449781 51599105 57400032 60434864 60152736 57051355 51655589 45228929 39265144
8522 39265144 34160233 30197232 27063431 24770131 23038143 21683888 20806068 20034826
8514 20034826 19695069 19593233 19749676 20244267 20839195 21765591 22732546 24167446 26469068
8505 26469068 29631316 34491500 42040910 52895431 66484412 80561313 93298257 102102189
8497 102102189 104520375 101398275 94771106 86698506 79470882 75165811 75233797 79792635
8489 79792635 87094180 94809319 100813204 102676934 99234304 91567782 81476347 70659297
8481 70659297 60268226 51436977 44520016 39269060 35254081 32208609 30020832 28078313
8473 28078313 26327507 24971163 23720253 22542347 21628698 21114630 20975360 21107251 21516295
8464 21516295 22471028 23998475 26753042 31717465 39325881 48323093 56121330 60297454
8456 60297454 60744147 58286615 53565967 48296522 43806915 41368988 41419581 44327276 49946255
8447 49946255 56491442 61153758 62329227 60343604 55814521 49667712 43157879 37143655
8439 37143655 32211384 28378355 25768190 23800673 22442375 21622790 20693207 19592708
8431 19592708 18627781 17341671 16171041 15119236 14071841 13122168 12449598 12118001 12093379
8422 12093379 12093951 12535634 13135166 13696762 14416080 14890973 15276184 15060272 14613539 14064688
8412 14064688 13392204 12801835 12674471 13031874 13365538 14108825 15090603 15767342 15964121
8403 15964121 15694345 14877949 13751804 12412261 11167887 10226870 9622036 9100007 8571945
8394 8571945 8494757 8562862 8412159 8252134 8022602 7587187 7157667 6703957 6247667 5727093
8384 5727093 5444200 5150827 5210833 5197876 5413614 5898899 6369446 7070559 7483996 7614211
8374 7614211 7409592 6862601 6378786 5906299 5534149 5245273 5215690 5378744 5872765 6170675
8364 6170675 6158219 6148986 5846325 5305045 4891423 4445005 3887925 3593930 3328661 3055969
8354 3055969 2790566 2680301 2561259 2394170 2256457 2219268 2108385 2102088 2280805 2383406
8344 2383406 2366255 2303158 2241067 2322771 2273781 2209669 2154533 2086451 2057489 2111312 2007492
8333 2007492 1850414 2031765 2131369 1928167 1787259 1749240 1637012 1468883 1573708 1483219
8323 1483219 1364820 1479231 1410408 1374273 1319462 1330579 1287844 1126096 991408 1114188
8313 1114188 1029802 922696 923836 989837 879077 949649 948011 979495 1002478 1062197 1161766
8302 1161766 1215741 1304142 1353387 1377009 1430738 1373014 1325660 1359145 1200309 1215543 1073586
8291 1073586 1050443 1066651 1114129 1155269 1187873 1137943 983412 1007887 1014955 990642 908830
8280 908830 678033 673498 774868 749901 768501 803335 726930 740529 646560 592884 698131
8269 698131 656417 694530 669690 528217 462075 519909 609146 626950 703721 710123 611751 527050
8257 527050 524583 698902 766857 710811 695475 753633 549451 455557 559118 566743 570070 568936
8245 568936 562829 494912 533567 543287 409659 436034 478364 542328 501501 377883 397676 440979
8233 440979 533037 544803 500634 514963 497767 287072 347957 394336 567250 520812 475758
8222 475758 500579 457056 345944 283623 406916 381680 330175 278138 271742 403105 400172
8211 400172 358027 458024 472354 390604 302237 291039 311814 319426 361307 295471 300077 345895
8199 345895 423004 420549 396167 419660 523333 651848 889386 372193 -385686 -30929 44984
8188 44984 39220 44355 54353 131894 207320 182992 197999 28152 6238 116898 142903 6122
8176 6122 251 189332 274315 313943 296590 235269 132215 116623 342374 367316 283436 234659
8164 234659 267753 336433 407056 420468 330781 280858 323656 504536 457237 587607 601997
8153 601997 420795 363961 344495 238579 321458 277410 338884 191966 21663 150767 267033
8142 267033 276394 239364 165878 216806 255858 376875 436753 365761 386667 417968 454528 465505
8130 465505 435727 482953 564137 442143 442552 510521 433118 465362 480441 588186 505901 492633
8118 492633 529492 491142 551669 427149 302168 432574 475183 289535 272949 397808 517913
8107 517913 395048 286459 140844 230731 259928 259319 293296 323378 185550 60803 96423
8096 96423 154348 160395 88765 119000 309340 254363 307911 171765 153398 151662 188198 332176
8084 332176 213342 120821 199613 297616 243521 288948 271125 238282 134234 226683 117217
8073 117217 147016 101285 55937 138235 87202 93096 152888 163849 197424 118916 58337 70809
8061 70809 3250 -119023 -24946 457 -85681 -17993 -103049 -91639 -52922 -30075 -25444 114715
8049 114715 -13350 -35113 -27405 -92071 -93669 -73709 -25465 57303 14682 14686 -5479 -35384 126139
8036 126139 137852 127882 276366 238210 -31418 -102600 48883 144027 107400 178804 -19015
8025 -19015 -72094 -3193 96821 14061 59962 47905 -40730 37227 43000 98758 -61170 -50846
8013 -50846 90467 136708 -25607 3197 -27513 -75459 -161311 -73651 -111250 -155619 -155450 -281463
8001 -281463 -192072 -110868 -6944 20211 -45202 -113270 -113534 -131038 -155695 -101824 43681 113719
7989 113719 -86542 -272348 -114441 -209654 -155051 -106642 -84773 -17302 -19921 -181718 -113460
7978 -113460 -161921 -74456 -89969 -80710 -74443 25376 131595 85801 80751 98098 44505 -130263
7966 -130263 -184076 -143149 -225747 -212427 -89762 -20569 88829 20023 -137075 -204053 -99288
7955 -99288 -176308 -142346 -117522 -106410 -220158 -77276 -63386 -61065 -93083 -52901 -30567 -25299
7943 -25299 -104593 117834 42030 -54680 16389 5219 -61678 -231375 -196927 -90358 59151
7932 59151 -155276 -204136 -54657 -120345 -265317 -140621 -103202 -63043 -105063 -49802 -8088
7921 -8088 52085 -68329 -85059 -154085 -265390 -92887 -39534 -112539 -125414 36417 16930
7910 16930 -43273 -21640 -34878 14575 57430 -52852 -115828 -141652 -225416 -124664 -105949
7899 -105949 -118619 -146840 -172166 -156414 -78230 -100450 -153808 -169979 16042 17023 -261316 -142581
7887 -142581 -50301 68690 -27446 -42698 69476 -79933 -229514 -206493 -217646 -128850 -117487
7876 -117487 -68302 -113335 -103595 -25844 -161991 -136669 -87415 -86883 -167624 -245942 -213900 -245603
7864 -245603 -165491 -66889 -54346 -183692 -146379 -219122 -249652 -235992 -287813 -303348 -344144
7853 -344144 -196048 21242 -54766 -266242 -294112 -213071 -233564 -125157 -91115 -97605 -6016
7842 -6016 -21829 -66821 -34657 -47690 -192897 -187000 -30831 -94365 -68405 35764 -73507
7831 -73507 -130299 -52694 -100825 -51738 -54469 -98858 -23373 -144642 -134377 -122927 -206385 -110611
7819 -110611 -21677 -121282 -19056 19280 -12798 -63360 -51289 -141098 -101331 82673 131708
7808 131708 32941 110074 94229 299590 -208052 -280552 -262523 -282179 -259467 -287484 -20758
7797 -20758 -671 75803 201869 120787 176652 125526 28652 30264 26686 206176 58106 -20481
7785 -20481 -7540 78839 -18936 5543 -169255 -148422 -44762 -9559 89621 6959 -135077
7774 -135077 2048 82110 57580 71482 104506 183804 92271 189527 535508 720129 947094
7763 947094 1063069 1036573 890530 632192 439429 255657 325182 323742 172315 95527 151106
7752 151106 71997 5957 182124 169110 164149 225198 402569 365094 171452 136130 24989
7741 24989 124818 218762 199567 224044 219785 365790 578321 907041 1040278 1096403 916985
7730 916985 711178 618489 464926 394883 497297 463696 281118 271252 220764 114998 38290
7719 38290 156319 219030 154140 200443 177310 344390 322483 134111 258619 175364 197671
7708 197671 205468 189908 173971 199110 442956 515880 532205 604676 475667 244518 288803
7697 288803 262276 126667 65449 4325 69946 78505 143371 162836 45574 80473 89624 -140654
7685 -140654 -88691 -10724 65304 145369 90638 94638 58061 130929 61657 31004 -35293 44936
7673 44936 110131 174071 140161 18841 85682 152893 113175 105704 131226 117581 66426 -12306
7661 -12306 125649 172084 91616 58597 -57865 -43826 -78837 -138887 -77755 -111780 -81762
7650 -81762 -43832 -517 -45711 -200037 -356314 -126071 -160004 -153352 -57919 -64611 52082
7639 52082 114237 91040 101528 61908 21901 -52873 -127123 6894 75294 64938 64923 23341
7627 23341 -133961 -151156 -122099 -137129 -96709 -172360 -59111 -89536 -97019 -27484 37391 35396
7615 35396 -121416 -163127 -209396 -197507 -29836 -77657 -118431 16576 -45856 -16398 19497
7604 19497 -104150 -135466 -156422 -253829 -172471 -27985 -3365 -80464 -46048 -63677 -69307 -167333
7592 -167333 -12023 -13670 -105288 -75885 -17183 46041 106063 -36708 -17662 47638 16518
7581 16518 3955 -75268 -145112 -134783 67761 63305 4262 74664 -8622 -46284 54598 70075
7569 70075 102167 23279 -93054 -38645 -3076 -12317 -35069 -139704 -176547 -104640 -30738 2410
7557 2410 21445 -89941 -83776 -85414 64574 45104 46723 39963 -128285 -91995 -170957 -198546
7545 -198546 1893 -31298 -65989 42576 -83199 -176564 -206216 -180846 -166268 -43160 108144
7534 108144 57834 -28931 -140369 -110010 -88479 -47198 -12804 59105 30417 49068 68808
7523 68808 -73659 -28020 -32322 39468 -60332 20925 146871 55519 199720 137068 189414
7512 189414 258935 209102 126759 133825 249573 63292 -36386 -38834 59639 158536 81945 40256
7500 40256 127451 -22442 -7032 222659 292601 294333 166515 112086 175406 101640 134275
7489 134275 125663 162201 240556 64658 53747 -41322 -9457 145198 266293 248957 237500
7478 237500 118015 230898 319624 258956 159326 227228 372964 385882 498726 430343 355476
7467 355476 363710 481807 506036 388613 384669 432109 527896 486959 472949 378701 418487 446574
7455 446574 395576 520675 473618 351075 310934 429223 348020 416748 332298 270782 288700
7444 288700 353764 387784 303152 404682 462981 373317 286071 342958 392612 327570 158230
7433 158230 165033 134702 198333 352077 389038 355280 295255 265351 168552 202675 101448
7422 101448 112614 213905 138089 124614 204034 257967 215204 -20227 -96907 -57002 137494
7411 137494 144345 245603 201669 35232 148813 216786 195314 209586 266873 272916 72810
7400 72810 83960 193465 181215 161018 138032 189208 168596 37610 4701 53383 99686
7389 99686 123199 116375 164260 146756 41198 69146 -8589 131731 250880 248401 308222 193566
7377 193566 157519 65019 96410 166009 203954 182534 217846 86537 211723 190456 156515
7366 156515 85438 19539 130449 146060 53801 124675 604 -55599 111739 141825 122666
7355 122666 149736 141908 175062 135180 35369 -47326 -73349 68832 175066 101088 161043
7344 161043 226990 194106 103660 187886 188764 201069 358674 209941 104549 55798 208023
7333 208023 308026 515630 773935 725073 644495 631381 459574 323615 250917 158462 158201
7322 158201 78506 94766 94059 84507 103665 58742 -44441 49879 50016 26152 54465 74315
7310 74315 147900 59153 37181 94128 121651 14567 -16410 -36936 -79412 -73894 25214 -76608
7298 -76608 -82289 44625 186565 237078 215421 121167 38994 66538 9190 53863 155720
7287 155720 116646 182278 202072 147486 140368 12034 154275 277132 252863 329671 266312
7276 266312 140336 220743 258995 231637 134287 106785 184852 113419 147320 215894 219189 127409
7264 127409 228301 26886 53355 149691 108556 216417 195833 246881 227168 75123 3721
7253 3721 -95767 -25351 -36811 -39677 -76307 -82517 17890 117495 55963 -6758 11841 -43285
7241 -43285 51555 138782 16858 -29119 24892 164966 318968 290016 189533 96806 135370
7230 135370 54073 2135 132902 97882 -37792 160530 36246 44753 122071 267919 244864
7219 244864 154437 107142 105252 43746 130172 70779 -8708 -116141 -10244 181623 174725
7208 174725 152752 15297 159645 293564 349251 260287 45565 35404 112688 73579 184294
7197 184294 223520 207091 338475 393009 335156 340532 269151 351615 459511 396151 169024
7186 169024 175814 239984 267532 424720 413499 359212 319471 259628 335832 304220 230252 363829
7174 363829 327904 219830 340405 359543 360824 351565 393515 469271 446069 425859 443304 386904
7162 386904 348422 217372 334045 392332 364023 426906 571910 588608 481671 469452 564531
7151 564531 537028 525228 513572 591948 623490 609291 583193 535870 616663 632566 629451 743922
7139 743922 779628 650911 784192 891432 912404 795561 770402 711625 824146 851529 993857
7128 993857 910428 843058 800826 918269 1036661 1079017 1249537 1216756 1248817 1337147 1205500
7117 1205500 1320440 1388460 1281073 1313244 1364893 1489600 1546223 1565344 1477470 1398367 1451151
7106 1451151 1522090 1556856 1453245 1514957 1663363 1774640 1751191 1733017 1696313 1663948 1684554
7095 1684554 1750581 1802811 1720799 1810044 1719667 1640953 1636546 1637936 1575310 1681150 1676280 1697554
7083 1697554 1828088 1687968 1730530 1750628 1661252 1491231 1503664 1578254 1517802 1462653 1474833
7072 1474833 1582634 1516531 1597052 1478811 1421072 1492747 1413809 1422447 1395739 1435525 1510838
7061 1510838 1384759 1350291 1264449 1217610 1211693 1327876 1257673 1073849 919986 862968 1029360
7050 1029360 967774 1009948 978136 884961 835722 890855 889777 804544 835504 762577 604015
7039 604015 748707 835204 668863 705482 692405 742269 708246 743339 775807 781349 673168
7028 673168 514680 407723 531167 541590 634483 659606 556246 424357 428703 332374 316966
7017 316966 394187 377261 452809 490252 519264 528496 441352 357009 429760 340791 284343 445403
7005 445403 378908 345518 401972 252394 215613 176070 282511 267799 304942 231887 251058
6994 251058 338649 232122 266355 306603 183797 244478 179561 189054 195283 180603 219241 231848
6982 231848 372347 447549 299909 249378 252008 255924 264639 332570 318782 254406 271719 276402
6970 276402 209609 339893 446653 451492 449030 519330 475436 463590 502415 381234 402939
6959 402939 551299 621080 618970 713024 800430 778821 865457 874675 678638 706328 605376
6948 605376 487032 530132 520844 630787 638936 462265 476235 464029 481813 420389 350175
6937 350175 456670 451932 298040 228922 236003 165432 178023 275415 337367 290883 243681 254881
6925 254881 172343 153179 177402 132447 -10681 56441 199104 206028 134564 120715 65470
6914 65470 45183 135321 -11285 39680 52596 32434 146570 246562 131103 104992 -8960
6903 -8960 26147 101515 70772 132025 40403 80231 13269 -4958 76685 67914 -75084 -53175
6891 -53175 -53493 45115 53209 114929 63690 79029 118774 171756 159274 118875 149217 121089
6879 121089 25026 -93090 -957 -24199 101332 151072 90672 2766 -66082 -139459 -78286
6868 -78286 -105815 -105848 24938 70606 65469 62313 158741 83863 198085 228990 154091 67118
6856 67118 -16752 65046 36929 -19357 -3316 -35474 -118118 35706 67064 41302 56460 53304
6844 53304 46256 14342 99651 20440 22259 -4823 115314 130944 53660 -38971 -55872 -75625
6832 -75625 -187478 -126724 -48220 -27804 -60480 -73521 -24339 134405 140071 64140 20029 111052
6820 111052 115293 52420 126122 77334 35358 107199 89348 120998 42722 20015 102954 55622
6808 55622 70787 104583 42218 42206 5220 -7436 197939 168591 68313 167361 152958 42617
6796 42617 -8823 3710 7912 26826 119375 107726 104723 174810 186247 94119 -16987 -11081
6784 -11081 -41411 -23315 17025 36046 95216 184775 122411 162130 44544 142623 67737 -4293
6772 -4293 23591 -59555 -9377 -13080 79933 142285 64342 118780 12974 -935 6500 -12232
6760 -12232 5960 -4189 -118784 -29441 91058 61907 105524 80594 94026 13676 244709
6749 244709 222395 176921 187495 242112 203855 196371 163006 187945 183939 286639 308206 348367
6737 348367 338364 276275 322646 379734 338963 289479 220724 266820 269121 188052 289104 219003
6725 219003 238497 209730 144289 174842 274028 245025 201295 184212 147482 63217 122737 116678
6713 116678 164502 1595 71961 242780 155540 123425 151185 75065 -659 97161 -14413
6702 -14413 -82568 2396 28306 51861 164546 116033 -11113 20261 156060 214889 218161
6691 218161 105553 204931 180363 96031 90579 160612 222759 160001 160103 107001 248137 279680
6679 279680 172141 93272 139201 252093 207499 293644 290647 247821 300968 300755 309520 354512
6667 354512 417485 383708 329421 384145 501379 528349 498190 361810 472685 525699 455360
6656 455360 438137 477518 527034 618301 690852 779659 891036 882139 921414 881563 709364
6645 709364 556241 514023 485382 498950 493885 513937 529856 625083 526940 537761 460465 392182
6633 392182 423451 394445 552727 424961 366221 353195 171085 236963 354069 278599 126086
6622 126086 222111 235797 203466 225860 56349 34968 186485 218386 373081 366304 246933
6611 246933 150389 230135 288286 281782 334945 337220 313265 291211 292178 294807 297462 339534 463344
6598 463344 374560 573020 594587 617239 619845 621908 699304 771905 775998 691513 634371 592623
6586 592623 553126 591301 627250 661008 784622 868106 950606 950911 1018856 990750 1035247 987599
6574 987599 897503 923126 895253 838198 774888 772526 699919 824746 787327 743167 763305 795281
6562 795281 869460 664658 664663 684029 516944 429974 535004 518194 505629 491381 409132 416465
6550 416465 346554 342948 442663 454240 300352 446724 430661 406303 317467 382430 357341
6539 357341 381312 473209 430055 453608 412597 404960 328896 434792 488332 543752 515012 546275
6527 546275 539406 416147 451783 735090 700575 642492 614296 442935 502481 576512 604413
6516 604413 616708 701180 723528 692858 522844 527733 680082 687559 843922 834746 693473
6505 693473 729329 707806 723431 831744 740382 783215 766962 782885 660975 734790 696206
6494 696206 687521 777376 895609 861416 810800 835638 740066 689780 769541 800529 772064 623871
6482 623871 627979 763355 719949 806783 992924 912174 703982 845865 895390 887859 794808
6471 794808 721504 671892 851480 852863 793729 788702 947731 1038863 994331 823469 835895
6460 835895 950202 881544 914061 933940 984895 1108534 1161251 1195229 1260005 1221093 1171490
6449 1171490 1063561 977505 1122365 1158988 1113543 1151138 1172330 1149347 1208215 1291444 1313807
6438 1313807 1392839 1428448 1721181 1679526 1638072 1539072 1495003 1563450 1600702 1573696 1359771
6427 1359771 1396253 1418699 1439574 1541347 1515760 1446431 1585720 1619433 1710048 1800055 1722880
6416 1722880 1667390 1708267 1631283 1616073 1500848 1554021 1595050 1654100 1665800 1630588 1683135
6405 1683135 1633309 1781657 1787270 1829912 1815955 1780446 1692375 1818484 1999009 2007560 2208186
6394 2208186 2158920 2109884 2338838 2355018 2480808 2629958 2556777 2574758 2689126 2815610
6384 2815610 2779188 2665054 2642259 2686174 2726416 2933508 3140406 3208978 3314659 3415823
6374 3415823 3526938 3588401 3720361 3844938 3827277 3878324 3899190 4171251 4352306 4485287
6364 4485287 4692745 4851463 5034231 5429929 5535974 5739887 6113659 6551924 7113230 7618219
6354 7618219 8265769 9053894 9990336 10884848 11921556 13185546 14783322 16736266 19194960
6345 19194960 22724243 27923649 35031300 44114270 53823729 62188015 67596945 69103905
6337 69103905 66986421 62569400 57190967 51782637 47569374 45396209 45673525 48774721
6329 48774721 54684812 62244755 69096911 73214259 73489219 70104385 63784456 55903251
6321 55903251 47827641 40621570 34350149 29304456 25209201 21931227 19320816 17158251
6313 17158251 15463894 14124444 13181413 12195788 11592463 11144145 10686053 10442235 10149332
6304 10149332 9885058 9637693 9518380 9294852 9103961 8986867 9079517 9180681 9152724 9298329
6294 9298329 9343352 9497287 9784605 9944701 10176352 10520252 10880390 11370050 11965054 12679645
6284 12679645 13456010 14273218 15293962 16426722 17799166 19320386 21243747 23523799
6276 23523799 26307043 30049696 34945067 42219386 52644352 66192182 81302424 95137239
6268 95137239 104781462 108773906 107188535 101278001 93238173 84946060 78032459 73527593
6260 73527593 72428908 75438910 82561675 92434046 102417187 109274353 110907297 107094687
6252 107094687 98882186 88058941 76201998 64839721 54732582 46269846 39314309
6245 39314309 33641229 29105558 25398829 22342018 19782706 17831806 16165986 14762724
6237 14762724 13613895 12776060 12035116 11186283 10462539 9873206 9426253 8836661 8385773
6228 8385773 8195936 7982024 7558075 7309828 7114854 6964893 6704227 6421194 6126397 6048950
6218 6048950 6041196 5868883 5818774 5793044 5663250 5666774 5605819 5687398 5738681 5507908 5417895
6207 5417895 5244083 5034055 4952226 4760956 4628559 4552653 4415381 4333549 4393819 4223869
6197 4223869 4205404 4198956 4144376 4171617 4019661 3933566 3984221 3913666 3828523 3755452 3731032
6186 3731032 3727361 3630967 3593082 3549818 3611870 3641969 3487280 3452215 3453878 3487549 3407098 3267320
6174 3267320 3221810 3185765 3191686 3155360 3137879 3104220 3081047 3053667 3123076 3062719 3138413 3210580
6162 3210580 3162215 3057174 2977376 2883614 2773039 2748279 2715692 2733662 2792788 2669573 2898726
6151 2898726 2956811 2954289 2937914 2848679 2905545 2718752 2735068 2861036 2862745 2804671 2856698
6140 2856698 2964005 2953889 3163306 3280612 3284984 3234294 3321516 3378513 3436305 3414028 3290303
6129 3290303 3312120 3409964 3491566 3635376 3672905 3677976 3989936 4198345 4214341 4275863 4274222
6118 4274222 4355013 4328202 4367895 4278467 4400149 4424815 4337703 4359523 4503119 4556127 4571492
6107 4571492 4629183 4734235 4810030 4852695 4996714 4993069 5064052 5117548 5238920 5251489 5291661
6096 5291661 5210650 5223615 5263881 5444683 5554439 5676982 5854736 5877241 5775296 5899049
6086 5899049 6119662 6043528 6038612 6156749 6207123 6187143 6179654 6277583 6371330 6581727 6752383
6075 6752383 6885100 7058268 7189719 7293694 7490870 7619740 7752210 8080395 8276531 8470107
6065 8470107 8863885 9361846 9601074 9883436 10153077 10301723 10741134 11182456 11730780 12264431
6055 12264431 12686782 13156625 13879412 14611059 15611841 16679304 17908342 19310232 21127217
6046 21127217 23194993 25874024 29379114 34141268 40872119 50465128 63279265 77938015
6038 77938015 91425855 100291874 103098631 100162972 93154474 83729636 73540881 64313973
6030 64313973 56641698 50220278 45315006 41811857 39291953 37697590 36934754 36906269 37567513
6021 37567513 39162419 41665554 45814358 52421947 62260061 75672321 90901772 104027240
6013 104027240 111708959 113024929 108283741 99217374 87577917 75628580 64671222 55352270
6005 55352270 47594121 41226361 36023990 31701489 28270554 25531702 23150886 21310088
5997 21310088 19831915 18597769 17757941 16872872 16187712 15693002 15426217 15216248 15072949
5988 15072949 14989187 14772162 14723708 14893501 15051281 15357536 15746724 16272999 16686462 17110103
5978 17110103 17821511 18680031 19716419 20958337 22551669 24345111 27107310 30997551
5970 30997551 36802660 45052779 55296447 65445918 73069747 76755653 76423392 73038714
5962 73038714 67534164 61332187 55480887 50256733 46078025 42738306 40084951 37812348
5954 37812348 36073750 34954872 34259530 34068117 34385305 35257628 37258614 40673737 46218868
5945 46218868 54376355 64466954 74275094 80970446 83259690 81319203 76106635 69015195
5937 69015195 61383590 54281548 47978509 42636498 38245661 34782514 31824456 29220120
5929 29220120 27014910 25109055 23414721 22050326 20794603 19593532 18756886 17961349
5921 17961349 17203129 16575003 15771094 14907210 14275155 13607629 13189002 12751904 12418710
5912 12418710 12015662 11537081 11166669 10736430 10250090 9921662 9390600 9176358 8887728
5903 8887728 8383862 7999427 7642495 7227598 7129937 6958089 6834197 6639062 6510165 6313832
5893 6313832 6179803 5990827 5951697 5831587 5751530 5702474 5640287 5543202 5663881 5709580 5647623
5882 5647623 5578655 5517078 5676054 5592680 5494012 5546627 5500390 5235657 5082097 4856431 4683590
5871 4683590 4614540 4726262 4476287 4327356 4368775 4374079 4191683 4127474 4102279 4137428 4037216
5860 4037216 3991821 3929706 3975962 3943741 3820278 3774713 3711653 3587594 3376293 3393312 3407997
5849 3407997 3260033 3192656 3073457 2944582 2891237 2861071 2764411 2711249 2657154 2649990 2587057
5838 2587057 2575186 2541682 2522020 2547756 2447831 2506389 2427633 2325861 2294071 2388618 2386082
5827 2386082 2186699 2124880 2266258 2198692 2097292 2165429 2187769 2233902 2219732 2150104 2047493
5816 2047493 2070529 2175693 2131122 2070678 2080198 2083275 2143256 2120087 2063943 2063576 1959713 1772263
5804 1772263 1948041 2021462 1926620 1988771 2076076 2099830 2034392 2054522 2023587 2007374 1970010
5793 1970010 1945689 2026363 2011049 1936123 1983759 2012371 2001006 2146850 2240083 2218870 2419384
5782 2419384 2712630 2746758 2787602 2969776 3242171 3431007 3608107 3812700 4080316 4567536
5772 4567536 4936361 5582327 6446184 7749117 10111194 15344062 25203715 37638016 43707522
5763 43707522 43392498 41466816 36052758 29006533 22550229 17358434 13666533 11017744
5755 11017744 8922624 7159365 5921892 5300317 4713023 4188313 3757068 3467758 3305801
5746 3305801 3064253 2817888 2579637 2378090 2342813 2394248 2433215 2324445 2205861 2215786
5736 2215786 2134560 2030834 2031281 2006088 1996445 1921517 1955189 1999166 2097810 2139711 2126756 2046481
5724 2046481 2123515 2079358 2086837 2111269 2131671 2138923 2013941 2152841 1956520 1857076 1726860
5713 1726860 1780890 1804628 1799082 1673720 1798833 1794266 1700919 1788025 1804309 1801277 1808478 1860927
5701 1860927 1758747 1751183 1656495 1701155 1698113 1733175 1682628 1527543 1392414 1349536 1438906
5690 1438906 1376705 1473275 1501045 1409178 1353207 1272354 1293024 1180557 1354210 1496418 1382301
5679 1382301 1229052 1169581 1150470 1057748 1028223 1055225 1245033 1358490 1331621 1450167 1483324
5668 1483324 1298652 1076757 1049751 1226510 1087590 1118326 1157091 1162995 1275855 1241027 1214235
5657 1214235 1283660 1424638 1515617 1393790 1326215 1363539 1444889 1548659 1593600 1402181 1187586
5646 1187586 1176100 1116199 1104480 1006420 956407 1064269 1068097 1069299 1196241 1179297 1214381
5635 1214381 1196319 1066235 1227929 1235044 1109200 1183117 1178014 1256188 1336525 1277482 1344308
5624 1344308 1378145 1254903 1130637 1142458 1213427 1159079 1171968 1098241 972728 882038 1032789
5613 1032789 1142013 1122467 1020807 1013875 1047894 988000 1010946 1133037 1134377 1023828 1149008
5602 1149008 1255241 1284972 1116468 1137740 1258902 1273283 1159077 1192148 1309228 1223358
5592 1223358 1212560 1268745 1234831 1198981 1325072 1321223 1432599 1510175 1507764 1515758 1477056 1570093
5580 1570093 1605391 1626662 1497861 1488223 1691151 1623969 1674775 1631951 1535942 1484063 1349049
5569 1349049 1434348 1436338 1445798 1457401 1388674 1341050 1295119 1345052 1402222 1350943 1293468 1295581
5557 1295581 1195976 1130070 1130998 1229756 1230257 1232237 1125555 1142682 1217294 1250591 1222701 1236268
5545 1236268 1371075 1384654 1360149 1234408 1195213 1174777 1216158 1330161 1399086 1312043 1285261
5534 1285261 1314512 1263535 1186536 1158335 1191446 1235138 1255799 1365405 1406414 1363287 1348861
5523 1348861 1393050 1303230 1380498 1343402 1377930 1464523 1615407 1523978 1467692 1319565 1268766
5512 1268766 1267491 1344983 1449923 1292293 1306646 1334025 1422981 1547542 1560731 1357598 1379537
5501 1379537 1374972 1335521 1298233 1312237 1209206 1136653 1354956 1431194 1383985 1406853 1520787
5490 1520787 1540110 1413294 1491220 1498382 1432756 1459679 1485902 1465255 1467174 1559303 1494843 1314579
5478 1314579 1427067 1359514 1324852 1398785 1449084 1368428 1390595 1333095 1318333 1340290 1344339
5467 1344339 1462068 1507826 1481829 1405915 1426703 1503161 1653044 1632374 1553313 1511632 1601597
5456 1601597 1630830 1568916 1521241 1522389 1672087 1692049 1579661 1562645 1632443 1686478 1632273
5445 1632273 1552464 1738724 1866537 1858533 2007452 2028419 1879953 1717454 1824812 1918545
5435 1918545 1783901 1719073 1799471 1839350 1698381 1756325 1882444 1955726 1838477 1960814
5425 1960814 1895532 1834722 1906934 1984555 2002267 2103263 2130918 2046195 1945419 2006699 2157183
5414 2157183 2139828 2242589 2226057 2298493 2303332 2270136 2169085 2259229 2377735 2485306 2416487
5403 2416487 2402284 2259227 2315761 2457195 2518710 2566819 2659901 2520588 2533005 2586071 2546482
5392 2546482 2604529 2643649 2667761 2756179 2759068 2733625 2653366 2643891 2841745 2887859 2906882 2945666
5380 2945666 3031133 3100712 3017810 2889130 2955143 3145327 3239575 3185600 3230429 3369944 3362704
5369 3362704 3341514 3528707 3499303 3476372 3510305 3531006 3606881 3556376 3566769 3668573 3759621
5358 3759621 3655573 3924655 4055150 4030748 4164476 4220729 4263765 4266891 4420825 4424221 4453921
5347 4453921 4606388 4902369 4999016 4971543 4973257 5064208 5139013 5276040 5331254 5443415 5302374
5336 5302374 5255671 5433889 5560406 5616939 5777022 5943263 5980860 6083556 6224915 6295666
5326 6295666 6480890 6613525 6748453 6774011 6842588 6980902 7110686 7272792 7152018 7441248
5316 7441248 7726375 7756938 7858226 8068610 8359779 8544744 8664407 8896618 9076577 9138237
5306 9138237 9263092 9396288 9669611 9883359 9887355 10244555 10454636 10649179 10896396 11326962
5296 11326962 11533705 11703547 12073071 12249600 12600804 12822337 13095700 13307199 13500560
5287 13500560 13631677 13826055 14178930 14619795 14986235 15156597 15365302 15834155 16194612
5278 16194612 16619173 17115291 17492318 17972569 18536499 19004022 19514216 20102911 20691628
5269 20691628 21329818 21963902 22634688 23367294 23852240 24589823 25306180 26094851 26932103
5260 26932103 27611558 28469830 29426003 30547767 31645192 32849592 34045220 35283941 36469933
5251 36469933 38094748 39674656 41237159 42886122 44659781 46626522 48605700 50803162
5243 50803162 53104130 55427114 57984827 60655078 63412151 66318762 69168775 72390566
5235 72390566 75769662 79121835 82648936 86234469 89842368 93233931 96695599 99937854
5227 99937854 103021254 105928668 108289330 110252313 112064604 113628091 114931487 115846414
5219 115846414 116697731 117357162 118270971 119506260 120479615 120545020 119448531 117169208 113801538
5210 113801538 109958397 106242141 102916489 100550728 99615149 100383843 103010736 106826075
5202 106826075 110273041 112176377 112765660 112128272 111139663 109873096 108007038 105977567
5194 105977567 104505994 104162551 105979084 109190631 112155433 113654769 113852182 113646506
5186 113646506 113757246 114359397 115102746 115203122 114371306 113852767 113473211 112999445 111801138
5177 111801138 109684465 107480090 106058501 106078532 107093958 107209341 105192528 101791445
5169 101791445 97144987 92183977 88003739 84840988 82381934 80624809 80388496 81559854
5161 81559854 82746473 82882762 81005729 77018374 71621854 65295609 58973575 53333424
5153 53333424 48641062 45480476 43593929 42960747 43411676 43973417 43657807 42214961 39928611
5144 39928611 36860819 33623847 30508835 27660402 25174572 23129381 21500108 20206981
5136 20206981 19033298 18091232 17388731 16527276 15708342 15243418 14766028 14409428 14112421
5127 14112421 13737953 13241843 12913163 12633848 12308317 12124207 11840572 11665405 11429557
5118 11429557 11295348 11041943 10824717 10753376 10511174 10383742 10311927 10087110 9951257 9802876
5108 9802876 9642497 9408032 9260094 9182930 9092982 8906026 8792676 8579804 8592447 8478304
5098 8478304 8484875 8304876 8144848 8142837 8055148 8067559 7912340 7634972 7610095 7728997 7706980
5087 7706980 7606431 7485213 7581021 7221071 6989825 6898419 6903849 6833404 6780749 6674260 6515211
5076 6515211 6437509 6312714 6205410 6209940 6211346 6163825 5879345 5768701 5978261 5955166 5790541
5065 5790541 5759499 5721816 5629113 5534409 5507538 5461249 5450279 5406259 5261286 5111546 5076990
5054 5076990 5094496 5106470 4886498 4815672 4764880 4803737 4924158 4786623 4661904 4713306 4679795
5043 4679795 4798959 4828109 4720736 4722420 4693756 4803274 4727058 4604634 4798944 4760671 4683332
5032 4683332 4792117 4710075 4683587 4677919 4819272 4910081 4869537 4865185 4910500 4852140 4869695
5021 4869695 4916953 4858620 4941993 4792820 4729414 4882132 4807816 4916171 4957769 4870700 4912877
5010 4912877 5064248 5102338 5142481 5141071 5270356 5313831 5325822 5506740 5410290 5276631 5347828
4999 5347828 5536357 5635203 5583502 5566889 5604119 5547464 5394172 5372558 5292747 5299566 5259853
4988 5259853 5364002 5362686 5411109 5575851 5734176 5893242 6033910 6340521 6476931 6775757
4978 6775757 7071487 7104568 7132448 6923268 6906988 6737586 6537026 6479035 6247818 6202097
4968 6202097 6073099 6174258 6228570 6126015 6082575 6081047 6089782 6162947 6152851 6288698 6173898
4957 6173898 6169642 6224248 6165730 6180046 6112512 6028847 6118850 5991967 5987083 6122920 6026351
4946 6026351 6129646 6206124 6374630 6487299 6608131 6782339 6777042 6728828 6543623 6586602
4936 6586602 6626382 6673013 6690087 6728997 6796136 6841750 6836872 6834134 6942536 6986036 7245123
4925 7245123 7310253 7362824 7488923 7613694 7755282 8002519 8070184 8103485 8391336 8577033
4915 8577033 8613048 8659223 8777800 8881962 8986981 9230551 9456989 9809211 10193035 10414869
4905 10414869 10560226 10827796 11125170 11347240 11361884 11562925 11698411 11915635 12080006 12362649
4895 12362649 12642741 12645258 12781390 13021486 13279633 13556149 13736742 13876600 14240564 14599740
4885 14599740 14838259 15264441 15539101 15674764 15915846 16025021 16193479 16554728 16835592
4876 16835592 16978969 17152131 17462061 17999911 18391991 18643482 18973171 19209069 19451285
4867 19451285 19914588 20391762 20801472 21262462 21887627 22681023 23252442 23846262 24224591
4858 24224591 24674067 25489036 25981246 26587962 27343513 27998187 29008640 29955198 31027055
4849 31027055 32268215 33710675 35480608 37020842 39006299 41493456 44245011 47199962
4841 47199962 50720872 54859642 59559467 65771193 75193201 88155895 100254188 106908840
4833 106908840 111882949 115566100 117097814 118480107 120231848 122504749 124829476 126911497
4825 126911497 128800514 130135045 131291982 132523261 133376112 133908120 134383632 134766168 135264484
4816 135264484 136128003 137316229 139134598 141589288 145112397 149726077 155369666 161927563
4808 161927563 169296423 177262827 186056323 195223810 204868683 214407712 223190690 230432119
4800 230432119 235414309 238090017 238705775 237711345 236414680 236189914 239123766 246724711
4792 246724711 256232079 260662018 256539529 246353768 231661547 214632656 198110031
4785 198110031 184172205 173501727 166255663 161744182 159667097 159740028 162366964 167799360
4777 167799360 176638417 190153766 208932829 229812054 246812374 258321903 268408492
4770 268408492 278540364 285551566 284017287 273655484 257916103 237359224 214485924
4763 214485924 192352423 173209372 157764801 145883731 137289758 131524041 128480974
4756 128480974 128465435 132292762 140796463 155906166 177536412 199922343 214837670 220613904
4748 220613904 219825633 213265908 203719125 194036976 185902995 179209237 173405938 168115097
4740 168115097 163078834 158335122 154209853 150623902 147706040 145288577 143631781 142804314
4732 142804314 142911887 143793745 145631164 148615725 153096638 159285391 167188566 176314208
4724 176314208 186263477 196544531 206706448 216813248 226494191 235577918 243519942 249697322
4716 249697322 253321677 253855992 251393940 246180398 239108067 230702947 221799498 212801529
4708 212801529 203616445 194537688 186044470 178351995 171566182 165921081 161348118 158193731
4700 158193731 156068544 154855389 154286583 154301651 154564886 154648357 154840694 154808425 154390241
4691 154390241 153086210 150463391 146468087 140990701 134394102 127012661 119028504 110809356
4683 110809356 102826037 95219807 87870738 80964382 74562849 68915498 63835530 59197301
4675 59197301 54987812 51249855 47916374 44935143 42399881 40120275 38126396 36362619
4667 36362619 34837663 33520645 32309470 31190235 30256080 29384076 28679798 27901292 27256540
4658 27256540 26633467 26086270 25627125 25319204 24905795 24440707 24181392 23830699 23441152
4649 23441152 23107542 22920597 22685525 22343113 22172673 21804362 21598513 21286100 20947397
4640 20947397 20575814 20115687 19606953 19199353 19054252 18842832 18555642 18425127 18392768 18368384
4630 18368384 18622012 19748563 21764714 23853540 24590479 24458467 23735817 22328854 20831698
4621 20831698 19359312 18272094 17577702 16942256 16422885 16108271 16001537 15940226 16258559
4612 16258559 16842775 17616559 18377269 18928287 19086622 19301801 19483860 19770712 20727603
4603 20727603 22129376 23754581 24814463 25361693 25469902 25394762 25256595 25723794 26887704
4594 26887704 28605302 29971976 30499699 30262546 29368068 28053810 26859529 26095962 25991368
4585 25991368 26211490 25955471 25194655 24263278 22926461 21417193 20312691 19352375 18693590
4576 18693590 18389663 17689531 16857172 16019636 15172900 14095510 13338135 12701941 12116798
4567 12116798 11584236 11246600 11058887 10808966 10721564 10765250 10757185 10740280 10635086 10547126
4557 10547126 10614975 10656596 10582347 10671141 10862891 10950289 10946041 11080866 11228123 11296374 11587042
4546 11587042 11798020 12145961 12508055 12779449 13140428 13618486 14125575 14588205 15364986
4537 15364986 16044382 16893029 17880500 18972779 20207154 21735915 24012820 26773274 30554564
4528 30554564 35798620 43800169 56217886 73909923 93925856 109747746 117301016 117469718
4520 117469718 111787937 102472548 92496909 84384283 80210976 81333596 88767030 101954162
4512 101954162 116178572 125200605 126469830 121672574 112292074 100679918 89934781 82211312
4504 82211312 79677363 83609619 93468206 105233453 113088255 114539736 110703098 102775449
4496 102775449 92492565 82443712 74705160 70861309 71980600 78670998 89597374 99949129
4488 99949129 104422438 102478346 95487410 84744922 72584976 60656783 50492495 42512653
4480 42512653 36116687 31015767 26848891 23710231 21432984 19705261 18049414 16719286
4472 16719286 15649961 14711273 13895189 13211988 12751484 12225726 11810994 11443033 11149126
4463 11149126 10742231 10373053 10172070 9830224 9549859 9492273 9418495 9231000 8961281 8768102
4453 8768102 8487436 8356939 8268854 8040687 7862399 7826489 7780757 7690768 7562347 7466796
4443 7466796 7469605 7235107 7028271 7040658 6929033 6831432 6850200 6978288 7076593 7264406 7624062
4432 7624062 7767651 7795911 7651912 7491641 7304798 7166527 7006751 6808068 6628889 6524224
4422 6524224 6434428 6441786 6210039 6050873 5959512 5845491 6011474 6048170 6058854 6023625 6120191
4411 6120191 6151453 6175288 6330116 6346985 6138331 6085232 5885106 5732199 5440225 5322625
4401 5322625 5185548 4968759 4883482 4815504 4706532 4635243 4689741 4773453 4814704 5015618 5108497
4390 5108497 5270410 5414415 5214750 5065358 4933615 4830211 4723881 4587656 4584555 4535567
4380 4535567 4418935 4546587 4601938 4702413 4946650 5137837 5619730 6094209 6152839 6154152
4370 6154152 6085247 5867507 5513198 5289465 5109331 5011244 4913816 4743355 4472622 4326165
4360 4326165 4365812 4236826 4248834 4333810 4403682 4411443 4247334 4327249 4513387 4517859 4615478
4349 4615478 4717180 4685104 4592484 4358836 4203468 4237323 4293766 4211392 4059961 4033424 4127844
4338 4127844 4076743 4157673 4133322 4181731 4193975 4204264 4163270 4087093 3918723 3840205 3862912
4327 3862912 4028721 4152992 4123444 4058463 3982532 4001390 4045989 4140935 4239779 4286278 4343502
4316 4343502 4391478 4311226 4259696 4300507 4083808 3977089 4051247 3955924 4015620 4019617 4125418
4305 4125418 4132351 4145594 4139827 4052801 4020150 4005289 4118564 4157091 4112956 4234555 4226038 4265834
4293 4265834 4409686 4411634 4370761 4304641 4334852 4312018 4243880 4279667 4160732 4230203 4230266 4217556
4281 4217556 4300737 4233401 4157735 4112947 4184413 4303533 4360889 4214152 4203411 4258869 4176590
4270 4176590 4141702 4119694 4282191 4362688 4287587 4103387 3900357 3910717 4004745 4071152 4077254
4259 4077254 4072465 4042648 3958271 3971090 4213282 4291960 4143155 4103410 4144042 4222505 4259718
4248 4259718 4118617 4098862 4277566 4340729 4240654 4181350 4163557 4282228 4248248 4311000 4331633
4237 4331633 4320266 4502794 4586783 4704476 4659964 4556435 4545305 4396934 4442024 4631256
4227 4631256 4580913 4612005 4668402 4685642 4814910 4770242 4789442 4976121 5045964 5244035 5205065
4216 5205065 5127941 5145501 5129250 5172885 5332992 5337658 5327997 5463617 5512473 5540051 5507319
4205 5507319 5600909 5538323 5490077 5600485 5816831 5852082 5887848 6075999 6056907 6148361 6238872
4194 6238872 6342608 6385821 6639009 6782395 6821988 6748878 6784367 6830591 6933522 6982089 7234902
4183 7234902 7363391 7503535 7616949 7549987 7913393 8110587 8050993 8212497 8345533 8432296
4173 8432296 8698343 8802804 8936733 9250134 9510369 9492911 9649890 9914320 10015091 10118331
4163 10118331 10224084 10204672 10567989 10792719 11011107 11355242 11654975 11898556 12235864 12646058
4153 12646058 12955092 13269792 13858898 14596134 15130059 15895802 16587540 17312714 18195766
4144 18195766 18928823 19893600 21048526 22158847 23432810 25033366 26590728 28060257
4136 28060257 29605847 31164382 32469497 33657666 34684178 35654388 36460987 37068802 37569010
4127 37569010 38400526 39305941 40431357 41927812 43840520 46007784 48202086 50441209
4119 50441209 52286977 53891509 55512964 57036477 58567111 60197777 62013006 63899624
4111 63899624 65558931 67106688 68628505 70201331 71822929 73462393 75206860 76968373
4103 76968373 78708245 80449643 81881833 83316208 84979942 87281608 90338241 94411628
4095 94411628 99470556 104568147 109018198 112364994 114770618 116217110 117042659 118327981
4087 118327981 120284657 122265956 123561648 124500054 125173826 125476080 125586435 125673385 125966751
4078 125966751 126399309 126807354 127407740 127822559 127933668 128071450 128520256 129584740 131609841
4069 131609841 134963935 139980578 146164688 152998545 159993275 166209947 171767597 176836805
4061 176836805 181653384 186197270 190661593 195014244 198837547 202230806 205226623 207337104
4053 207337104 208332040 208365632 207626013 206538695 205710514 205060935 205457209 207314892 210188641
4044 210188641 214125484 218569628 222831753 226342116 228861290 230138328 230286817 229459573
4036 229459573 228220499 226974184 226075816 226017940 226989678 228565159 230485323 232274421 233328435
4027 233328435 233716808 233327413 232498697 231648221 230322910 228484982 226019226 223396149 220695863
4018 220695863 218279758 216129444 213470803 209765218 204530946 197962742 190398978 182531540
4010 182531540 175072932 168734638 163877472 160225571 157724929 156046900 154717069 153520044
4002 153520044 152276329 150817296 149368851 147676861 145590531 143460441 141091522 138392235
3994 138392235 135544414 133179586 131251922 129827138 129250688 129052098 128711968 127377035
3986 127377035 124856043 121100171 116567580 111773112 107137478 103093474 99683319 96946642
3978 96946642 94620232 92564414 90505779 88241043 85858383 83304881 80958655 78697490
3970 78697490 76346670 74307557 72404944 70599438 69009835 67537046 66249802 65039274
3962 65039274 64326017 64015210 63552330 61885223 59572687 57063851 54091614 51253586 48734161
3953 48734161 46716435 44821709 43163446 41723081 40329617 38916328 37566200 36223385
3945 36223385 35309805 34206794 33422315 32388838 31129478 29833318 28396247 26900999
3937 26900999 25629682 24300844 23188627 22045994 21008227 20473057 20196774 20441840 21104171
3928 21104171 21194440 20433796 19570361 18595697 17366255 16281157 15369070 14547239 14012988
3919 14012988 13406928 12817280 12344378 12019093 11688272 11411770 11150925 10984269 10728871
3910 10728871 10636786 10312326 9977348 9804837 9551362 9423298 9364596 9162546 8928713 8794345
3900 8794345 8613901 8619839 8405173 8217380 8227464 8094738 7952187 7832550 7723346 7425077
3890 7425077 7365232 7373658 7288901 7105998 6997766 6815158 6699033 6749406 6668834 6705888 6673515
3879 6673515 6615095 6511691 6299846 6214555 6194667 6159102 6023458 5931304 5935803 5855339 5623423
3868 5623423 5512404 5363451 5380852 5494891 5411204 5363660 5419930 5420427 5261016 5139832 5108344
3857 5108344 5138352 5103938 5123431 5051572 5008242 5121795 4984795 4857065 4941764 4822711 4716538
3846 4716538 4706582 4682701 4510701 4377536 4473685 4566148 4649276 4664698 4672590 4612437 4490019
3835 4490019 4393311 4547054 4558417 4493342 4511416 4493740 4535178 4403085 4232550 4238200 4170765
3824 4170765 4269495 4354260 4287010 4307665 4376543 4174711 4156709 4154884 4233930 4294254 4312259
3813 4312259 4222685 4258747 4368257 4309071 4404892 4411439 4337014 4197039 4196277 4186162 4145043 4148484
3801 4148484 4092576 4040937 4109027 4036625 4048208 3931217 3959671 4030451 3990981 3893344 3894916
3790 3894916 3943262 3921268 3859419 3743272 3788085 3885523 3880362 3836334 3884519 3957844 3810567
3779 3810567 3835349 3891259 3687891 3557161 3514203 3530090 3563180 3481931 3500160 3435627 3452384
3768 3452384 3419467 3403777 3341329 3174139 3292837 3298606 3214147 3142993 3171512 3288165 3319345
3757 3319345 3482948 3404010 3272665 3280735 3100952 3029412 2995822 3020429 3154373 3185583 3250681
3746 3250681 3213270 3144668 3060034 3098331 3273327 3175867 3153206 3120062 3254658 3231292 3104994
3735 3104994 3158058 3009492 2919447 2888936 2864309 2954820 2999122 3054900 3000056 3118782 2966499
3724 2966499 2899374 2908408 2992982 2870221 2766060 2842405 2809828 2802781 2792381 2780323 2838135
3713 2838135 2880468 2905576 2883797 2722217 2740185 2921126 2816275 2615622 2717148 2576457
3703 2576457 2465390 2380805 2420634 2425584 2417954 2306030 2196232 2071708 2194821 2298329 2157019
3692 2157019 2108167 2047076 2022194 2076002 2137105 2168067 2147830 2068685 2132937 2200226 2222070
3681 2222070 2205695 2095616 2072460 2058635 1952857 1939105 1897514 1798308 1771730 1759399 1685986
3670 1685986 1733473 1818353 1740246 1737129 1767436 1780280 1793298 1936885 1921874 2063927 2110856
3659 2110856 1886355 1820897 1918396 1873240 1900969 1818430 1771151 1860476 1914187 1884315 1961287
3648 1961287 1968200 2025297 2035267 1958892 2030755 2032513 2054657 1972208 1953515 1873108 1840582 2012297
3636 2012297 2017208 2003283 1928621 1954861 2019563 2100919 2100761 2092943 2091925 2046072 2187344 2094430
3624 2094430 1961093 1863868 1999647 2049551 1990098 2076585 2208866 2213306 2221668 2302762 2260528
3613 2260528 2127979 2031363 2122274 2237877 2213338 2212512 2232987 2365836 2391618 2276721 2293374
3602 2293374 2418015 2253721 2319515 2324026 2186439 2269629 2400505 2324680 2387280 2413423 2481404
3591 2481404 2409617 2454182 2632334 2729400 2753969 2614780 2605304 2794943 2826464 2821361 2774777
3580 2774777 2740400 2814202 2838202 2919171 2906226 3027891 3060226 3057018 3188220 3282539 3305009
3569 3305009 3191763 3127373 3126183 3204456 3313994 3360012 3300690 3286072 3274380 3357798 3406622
3558 3406622 3534133 3592561 3631738 3725084 3797156 3912600 3978185 4222681 4294630 4400577 4506516
3547 4506516 4600343 4818978 4866255 4919405 4995448 4941021 5097563 5102283 5135527 5330934 5456366
3536 5456366 5563431 5558849 5684889 5681856 5722761 5976817 6145354 6095348 6143297 6380572 6486513
3525 6486513 6661172 6975110 7257368 7476352 7536141 7648049 7961954 8000704 8210923 8562284
3515 8562284 8946798 9341518 9741207 10224510 10853952 11444282 12190052 13324006 14413934
3506 14413934 15463138 16502587 17663482 18746298 19602942 20321213 20627235 20762299 20588795
3497 20588795 20208139 19772360 19199571 18424265 17846613 17349946 16973780 16626675 16313915
3488 16313915 16083067 15852614 15537721 15434647 14935665 14322507 13712168 12966202 12190781
3479 12190781 11430126 10635131 9957637 9285551 8557420 8021377 7536881 7182898 6796312
3470 6796312 6367696 6232653 5989198 5702975 5461619 5380061 5194668 4925660 4745986 4612217
3460 4612217 4510590 4404343 4317277 4185928 4145731 4015252 3984174 3832757 3692079 3680977
3450 3680977 3633885 3464135 3387200 3292761 3218737 3045029 2996082 2951615 3012588 2940945 2909600
3439 2909600 2915273 2869973 2873045 2671801 2688840 2568110 2496240 2640417 2561967 2405273 2280752
3428 2280752 2246282 2244202 2304794 2300767 2214952 2212558 2313097 2234725 2233656 2110323 2246397 2240728
3416 2240728 2080862 2038604 1973325 1866856 2004159 1975570 1989629 1835756 1744529 1793541 1765887
3405 1765887 1790760 1933019 1958611 1897915 1840765 1832193 1830673 1800917 1803306 1733714 1668687 1581065
3393 1581065 1514086 1433415 1475081 1450347 1419831 1477914 1442568 1410533 1318999 1349049 1496729
3382 1496729 1493486 1651193 1702803 1762823 1738978 1684497 1719452 1794840 1771909 1560844 1520407
3371 1520407 1507414 1573881 1552729 1585408 1604396 1600508 1622573 1588208 1600099 1632110 1673386 1580570
3359 1580570 1555191 1587367 1697284 1481825 1504160 1548650 1566225 1473664 1488543 1601797 1715276
3348 1715276 1864090 1868831 1850911 1813394 1894892 1700036 1713295 1662096 1449931 1422180 1392202
3337 1392202 1277625 1290357 1280811 1264258 1257510 1173932 1094435 1143780 1024627 937952 1081555
3326 1081555 1047907 945712 924938 973137 928069 931353 991184 1053102 874729 1012954 1138532
3315 1138532 1269839 1210613 1349067 1301352 1294235 1184757 1285067 1394710 1472592 1509613 1406488
3304 1406488 1437496 1430416 1362740 1333330 1216069 1094672 1107378 1148079 1095030 1058673 1177638
3293 1177638 1169520 1210015 1167196 1204965 1233452 1391642 1426609 1347742 1177972 1253589 1215426
3282 1215426 1159344 1161199 945824 889905 826816 871231 839384 723485 811662 833856 797278
3271 797278 844342 815450 777912 758176 714781 763640 714312 761080 873824 830166 717595
3260 717595 795298 783191 797710 743148 738169 784881 939677 885829 1054391 1153538 1067343
3249 1067343 1196438 1088425 1170183 1132408 1152286 1125496 1180756 1459447 1334148 1248503 1204101
3238 1204101 1238368 1406582 1404484 1369357 1378831 1316368 1399781 1427779 1504800 1447980 1463270 1436149
3226 1436149 1400250 1454394 1361095 1379333 1459976 1479106 1378024 1387228 1456610 1444419 1477389
3215 1477389 1502566 1653613 1798827 1660959 1677086 1715271 1772360 1846933 1884586 1968411 1951661
3204 1951661 2076610 2268454 2391828 2469184 2610359 2909589 2850635 3010351 3381551 3714635
3194 3714635 4015800 4261382 4809978 5177950 5514687 5937826 6416644 6676462 6892997 7116065
3184 7116065 7022300 6790230 6826218 6701130 6681292 6743515 6633785 6652643 6705427 6808073 6783555
3173 6783555 6826091 6871501 6975108 7070750 7105586 7100376 7333045 7504605 7874910 8357360 9141998
3162 9141998 10369319 12231120 14412185 15789310 16463317 16480099 15603552 14202447 12759261
3153 12759261 11385446 10139584 9135675 8317313 7677057 7026428 6726577 6293456 6040513
3144 6040513 5956182 5819535 5706193 5510397 5428727 5514570 5525215 5459296 5532003 5637644 5860171
3133 5860171 6201836 6552542 6894379 7316537 7504476 7693974 7675209 7541468 7170524 6831734
3123 6831734 6398845 5892641 5364278 4912156 4553302 4234922 3897276 3753468 3528051 3279851
3113 3279851 3129446 3017659 2883267 2738914 2834028 2671816 2511718 2475032 2492900 2546061
3103 2546061 2434961 2250581 2199886 2164512 2036537 1964586 1931541 1866720 1806138 1754740 1686797
3092 1686797 1518847 1483740 1355383 1270794 1373770 1281401 1189283 1161681 1119791 1108165 1070216
3081 1070216 1114087 1182772 1158668 1062035 910691 731900 763230 846510 939119 950126 965722
3070 965722 938673 932538 888107 819979 737349 622569 714155 784817 745508 695849 693270 536757
3058 536757 563055 656142 685111 644302 470769 371477 358910 307220 348706 384558 246647
3047 246647 284078 335921 404445 510864 492986 428242 419713 408503 335890 304992 266169 303887
3035 303887 290810 311964 335913 270161 329263 315629 330301 332388 409697 235045 251986 288889
3023 288889 185575 313084 333690 226765 242995 227468 179067 84500 -31656 14186 77603
3012 77603 133045 263929 241103 56788 -48223 16740 124318 143146 284674 260450 115038
3001 115038 -78926 -106565 10535 176120 153511 131294 81381 35790 -96453 -57833 65204
2990 65204 79425 88886 83538 90205 25295 -58487 -94973 -43843 82508 79041 77713 19094 1396
2977 1396 26833 -19039 88232 -32632 -16104 -87395 -137245 -33655 -69586 -38638 -237705
2966 -237705 -204212 -89809 -162193 -180371 -108092 -189619 -154263 -190759 -195856 -98442 -92509 -213688
2954 -213688 -237029 -167105 -218709 -171436 -235881 -217066 -84199 17867 -55915 -74504 -57565
2943 -57565 -69108 -90974 -96744 -48312 18522 79794 -29785 -77736 -114390 -207311 -203820 -40874
2931 -40874 115375 -114899 -205156 -266698 -131319 -95260 -157721 -260394 -197542 -218235 -324646
2920 -324646 -320091 -269444 -140501 -139905 -108001 -33160 -62254 -112356 -243476 -191740 -200875 -152456
2908 -152456 -175850 -100981 18609 -200636 -179319 -187249 -196767 -251098 -254076 -187820 -223525 -329455
2896 -329455 -148709 -33160 -61783 -112427 -116202 -122282 -158603 -157399 -135670 -168660 -45376 -125010
2884 -125010 -110229 -74184 -143341 -104009 -108893 76319 -10235 -153448 -158366 -193849 -195460 -85923
2872 -85923 -39023 -54363 -160995 -226312 -41320 -37741 -45475 -148991 -126930 -217793 -238378 -120202
2860 -120202 -249868 -165927 -77828 -58047 -117406 -186289 -173110 -182323 -166122 -80557 -127117 -254998
2848 -254998 -225314 -211072 -193866 -248251 -284448 -301986 -197672 -240059 -274482 -239871 -206051
2837 -206051 -160146 -91131 -13722 -176683 -144137 -166402 -169904 -178200 -137619 -141514 -178007 -237230
2825 -237230 -284078 -146078 -218155 -303580 -329154 -278104 -50716 -42740 -97989 -109236 -78468
2814 -78468 -128656 -197148 -21402 -112451 -258914 -283335 -351358 -301930 -340393 -302798 -193506
2803 -193506 -221737 -254031 -225065 -191820 -140383 -176639 -381795 -458782 -403114 -387182 -304434
2792 -304434 -297635 -274435 -445847 -315986 -282406 -363075 -340819 -299457 -140864 -268618 -238851
2781 -238851 -266671 -310127 -288582 -226832 -233031 -365824 -384855 -494797 -378859 -418718 -367384
2770 -367384 -228985 -287215 -278927 -336302 -316965 -300776 -186238 -64552 -172194 -240686 -291158
2759 -291158 -285967 -357804 -294580 -219960 -252086 -353586 -201742 -174882 -322962 -314477 -223837
2748 -223837 -91451 -169587 -187970 -283961 -246281 -269046 -220725 -121276 -190887 -334219 -301005
2737 -301005 -353590 -374500 -282488 -116135 -112136 -216052 -426656 -207739 -45937 -118304 -148865
2726 -148865 -57851 -80553 -141735 -166715 -124672 -38701 -108955 -229048 -307254 -179580 -187165
2715 -187165 -279144 -69315 -15757 -135946 -197467 -132225 -152213 -349508 -351662 -259821 -246525
2704 -246525 -303289 -246555 -180858 -166031 -335625 -437966 -332898 -191861 -231499 -314798 -245600
2693 -245600 -259818 -358180 -307002 -188205 -217739 -185860 -162501 -139507 -18332 -284242 -234567
2682 -234567 -267021 -309763 -273754 -282642 -365406 -411968 -378319 -193974 -288911 -177794 -182449 -234772
2670 -234772 -154406 -229586 -201927 -248979 -396312 -369890 -233961 -228628 -315256 -361170 -193025
2659 -193025 -269718 -194864 -238524 -109189 -185311 -208215 -63598 -110943 -189230 -327470 -316981
2648 -316981 -286017 -281400 -302174 -349073 -365396 -238837 -242125 -124684 -97357 -194203 -177625 -73290
2636 -73290 -72192 -86352 -24485 -9128 47362 -103941 -80228 -29444 31148 255357 585220
2625 585220 609449 752066 774440 850823 741028 490095 264199 143070 115881 82528 105668
2614 105668 170765 42203 35323 22733 -94122 -143896 -102238 -45561 -135551 -117353 -98760
2603 -98760 22711 -47849 -180306 -183845 -123372 -196263 -175172 -120487 -114705 -178225 -176658 -298164
2591 -298164 -191135 -159969 -216945 -220536 -235992 -220706 -187699 -269617 -241769 -118213 -260757
2580 -260757 -360010 -278249 -130287 -50724 -127628 -136028 -66688 -204135 -211910 -45897 -61950
2569 -61950 -105320 -74503 -5091 -124780 -91383 -101019 -31368 -174846 -152172 -99489 -147872 -106077
2557 -106077 25695 -83404 -85851 -34766 -133676 -89171 -162268 -124984 -88618 -33136 72590
2546 72590 -22382 -59953 -75387 -103577 -115332 -84515 5207 58759 55398 -177362 -194530 -160148
2534 -160148 -185221 -123578 89121 162358 150141 76047 96798 154744 101882 53015 48532 -4614
2522 -4614 38499 -12463 -48267 76183 33684 -72483 -74286 -121935 -145503 -22446 19956 49612
2510 49612 -103750 -47204 91530 49168 -50233 79226 173049 154070 149726 -31287 3332
2499 3332 -702 18341 52845 119527 87732 67063 123546 115535 -116740 -126476 -46652 106317
2487 106317 113305 133721 97719 131219 171651 242546 213720 164248 288684 365302 252202
2476 252202 237656 374168 447391 327571 352826 263542 431516 473832 482599 465610 320379
2465 320379 473045 458335 460040 359639 173953 365121 288696 210147 260010 521527 506867
2454 506867 468991 480650 611975 744158 468658 493126 574668 539247 484393 538696 677933
2443 677933 631181 553637 608684 624368 574447 618673 758293 675074 636899 592066 736365
2432 736365 805743 898638 896160 911374 950314 1101347 1042502 1202944 1361224 1300385 1209724
2421 1209724 1331428 1489146 1480954 1386468 1318972 1333323 1344288 1263879 1380230 1274377 1369702
2410 1369702 1630437 1781418 1887321 2010892 2048812 2167691 2173236 2176469 2167338 2103160 2100980
2399 2100980 2288794 2429805 2609925 2656753 2904153 2923668 2854051 2910132 3035476 3056917
2389 3056917 3382248 3657357 3862203 4008457 4283739 4320278 4558165 4908598 5358360 5732671
2379 5732671 6086985 6605243 7264324 8328539 9945664 12070287 14061712 15025688 15789741
2370 15789741 16312644 16876846 17283166 18484824 20542264 23710864 27961199 34015796 43249297
2361 43249297 63533512 104923263 163078753 201390440 203729252 196967010 175723292
2354 175723292 142740841 110580709 84232557 65132952 51407111 40994897 32201863
2347 32201863 25797058 22291181 20132230 19125723 18160836 16525245 14923750 13415982
2339 13415982 11867605 10330235 9144344 8103631 7463277 6714656 6214066 5776177 5488831
2330 5488831 5041303 4863434 4629955 4307361 4213346 4162904 3987570 3776918 3578425 3395819
2320 3395819 3186388 3060547 3014841 3035653 2928479 2793097 2763023 2790230 2620386 2440567
2310 2440567 2378358 2310847 2197687 2141847 2137042 2200120 2181597 2255880 2227337 2073227 2047370
2299 2047370 1992144 1964106 2004654 1791247 1674359 1555417 1570905 1443690 1419404 1382689 1321915
2288 1321915 1205661 1143509 1108794 1133562 1075247 1097319 1041059 1098289 1045094 1047238 1075181
2277 1075181 1025546 960256 962479 946798 690707 760690 811628 804668 807094 812348 772874 599166
2265 599166 551816 485854 412662 410005 307299 335268 359099 262638 381930 467947 425513
2254 425513 348962 396660 230484 214694 357389 168626 74542 139080 194874 173928 110261
2243 110261 62952 19738 81863 -56659 -77081 -73267 -52346 8299 17303 -56936 3781 77064
2231 77064 35751 88723 113549 79596 99110 115166 81079 22065 63136 81326 -1511 85433
2219 85433 -42059 -40714 88191 61362 -85381 12336 152779 140653 150641 9094 -98629
2208 -98629 -113935 2034 19447 65213 126619 108627 64293 85084 -7253 -161064 -132603
2197 -132603 -167883 -20453 7413 -37243 -130811 -169409 -300695 -300532 -425499 -428758 -402862 -387599
2185 -387599 -317614 -476982 -221235 -91771 -267284 -175850 -90844 -151474 -280009 -262883 -195957
2174 -195957 -207331 -309646 -209648 -121181 -101671 -96897 5535 -132429 -144304 -190010 -300771
2163 -300771 -293431 -329476 -322206 -304920 -221941 -191565 -114110 -223771 -162360 -195747 -174857 -163939
2151 -163939 -5779 -132551 -146089 -148837 -217650 -172176 -185772 -35408 -61677 -88531 -103973
2140 -103973 -36073 -210413 -197290 -153043 -1247 -104808 -142897 -182609 -143199 -159054 -205134
2129 -205134 -335810 -325341 -255643 -337583 -352786 -303225 -207929 -268432 -346869 -345351 -305991 -322799
2117 -322799 -212171 -268423 -193112 -210404 -193630 -217519 -197044 -331989 -288605 -236471 -298462
2106 -298462 -266588 -310314 -287452 -339201 -251415 -234222 -184023 -224523 -393012 -221476 -172420
2095 -172420 -197163 -256275 -239179 -124906 54941 276657 375222 317581 387898 513844 580357
2084 580357 461565 295852 159710 -15846 -89656 -70069 -106005 -126607 -22465 -16767 -120291
2073 -120291 -38257 -49602 -128491 -167171 -306479 -378898 -404379 -350749 -399397 -309760 -272780
2062 -272780 -320972 -320805 -438786 -508279 -411846 -375279 -291648 -321890 -470228 -396855 -506519
2051 -506519 -396942 -384308 -331557 -365602 -360596 -324823 -315692 -247864 -398384 -305771 -322457 -365281
2039 -365281 -250771 -270298 -192206 -104331 -234225 -333525 -359614 -379093 -388979 -371314 -381531
2028 -381531 -298206 -404439 -506501 -441955 -387096 -285969 -347854 -356880 -382125 -322350 -318137
2017 -318137 -402771 -263581 -259006 -295761 -282737 -343651 -336380 -317752 -195634 -57141 -202791
2006 -202791 -264310 -370622 -259940 -279327 -365302 -361226 -253602 -268105 -503610 -587894 -462756
1995 -462756 -322217 -298361 -397636 -336824 -317699 -287176 -341021 -480219 -417800 -376846 -345976
1984 -345976 -324203 -425020 -429544 -241184 -318550 -265780 -251744 -351121 -210409 -249115 -254204
1973 -254204 -344947 -309675 -282415 -427314 -458503 -401821 -340030 -342456 -367389 -368920 -344799 -333487
1961 -333487 -267110 -200027 -218828 -329358 -364790 -343879 -304493 -288021 -187736 -387121 -344169
1950 -344169 -339791 -385793 -400503 -459341 -424576 -432948 -440498 -340622 -323900 -345032 -301159 -263992
1938 -263992 -338192 -290675 -216600 -236625 -180349 -208394 -257181 -131608 -253243 -203643 -322483
1927 -322483 -246832 -174246 -283846 -253466 -305910 -202352 -241225 -239018 -380289 -341373 -363567
1916 -363567 -429947 -468957 -271814 -285665 -243900 -342249 -382391 -262702 -306629 -329300 -410173
1905 -410173 -293204 -283478 -206849 -154758 -149409 -250468 -411700 -511985 -489155 -264637 -165976
1894 -165976 -99244 -126637 -171525 -259949 -210119 -299550 -429636 -388217 -393932 -364770 -361117 -520267
1882 -520267 -423111 -345406 -369580 -470501 -403341 -381199 -396714 -400686 -403032 -362108 -443609 -370566
1870 -370566 -247400 -326924 -484195 -379388 -173570 -112345 -308801 -430062 -398613 -299967
1860 -299967 -256616 -380100 -387813 -364437 -314825 -253140 -367473 -344133 -220784 -177062 -260914
1849 -260914 -159401 -204924 -270876 -365539 -371701 -309075 -391840 -440729 -286057 -325372 -425468
1838 -425468 -505703 -459893 -362976 -401812 -336443 -235828 -299866 -326088 -405855 -326258 -352875
1827 -352875 -427653 -484151 -496934 -301196 -270409 -322158 -387952 -519065 -390904 -337891 -301332
1816 -301332 -241099 -339493 -265859 -201768 -311711 -368019 -332167 -273403 -289449 -280577 -408372
1805 -408372 -387310 -270224 -195017 -199046 -242798 -350061 -431021 -352277 -429458 -405713 -360916
1794 -360916 -335641 -419272 -338709 -331196 -235674 -309852 -484003 -568861 -465290 -391923 -267593
1783 -267593 -389765 -431737 -481677 -378665 -253239 -378951 -418776 -391828 -284760 -323696 -308396
1772 -308396 -305209 -394958 -337270 -282894 -292889 -426769 -472891 -427766 -264392 -180170 -213616 -269381
1760 -269381 -307015 -199411 -188943 -179998 -164600 -356890 -310505 -410415 -319741 -185934 -118972
1749 -118972 -110213 -173561 -211507 -266614 -232769 -205829 -184753 -302836 -380139 -399008 -332369 -336114
1737 -336114 -323495 -394616 -402543 -381864 -362094 -357251 -307881 -345908 -196589 -281202 -375256 -300593
1725 -300593 -282058 -318683 -297244 -256993 -196612 -268585 -266217 -247047 -332411 -439948 -486767 -369864
1713 -369864 -227211 -282754 -326433 -346026 -314112 -285266 -266911 -278225 -258096 -275430 -224826
1702 -224826 -335101 -419131 -394130 -239603 -229163 -366702 -407529 -491916 -475131 -403043 -360637
1691 -360637 -358070 -278551 -198758 -196667 -315308 -351651 -393242 -327888 -296346 -320365 -368530 -287999
1679 -287999 -235997 -143559 -247546 -339681 -266960 -318999 -370057 -430490 -260955 -222713 -270598
1668 -270598 -404608 -463038 -357845 -247798 -250876 -300313 -324575 -434934 -440514 -425723 -323470
1657 -323470 -398193 -411512 -553772 -390654 -231282 -253616 -228353 -322437 -425942 -445275 -319751
1646 -319751 -364246 -291889 -393522 -391354 -290210 -333900 -246136 -371828 -475827 -280054 -293524
1635 -293524 -306438 -372607 -405316 -479572 -553115 -383016 -358584 -330489 -330949 -386605 -372085 -362694
1623 -362694 -460757 -398966 -319908 -275367 -381369 -314110 -291389 -225633 -217329 -324870 -353069
1612 -353069 -236989 -246637 -121352 -428511 -483223 -327016 -425783 -473641 -321925 -234151 -345282
1601 -345282 -348908 -437476 -274358 -283161 -370561 -367209 -363461 -390750 -324329 -455542 -482695 -563791
1589 -563791 -437113 -348279 -268744 -291522 -302679 -402083 -358836 -240084 -220612 -240664 -277268
1578 -277268 -360166 -420241 -384464 -361709 -331068 -383094 -421871 -354079 -342803 -394980 -354951 -387698
1566 -387698 -352987 -315422 -142083 -150955 -263697 -358770 -506298 -467161 -343688 -264100 -279275
1555 -279275 -301136 -373648 -342913 -370656 -295345 -306062 -390782 -273540 -381650 -277221 -268081
1544 -268081 -284653 -346880 -420104 -322737 -261522 -380875 -338738 -312397 -328646 -389798 -442761
1533 -442761 -394000 -352143 -404635 -425011 -560934 -578879 -442165 -509675 -496719 -473248 -386011
1522 -386011 -467459 -321498 -249259 -204719 -299592 -325106 -274646 -249196 -159594 -106014 -104420 -168092
1510 -168092 -274231 -207460 -204693 -279578 -307050 -363747 -308602 -346459 -270619 -238772 -232598 -363798
1498 -363798 -364306 -420727 -403742 -329709 -476511 -422728 -360191 -333260 -335848 -273780 -330948 -345900
1486 -345900 -289938 -191632 -270999 -259576 -264222 -275423 -246677 -263535 -234528 -303012 -226533 -268937
1474 -268937 -225179 -279399 -405433 -395992 -407401 -324276 -340776 -354923 -224972 -249603 -248178 -298988
1462 -298988 -343685 -179145 -190038 -271759 -453801 -476789 -418513 -360505 -258030 -215938 -151134
1451 -151134 -203209 -286504 -293264 -311033 -532137 -465051 -425412 -307716 -248218 -397153 -333669
1440 -333669 -351556 -193687 -243303 -395273 -355078 -378193 -317109 -254289 -360518 -452303 -374475
1429 -374475 -474185 -302909 -256965 -340978 -299615 -300680 -400058 -358916 -198484 -262114 -362294
1418 -362294 -311512 -274599 -207234 -139097 -171392 -291467 -297208 -368664 -450070 -343138 -173190
1407 -173190 -258083 -302857 -209903 -176541 -313044 -399101 -320538 -288672 -243431 -342996 -288366
1396 -288366 -313816 -349266 -267054 -280721 -326113 -231441 -140945 -212061 -264393 -228808 -237171 -291451
1384 -291451 -401863 -444799 -295312 -273546 -279760 -320238 -326292 -442755 -515458 -499799 -461727
1373 -461727 -382263 -394190 -369090 -374888 -414598 -418679 -376867 -405091 -318344 -292146 -204182 -211081
1361 -211081 -178768 -175790 -315199 -244108 -95749 -249298 -347817 -419851 -306055 -339969 -393555
1350 -393555 -305762 -300709 -221586 -238475 -197568 -368945 -407112 -317498 -366349 -218698 -279749
1339 -279749 -306300 -328922 -317446 -280419 -394888 -323665 -229909 -349782 -310514 -357579 -443718
1328 -443718 -509469 -452686 -396837 -361285 -389735 -529204 -413364 -249439 -180306 -285227 -413734
1317 -413734 -382335 -428145 -328395 -304165 -310272 -337742 -308072 -263801 -317321 -323523 -280075 -303058
1305 -303058 -435877 -388444 -325544 -387595 -434502 -400425 -336565 -294118 -409329 -253393 -300797
1294 -300797 -396274 -307496 -173354 -341610 -217685 -183115 -348967 -316093 -208852 -311402
1284 -311402 -396135 -416772 -454437 -311221 -251364 -297223 -357517 -384451 -358688 -363738 -341278 -287696
1272 -287696 -283777 -249144 -259472 -176015 -272595 -398188 -355188 -282035 -239907 -217710 -132996 -135074
1260 -135074 -136191 -163566 -200621 -198458 -315138 -297359 -351301 -346925 -326618 -364960 -372232 -300474
1248 -300474 -175526 -232595 -241905 -288308 -196280 -217496 -328050 -422857 -308129 -308135 -328329 -376073
1236 -376073 -268812 -298407 -303423 -327684 -314909 -419581 -341218 -306151 -468683 -417152 -442974
1225 -442974 -416710 -388243 -362778 -331251 -371250 -430613 -243355 -381278 -301595 -356992 -363094
1214 -363094 -291689 -306290 -392236 -388125 -242550 -230703 -323347 -411723 -351007 -209804 -332367
1203 -332367 -452664 -364768 -459287 -512171 -417934 -488474 -485096 -478796 -379021 -273453 -298954 -470543
1191 -470543 -283839 -226112 -392849 -284159 -368013 -369752 -197185 -229330 -238673 -369122 -408856
1180 -408856 -338108 -319988 -191021 -281842 -364704 -296242 -299058 -264627 -300826 -370361 -462304 -421417
1168 -421417 -260788 -349086 -449896 -426875 -432372 -471072 -480015 -327685 -329573 -400228 -384811 -372883
1156 -372883 -365709 -227125 -299584 -303664 -330267 -319146 -251625 -326698 -229432 -202054 -210742 -247278
1144 -247278 -179843 -345858 -295049 -265580 -300315 -392252 -365413 -380525 -444429 -367954 -256282
1133 -256282 -276020 -387264 -397757 -280184 -320478 -252732 -246335 -305738 -289759 -245057 -144254
1122 -144254 -239953 -311892 -207488 -119363 -116002 -157044 -182367 -195020 -260966 -197065 -275904 -309243
1110 -309243 -289390 -389070 -454963 -488871 -398518 -357616 -358494 -346469 -372935 -378389 -296663 -247707
1098 -247707 -315804 -387147 -277007 -266299 -304439 -325992 -351749 -429731 -455967 -439019 -381438
1087 -381438 -302018 -325793 -211415 -223880 -309447 -351854 -361377 -356714 -279720 -300068 -380441 -379600
1075 -379600 -360336 -380851 -311212 -288229 -202414 -212893 -230689 -251898 -226123 -237413 -411403
1064 -411403 -391385 -404266 -394743 -331286 -297514 -396344 -346565 -434918 -390975 -342912 -438167 -318237
1052 -318237 -359132 -386000 -360811 -247851 -293179 -228486 -299830 -239835 -182605 -172523 -316252
1041 -316252 -367298 -304254 -349195 -358648 -321012 -310273 -348231 -458782 -460145 -441863 -400409 -378265
1029 -378265 -535299 -471809 -349033 -383408 -388471 -329249 -327989 -344903 -376433 -350445 -411490 -415689
1017 -415689 -402357 -427379 -337316 -225467 -200426 -259238 -364589 -212585 -281061 -230071 -217171
1006 -217171 -205533 -300016 -478033 -420702 -310904 -259833 -226118 -370919 -423388 -430431 -437718
995 -437718 -448745 -511643 -362393 -317073 -281589 -316682 -398535 -401901 -385910 -296191 -253413 -292718
983 -292718 -370258 -208513 -270072 -336784 -323400 -417850 -373512 -333751 -337745 -150953 -256512
972 -256512 -331418 -259269 -444353 -502465 -461202 -413052 -387777 -524195 -609194 -550921 -498909
961 -498909 -486735 -557320 -492304 -503819 -531259 -572436 -427931 -267130 -345011 -191355 -80950
950 -80950 -163539 -184238 -198466 -77605 -145993 -241225 -373613 -380004 -378068 -313640 -339238 -389416
938 -389416 -232298 -199256 -224123 -286306 -257545 -114289 -124540 -55777 -253120 -329435 -343091
927 -343091 -453766 -483525 -419687 -340772 -234072 -173627 -279272 -408550 -427512 -452198 -436612
916 -436612 -360876 -373497 -298286 -301952 -293116 -359900 -490135 -366835 -314030 -293894 -255010 -340164
904 -340164 -383467 -298663 -351472 -322890 -208090 -213797 -220897 -276327 -297756 -334441 -250822 -295185
892 -295185 -212805 -234443 -318373 -334532 -333527 -289076 -220062 -243170 -151827 39613 -82752 -181168
880 -181168 -231208 -205892 -118185 -179708 -263135 -259121 -250953 -303015 -281525 -230008 -222965 -255181
868 -255181 -282695 -378213 -314371 -345292 -371020 -389414 -205748 -53273 -138614 -168011 -266485
857 -266485 -309667 -387656 -485796 -464511 -342436 -352156 -341435 -347180 -338513 -321225 -389084 -318857
845 -318857 -466631 -435721 -472677 -543993 -416962 -335264 -273596 -296451 -320069 -325088 -256493 -369799
833 -369799 -394075 -249268 -123413 -339771 -487236 -441053 -366652 -217568 -226080 -353386 -378906
822 -378906 -250970 -290100 -317918 -271166 -304264 -499093 -459149 -273133 -243462 -160562 -161496 -114137
810 -114137 -272510 -370183 -318995 -371911 -188015 -186172 -316559 -384413 -300765 -215983 -221959 -277136
798 -277136 -287593 -200469 -184764 -188724 -293378 -270935 -225823 -195593 -221178 -275396 -209792 -335637
786 -335637 -387384 -351188 -326018 -342716 -416920 -302806 -303366 -473036 -540519 -564152 -441969 -334414
774 -334414 -287845 -322227 -386991 -192969 -247937 -277357 -255787 -393289 -416136 -341820 -293973
763 -293973 -326083 -365979 -460651 -358631 -345961 -409104 -319453 -415671 -421518 -420918 -336815 -398376
751 -398376 -380278 -373936 -314744 -285607 -357748 -382136 -268721 -363717 -458396 -408134 -173242 -156554
739 -156554 -345058 -333311 -224809 -199431 -282346 -327401 -314438 -403296 -343201 -195908 -252653
728 -252653 -378381 -453828 -442486 -402541 -316542 -310276 -239042 -411542 -414015 -351315 -364129 -376506
716 -376506 -265615 -371257 -248665 -411322 -420273 -309974 -343321 -392739 -353241 -287077 -297382
705 -297382 -320300 -429561 -323425 -299700 -316646 -364696 -350747 -267365 -205193 -260905 -205584
694 -205584 -273961 -268192 -188531 -220781 -190101 -178900 -300807 -359506 -441453 -340032 -319824 -369217
682 -369217 -259639 -290114 -272971 -367388 -328323 -347192 -284054 -166353 -253942 -315861 -199897
671 -199897 -241450 -293852 -254210 -258050 -435028 -399354 -331611 -335397 -384970 -472127 -377581 -260842
659 -260842 -235124 -222911 -206734 -321958 -214113 -180632 -288540 -265867 -216624 -268234 -203373
648 -203373 -133510 -336663 -483843 -411425 -396493 -388296 -307295 -300524 -233294 -259748 -281111 -217065
636 -217065 -206308 -223978 -152351 -152704 -330970 -381502 -371631 -332796 -200300 -372040 -391251 -322697
624 -322697 -327576 -198305 -337592 -342352 -359193 -177287 -179276 -322525 -340770 -234047 -202166
613 -202166 -219488 -253943 -241536 -322410 -358685 -400079 -332553 -339434 -250646 -181475 -244817 -326835
601 -326835 -313158 -220511 -229445 -325974 -346584 -405876 -406719 -349284 -315949 -368109 -385439 -303884
589 -303884 -273952 -223111 -175652 -98605 -243312 -360652 -307601 -163368 -134537 -182821 -96669
578 -96669 -226287 -405310 -387626 -224259 -198157 -238235 -200644 -214064 -260664 -273809 -221522
567 -221522 -287774 -357184 -411896 -473962 -454007 -427239 -477744 -484122 -340312 -278134 -298546 -283009
555 -283009 -419045 -300943 -283756 -214877 -213261 -94674 -153937 -266850 -296847 -378098 -353187
544 -353187 -328600 -355090 -329814 -244013 -279751 -423613 -315675 -422606 -342892 -219199 -265479
533 -265479 -212991 -171631 -251132 -174043 -277194 -243956 -236927 -270437 -259792 -351148 -388061 -463693
521 -463693 -468926 -432699 -497134 -483721 -402260 -377561 -434729 -327667 -430201 -471775 -359319
510 -359319 -336625 -394487 -269401 -174337 -298540 -342946 -299033 -302247 -471404 -359438 -266700
499 -266700 -169210 -239356 -320332 -411189 -209759 -188817 -173903 -270458 -436092 -385727 -355388
488 -355388 -261204 -254711 -409085 -397462 -367732 -374854 -409212 -204719 -249739 -265889 -177151 -203154
476 -203154 -260863 -163568 -228547 -161383 -231209 -296658 -265432 -391188 -237651 -107431 -93099
465 -93099 -148952 -241471 -260608 -340554 -373527 -365300 -429814 -414958 -339538 -374015 -392995 -411006
453 -411006 -370340 -313950 -339129 -428707 -377770 -294172 -414454 -325624 -58275 -82952 -383131
442 -383131 -327388 -302890 -335348 -230669 -261532 -268145 -258485 -320667 -362182 -410770 -380445 -337485
430 -337485 -349460 -209131 -291500 -219063 -178062 -247161 -324921 -227518 -179048 -265286 -387321
419 -387321 -483663 -428632 -407782 -307602 -307455 -402913 -375117 -277543 -243855 -266741 -268137 -425600
407 -425600 -385359 -147111 -199216 -358420 -495494 -271576 -392421 -422267 -375332 -481675 -393468
396 -393468 -283886 -134542 -192813 -286648 -208522 -375570 -429829 -397516 -396623 -528077 -457859
385 -457859 -413661 -367247 -393360 -366518 -407237 -411045 -283174 -434032 -456580 -270198 -223612
374 -223612 -178865 -193563 -246260 -264012 -385245 -323354 -267238 -185874 -186492 -288628 -246040 -261972
362 -261972 -240383 -333417 -413161 -351153 -113095 -65069 -232930 -322550 -263654 -415689 -368020
351 -368020 -209509 -256356 -258119 -319924 -395562 -391768 -402871 -407253 -395037 -352753 -244291 -290698
339 -290698 -374772 -344373 -426438 -364640 -261294 -302140 -206277 -137341 -238952 -273112 -386357
328 -386357 -436468 -474051 -377684 -404515 -354305 -206092 -260121 -274980 -240837 -287299 -402395
317 -402395 -378309 -472915 -402133 -330294 -204287 -228503 -346689 -169795 -47859 -113038 -221680
306 -221680 -275930 -312227 -431038 -471535 -401952 -222873 -362651 -412001 -456009 -483647 -440236
295 -440236 -511838 -476275 -389596 -437060 -390809 -467213 -486279 -375586 -224461 -268857 -225166
284 -225166 -242815 -254938 -459337 -378428 -351346 -345736 -429308 -337009 -307609 -372291 -406102 -355710
272 -355710 -334957 -453322 -362812 -366106 -394281 -390951 -321072 -413580 -407039 -333221 -311756 -214200
260 -214200 -148339 -149524 -186908 -384295 -442899 -369060 -282131 -312405 -302674 -309823 -394774 -361071
248 -361071 -320757 -318167 -350988 -315078 -350705 -323584 -263122 -236978 -267700 -240229 -232308 -212904
236 -212904 -200170 -392276 -345277 -202829 -134046 -320158 -316054 -363224 -391919 -315156 -258788
225 -258788 -307737 -343407 -362194 -283452 -297049 -358512 -421407 -372530 -393764 -343147 -367058 -383571
213 -383571 -270317 -333175 -384577 -409461 -475560 -456035 -481895 -580321 -554447 -440514 -456393
202 -456393 -557456 -465533 -355827 -501354 -469070 -357346 -403861 -389144 -359225 -325473 -296348
191 -296348 -233678 -248605 -298441 -338838 -373201 -336230 -363465 -300845 -412894 -427276 -374092 -410942
179 -410942 -386634 -325874 -443953 -374705 -339300 -289581 -245753 -389492 -441815 -316914 -207034
168 -207034 -351448 -350212 -408580 -348637 -285550 -326531 -373911 -356658 -389374 -280305 -335059 -378654
156 -378654 -383078 -467337 -469515 -583073 -497889 -342007 -272927 -484215 -521526 -441664 -506035 -435660
144 -435660 -382933 -445455 -448407 -465102 -374961 -228136 -173281 -327584 -515302 -499686 -520666
133 -520666 -579759 -498546 -357628 -397397 -425939 -514559 -546221 -397306 -407268 -386691 -411034 -470286
121 -470286 -468855 -449781 -318264 -350831 -360162 -460913 -470535 -494698 -497200 -490099 -502141 -553232
109 -553232 -368548 -378366 -455665 -500875 -398120 -385875 -434230 -417737 -366973 -350149 -521691
98 -521691 -509387 -456745 -494780 -554909 -599295 -587508 -517215 -456988 -472813 -513366 -492442 -508438
86 -508438 -526873 -519200 -524154 -444090 -413683 -516189 -448139 -486874 -434829 -482343 -458072 -543559
74 -543559 -605679 -627738 -563579 -581982 -667510 -608989 -616511 -594186 -592513 -523060 -488387 -504244
62 -504244 -570517 -609922 -604922 -563865 -641250 -616536 -641991 -572279 -576094 -522927 -548309 -573174
50 -573174 -567832 -550839 -505885 -524397 -614295 -644945 -610462 -623017 -614074 -611330 -646154 -745999 -759901
37 -759901 -729698 -718448 -725373 -777324 -729957 -664649 -644534 -672510 -581118 -661147 -677040 -668583
25 -668583 -717439 -587724 -635759 -635521 -671053 -615817 -597857 -618306 -617598 -631337 -716803 -744499 -724754
12 -724754 -660736 -807033 -806277 -697133 -704956 -739955 -802284 -763450 -785644 -717670 -646148 -772559
0 -772559
$$ Imaginary data points
##PAGE= N=2
##DATA TABLE= (X++(I..I)), XYDATA
16383 -1881269 -1855028 -1884597 -1813433 -1784810 -1784200 -1653942 -1600514 -1608746 -1553533 -1492575 -1417192 -1404480
16371 -1404480 -1394804 -1367196 -1320107 -1281608 -1222221 -1277222 -1322320 -1261578 -1156236 -1012721 -1065625
16360 -1065625 -1027354 -1021689 -997990 -924354 -901427 -941915 -870210 -835532 -806840 -718086 -663260
16349 -663260 -645297 -554072 -488759 -507346 -550510 -519057 -486502 -542069 -507553 -415671 -377593
16338 -377593 -311393 -350787 -310013 -255911 -241819 -177279 -102641 -24088 77654 148722 86881
16327 86881 125230 227792 172604 154738 208780 269746 348842 329975 366541 357732 371298 394049
16315 394049 559284 549339 525266 548097 525564 608581 572896 587343 688135 693985 797482
16304 797482 858969 844562 913791 798528 692524 778370 967857 961411 952209 966948 1036633
16293 1036633 957736 993808 997050 1049502 1142341 1180824 1210520 1250405 1243974 1338485 1433322 1426172
16281 1426172 1432906 1527959 1463912 1391595 1480265 1545056 1528387 1533399 1581039 1600297 1582769 1592162
16269 1592162 1656566 1652278 1695944 1719066 1780133 1829124 1813598 1818082 1937789 2023430 1988135
16258 1988135 1928629 1898629 1916730 2052985 2172541 2150448 2089173 2034515 2103287 2182353 2139043
16247 2139043 2123036 2133162 2267325 2386213 2400932 2390338 2329452 2360928 2358030 2373495 2344418
16236 2344418 2430619 2404133 2389261 2491387 2463030 2538905 2511430 2484459 2534973 2508364 2569815
16225 2569815 2640341 2666522 2630522 2630344 2680077 2671084 2722041 2636871 2719603 2805645 2891940 2807105
16213 2807105 2848475 2934658 2997721 2970828 3061549 2993418 2905775 2958536 2961862 2937554 3003019
16202 3003019 2956282 2953817 2948282 3085362 3073781 2968877 2921508 3052523 2892315 2920577 3006779
16191 3006779 2952201 3018738 3063940 3172944 3094808 3129572 3086927 3042427 3062275 3071826 3003255
16180 3003255 3036078 3051743 3196256 3252752 3288405 3396192 3394491 3400262 3371781 3431139 3439067
16169 3439067 3340598 3269335 3243848 3283642 3231939 3387328 3394487 3451919 3544030 3487258 3402880
16158 3402880 3431765 3405727 3391991 3392484 3423107 3439105 3603114 3602264 3550899 3475071 3374733 3468672
16146 3468672 3581645 3459593 3432555 3595040 3637435 3725380 3699547 3577615 3468148 3491203
16136 3491203 3539372 3560492 3507152 3401264 3571360 3595067 3642766 3736913 3715169 3695937 3684713
16125 3684713 3668655 3547620 3629267 3510208 3473653 3553910 3561800 3641612 3588701 3487525 3542704
16114 3542704 3580950 3505628 3611510 3730958 3763514 3733170 3663878 3626255 3629442 3604281 3739972
16103 3739972 3875085 3789801 3730572 3719826 3745452 3780537 3669989 3754953 3757277 3814327 3809558
16092 3809558 3813017 3833571 3676878 3683435 3726033 3694978 3694794 3651706 3615790 3644519 3727062 3931410
16080 3931410 3806356 3719413 3770014 3775581 3820516 3762655 3722139 3764870 3736887 3723359 3763099
16069 3763099 3779350 3773984 3704108 3616063 3714389 3717854 3654681 3610205 3699475 3815398 3852263
16058 3852263 3755280 3821753 3858820 3835832 3810767 3892532 3632080 3809079 3828676 3767719 3873266
16047 3873266 3805442 3859494 3796470 3742155 3658300 3744734 3694599 3769778 3740400 3860761 3854402
16036 3854402 3764681 3780763 3809208 3734170 3752908 3803427 3814384 3800959 3764053 3830995 3925299
16025 3925299 3823648 3735801 3732048 3712095 3723616 3870448 3827499 3812767 3845946 3896320 3932795
16014 3932795 3918463 3945850 3922621 3868793 3839055 3784636 3831448 3858725 3841367 3922824 3977589
16003 3977589 3859283 3870029 3882721 3790895 3831236 3817715 3806950 3691770 3830829 3746230 3822741
15992 3822741 3723352 3735579 3838042 3791330 3883033 3915914 3913545 4019236 4022243 3865930 3764629
15981 3764629 3744873 3579670 3577177 3798750 3693875 3612180 3722236 3892231 3900395 3807958 3801650
15970 3801650 3945343 3980193 3828355 3720090 3765574 3686078 3700866 3863114 3821645 3812828 3801698
15959 3801698 3819280 3902801 3888992 3786160 3880667 4048831 3919327 3814595 3873130 3938412
15949 3938412 3838375 3869747 3835822 3766484 3868951 3930283 3781851 3730799 3761454 3721453 3863939
15938 3863939 3891022 3890224 3859022 3847670 3952210 3860560 3815371 3841696 3818262 3758174 3863420
$$ [...]
##END NTUPLES=NMR SPECTRUM
##END=
