##TITLE=1H_DE-80H_X3
 200.13MHz, d2o
 8 sc
 
 19ns.26.2.2025
##JCAMPDX= 6.0         $$ Bruker NMR JCAMP-DX V2.0
##DATA TYPE= NMR SPECTRUM
##DATA CLASS= NTUPLES
##ORIGIN= UXNMR, Bruker Analytische Messtechnik GmbH
##OWNER= pz
$$ XWIN-NMR		Version 3.5
$$ Mon Mar 16 09:46:45 2026 Russian Standard Time (UT+4h)  Yarkov@DPX200
##.OBSERVE FREQUENCY= 200.1313
##.OBSERVE NUCLEUS= ^1H
##.ACQUISITION MODE= SIMULTANEOUS
##.ACQUISITION SCHEME= undefined
##.AVERAGES= 8
##.DIGITISER RES= 18
##SPECTROMETER/DATA SYSTEM= spect
##.PULSE SEQUENCE= zg30
##.SOLVENT NAME= DMSO
##.SHIFT REFERENCE= (INTERNAL, DMSO, 0, 15.4119)
##AUDIT TRAIL= $$ (NUMBER, WHEN, WHO, WHERE, WHAT)
$$ ##TITLE= Audit trail, XWIN-NMR		Version 3.5
$$ ##JCAMPDX= 5.01
$$ ##ORIGIN= Bruker BioSpin GmbH
$$ ##OWNER= Yarkov
$$ C:/Bruker/XWIN-NMR/data/yarkov2/nmr/H-C/1/pdata/1/auditp.txt
$$ ##AUDIT TRAIL=  $$ (NUMBER, WHEN, WHO, WHERE, WHAT)
(   1,<2026-03-16 09:45:52.62 +0400>,<Yarkov>,<DPX200>,
      <created by zg, POWCHK disabled, PULCHK disabled
       configuration hash MD5:
       00 E9 B6 7A A2 85 ED C7 34 08 36 98 17 FE 4E 26
       data hash MD5: 16K
       05 EA 7E 3E C7 C5 4B DF BA F9 0B 44 31 F0 8D 77>)
(   2,<2026-03-16 09:45:57.79 +0400>,<Yarkov>,<DPX200>,
      <Start of raw data processing
       efp BC_mod = 2 LB = 0.25 FT_mod = 6 PKNL = 1 PHC0 = -5299.148 PHC1 = 6.821927 SI = 16K 
       data hash MD5: 16K
       02 AB AE 6F 6C 1C 53 7B 74 0B 48 A6 02 7E C3 83>)
(   3,<2026-03-16 09:46:05.43 +0400>,<Yarkov>,<DPX200>,
      <abs ABSG = 5 
       data hash MD5: 16K
       54 7D F9 41 B5 1B 4D 46 2D 52 5F E2 BB D3 1D BF>)
$$ ##END=
$$ 
$$ hash MD5
$$ AE 35 05 AC D3 0D A1 DF 0C 33 3C D9 5B 04 51 00
##$RELAX= 
##$RELAX= 
##$RELAX= 
##$RELAX= 
##$RELAX= 
##$RELAX= 
$$ Bruker specific parameters
$$ --------------------------
##$DU= <C:/Bruker/XWIN-NMR>
##$EXPNO= 1
##$NAME= <H-C>
##$PROCNO= 1
##$TYPE= <nmr>
##$USER= <yarkov2>
##$AMP= (0..31)
100 100 100 100 100 100 100 100 100 100 100 100 100 100 100 100 100 100 
100 100 100 100 100 100 100 100 100 100 100 100 100 100 
##$AQSEQ= 0
##$AQ_mod= 1
##$AUNM= <au_zg>
##$AUTOPOS= <>
##$BF1= 200.13
##$BF2= 200.13
##$BF3= 200.13
##$BF4= 200.13
##$BF5= 200.13
##$BF6= 200.13
##$BF7= 200.13
##$BF8= 200.13
##$BYTORDA= 1
##$CFDGTYP= 0
##$CFRGTYP= 5
##$CHEMSTR= <none>
##$CNST= (0..31)
1 1 145 1 1 1 1 1 1 1 1 1 1 1 1 1 1 1 1 1 1 1 1 1 1 1 1 1 1 1 1 1 
##$CPDPRG= <>
##$CPDPRG1= <>
##$CPDPRG2= <>
##$CPDPRG3= <>
##$CPDPRG4= <mlev>
##$CPDPRG5= <mlev>
##$CPDPRG6= <mlev>
##$CPDPRG7= <mlev>
##$CPDPRG8= <mlev>
##$CPDPRGB= <>
##$CPDPRGT= <>
##$D= (0..31)
0 0.7 0 0 0 0 0 0 0 0 0 0.03 0 0 0 0 0 0 0 0 0 0 0 0 0 0 0 0 0 0 0 0 
##$DATE= 1773639952
##$DBL= (0..7)
120 120 120 120 120 120 120 120 
##$DBP= (0..7)
150 150 150 150 150 150 150 150 
##$DBP07= 0
##$DBPNAM0= <>
##$DBPNAM1= <>
##$DBPNAM2= <>
##$DBPNAM3= <>
##$DBPNAM4= <>
##$DBPNAM5= <>
##$DBPNAM6= <>
##$DBPNAM7= <>
##$DBPOAL= (0..7)
0.5 0.5 0.5 0.5 0.5 0.5 0.5 0.5 
##$DBPOFFS= (0..7)
0 0 0 0 0 0 0 0 
##$DE= 6
$$ [...]
##$SUBNAM3= <"">
##$SUBNAM4= <"">
##$SUBNAM5= <"">
##$SUBNAM6= <"">
##$SUBNAM7= <"">
##$SUBNAM8= <"">
##$SUBNAM9= <"">
##$SW= 18.0517328524113
##$SWIBOX= (0..15)
0 0 2 0 0 0 0 0 0 0 0 0 0 0 0 0 
##$SW_h= 3612.71676300578
##$TD= 16384
##$TD0= 1
##$TE= 0
##$TE2= 300
##$TE3= 300
##$TEG= 300
##$TL= (0..7)
0 120 120 120 120 120 120 120 
##$TP= (0..7)
150 150 150 150 150 150 150 150 
##$TP07= 0
##$TPNAME0= <>
##$TPNAME1= <>
##$TPNAME2= <>
##$TPNAME3= <>
##$TPNAME4= <>
##$TPNAME5= <>
##$TPNAME6= <>
##$TPNAME7= <>
##$TPOAL= (0..7)
0.5 0.5 0.5 0.5 0.5 0.5 0.5 0.5 
##$TPOFFS= (0..7)
0 0 0 0 0 0 0 0 
##$TUNHIN= 0
##$TUNHOUT= 0
##$TUNXOUT= 0
##$USERA1= <user>
##$USERA2= <user>
##$USERA3= <user>
##$USERA4= <user>
##$USERA5= <user>
##$V9= 5
##$VALIST= <valist>
##$VCLIST= <CCCCCCCCCCCCCCC>
##$VD= 0
##$VDLIST= <DDDDDDDDDDDDDDD>
##$VPLIST= <PPPPPPPPPPPPPPP>
##$VTLIST= <TTTTTTTTTTTTTTT>
##$WBST= 1024
##$WBSW= 4
##$XGAIN= (0..3)
0 0 0 0 
##$XL= 0
##$YL= 0
##$YMAX_a= 553100
##$YMIN_a= -435099
##$ZGOPTNS= <>
##$ZL1= 120
##$ZL2= 120
##$ZL3= 120
##$ZL4= 120
##$ABSF1= 15.43508
##$ABSF2= -2.61677
##$ABSG= 5
##$ABSL= 3
##$ALPHA= 0
##$AQORDER= 0
##$ASSFAC= 0
##$ASSFACI= 0
##$ASSFACX= 0
##$ASSWID= 0
##$AUNMP= <proc_1d>
##$AZFE= 0.1
##$AZFW= 0.1
##$BCFW= 0
##$BC_mod= 2
##$BYTORDP= 0
##$COROFFS= 0
##$CY= -3
##$DATMOD= 1
##$DC= 0
##$DFILT= <>
##$DTYPP= 0
##$F1P= 0
##$F2P= 0
##$FCOR= 1
##$FTSIZE= 16384
##$FT_mod= 6
##$GAMMA= 0
##$GB= 0
##$INTBC= 1
##$INTSCL= 3.241238e-09
##$ISEN= 128
##$LB= 0.25
##$LEV0= 0
##$LPBIN= 0
##$MAXI= 10000
##$MC2= 0
##$MEAN= 0
##$ME_mod= 0
##$MI= 1.114404
##$NCOEF= 0
##$NC_proc= -6
##$NLEV= 6
##$NOISF1= 3.799351
##$NOISF2= 2.8
##$NSP= 0
##$NTH_PI= 0
##$NZP= 0
##$OFFSET= 15.41194
##$PC= 1
##$PHC0= -5299.148
##$PHC1= 6.821927
##$PH_mod= 1
##$PKNL= yes
##$PPARMOD= 0
##$PSCAL= 0
##$PSIGN= 0
##$REVERSE= no
##$SF= 200.130021965911
##$SI= 16384
##$SIGF1= 3
##$SIGF2= 2
##$SINO= 0.751879
##$SIOLD= 32768
##$SREGLST= <19F.Aceton>
##$SSB= 0
##$STSI= 16384
##$STSR= 0
##$SW_p= 3612.71676300578
##$SYMM= 0
##$S_DEV= 0
##$TDeff= 16384
##$TDoff= 0
##$TI= <>
##$TILT= no
##$TM1= 0
##$TM2= 0
##$TOPLEV= 0
##$USERP1= <user>
##$USERP2= <user>
##$USERP3= <user>
##$USERP4= <user>
##$USERP5= <user>
##$WDW= 1
##$XDIM= 16384
##$YMAX_p= 272306771
##$YMIN_p= -297352
$$ End of Bruker specific parameters
$$ ---------------------------------
##NTUPLES= NMR SPECTRUM
##VAR_NAME=  FREQUENCY,     SPECTRUM/REAL,   SPECTRUM/IMAG
##SYMBOL=    X,             R,               I
##VAR_TYPE=  INDEPENDENT,   DEPENDENT,       DEPENDENT
##VAR_FORM=  AFFN,          ASDF,            ASDF
##VAR_DIM=   16384,         16384,           16384
##UNITS=     HZ,            ARBITRARY UNITS, ARBITRARY UNITS
##FACTOR=    0.220516191357247, 1,           1
##FIRST=     3084.39181488236, 0,            0
##LAST=      -528.324948123424, 0,           0
##MIN=       -528.324948123424, -297352,     0
##MAX=       3084.39181488236, 272306771,    0
$$ Real data points
##PAGE= N=1
##DATA TABLE= (X++(R..R)), XYDATA
$$ [...]
$$ plain form
7861 -147270 -177140 -139638 -139414 -162114 -170090 -195823 -225596 -207950 -264956 -204161 -130335 -145179
7849 -145179 -216367 -153658 -167808 -163276 -154240 -156930 -151125 -191858 -186988 -160750 -232626 -196352 -177098
7836 -177098 -249558 -174293 -186413 -115801 -62616 -93540 -50790 -181726 -175239 -172649 -113313 -128068
7824 -128068 -165763 -160110 -110912 -155802 -104903 -115265 -172648 -188700 -137462 -147221 -129477 -150066
7812 -150066 -91816 -70790 -79669 -48579 9360 7684 -280756 -197778 -81098 28215 -41882
7801 -41882 -51097 -72469 -105074 -104199 -181113 -203552 -231143 -165512 -118236 -113695 -81798 -109362 -140353
7788 -140353 -63518 -98679 -74972 -46604 -90808 -71088 -3683 9546 40103 98001 86099 124945
7776 124945 217916 295332 319421 369144 348991 267015 233311 259504 198126 153427 74787 94307
$$ packed form
7861a47270k9870L7502K24k2700p976k5733k9773J7646n7006O0795P3826j4844
7849a45179p1188O2709j4150M532R036k690N805m0733M870K6238p1876L6274J9254
7836a77098p2460P5265j2120P0612N3185l0924M2750j30936O487K590N9336j4755
7824a28068l7695N653M9198m4890N0899j0362n7383j6052N1238r759J7744k0589
7812a50066N8250K1026q879L1090N7939j676k88440Q2978J16680J09313p0097
7801d1882r215k1372l2605Q75p6914k2439k7591O5631M7276M541L1897k7564l0991
7788a40353P6835l5161K3707K8368m4204J9720O7405J3229L0557N7898j1902L8846
7776A24945R2971P7416K4089M9723k0153q1976l3704K6193o1378m4699p8640J9520
$$ plain form
7764 94307 68767 79122 69822 12274 39057 -14402 10529 15331 -25632 39785 72069 81852
7752 81852 29290 31457 53136 87083 133402 155130 200396 224653 324981 325347 335128 349503
7740 349503 388400 405905 300487 317122 255739 160830 89743 53324 6378 51763 54238 30232
7728 30232 96703 81927 83821 75153 14602 92050 78690 79628 73056 89701 66998 119150 118264
7715 118264 140606 168262 144509 137171 175602 155177 54197 64010 69824 62403 79239 49000
7703 49000 -29515 12058 59423 8510 -58973 10159 31079 -32302 -107250 -107784 -121589 -126034
7691 -126034 -66460 -56188 -34706 -54837 -83559 -63281 -69411 -67274 -62233 -53935 -95511 -96833 -111512
7678 -111512 -81086 -52284 -40590 -109056 -56938 -60401 -118219 -119076 -101230 -63200 -97131 -18042
$$ packed form
7764I4307k5540J0355r300n7548K6783n3459K4931M802m0963O5417L2284R783
7752H1852n2562K167K1679L3947M6319K1728M5266K4257J00328L66R781J4375
7740C49503L8897J7505j05418J6635o1383r4909p1087l6419m6946M5385K475k4006
7728C0232O6471j4776J894q668o0551P7448j3360R38o572J6645k2703N2152q86
7715A18264K2342K7656k3753p338L8431k0425j00980R813N814p421J6836l0239
7703D9000p8515M1573M7365n0913o7483O9132K0920o3381p4948n34j3805m445
7691a26034N9574J0272K1482k0131k8722K0278o130K137N041Q298m1576j322j4679
7678a11512L0426K8802J1694o8466N2118l463n7818q57J7846L8030l3931P9089
$$ plain form
7666 -18042 -21952 -17134 -56824 -56689 -19508 -99031 -117474 -67490 -68777 -72989 -67745 -138783 -177994
7653 -177994 -125718 -105741 -157293 -105673 -90066 -92360 -17029 9324 -113534 -133109 -154065 -119254
7641 -119254 -144510 -139557 -79065 -50510 -96198 -134520 -175392 -167584 -161597 -114872 -93413 -20824
7629 -20824 -95787 -71079 -72964 -84885 -105377 -121931 -129699 -103063 -65083 -69743 -67346 5997 14137
7616 14137 -95475 -75297 -22342 -25896 -65326 -77212 -74398 -99274 -181866 -163449 -133832 -108032
7604 -108032 -100874 -94917 -134674 -115037 -122446 -71810 -39890 -41621 -37620 -40416 -75496 -59781 -25196
7591 -25196 -38688 -99911 -35559 -38190 -125298 -96045 -62409 -110749 -74625 -81574 -100993 -117851
7579 -117851 -97741 -94339 -56329 -82011 -104504 -165141 -141633 -93026 -23782 -36017 -29001 -30318
$$ packed form
7666a8042l910M818l9690J35L7181p9523j8443M9984j287m212N244p1038l9211
7653a77994N2276J9977n1552N1620J5607k294P5331K6353j22858j9575k0956L4811
7641a19254k5256M953O0492K8555m5688l8322m0872P808N987M6725K1459P2589
7629b0824p4963K4708j885j1921k0492j6554p768K6636L7980m660K397P3343Q140
7616A4137j09612K0178N2955l554l9430j1886K814k4876q2592J8417K9617K5800
7604a08032P158N957l9757J9637p409N0636L1920j731M001k796l5080J5715L4585
7591b5196j3492o1223O4352k631q7108K9253L3636m8340L6124o949j9419j6858
7579a17851K0110L402L8010k5682k2493o0637K3508M8607O9244j2235P016j317
$$ plain form
7567 -30318 -74563 -57908 -112227 -95805 -54058 -88766 -85248 -78622 -90211 -140774 -141393 -82297 -49391
7554 -49391 -109420 -89684 -48799 -107583 -117257 -79184 -44331 -52895 6708 -2803 -69857 -54419
7542 -54419 -13577 -105213 -78558 -78666 -123886 -68429 -64205 -27689 -29886 -50151 -64637 -65169 -80475
7529 -80475 -70864 -54821 -27440 -53032 30356 77067 18791 -9375 -33050 -40462 -2295 19361
7517 19361 -19598 -20860 -7193 31097 48661 109925 69494 105967 54203 87214 130798 165881
7505 165881 135087 101881 143558 176336 225036 217251 171665 154883 142387 182934 246164 223027
7493 223027 195658 247420 237300 194969 181403 252740 279992 287732 379318 364939 364656 326391
7481 326391 233349 229421 274824 301515 301293 263502 211713 240406 303048 263290 251015 264478
$$ packed form
7567c0318m4245J6655n4319J6422M1747l4708L518O626j1589n0563o19N9096L2906
7554d9391o0029J9736M0885n8784r674L8073L4853q564N9603r511o7054J5438
7542e4419M0842r1636K6655j08m5220N5457M224L6516k197k0265j4486n32j5306
7529h0475R611J6043K7381k5592Q3388M6711n8276k8166k3675p412L8167K1656
7517A9361l8959j262J3667L8290J7564O1264m0431L6473n1764L3011M3584L5083
7505A65881l0794l3206M1677L2778M8700p785m5586j6782j2496M0547O3230k3137
7493B23027k7369N1762j0120m2331j3566P1337K7252P740R1586j4379k83l8265
7481C26391r3042l928M5403K6691k22l7791n1789K8693O2642l9758j2275J3463
$$ plain form
7469 264478 221877 230993 232441 219766 159138 157379 210301 206676 162189 69472 86509 62060
7457 62060 67856 87008 117585 105369 101592 152302 165634 82524 56533 94097 162048 159356
7445 159356 71971 49317 31844 40122 11609 70211 58142 38540 94936 81743 90014 116256
7433 116256 69180 30361 -26651 -18625 31938 45208 31795 52455 23696 18296 25169 22254
7421 22254 18944 50691 64565 -22920 9063 16770 -25493 -48585 -15355 -1872 -15385 -61914
7409 -61914 -68383 -114371 -81326 -11782 32453 14886 32282 5855 -73933 -42514 -19242 -25382
7397 -25382 -81885 -86588 -62806 -71175 -26306 -1751 16240 62695 23568 1049 30245 25338
7385 25338 3376 -32576 -25852 -35306 13787 -3306 -54881 13671 13455 59806 20616 429 20356
$$ packed form
7469B64478m2601R116J448j2675o0628j759N2922l625m4487r2717J7037k4449
7457F2060N796J9152L0577j2216l777N0710J3332q3110k5991L7564O7951k692
7445A59356q7385k2654j7473Q278k8513N8602j2069j9602N6396j3193Q271K6242
7433A16256m7076l8819n7012Q026N0563J3270j3413K0660k8759n400O873k915
7421B2254l310L1747J3874q7485L1983P707m2263k3092L3230J3483j3513m6529
7409f1914o469m5988L3045O9544M4235j7567J7396k6427p9788L1419K3272o140
7397b5382n6503m703K3782q369M4869K4555J7991M6455l9127k2519K9196m907
7385B5338k1962l5952O724r454M9093j7093n1575O8552k16M6351l9190k0187J9927
$$ plain form
7372 20356 102007 100156 53039 46209 35833 -20529 -17359 -16432 17490 -31212 -84263 -49932 -32995
7359 -32995 -35243 -38741 7350 -6602 -3372 -60024 -28220 15504 -22410 18086 -8356 -21643
7347 -21643 -60012 50387 35687 21448 39528 46277 96421 77522 140228 184326 234123 224910
7335 224910 185874 200050 233077 166942 173199 134522 98656 67540 79274 96737 95108 89331
7323 89331 115255 130422 96166 101681 74612 62520 40080 -4750 -7092 38368 77108 27291
7311 27291 -4766 19365 33346 -14446 37915 58526 42307 29733 127021 45516 33493 8452
7299 8452 35487 65743 36702 10618 -26198 -18264 -10316 -22687 -6711 80960 50543 39305
7287 39305 46321 -12528 6881 25936 109839 100402 21546 62832 57785 94675 71012 51549
$$ packed form
7372B0356Q1651j851m7117o830j0376n6362L170R27L3922m8702n3051L4331J6937
7359c2995k248l498M6091j3952L230n6652L1804M3724l7914M0496k6442j3287
7347b1643l8369J10399j4700j4239J8080O749N0144j8899O2706M4098M9797r213
7335B24910l9036J4176L3027o6135O257l8677l5866l1116J1734J7463j629n777
7323H9331K5924J5167l4256N515k7069j2092k2440m4830k342M5460L8740m9817
7311B7291l2057K4131J3981m7792N2361K0611j6219j2574R7288q1505j2023k5041
7299H452K7035L0256k9041k6084l6816P934P948j2371J5976Q7671l0417j1238
7287C9305P016n8849J9409J9055Q3903r437p8856M1286n047L6890k3663j9463
$$ plain form
7275 51549 81738 111396 68434 96659 150706 131933 72077 86913 158689 172019 136631 145345
7263 145345 128749 120538 123486 105983 139896 187556 209926 120251 108404 136202 72903 83389
7251 83389 56206 115232 118469 115962 98003 130304 165708 200084 225808 179316 159822 173822
7239 173822 162074 114492 136153 101074 154779 201225 109576 128258 124570 141406 147463 146564
7227 146564 205674 233060 209413 221811 261264 245228 230383 256394 233712 233250 309706 330922
7215 330922 304008 334048 285675 266540 291556 292681 271646 265436 293004 318773 320266 246020
7203 246020 260565 315799 336178 405561 318454 266159 309227 368201 406028 426118 426224 421992
7191 421992 419384 430072 425069 465445 521600 486528 494077 516799 505329 587801 613956 535407
$$ packed form
7275E1549L0189K9658m2962K8225N4047j8773n9856J4836P1776J3330l5388Q714
7263A45345j6596q211K948j7503L3913M7660K2370q9675j1847K7798o3299J0486
7251H3389k7183N9026L237k507j7959L2301L5404L4376K5724m6492j9494J4000
7239A73822j1748m7582K1661l5079N3705M6446r1649J8682l688J6836O057q99
7227A46564N9110K7386k3647J2398L9453j6036j4845K6011k2682m62P6456K1216
7215C30922k6914L0040m8373j9135K5016J125k1035o210K7568K5769J493p4246
7203B46020J4545N5234K0379O9383q7107n2295M3068N8974L7827K0090J06m232
7191D21992k608J0688n003M0376N6155l5072P549K2722j1470Q2472K6155p8549
$$ plain form
7179 535407 613022 604140 658551 702195 679141 696843 745971 746277 770932 756609 850511 882192
7167 882192 873944 922977 921651 959743 976875 1036829 1050074 1031046 1152033 1218184 1249994 1293615
7155 1293615 1346198 1364478 1355865 1419327 1441382 1482910 1542038 1601980 1634992 1681222 1753375 1823159
7143 1823159 1841958 1932642 2031705 2047065 2088146 2142921 2241909 2324375 2362105 2333291 2324065 2331168
7131 2331168 2406635 2489412 2492084 2483756 2461258 2523842 2591957 2563444 2601862 2522309 2582749 2581961
7119 2581961 2595701 2679675 2574994 2539885 2490955 2417119 2408905 2375825 2346458 2312594 2253843
7108 2253843 2225183 2173050 2118760 2107135 2082353 1978793 1943901 1928189 1898219 1848921 1723951
7097 1723951 1668959 1665800 1617920 1600981 1551766 1520804 1414738 1306229 1282011 1161770 1105671
$$ packed form
7179E35407P7615q882N4411M3644k3054J7702M9128L06K4655j4323R3902L1681
7167H82192q248M9033j326L8092J7132N9954J3245j9028J20987O6151L1810M3621
7155A293615N2583J8280q613O3462K2055M1528N9128N9942L3012M6230P2153O9784
7143A823159J8799R0684R9063J5360M1081N4775R8988Q2466L7730k8814r226P103
7131B331168P5467Q2777K672q328k2498O2584O8115k8513L8418p9553O0440p88
7119B581961J3740Q3974j04681l5109m8930p3836q214l3080k9367l3864n8751
7108B253843k8660n2133n4290j1625k4782j03560l4892j5712k9970m9298j24970
7097A723951n4992l159m7880j6939m9215l0962j06066j08509k4218j20241n6099
$$ plain form
7086 1105671 1162900 1115758 1113009 1086473 1108847 1028390 1020349 1075498 1003757 925449 908123 917269
7074 917269 820560 757940 706762 735252 677448 589853 545052 519827 567696 543853 540005 585501
7062 585501 582707 583743 568840 507899 413138 433986 473193 469900 462888 397385 414576 443900
7050 443900 451096 426455 375433 361332 315402 294288 248584 274237 380116 345059 347041 280930
7038 280930 211869 217796 251680 297624 261625 235387 259497 256040 237322 235527 205060 194000
7026 194000 226342 287949 301621 226294 223694 279738 253279 173256 194072 204010 178703 192400
7014 192400 237957 310608 332223 290524 321814 295322 264197 339241 364863 328090 340292 358257
7002 358257 290955 334262 358285 336111 362142 315283 310192 380335 417425 391445 348735 321979
$$ packed form
7086A105671N7229m7142k749k6536K2374q0457q041N5149p1741p8308j7326R146
7074I17269r6709o2620n1178K8490n7804q7595m4801k5225M7869k3843l848M5496
7062E85501k794J036j4903o0941r4761K0848L9207l293p012o5503J7191K9324
7050D43900P196k4641n1022j4101m5930k1114m5704K5653J05879l5057J982o6111
7038B80930o9061N927L3884M5944l5999k6238K4110l457j8718j795l0467j1060
7026A94000L2342O1607J3672p5327k600N6044k6459q0023K0816R938k5307J3697
7014A92400M5557P2651K1615m1699L1290k6492l1125P5044K5622l6773J2202J7965
7002C58257o7302M3307K4023k2174K6031m6859n091P0143L7090k5980m2710k6756
$$ plain form
6990 321979 286904 321287 317521 308629 289856 275840 279481 227853 202915 243600 225027 255608
6978 255608 345631 402670 298881 192813 252890 237035 222157 203234 173266 120298 90047
6967 90047 110234 54118 47317 97039 123252 107466 68203 75075 64202 53067 50242 93213
6955 93213 116364 69175 79084 32692 20098 54723 91702 34046 -32353 -18458 30846 -1129
6943 -1129 16296 66872 158035 151820 74506 91794 95149 108556 35518 -27889 -1207 4151 36811
6930 36811 55776 40531 71700 33845 37098 -2299 12786 -41324 -52903 -8607 21156 6815
6918 6815 66229 31704 -11243 15324 -15086 -3621 72958 89437 76710 68882 94802 78595
6906 78595 -35148 -26393 8603 31160 41275 134877 139778 51965 17710 29732 28237 27591 -33386
$$ packed form
6990C21979l5075L4383l766q892j8773j4016L641n1628k4938M0685j8573L0581
6978B55608R0023N7039j03789j06068O0077j5855j4878j8923k9968n2968l0251
6967I0047K0187n6116o801M9722K6213j5786l9263O872j0873j1135k825M2971
6955I3213K3151m7189R909m6392j2594L4625L6979n7656o6399J3895M9304l1975
6943a129J7425N0576R1163o215p7314J7288L355J3407p3038o3407K6682N358L2660
6930C6811J8965j5245L1169l7855L253l9397J5085n4110j1579M4296K9763j4341
6918F815N9414l4525m2947K6567l0410J1465P6579J6479j2727p828K5920j6207
6906G8595j13743Q755L4996K2557J0115R3602M901q7813l4255J2022j495o46o0977
$$ plain form
6893 -33386 9968 65182 25178 -33636 -15880 12716 -35713 -18472 41593 58895 23030 -23621
6881 -23621 -15276 -34764 -38240 -8194 55058 66491 27371 47803 25627 5609 -24766 -34056
6869 -34056 13309 -9401 16781 22914 109301 58980 16283 7008 46221 98139 69030 13534
6857 13534 -31428 708 50347 47908 -1223 28976 89165 92543 66221 65967 51711 39949 28666
6844 28666 47543 68938 88572 45326 40031 9267 61117 47976 51198 59262 53380 17740 1645
6831 1645 -18369 -50667 7973 71635 39398 39612 -22826 -2652 -4151 26796 25514 57189 65282
6818 65282 70151 43015 16816 86492 73923 -1876 5793 66894 33223 35538 2959 47002
6806 47002 60186 88940 48027 17258 46995 100101 165713 128422 84432 94633 81681 52395
$$ packed form
6893c3386M3354N5214m0004n8814J7756K8596m8429J7241O0065J7302l5865m6651
6881b3621Q345j9488l476L0046O3252J1433l9120K0432k2176k0018l0375r290
6869c4056M7365k2710K6182O133Q6387n0321m2697r275L9213N1918k9109n5496
6857A3534m4962L2136M9639k439m9131L0199O0189L378k6322k54j4256j1762j1283
6844B8666J8877K1395J9634m3246n295l0764N1850j3141L222Q064n882l5640j6095
6831A645k0014l2298N8640O3662l2237K14o2438K0174j499L0947j282L1675Q093
6818F5282M869k7136k6199O9676j2569p5799P669O1101l3671K315l2579M4043
6806D7002J3184K8754m0913l0769K9737N3106O5612l7291m3990J0201j2952k9286
$$ plain form
6794 52395 93724 119267 77911 120364 110364 88627 89804 76902 15969 77713 164030 141466
6782 141466 38476 2254 20058 12949 29634 69854 71889 90841 92608 63392 48529 46202
6770 46202 112837 114496 129582 102203 93260 38695 59119 167337 92163 137709 119531 89427
6758 89427 131262 59061 41426 46856 66111 78670 111846 140980 96655 115491 159976 133949
6746 133949 144470 153582 113104 130847 137192 142844 112511 50366 77826 137269 143053 118078
6734 118078 82021 137721 99567 89979 116858 159696 153581 149462 75826 62116 121817 102526
6722 102526 143877 105532 72087 86525 12936 78760 161443 102369 54990 52605 97430 62572
6710 62572 47560 47240 128163 133554 148752 149438 130926 120958 147753 114360 114503 143856 188874
$$ packed form
6794E2395M1329K5543m1356M2453j0000k1737J177j2902o0933O1744Q6317k2564
6782A41466j02990l6222J7804p109J6685M0220K035J8952J767k9216j4863k327
6770D6202O6635J659J5086k7379q943n4565K0424J08218p5174M5546j8178l0104
6758H9427M1835p2201j7635N430J9255J2559L3176K9134m4325J8836M4485k6027
6746A33949J0521R112m0478J7743O345N652l0333o2145K7460N9443N784k4975
6734A18078l6057N5700l8154r588K6879M2838o115m119p3636j3710N9701j9291
6722A02526M1351l8345l3445J4438p3589O5824Q2683n9074m7379k385M4825l4858
6710F2572j5012l20Q0923N391J5198O86j8512r968K6795l3393J43K9353M5018
$$ plain form
6697 188874 154747 186708 200694 185345 172981 148242 190397 188575 211723 136676 134626 174365
6685 174365 134237 225061 143027 134924 193263 186527 204936 231108 228328 222993 243329 171270
6673 171270 188785 203163 198730 152863 152935 161078 133780 143510 216669 242555 192365 218475 256388
6660 256388 302507 334871 324280 321724 290033 375266 396773 427104 428920 431237 384478 324815
6648 324815 414520 468713 498850 501879 543549 587890 617364 600321 557422 594696 600996 624358
6636 624358 610482 596314 582398 530461 560095 611608 631793 609145 511568 552587 588370 543058
6624 543058 559432 523257 460877 445736 429642 407487 410699 407878 412949 385337 361149 360079
6612 360079 395328 395659 363267 314727 355202 401766 389579 332197 287878 271305 339296 369475
$$ packed form
6697A88874l4127L1961J3986j5349j2364k4739M2155j822K3148p5047k050L9739
6685A74365m0128R0824q2034q103N8339o736J8409K6172k780n335K0336p2059
6673A71270J7515J4378m433m5867P2Q143k7298R730P3159K5886n0190K6110L7913
6660B56388M6119L2364j0591k556l1691Q5233K1507L0331J816K317m6759n9663
6648C24815Q9705N4193L0137L029M1670M4341K9474j7043m2899L7274O300K3362
6636F24358j3876j4168j3916n1937K9634N1513K0185k2648r7577M1019L5783m5312
6624E43058J6374l6175o2380j5141j6094k2155L212k821N071k7612k4188j070
6612C60079L5249L31l2392m8540M0475M6564j2187n7382m4319j6573O7991L0179
$$ plain form
6600 369475 354891 341717 321609 331690 398147 412213 370426 368568 363412 400778 450350 462602
6588 462602 431320 471523 506980 521098 565041 520405 545198 570454 588057 642294 708164 775366
6576 775366 724408 757146 808507 822635 863464 935673 942094 928212 906702 950853 947692 969100
6564 969100 970460 976209 946973 936581 941166 874017 834071 822159 881349 917379 839787 845125
6552 845125 854364 801400 766284 751863 701291 684394 671574 686885 692902 673462 577138 630365
6540 630365 757639 668369 592552 539104 580321 664397 666227 599321 668409 710364 661043 641301
6528 641301 608254 645585 655006 619651 688190 632222 641111 607753 629228 613980 628818 634609
6516 634609 660110 645956 664093 686126 695564 733627 714470 736880 712733 754996 727779 723459
$$ packed form
6600C69475j4584j3174k0108J0081O6457J4066m1787j858n156L7366M9572J2252
6588D62602l1282M0203L5457J4118M3943m4636K4793K5256J7603N4237O5870O7202
6576G75366n0958L2738N1361J4128M0829P2209O421j3882k1510M4151l161K1408
6564I69100J360N749k9236j0392M585o7149l9946j1912N9190L6030p7592N338
6552H45125R239n2964l5116j4421n0572j6897j2820J5311O017j9440r6324N3227
6540F30365J27274q9270p5817n3448M1217Q4076J830o6906O9088M1955m9321j9742
6528F41301l3047L7331R421l5355O8539n5968Q889l3358K1475j5248J4838N791
6516F34609K5501j4154J8137K2033R438L8063j9157K2410k4147M2263k7217m320
$$ plain form
6504 723459 768149 767881 763709 804970 798363 758819 788255 823974 839794 850271 879357 943570
6492 943570 958780 932728 974206 1090881 1103094 1064078 1084315 1033519 1000059 1006805 1075160 1092486
6480 1092486 1081392 1074094 1082726 1107068 1120231 1106894 1104737 1142929 1093680 1115164 1113503 1003012
6468 1003012 1033469 1099287 1105045 1104987 1071940 1067314 1077097 1101228 1148992 1198470 1176080 1220679 1240037
6455 1240037 1275310 1267438 1197642 1201130 1241346 1215097 1127188 1116614 1187488 1246018 1271790 1289563
6443 1289563 1278206 1238664 1290733 1276313 1243820 1199608 1283832 1298540 1313836 1387673 1381623 1331457
6431 1331457 1363768 1450364 1430456 1415676 1462777 1463601 1505944 1534960 1513616 1546943 1569083 1576407
6419 1576407 1626880 1713444 1686343 1666287 1683914 1788830 1747808 1767242 1784548 1828839 1820169
$$ packed form
6504G23459M4690k68m172M1261o607l9544K9436L5719J5820J0477K9086O4213
6492I43570J5210k6052M1478J16675J2213l9016K0237n0796l3460O746O8355J7326
6480A092486j1094p298Q632K4342J3163j3337k157L8192m9249K1484j661j10491
6468A003012L0457O5818N758n8l3047m626R783K4131M7764M9478k2390M4599J9358
6455A240037L5273p872o9796L488M0216k6249q7909j0574P0874N8530K5772J7773
6443A289563j1357l9542N2069j4420l2493m4212Q4224J4708J5296P3837o050n0166
6431A331457L2311Q6596j9908j4780M7101Q24M2343K9016k1344L3327K2140P324
6419A576407N0473Q6564k7101k0056J7627J04916m1022J9434J7306M4291q670
$$ plain form
6408 1820169 1854301 1868887 1852183 1895669 1957882 1937559 1948784 1984375 1937400 1941411 2031248 2062028
6396 2062028 2139316 2174341 2143888 2147793 2165465 2292017 2366158 2391475 2367640 2410183 2487080
6385 2487080 2610502 2693545 2727707 2835468 2915402 2929467 3070657 3155475 3242790 3246292 3350068
6374 3350068 3448154 3491028 3629431 3787699 3848927 3957040 4107073 4183636 4363805 4478028
6364 4478028 4618999 4763503 4921812 5119216 5282492 5506288 5702976 5953640 6240578 6572337
6354 6572337 6979275 7203662 7579063 8130458 8625904 9187304 9907255 10691325 11527198 12573146
6344 12573146 13668769 15005884 16605986 18583003 21045112 24104521 27744746 31863357
6336 31863357 36147847 40174125 43726383 46595748 48783599 50206432 50860779 50785001 50142088
$$ packed form
6408A820169L4132J4586j6704M3486O2213k0323J1225L5591m6975M011Q9837L0780
6396B062028P7288L5025l0453L905J7672J26552P4141K5317k3835M2543P6897
6385B487080J23422Q3043L4162J07761P9934J4065J41190Q4818Q7315L502J03776
6374C350068R8086M2874J38403J58268O1228J08113J50033P6563J80169J14223
6364D478028J40971J44504J58309J97404J63276K23796J96688K50664K86938L31759
6354F572337M06938K24387L75401N51395M95446N61400P19951P84070Q35873J045948
6344A2573146J095623J337115J600102J977017K462109L059409L640225M118611
6336C1863357M284490M026278L552258K869365K187851J422833O54347p5778o42913
$$ plain form
6327 50142088 49322049 48682492 48674303 49305230 50319959 51553570 52521068 53103984 53124375 52448726
6317 52448726 50894090 48460162 45200717 41312191 37212729 33143196 29252643 25805000
6309 25805000 22820825 20463131 18461254 16676930 15076702 13763666 12676980 11716478
6301 11716478 10985432 10396644 10019972 9758891 9537941 9435979 9351665 9308579 9308511 9354893 9441074
6290 9441074 9573622 9720403 9883939 10126748 10409988 10656612 10965874 11389502 11833304 12340101
6280 12340101 12946789 13686535 14500256 15398808 16423087 17736280 19164547 20758442 22677635
6271 22677635 25024204 27946987 31623959 36083866 41563282 47888920 54654136 61186570
6263 61186570 66930743 71756493 75504837 78134447 79481873 79643324 78813638 77433990
$$ packed form
6327E0142088q20039o39557q189O30927J014729J233611R67498N82916K0391o75649
6317E2448726j554636k433928l259445l888526m099462m069533l890553l447643
6309B5805000k984175k357694k001877j784324j600228j313036j086686r60502
6301A1716478p31046n88788l76672k61081k20950j01962q4314m3086o8M6382Q6181
6290I441074J32548J46781J63536K42809K83240K46624L09262M23628M43802N06797
6280A2340101O06688P39746Q13721Q98552J024279J313193J428267J593895J919193
6271B2677635K346569K922783L676972M459907N479416O325638O765216O532434
6263F1186570N744173M825750L748344K629610J347426J61451q29686j379648
$$ plain form
6255 77433990 76252807 75684667 75864098 76814972 78210877 79354225 80001308 79845768 78753702
6246 78753702 76463842 72866741 68151005 62471745 56372168 50091534 44007535 38445241
6238 38445241 33609907 29512218 26021293 22984442 20289246 17853645 15796755 14020294
6230 14020294 12524865 11306177 10243555 9392990 8658311 8066377 7547888 7160680 6802264
6221 6802264 6499031 6201402 5906464 5729885 5485122 5227750 5070983 4919325 4770183 4585409
6211 4585409 4431203 4205675 4077314 4075849 3988837 3929832 3830681 3759886 3728435 3660800 3634870
6200 3634870 3596215 3565390 3582175 3580668 3537475 3613485 3593459 3485181 3470003 3458526 3367693
6189 3367693 3341498 3322281 3292298 3294290 3264835 3210992 3225131 3160146 3126709 3153244 3027759
$$ packed form
6255G7433990j181183n68140J79431R50874J395905J143348O47083j55540j092066
6246G8753702k289860l597101m715736n679260o099577o280634o083999n562294
6238C8445241m835334m097689l490925l036851k695196k435601k056890j776461
6230A4020294j495429j218688j062622q50565p34679n91934n18489l87208l58416
6221F802264l03233k97629k94938j76579k44763k57372j56767j51658j49142j84774
6211D585409j54206k25528j28361j465q7012n9005r9151p0795l1451o7635k5930
6200C634870l8655l0825J6785j507m3193P6010k0026j08278j5178j1477r0833
6189C367693k6195j9217k9983J992k9455n3843J4139o4985l3437K6535j25485
$$ plain form
6178 3027759 3038457 3022522 3049217 2983518 2946754 3012176 3040309 3041972 2969470 2917319 2894491 2836308
6166 2836308 2833036 2853205 2848338 2760288 2811307 2791072 2798764 2772381 2754917 2831592 2893322 2942490
6154 2942490 2962424 2985638 2982014 3009078 3016474 3071523 3138848 3138546 3149540 3184951 3162530 3208280
6142 3208280 3228546 3308465 3306679 3363782 3472701 3553772 3628495 3695505 3777619 3862863 3900197
6131 3900197 3941334 4037687 4111417 4222616 4260583 4402899 4519552 4577001 4609460 4692476 4765494
6120 4765494 4817910 4904779 5005331 5062098 5150071 5256441 5322536 5474425 5550538 5621685 5776680
6109 5776680 5864867 5974417 6137200 6204895 6257548 6363555 6470728 6473479 6497623 6565017 6628975
6098 6628975 6685676 6689935 6645095 6716578 6830704 6886132 6924828 7084709 7131946 7195636 7271264
$$ packed form
6178C027759J0698j5935K6695o5699l6764O5422K8133J663p2502n2151k2828n8183
6166B836308l272K0169m867q8050N1019k0235P692k6383j7464P6675O1730M9168
6154B942490J9934K3214l624K7064P396N5049O7325l02J0994L5411k2421M5750
6142C208280K0266P9919j786N7103J08919Q1071P4723O7010Q2114Q5244L7334
6131C900197M1137R6353P3730J11199L7967J42316J16653N7449L2459Q3016P3018
6120D765494N2416Q6869J00552N6767Q7973J06370O6095J51889P6113P1147J54995
6109E776680Q8187J09550J62783O7695N2653J06007J07173K751K4144O7394O3958
6098F628975N6701M259m4840P1483J14126N5428L8696J59881M7237O3690P5628
$$ plain form
6087 7271264 7367005 7566419 7689850 7812136 7924992 8031015 8159936 8351702 8533321 8734919
6077 8734919 8874040 9101521 9272380 9350955 9439697 9566356 9645359 9750931 9887919 9972040
6067 9972040 10130639 10226063 10409296 10543418 10644629 10870380 11082346 11282469 11577818 11933606
6057 11933606 12372568 12788946 13216694 13733351 14309832 14989569 15582870 16272987 17005509
6048 17005509 17821972 18671103 19513927 20481346 21488023 22640736 23932590 25387208 27026018
6039 27026018 29063586 31668143 34952515 39168701 44170198 49830177 55656235 60996587
6031 60996587 65339792 68574881 70666353 71532990 71223729 69401028 66353551 62480002
6023 62480002 58201662 53734892 49625411 46141755 43420299 41519373 40264448 39668380
$$ packed form
6087G271264R5741J99414J23431J22286J12856J06023J28921J91766J81619K01598
6077H734919J39121K27481J70859P8575Q8742J26659P9003J05572J36988Q4121
6067I972040J58599R5424J83233J34122J01211K25751K11966K00123K95349L55788
6057A1933606M38962M16378M27748N16657N76481O79737N93301O90117P32522
6048A7005509Q16463Q49131Q42824R67419J006677J152713J291854J454618J638810
6039B7026018K037568K604557L284372M216186N001497N659979N826058N340352
6031F0996587M343205L235089K091472Q66637l09261j822701l047477l873549
6023F2480002m278340m466770m109481l483656k721456j900926j254925n96068
$$ plain form
6015 39668380 39744499 40713827 42683032 45896706 50320869 55619996 61142578 66174109 70344661
6006 70344661 73337350 74971111 75365527 74365460 72018662 68299730 63488178 58259455
5998 58259455 52856575 47751077 43253275 39516168 36468364 34014084 31930246 30157167
5990 30157167 28605465 27322223 26344294 25599126 24967082 24424919 24005326 23630710 23302085
5981 23302085 23018016 22843711 22648793 22505677 22402649 22423633 22661558 22993699 23517828 24183888
5971 24183888 24930114 25881215 26995171 28386978 30079535 32240978 35055902 38500614
5963 38500614 42446888 46572690 50385933 53559591 55997063 57472502 58118029 57929657
5955 57929657 56729655 54642504 51775574 48517114 45152736 41975767 39126768 36858523
$$ packed form
6015C9668380P6119R69328J969205L213674M424163N299127N522582N031531M170552
6006G0344661K992689J633761L94416j000067k346798l718932m811552n228723
5998E8259455n402880n105498m497802l737107l047804k454280k083838j773079
5990C0157167j551702j283242r77929p45168o32044n42163m19593l74616l28625
5981B3302085k84069j74305j94918j43116j03028K0984K37925L32141N24129O66060
5971B4183888P46226R51101J113956J391807J692557K161443K814924L444712
5963C8500614L946274M125802L813243L173658K437472J475439O45527j88372
5955E7929657j200002k087151k866930l258460l364378l176969k848999k268245
$$ plain form
5947 36858523 35011579 33725283 32883795 32336105 32367797 33018699 34557520 36854673 39836700
5938 39836700 43134925 46230785 48711908 50469560 51362967 51460419 50698305 48954583 46210116
5929 46210116 42665926 38722421 34602479 30689898 27099432 23975168 21380270 19093428
5921 19093428 17122110 15337610 13749887 12408279 11317946 10405112 9616211 8984359 8444266
5912 8444266 8116792 7764409 7407053 7193487 7017041 6757706 6659522 6608890 6504190 6318226
5902 6318226 6234727 6082204 5961417 5909604 5694045 5493782 5370820 5250381 5057107 4933141
5892 4933141 4788631 4518921 4310191 4196643 4108159 4040974 3927072 3892601 3909482 3730024
5882 3730024 3631686 3592208 3626182 3611280 3522895 3362712 3329794 3336329 3236897 3192000 3124046
$$ packed form
5947C6858523j846944j286296q41488n47690L1692O50902J538821K297153K982027
5938C9836700L298225L095860K481123J757652Q93407R7452p62114j743722k744467
5929D6210116l544190l943505m119942l912581l590466l124264k594898k286842
5921A9093428j971318j784500j587723j341608j090333r12834p88901o31852n40093
5912H444266l27474l52383l57356k13566j76446k59335r8184n0632j04700j85964
5902F318226q3499j52523j20787n1813k15559k00263j22962j20439j93274j23966
5892D933141j44510k69710k08730j13548q8484o7185j13902l4471J6881j79458
5882C730024r8338l9478L3974j4902q8385j60183l2918O535r9432m4897o7954
$$ plain form
5871 3124046 3007713 2886418 2818768 2748737 2651864 2640306 2573817 2455778 2416042 2353231 2294258
5860 2294258 2167334 2153572 2163898 2107547 2066556 2085655 2048368 1948146 1873183 1913399 1846698
5849 1846698 1842475 1819330 1824659 1772038 1746731 1732715 1694968 1659940 1640808 1595835 1522101 1486572
5837 1486572 1441950 1395353 1356330 1408674 1374972 1258075 1276749 1318475 1299539 1248758 1344695
5826 1344695 1360941 1370931 1377942 1346012 1313058 1302519 1323623 1346601 1309643 1296136 1269613 1272393
5814 1272393 1230854 1223492 1236143 1231572 1260237 1256343 1216057 1196597 1267318 1253928 1247302 1244602
5802 1244602 1342949 1294716 1296936 1395910 1345821 1279215 1389747 1427951 1481568 1477433 1531610 1547583
5790 1547583 1575458 1691469 1720915 1788535 1866242 2012780 2113403 2249254 2416507 2559746
$$ packed form
5871C124046j16333j21295o7650p0031r6873j1558o6489j18039l9736o2811n8973
5860B294258j26924j3762J0326n6351m0991J9099l7287j00222p4963M0216o6701
5849A846698m223k3145N329n2621k5307j4016l7747l5028j9132m4973p3734l5529
5837A486572m4622m6597l9023N2344l3702j16897J8674M1726j8936n0781R5937
5826A344695J6246R990P011l1930l2954j0539K1104K2978l6958j3507k6523K780
5814A272393m1539p362J2651m571K8665l894m0286j9460P0721j3390o626k700
5802A244602R8347m8233K220R8974n0089o6606J10532L8204N3617m135N4177J5973
5790A547583K7875J16011K9446O7620P7707J46538J00623J35851J67253J43239
$$ plain form
5780 2559746 2714154 2899591 3186204 3604509 4156717 4973749 6046270 7564267 9750628
5771 9750628 12172709 13712561 14524374 14946318 14691295 14031285 13187244 11655092 9853897
5762 9853897 8179362 6398923 5093019 4218018 3670523 3102658 2621158 2329872 2134411
5753 2134411 1948254 1806586 1757285 1706521 1670863 1639574 1568831 1476659 1506462 1478577 1480838
5742 1480838 1413262 1324049 1226643 1268449 1277768 1193559 1233076 1251698 1257573 1217968 1250080 1231408
5730 1231408 1215303 1219992 1307918 1291907 1290820 1227522 1214210 1179843 1200140 1172674 1196131 1188492
5718 1188492 1244309 1268542 1240162 1228247 1269291 1312492 1275573 1224150 1197806 1199117 1131118 1106772
5706 1106772 1102423 1013242 977149 1032786 1057081 1055840 1014844 1028307 977102 925394 985307 1062910
$$ packed form
5780B559746J54408J85437K86613M18305N52208Q17032J072521J517997K186361
5771I750628K422081J539852Q11813M21944k55023o60010q44041j532152j801195
5762I853897j674535j780439j305904q75001n47495n67865m81500k91286j95461
5753B134411j86157j41668m9301n0764l5658l1289p0743r2172K9803k7885K261
5742A480838o7576q9213r7406M1806R319q4209L9517J8622N875l9605L2112j8672
5730A231408j6105M689Q7926j6011j087o3298j3312l4367K0297k7466K3457p639
5718A188492N5817K4233k8380j1915M1044M3201l6919n1423k6344J311o7999k4346
5706A106772m349q9181l6093N5637K4295j241m0996J3463n1205n1708N9913P7603
$$ plain form
5694 1062910 1157080 1151360 1120368 1155871 1167876 1202795 1136787 1087472 1087143 1058862 1087231 1145737
5682 1145737 1155932 1201541 1197065 1228534 1178689 1174108 1161949 1140493 1132587 1142933 1166807 1111443
5670 1111443 993081 959659 922018 900593 832505 809804 854079 939634 1046644 1105504 1120792
5659 1120792 1150652 1133165 1115551 1163880 1100410 1094032 1063451 1099132 983546 947993 980239
5648 980239 955511 1024516 1003973 1032815 980067 995110 975857 941035 965313 1041991 1013558 1003187
5636 1003187 927915 851562 833496 873000 865832 879153 880157 852389 864220 838065 817524 821776
5624 821776 837769 930382 891014 881265 950867 1012356 1005794 1079576 1025265 973145 935110 889319
5612 889319 917264 914782 867824 846004 881809 891957 946207 914424 940192 970763 967102 1013296
$$ packed form
5694A062910R4170n720l0992L5503J2005L4919o6008m9315l29k8281K8369N8506
5682A145737J0195M5609m476L1469m9845m581j2159k1456p906J0346K3874n5364
5670A111443j18362l3422l7641k1425o8088k2701M4275Q5555J07010N8860J5288
5659A120792K9860j7487j7614M8329o3470o378l0581L5681j15586l5553L2246
5648I80239k4728O9005k0543K8842n2748J5043j9253l4822K4278P6678k8433j0371
5636A003187p5272p6353j8066L9504p168J3321J004k7768J1831k6155k0541M252
5624H21776J5993R2613l9368r749O9602O1489o562P3782n4311n2120l8035m5791
5612H89319K7945k482m6958k1820L5805J0148N4250l1783K5768L0571l661M6194
$$ plain form
5600 1013296 1015696 1028133 1057171 1022157 1031306 1018143 1093550 1102898 1140714 1208981 1166908 1207203
5588 1207203 1197596 1183753 1250007 1204964 1222278 1196742 1265230 1321232 1276731 1310828 1262919 1191270
5576 1191270 1174568 1176728 1135771 1113960 1161830 1111883 1173214 1199585 1211898 1249192 1248974 1235671
5564 1235671 1220479 1199463 1245248 1207942 1228948 1147861 1245826 1272088 1354116 1385955 1373952
5553 1373952 1342147 1331213 1391094 1403218 1370664 1260362 1209931 1162899 1073072 1018277 983896
5542 983896 949478 936194 939705 912493 937621 975112 990073 1007095 962796 987962 1028888 1123790
5530 1123790 1112325 1095271 1162521 1220318 1270014 1342027 1388276 1412324 1343095 1303466 1307982 1301149
5518 1301149 1275142 1226884 1241891 1246660 1155865 1089901 1112636 1080590 1067695 1040965 1077390 1096880
$$ packed form
5600A013296K400J2437K9038l5014R149j3163P5407R348L7816O8267m2073M0295
5588A207203r607j3843O6254m5043J7314k5536O8488N6002m4501L4097m7909p1649
5576A191270j6702K160m0957k1811M7870m9947O1331K6371J2313L7294k18j3303
5564A235671j5192k1016M5785l7306K1006q1087R7965K6262Q2028L1839j2003
5553A373952l1805j0934N9881J2124l2554j10302n0431m7032q9827n4795l4381
5542I83896l4418j3284L511k7212K5128L7491J4961J7022m4299K5166M0926R4902
5530A123790j1465j7054O7250N7797M9696P2013M6249K4048o9229l9629M516o833
5518A301149k6007m8258J5007M769r0795o5964K2735l2046j2895k6730L6425J9490
$$ plain form
5506 1096880 1137282 1188395 1196886 1182159 1216676 1303922 1269148 1260921 1206097 1243212 1244239 1199456
5494 1199456 1178581 1219342 1216652 1166294 1128832 1124603 1077114 1116568 1140207 1198051 1166060 1132611
5482 1132611 1144817 1192357 1200598 1211667 1273544 1361758 1350886 1330738 1348038 1378802 1459484 1504670
5470 1504670 1536590 1589861 1498730 1367567 1343022 1320327 1279153 1366624 1305898 1321982 1316321
5459 1316321 1292054 1297644 1230372 1171269 1233993 1287658 1265596 1304006 1271739 1316860 1336688 1339285
5447 1339285 1342290 1371041 1360066 1358953 1321353 1308213 1333607 1396274 1374154 1383825 1381218 1391682
5435 1391682 1422197 1458814 1428818 1405242 1401308 1443231 1427193 1463956 1537369 1539252 1566508 1522877
5423 1522877 1522327 1493262 1522188 1536193 1534228 1479052 1527511 1612095 1628194 1593419 1614870 1692070
$$ packed form
5506A096880M0402N1113Q491j4727L4517Q7246l4774q227n4824L7115J027m4783
5494A199456k0875M0761k690n0358l7462m229m7489L9454K3639N7844l1991l3449
5482A132611J2206M7540Q241J1069O1877Q8214j0872k0148J7300L0764Q0682M5186
5470A504670L1920N3271r1131j31163k4545k2695m1174Q7471o0726J6084n661
5459A316321k4267N590o7272n9103O2724N3665k2062L8410l2267M5121J9828K597
5447A339285L005K8751j0975j113l7600j3140K5394O2667k2120R671k607J0464
5435A391682L0515L6617k9996k3576l934M1923j6038L6763P3413J883K7256m3631
5423A522877n50k9065K8926J4005j965n5176M8459Q4584J6099l4775K1451P7200
$$ plain form
5411 1692070 1737662 1789084 1774495 1806728 1806977 1828886 1804525 1816063 1834843 1839964 1850398 1902477
5399 1902477 1929304 1958198 1989007 2024314 2052939 2078754 2084667 2117901 2136343 2165560 2238954 2269424
5387 2269424 2277057 2318016 2383083 2373972 2314183 2380363 2403024 2424596 2461970 2435463 2492398 2531621
5375 2531621 2649609 2686423 2644520 2669344 2782378 2820498 2831341 2870429 2860426 2932662 2934438
5364 2934438 2931582 2978821 3096275 3123551 3198709 3282140 3217549 3171160 3244528 3386993 3439201
5353 3439201 3460086 3520095 3532431 3592530 3706601 3734212 3819890 3903781 3911346 3972637 4063068
5342 4063068 4116260 4213619 4328897 4450394 4516665 4496128 4587328 4611314 4729505 4863475 4887699
5331 4887699 5051108 5122007 5225929 5302899 5477818 5606846 5672181 5808904 5983326 6151785
$$ packed form
5411A692070M5592N1422j4589L2233K49K1909k4361J1538J8780N121J0434N2079
5399A902477K6827K8894L0809L5307K8625K5815N913L3234J8442K9217P3394L0470
5387B269424P633M0959O5067r111n9789O6180K2661K1572L7374k6507N6935L9223
5375B531621J17988L6814m1903K4824J13034L8120J0843L9088j0003P2236J776
5364B934438k856M7239J17454K7276P5158Q3431o4591m6389P3368J42465N2208
5353C439201K0885O0009J2336O0099J14071K7611Q5678Q3891P565O1291R0431
5342D063068N3192R7359J15278J21497O6271k0537R1200K3986J18191J33970K4224
5331D887699J63409P0899J03922P6970J74919J29028O5335J36723J74422J68459
$$ plain form
5321 6151785 6257199 6374722 6485464 6650039 6804198 6890733 6997796 7152936 7322882 7487593
5311 7487593 7584883 7640922 7815139 8018515 8182785 8347490 8544384 8763795 8947967 9114927
5301 9114927 9353573 9599327 9853700 10084537 10345341 10606899 10813107 11109366 11412808 11786567
5291 11786567 12017325 12306662 12660643 12925819 13196819 13498121 13855227 14275525 14696916
5282 14696916 15073369 15544139 15963199 16444728 16925332 17408528 17935636 18541840 19090690
5273 19090690 19698409 20342204 20940255 21550099 22196423 22852043 23453013 23985054 24600965
5264 24600965 25168240 25696347 26255251 26672511 27140876 27496581 27850447 28222636 28495250
5255 28495250 28656243 28845086 29057939 29125580 29214455 29338950 29299117 29167374 29062275 28945717
$$ packed form
5321F151785J05414J17523J10742J64575J54159Q6535J07063J55140J69946J64711
5311G487593R7290N6039J74217K03376J64270J64705J96894K19411J84172J66960
5301I114927K38646K45754K54373K30837K60804K61558K06208K96259L03442L73759
5291A1786567K30758K89337L53981K65176K71000L01302L57106M20298M21391
5282A4696916L76453M70770M19060M81529M80604M83196N27108O06204N48850
5273A9090690O07719O43795N98051O09844O46324O55620O00970N32041O15911
5264B4600965N67275N28107N58904M17260M68365L55705L53866L72189K72614
5255B8495250J60993J88843K12853O7641Q8875J24495l9833j31743j05099j16558
$$ plain form
5245 28945717 28784074 28638026 28444495 28300381 28102478 27845368 27692751 27615610 27538387 27593447
5235 27593447 27679381 27877776 28167294 28588513 28999629 29497909 30124823 30807678 31717757 32937855
5225 32937855 34374817 35960288 37700828 39374330 40929213 42097201 42839263 43296986
5217 43296986 43648823 43880101 44202828 44860322 46029584 47891613 50482317 53463739 56466956
5208 56466956 59195805 61516413 63593000 65438281 66923293 67866561 68497790 69129256 70172271
5199 70172271 71911915 73998491 75880765 77370582 78681985 80053826 81609903 83052720
5191 83052720 84012074 84252956 84183140 84156815 84364423 84402336 83958161 83133331 82168941 81522246
5181 81522246 81329159 81138068 80269239 78614780 76407876 74202936 72199158 70130374 67826608
$$ packed form
5245B8945717j61643j46048j93531j44114j97903k57110j52617p7141p7223N5060
5235B7593447Q5934J98395K89518M21219M11116M98280O26914O82855R10079J220098
5225C2937855J436962J585471J740540J673502J554883J167988P42062M57723
5217D3296986L51837K31278L22727O57494J169262J862029K590704K981422L003217
5208E6466956K728849K320608K076587J845281J485012R43268O31229O31466J043015
5199G0172271J739644K086576J882274J489817J311403J371841J556077J442817
5191H3052720R59354K40882o9816k6325K07608L7913m44175q24830r64390o46695
5181H1522246j93087j91091q68829j654459k206904k204940k003778k068784k303766
$$ plain form
5172 67826608 65544531 63631755 62289091 61604075 61004471 59918075 58156451 55752018
5164 55752018 52863425 49831318 46514460 43037191 39616639 36638933 34270437 32514069
5156 32514069 31348267 30427536 29460976 28252123 26900218 25389432 23694402 21817322
5148 21817322 19830596 17945891 16168678 14583382 13269414 12120509 11222295 10491256
5140 10491256 9887121 9424610 9041381 8615809 8329211 8147753 7904214 7606275 7410709
5131 7410709 7167765 7132252 7038014 6899982 6709047 6620235 6580374 6475546 6403678 6285658
5121 6285658 6140727 5969456 5933748 5909232 5833965 5752416 5674962 5602279 5606001 5481964 5405936
5110 5405936 5364611 5299994 5301324 5271810 5261183 5267109 5216332 5196102 5212332 5210099 5156420 5172795
$$ packed form
5172F7826608k282077j912776j342664o85016n99604j086396j761624k404433
5164E5752018k888593l032107l316858l477269l420552k977706k368496j756368
5156C2514069j165802r20731r66560j208853j351905j510786j695030j877080
5148B1817322j986726j884705j777213j585296j313968j148905q98214p31039
5140A0491256o04135m62511l83229m25572k86598j81458k43539k97939j95566
5131G410709k42944l5513r4238j38032j90935q8812l9861j04828p1868j18020
5121F285658j44931j71271l5708k4516p5267q1549p7454p2683L722j24037p6028
5110E405936m1325o4617J330k9514j0627N926n0777k0230J6230k233n3679J6375
$$ plain form
5098 5172795 5206226 5127046 5120085 5094545 4983858 4913136 4934302 4866289 4784986 4808166 4729915
5087 4729915 4616994 4615770 4606124 4558533 4506398 4458413 4395478 4386127 4367568 4334096 4340240 4379770
5075 4379770 4395325 4441310 4438469 4411140 4380549 4367229 4357938 4405764 4450069 4404991 4383650 4353739
5063 4353739 4429935 4429360 4421129 4378096 4430615 4432937 4427119 4454682 4434518 4438152 4508488 4570583 4570796
5050 4570796 4522147 4458280 4445265 4436579 4439298 4436387 4459053 4587220 4556191 4560625 4665057 4700874
5038 4700874 4743544 4806965 4805190 4833154 4908547 4892820 4969804 4941880 4969187 5029012 5077688 5117476
5026 5117476 5130792 5146226 5104797 5160290 5170723 5169321 5152610 5136261 5172729 5229917 5279247 5220559
5014 5220559 5192575 5187401 5313715 5347269 5378728 5399745 5380072 5484492 5581881 5681260 5664100
$$ packed form
5098E172795L3431p9180o961k5540j10687p0722K1166o8013q1303K3180p8251
5087D729915j12921j224r646m7591n2135m7985o2935r351j8559l3472O144L9530
5075D379770J5555M5985k841k7329l0591j3320r291M7826M4305m5078k1341k9911
5063D353739P6196n75q231m3033N2519K322n818K7563k0164L634P0336O2095K13
5050D570796m8649o3867j3015q686K719k911K2666J28167l1029M434J04432L5817
5038D700874M2670O3421j775K7964P5393j5727P6984k7924K7307N9825M8676L9788
5026E117476J3316J5434m1429N5493J0433j402j6711j6349L6468N7188M9330n8688
5014E220559k7984n174J26314L3554L1459K1017j9673J04420R7389R9379j7160
$$ plain form
5003 5664100 5647801 5711523 5743898 5711535 5742803 5811806 5875262 5887954 5928433 6046732 6166533
4992 6166533 6249527 6287412 6275458 6338362 6395053 6487784 6489708 6583205 6702613 6738804 6830753
4981 6830753 6899734 6956033 7077159 7137730 7148314 7225493 7347321 7512486 7705234 7844822
4971 7844822 7902312 7978949 8047595 8124994 8222344 8276007 8286899 8269129 8232848 8199543 8237449
4960 8237449 8310505 8291714 8351376 8444482 8499210 8552811 8670933 8776955 8913588 9043049 9127507
4949 9127507 9159311 9226854 9270505 9340327 9449798 9561916 9643138 9720838 9867478 9961165 10125134
4938 10125134 10255350 10400321 10587074 10804166 11011315 11169692 11286155 11452006 11679647
4929 11679647 11846487 12095003 12224229 12358501 12565422 12790282 12890741 13075022 13231387
$$ packed form
5003E664100j6299O3722L2375l2363L1268O9003O3456J2692M0479J18299J19801
4992F166533Q2994L7885j1954O2904N6691R2731J924R3497J19408L6191R1949
4981F830753O8981N6299J21126O0571J0584P7179J21828J65165J92748J39588
4971G844822N7490P6637O8646P7399R7350N3663J0892j7770l6281l3305L7906
4960H237449P3056j8791N9662R3106N4728N3601J18122J06022J36633J29461Q4458
4949I127507L1804O7543M3651O9822J09471J12118Q1222P7700J46640R3687J63969
4938A0125134J30216J44971J86753K17092K07149J58377J16463J65851K27641
4929A1679647J66840K48516J29226J34272K06921K24860J00459J84281J56365
$$ plain form
4920 13231387 13430766 13650065 13821706 14072660 14344603 14542085 14795215 15069245 15308202
4911 15308202 15505755 15796326 16002694 16155228 16427088 16669112 16884482 17120306 17432983
4902 17432983 17728745 18014706 18301936 18683672 19047086 19333899 19657888 20071086 20555608
4893 20555608 20985879 21272882 21628639 22022397 22436041 22839423 23323318 23731285 24200363
4884 24200363 24744459 25297726 25878841 26519130 27177999 27936782 28771605 29672443 30610847
4875 30610847 31645206 32694076 33644689 34624242 35732846 36682897 37546153 38517962 39524233
4866 39524233 40515719 41481435 42589478 43685401 44818315 46058797 47311473 48582722
4858 48582722 50099954 51695362 53455987 55484988 58014015 60858110 64177504 68217375
$$ packed form
4920A3231387J99379K19299J71641K50954K71943J97482K53130K74030K38957
4911A5308202J97553K90571K06368J52534K71860K42024K15370K35824L12677
4902A7432983K95762K85961K87230L81736L63414K86813L23989M13198M84522
4893B0555608M30271K87003L55757L93758M13644M03382M83895M07967M69078
4884B4200363N44096N53267N81115O40289O58869P58783Q34823R00838R38404
4875C0610847J034359J048870R50613R79553J108604R50051Q63256R71809J006271
4866C9524233R91486R65716J108043J095923J132914J240482J252676J271249
4858D8582722J517232J595408J760625K029001K529027K844095L319394M039871
$$ plain form
4850 68217375 73041542 78331357 82679001 86322164 89957878 93762320 97791469 101265524
4842 101265524 103897325 106742102 110081330 113474057 116658129 119704766 122524603 124837811
4834 124837811 126660914 128094893 129170642 129946351 130489424 130842777 131294766 131988749 132762138
4825 132762138 133853518 135353485 137375781 140146384 143605441 147680832 152455165 157857280
4817 157857280 163864114 170308954 177200316 184185766 191244816 198053569 204378394 210118635
4809 210118635 215379998 220153105 224703803 229579666 234639225 238694044 239021306 235186225
4801 235186225 228858948 221608348 213779734 204743701 193888686 182768962 173694516 167445792
4793 167445792 163812455 162853254 164683769 169162249 176203616 186183952 198916865 212860828
$$ packed form
4850F8217375M824167N289815M347644L643163L635714L804442M029149L474055
4842A01265524K631801K844777L339228L392727L184072L046637K819837K313208
4834A24837811J823103J433979J075749P75709N43073L53353M51989O93983P73389
4825A32762138J091380J499967K022296K770603L459057M075391M774333N402115
4817A57857280O006834O444840O891362O985450P059050O808753O324825N740241
4809B10118635N261363M773107M550698M875863N059559M054819L27262l835081
4801B35186225o327277p250600p828614r036033j0855015j1119724r074446o248724
4793A67445792l633337r59201J830515M478480P041367R980336J2732913J3943963
$$ plain form
4785 212860828 225736275 237188404 248473341 259747476 268814561 272306771 269604354
4778 269604354 263615573 256871472 249540114 240584243 229691562 218839493 209715687 202572195
4770 202572195 197379947 194037768 192791090 193512540 196315313 201347171 208042105 213844727
4762 213844727 216061088 214970252 212423864 209339561 205569211 199957404 192505080 185523997
4754 185523997 180756551 178332607 177942518 179374380 182504088 186802666 191855410 197327155
4746 197327155 202874571 208181408 212642550 216113975 218433688 219216656 218580915 216599676
4738 216599676 213131052 208354290 202440751 195568524 188213740 180834838 173707453 167031156
4730 167031156 160943040 155673788 151032891 147214674 144096043 141642431 139757822 138186320
$$ packed form
4785B12860828J2875447J1452129J1284937J1274135R067085L492210k702417
4778B69604354n988781o744101p331358q955871j0892681j0852069r123806p143492
4770B02572195n192248l342179j246678P21450K802773N031858O694934N802622
4762B13844727K216361j090836k546388l084303l770350n611807p452324o981083
4754A85523997m767446k423944l90089J431862L129708M298578N052744N471745
4746A97327155N547416N306837M461142L471425K319713P82968o35741j981239
4738B16599676l468624m776762n913539o872227p354784p378902p127385o676297
4730A67031156o088116n269252m640897l818217l118631k453612j884609j571502
$$ plain form
4722 138186320 137003006 135896620 134768711 133528833 131884814 129894562 127296566 124178466
4714 124178466 120463093 116119966 111206448 105743048 99933261 93910618 87754460 81646493
4706 81646493 75818925 70373383 65284402 60628164 56406860 52628105 49206362 46083441
4698 46083441 43399622 41005131 38852070 36985291 35271716 33745717 32469242 31338007
4690 31338007 30262156 29248786 28383303 27577143 26743204 26041428 25375535 24684643 24075820
4681 24075820 23448076 22851727 22380055 21886376 21437353 21005178 20506070 20088739 19667095
4672 19667095 19236542 18868744 18495182 18038777 17621810 17221083 16835085 16423073 16006229
4663 16006229 15636851 15236799 14849992 14559693 14252508 13908455 13616694 13347781 13131928
$$ packed form
4722A38186320j183314j106386j127909j239878j644019j990252k597996l118100
4714A24178466l715373m343127m913518n463400n809787o022643o156158o107967
4706H1646493n827568n445542n088981m656238m221304l778755l421743l122921
4698D6083441k683819k394491k153061j866779j713575j525999j276475j131235
4690C1338007j075851j013370q65483q06160q33939p01776o65893o90892o08823
4681B4075820o27744n96349m71672m93679m49023m32175m99108m17331m21644
4672A9667095m30553l67798l73562m56405m16967m00727l85998m12012m16844
4663A6006229l69378m00052l86807k90299l07185l44053k91761k68913k15853
$$ plain form
4654 13131928 12931085 12720953 12466103 12244684 12081205 11935175 11709540 11472304 11312705
4645 11312705 11171097 10974172 10803460 10596981 10350229 10281257 10164947 10029624 9889390 9736919
4635 9736919 9657046 9566521 9564179 9615365 9731458 10026546 10433791 10801857 11029252 11150726
4625 11150726 11253770 11114721 10934366 10700105 10346944 9990748 9665576 9287165 9142224
4616 9142224 9181249 9155828 9321616 9425432 9547296 9753133 10099379 10385474 10638545 10949555
4606 10949555 11329504 11759875 12236009 12649803 12977969 13306564 13733377 14086086 14361006
4597 14361006 14658186 15024672 15236196 15405952 15568349 15600945 15600845 15595934 15400311 15276116
4587 15276116 15080478 14801610 14597520 14349080 14018988 13735858 13443580 13180193 12788283
$$ packed form
4654A3131928k00843k10132k54850k21419j63479j46030k25635k37236j59599
4645A1312705j41608j96925j70712k06479k46752o8972j16310j35323j40234j52471
4635I736919p9873r0525k342N1186J16093K95088M07245L68066K27395J21474
4625A1150726J03044j39049j80355k34261l53161l56196l25172l78411j44941
4616I142224L9025k5421J65788J03816J21864K05837L46246K86095K53071L11010
4606A0949555L79949M30371M76134M13794L28166L28595M26813L52709K74920
4597A4361006K97180L66486K11524J69756J62397L2596j00m911j95623j24195
4587A5276116j95638k78868k04090k48440l30092k83130k92278k63387l91910
$$ plain form
4578 12788283 12420919 12164462 11861738 11545561 11272347 11064592 10832428 10663569 10481952
4569 10481952 10311195 10155325 10137038 10064467 10096776 10159357 10208996 10382423 10573435 10851066
4559 10851066 11040781 11241147 11623743 11894838 12302617 12741665 13280057 13811034 14467718
4550 14467718 15240213 16111808 17030181 18066266 19366314 20874413 22491329 24487503 26858148
4541 26858148 29996593 34091490 39261151 45841103 54117063 64077863 74268015 82253479
4533 82253479 87000766 89197823 90066091 90194699 89220358 86951916 84267036 82956306 84433843
4524 84433843 88290869 92482349 95011800 95300831 94234930 92730621 90978139 88358681
4516 88358681 84864024 81869217 81021716 82739250 85397893 86883633 86622697 85297805
$$ packed form
4578A2788283l67364k56457l02724l16177k73214k07755k32164j68859j81617
4569A0481952j70757j55870j8287p2571L2309O2581M9639J73427J91012K77631
4559A0851066J89715K00366L82596K71095M07779M39048N38392N30977O56684
4550A4467718P72495Q71595R18373J036085J300048J508099J616916J996174K370645
4541B6858148L138445M094897N169661O579952Q275960R960800J0190152P985464
4533H2253479M747287K197057Q68268J28608r74341k268442k684880j310730J477537
4524H4433843L857026M191480K529451K89031j065901j504309j752482k619458
4516H8358681l494657k994807q47501J717534K658643J485740k60936j324892
$$ plain form
4508 85297805 83765655 81882273 79264643 75726814 72235791 70532757 71233719 73515734
4500 73515734 75604940 75751759 74033590 71123906 67523187 63118861 57202820 49801285
4492 49801285 42084363 35238065 29649259 25116461 21497704 18716995 16725148 15162265
4484 15162265 14037098 13203562 12478545 11904765 11314698 10798104 10365418 10015126 9686982
4475 9686982 9346696 9083100 8702952 8337786 8136621 7879035 7664935 7443973 7340067 7209097
4465 7209097 7044044 6960241 6894179 6788836 6703460 6667904 6650008 6704401 6642426 6606307 6647277
4454 6647277 6558354 6424367 6316913 6179593 5969613 5894780 5758991 5638978 5518733 5421297
4444 5421297 5314545 5209458 5297118 5346287 5324286 5354791 5359548 5374142 5494930 5523530 5481066
$$ packed form
4508H5297805j532150j883382k617630l537829l491023j703034P00962K282015
4500G3515734K089206J46819j718169k909684l600719m404326n916041p401535
4492D9801285p716922o846298n588806m532798l618757k780709j991847j562883
4484A5162265j125167q33536p25017n73780n90067n16594m32686l50292l28144
4475I686982l40286k63596l80148l65166k01165k57586k14100k20962j03906j30970
4465G209097j65053q3803o6062j05343q5376l5556j7896N4393o1975l6119M0970
4454F647277q8923j33987j07454j37320k09980p4833j35789j20013j20245r7436
4444E421297j06752j05087Q7660M9169k2001L0505M757J4594J20788K8600m2464
$$ plain form
4433 5481066 5492466 5500620 5490428 5385951 5221007 5077994 4819153 4616250 4504449 4444526
4423 4444526 4398519 4338967 4211564 4186719 4170842 4120176 4102446 4216048 4160648 4137806 4108834
4412 4108834 4136538 4176477 4136199 4146828 4040396 4042790 3967306 4007362 4068290 4069035 4209260 4317044
4400 4317044 4493207 4595118 4632688 4657605 4656950 4760852 4610225 4448575 4305415 4178449
4390 4178449 4045257 4026064 4014930 3999078 4000307 4013303 4061679 4058111 4129998 4131067 4071471 4030348
4378 4030348 4054073 4033378 3989852 3907507 3913600 3908353 3867155 3830020 3819283 3797877 3853611 3927152
4366 3927152 3982072 4104440 4088661 4064752 4043007 4096310 4050047 4035808 3984068 3985188 3956587
4355 3956587 3929595 3916662 3904396 3891089 3853974 3851357 3893396 3917997 3922789 3876081 3872825 3892340
$$ packed form
4433E481066J1400Q154j0192j04477j64944j43013k58841k02903j11801n9923
4423D444526m6007n9552j27403k4845j5877n0666j7730J13602n5400k2842k8972
4412D108834K7704L9939m0278J0629j06432K394p5484M0056O0928P45J40225J07784
4400D317044J76163J01911L7570K4917o55J03902j50627j61650j43160j26966
4390D178449j33192j9193j1134j5852J229J2996M8376l568P1887J069n9596m1123
4378D030348K3725k0695m3526q2345O093n247m1198l7135j0737k1406N5734P3541
4366C927152N4920J22368j5779k3909k1745N3303m6263j4239n1740J120k8601
4355C956587k6992j2933j2266j3307l7115k617M2039K4601M792m6708l256J9515
$$ plain form
4343 3892340 3944847 3958530 3909468 3935307 3966444 4018526 3975651 3976549 4025355 3979728 3905320 3997844
4331 3997844 3986318 3934741 3957237 4045601 4036047 4011280 3985946 3964188 3960190 4002670 4043223 4054213
4319 4054213 4036887 4029428 4074518 4109122 4104448 4084408 4098396 4194283 4219985 4202958 4204639 4118393
4307 4118393 4077907 4099693 4120672 4185907 4217468 4173210 4171016 4220528 4300723 4291620 4280581 4288530
4295 4288530 4279269 4286651 4299222 4301888 4372467 4465216 4434247 4431083 4538516 4565356 4543376 4607255
4283 4607255 4606918 4617915 4598164 4593593 4588463 4570582 4656267 4639922 4619790 4646611 4769711 4760848
4271 4760848 4823155 4843910 4811657 4824533 4924284 4982937 4930715 4959000 4960284 5040352 5072236 5068228
4259 5068228 5096908 5184770 5263761 5246076 5295526 5396008 5374070 5455515 5467692 5506597 5547300
$$ packed form
4343C892340N2507J3683m9062K5839L1137N2082m2875Q98M8806m5627p4408R2524
4331C997844j1526n1577K2496Q8364r554k4767k5334k1758l998M2480M0553J0990
4319D054213j7326p459M5090L4604m674k0040J3988R5887K5702j7027J681q6246
4307D118393m0486K1786K0979O5235L1561m4258k194M9512Q0195r103j1039P949
4295D288530r261P382J2571K666P0579R2749l0969l164J07433K6840k1980O3879
4283D607255l37J0997j9751m571n130j7881Q5685j6345k0132K6821J23100q863
4271D760848O2307K0755l2253J2876R9751N8653n2222K8285J284Q0068L1884m008
4259E068228K8680Q7862P8991j7685M9450J00482k1938Q1445J2177L8905M0703
$$ plain form
4248 5547300 5597881 5604037 5655003 5684430 5702987 5749066 5780950 5878839 5940321 6003482 6073874 6102035
4236 6102035 6110435 6119323 6285628 6359940 6384161 6446264 6553373 6586877 6634059 6738445 6746570
4225 6746570 6859484 6965635 7050712 7130772 7287241 7421418 7475031 7556855 7688548 7773533
4215 7773533 7925581 8067137 8139348 8192014 8352290 8448529 8588247 8677569 8791844 9001465
4205 9001465 9118650 9234062 9393155 9445857 9586661 9796548 9955251 10091775 10345189 10494622
4195 10494622 10659338 10891469 11023213 11177136 11343735 11497331 11667581 11919161 12146441
4186 12146441 12339591 12526591 12798565 13070749 13300053 13546351 13862510 14236287 14595608
4177 14595608 14938676 15322720 15813453 16275599 16824431 17494596 18109182 18712509 19431358
$$ packed form
4248E547300N0581O156N0966K9427J8557M6079L1884R7889O1482O3161P0392K8161
4236F102035Q400Q888J66305P4312K4221O2103J07109L3504M7182J04386Q125
4225F746570J12914J06151Q5077Q0060J56469J34177N3613Q1824J31693Q4985
4215G773533J52048J41556P2211N2666J60276R6239J39718Q9322J14275K09621
4205I001465J17185J15412J59093N2702J40804K09887J58703J36524K53414J49433
4195A0494622J64716K32131J31744J53923J66599J53596J70250K51580K27280
4186A2146441J93150J87000K71974K72184K29304K46298L16159L73777L59321
4177A4595608L43068L84044M90733M62146N48832O70165O14586O03327P18849
$$ plain form
4168 19431358 20195466 20906873 21732209 22525850 23505352 24468256 25465268 26572817 27773734
4159 27773734 29059373 30252736 31418044 32548043 33649880 34707168 35735053 36658179
4151 36658179 37526098 38459007 39507470 40663445 41835781 43107768 44602625 46121751
4143 46121751 47664838 49344131 51076804 52768958 54508559 56195765 57837833 59451348
4135 59451348 61019866 62469910 63841969 65355844 66880902 68360767 69880590 71457150
4127 71457150 73183978 75041992 76892783 78625423 80454717 82424089 84558578 86953956
4119 86953956 89422126 92136035 94895889 97658592 100449595 103066127 105508074 107641590
4111 107641590 109484515 111069845 112358752 113295711 114085433 115009840 115975712 117010841 118129663
$$ packed form
4168A9431358P64108P11407Q25336P93641R79502R62904R97012J107549J200917
4159B7773734J285639J193363J165308J129999J101837J057288J027885R23126
4151C6658179Q67919R32909J048463J155975J172336J271987J494857J519126
4143D6121751J543087J679293J732673J692154J739601J687206J642068J613515
4135E9451348J568518J450044J372059J513875J525058J479865J519823J576560
4127G1457150J726828J858014J850791J732640J829294J969372K134489K395378
4119H6953956K468170K713909K759854K762703K791003K616532K441947K133516
4111A07641590J842925J585330J288907R36959P89722R24407R65872J035129J118822
$$ plain form
4102 118129663 119350381 120664894 121910382 123310928 124676073 126035160 127582246 129144042
4094 129144042 130908402 132991826 135472894 138337845 141732731 145719460 150102677 154815287
4086 154815287 159827227 164911156 169990196 174941673 179717636 184145078 188196087 191916326
4078 191916326 195318995 198475233 201232508 203524978 205396188 206794236 207881794 208795683
4070 208795683 209546997 210244109 210987523 211739658 212553597 213543010 214456861 215403347 216456327
4061 216456327 217255626 217862399 218221915 218462561 218654914 218781049 218863279 218974472 219174505
4052 219174505 219219663 219232134 218992427 218527515 217815607 216641922 214961357 212815047 210386329
4043 210386329 207647069 204649885 201222671 197141589 192562955 187504106 182081051 176495490
$$ packed form
4102A18129663J220718J314513J245488J400546J365145J359087J547086J561796
4094A29144042J764360K083424K481068K864951L394886L986729M383217M712610
4086A54815287N011940N083929N079040M951477M775963M427442M051009L720239
4078A91916326L402669L156238K757275K292470J871210J398048J087558R13889
4070B08795683P51314O97112P43414P52135Q13939R89413R13851R46486J052980
4061B16456327P99299O06773L59516K40646J92353J26135Q2230J11193K00033
4052B19174505M5158J2471k39707m64912p11908j173685j680565k146310k428718
4043B10386329k739260k997184l427214m081082m578634n058849n423055n585561
$$ plain form
4035 176495490 170767384 165052436 159526542 154351881 149828948 146006211 142747000 140106376
4027 140106376 137946069 136152000 134475655 132794900 131033211 129242152 127336546 125230389
4019 125230389 123093439 120877764 118823344 116789086 114876753 113055569 111318043 109655585
4011 109655585 107898960 105946913 103740591 101200949 98440258 95400737 92129268 88854263
4003 88854263 85702555 82849697 80272671 77875527 75736822 73831060 71932497 70111452
3995 70111452 68213743 66354802 64513433 62669487 60975298 59357783 57788438 56300054
3987 56300054 54885820 53451572 52057907 50596649 49138351 47631280 46036477 44503277
3979 44503277 42984817 41444311 40024429 38752646 37624420 36291603 34903910 33708821
$$ packed form
4035A76495490n728106n714948n525894n174661m522933l822737l259211k640624
4027A40106376k160307j794069j676345j680755j761689j791059j905606k106157
4019A25230389k136950k215675k054420k034258j912333j821184j737526j662458
4011A09655585j756625j952047k206322k539642k760691l039521l271469l275005
4003H8854263l151708k852858k577026k397144k138705j905762j898563j821045
3995G0111452j897709j858941j841369j843946j694189j617515j569345j488384
3987E6300054j414234j434248j393665j461258j458298j507071j594803j533200
3979D4503277j518460j540506j419882j271783j128226j332817j387693j195089
$$ plain form
3971 33708821 32578694 31437432 30128137 28766631 27485650 26401154 25282460 24296171
3963 24296171 23319047 22325584 21305058 20324798 19311676 18304499 17446064 16620829 15817767
3954 15817767 15144931 14531571 13965503 13448466 12979626 12579363 12281085 12140819 11992970
3945 11992970 11855789 11846330 11725292 11343277 11111015 10877356 10533202 10089682 9549361 9043044
3935 9043044 8702725 8432813 8102344 7861712 7710813 7475316 7273997 7077924 6929851 6766272
3925 6766272 6640977 6572274 6429638 6315089 6184050 6133003 6058466 5966459 5858946 5754962
3915 5754962 5659710 5588955 5489624 5362072 5333307 5279367 5199457 5092858 5086267 4919052 4736196
3904 4736196 4724428 4661230 4637933 4598325 4535074 4476095 4362082 4306383 4256537 4196548 4116874
$$ packed form
3971C3708821j130127j141262j309295j361506j280981j084496j118694r86289
3963B4296171r77124r93463j020526r80260j013122j007177q58435q25235q03062
3954A5817767o72836o13360n66068n17037m68840m00263k98278j40266j47849
3945A1992970j37181r459j21038l82015k32262k33659l44154m43520n40321n06317
3935I043044l40319k69912l30469k40632j50899k35497k01319j96073j48073j63579
3925F766272j25295o8703j42636j14549j31039n1047p4537r2007j07513j03984
3915E754962r5252p0755r9331j27552k8765n3940p9910j06599o591j67215j82856
3904D736196j1768o3198k3297l9608o3251n8979j14013n5699m9846n9989p9674
$$ plain form
3893 4116874 4084934 4048108 4042039 3986032 3909139 3862812 3780462 3772282 3716953 3662666 3618067 3565741
3881 3565741 3497867 3487118 3453194 3411914 3444791 3412169 3346020 3250517 3182786 3221870 3283103
3870 3283103 3235399 3174755 3182211 3151202 3109314 3070940 2997885 3066435 3076706 3073394 3115350 3035779
3858 3035779 3064718 3031407 3036525 2978970 2961248 2955716 2931938 2864736 2803492 2835043 2839860 2844973
3846 2844973 2866594 2866003 2794115 2767167 2829090 2842957 2849502 2831331 2788960 2829148 2861112 2903237
3834 2903237 2907389 2879796 2959306 2976276 2954067 2938292 2956956 2976807 2975013 3019035 2987919 2946904
3822 2946904 2936808 3011950 2975518 2922401 2971664 2944260 2891746 2866782 2813228 2815625 2777010 2737683
3810 2737683 2749227 2720129 2670736 2736239 2813031 2736299 2733567 2699470 2708981 2724721 2648274 2565589
$$ packed form
3893D116874l1940l6826o069n6007p6893m6327q2350q180n5329n4287m4599n2326
3881C565741o7874j0749l3924m1280L2877l2622o6149r5503o7731L9084O1233
3870C283103m7704o0644P456l1009m1888l8374p3055O8550J0271l312M1956p9571
3858C035779K8939l3311N118n7555j7722n532k3778o7202o1244L1551M817N113
3846B844973K1621n91p1888k6948O1923J3867O545j8171m2371M0188L1964M2125
3834B903237M152k7593P9510J6970k2209j5775J8664J9851j794M4022l1116m1015
3822B946904j0096P5142l6432n3117M9263k7404n2514k4964n3554K397l8615l9327
3810B737683J1544k9098m9393O5503P6792p6732k732l4097R511J5740p6447q2685
$$ plain form
3798 2565589 2499905 2539095 2553825 2531066 2515755 2457719 2472954 2459066 2451125 2382535 2393177 2408616
3786 2408616 2436345 2412129 2345031 2341679 2310050 2267941 2344896 2389345 2350753 2386938 2430114 2403702
3774 2403702 2356798 2331970 2301188 2360785 2375218 2332401 2349610 2433584 2424264 2435280 2389124 2399259
3762 2399259 2416515 2360741 2356531 2414042 2391225 2356328 2348949 2319738 2323943 2271709 2310463 2295699
3750 2295699 2293078 2355452 2320158 2283308 2226576 2228685 2211729 2183659 2143083 2219730 2191913 2241942
3738 2241942 2285078 2156998 2116412 2182556 2116905 2081417 2075819 2000296 1947644 1953345 1937123 1958721
3726 1958721 2013976 1981692 1975245 1879227 1829136 1850165 1806849 1764682 1667435 1671245 1708476 1677935
3714 1677935 1677508 1671160 1672474 1651252 1661488 1704341 1665055 1670873 1715323 1664888 1541456 1547136
$$ packed form
3798B565589o5684L9190J4730k2759j5311n8036J5235j3888p941o8590J0642J5439
3786B408616K7729k4216o7098l352l1629m2109P6955M4449l8592L6185M3176k6412
3774B403702m6904k4828l0782N9597J4433m2817J7209Q3974r320J1016m6156J0135
3762B399259J7256n5774m210N7511k2817l4897p379k9211M205n2234L8754j4764
3750B295699k621O2374l5294l6850n6732K109j6956k8070m0576P6647k7817N0029
3738B241942M3136j28080m0586O6144o5651l5488n598p5523n2652N701j6222K1598
3726A958721N5255l2284o447r6018n0091K1029m3316m2167r7247L810L7231l0541
3714A677935m27o348J314k1222J0236M2853l9286N818M4450n0435j23432N680
$$ plain form
3702 1547136 1624975 1656467 1667791 1669630 1574315 1570195 1609724 1596394 1685113 1652539 1619377 1629792
3690 1629792 1640678 1676799 1732305 1655891 1607370 1671473 1721029 1750464 1809873 1774366 1756477
3679 1756477 1748406 1712334 1730285 1740245 1799253 1821589 1795685 1796154 1853058 1871937 1890244 1914535
3667 1914535 1878533 1854740 1859789 1856007 1902763 1898866 1899280 1972941 2039234 2083250 2057692 2039043
3655 2039043 2128313 2160392 2168635 2188581 2169482 2234306 2218746 2269083 2293553 2367142 2331222 2346443
3643 2346443 2415011 2468693 2447921 2501614 2598472 2636073 2623416 2664265 2712848 2792247 2824665
3632 2824665 2828035 2940231 2992636 2988955 3029185 3131713 3231781 3260559 3340752 3432342 3453136
3621 3453136 3511572 3618529 3784834 3908290 3925607 4037161 4157551 4280034 4395355 4434467
$$ packed form
3702A547136P7839L1492J1324J839r5315m120L9529j3330Q8719l2574l3162J0415
3690A629792J0886L6121N5506p6414m8521O4103M9556K9435N9409l5507j7889
3679A756477q071l6072J7951R960N9008K2336k5904M69N6904J8879J8307K4291
3667A914535l6002k3793N049l782M6756l897M14P3661O6293M4016k5558j8649
3655B039043Q9270L2079Q243J9946j9099O4824j5560N0337K4470P3589l5920J5221
3643B346443O8568N3682k0772N3693R6858L7601j2657M0849M8583P9399L2418
3632B824665L370J12196N2405l681M0230J02528J00068K8778Q0193R1590K0794
3621C453136N8436J06957J66305J23456J7317J11554J20390J22483J15321L9112
$$ plain form
3611 4434467 4494155 4571946 4586293 4613073 4682700 4747751 4777644 4866112 4960377 4995945 5041590
3600 5041590 5105261 5205572 5322023 5399263 5459291 5681765 5871167 5980919 6184051 6324586
3590 6324586 6536915 6767597 6941356 7229311 7430768 7678302 7876652 8160098 8349968 8471725
3580 8471725 8634798 8811205 8972890 9131113 9257938 9418821 9592691 9758658 9918667 10115713
3570 10115713 10259563 10458245 10610258 10908860 11233037 11578356 11957479 12318137 12648847
3561 12648847 12996286 13447382 13930150 14399027 14814485 15278966 15755404 16229058 16841283
3552 16841283 17479919 18274935 19161122 20134909 21268144 22513960 23879610 25342913 26888874
3543 26888874 28534875 30147462 31526493 32897268 34017831 34927793 35558629 35888434 35880789
$$ packed form
3611D434467N9688P7791J4347K6780O9627O5051K9893Q8468R4265L5568M5645
3600E041590O3671J00311J16451P7240O0028K22474J89402J09752K03132J40535
3590F324586K12329K30682J73759K87955K01457K47534J98350K83446J89870J21757
3580H471725J63073J76407J61685J58223J26825J60883J73870J65967J60009J97046
3570A0115713J43850J98682J52013K98602L24177L45319L79123L60658L30710
3561A2648847L47439M51096M82768M68877M15458M64481M76438M73654O12225
3552A6841283O38636P95016Q86187R73787J133235J245816J365650J463303J545961
3543B6888874J646001J612587J379031J370775J120563R09962O30836L29805p645
$$ plain form
3534 35880789 35592623 34992671 34173996 33141649 31961027 30665149 29388931 28152780 26867222
3525 26867222 25722856 24610060 23557064 22433620 21336546 20309785 19238675 18208807
3517 18208807 17249139 16323441 15367531 14471597 13615519 12797612 12078360 11420750 10850198
3508 10850198 10253928 9706191 9196049 8766361 8421340 8063092 7740336 7434108 7136866
3499 7136866 6912620 6667286 6459521 6139762 5922626 5761813 5495394 5362285 5191817 4969227
3489 4969227 4818701 4754522 4656215 4538750 4376697 4181843 4077976 4026936 3948934 3792436
3479 3792436 3679160 3596800 3553992 3487133 3487258 3449229 3287258 3145487 2979889 2928209 2879476
3468 2879476 2793458 2723133 2716585 2641336 2511179 2465957 2504872 2416694 2375924 2304338 2324086
$$ packed form
3534C5880789k88166n99952q18675j032347j180622j295878j276218j236151j285558
3525B6867222j144366j112796j052996j123444j097074j026761j071110j029868
3517A8208807r59668r25698r55910q95934q56078q17907p19252o57610n70552
3508A0850198n96270n47737n10142m29688l45021l58248l22756l06228k97242
3499G136866k24246k45334k07765l19759k17136j60813k66419j33109j70468k22590
3489D969227j50526o4179r8307j17465j62053j94854j03867n1040p8002j56498
3479C792436j13276q2360m2808o6859J25l8029j61971j41771j65598n1680m8733
3468B879476q6018p0325o548p5249j30157m5222L8915q8178m0770p1586J9748
$$ plain form
3457 2324086 2257077 2177896 2142968 2124759 2090107 2059006 2032978 2064782 2038225 1979705 1919356
3446 1919356 1844136 1854239 1904361 1908240 1907757 1845032 1791595 1794992 1772005 1803827 1763866 1793072
3434 1793072 1761790 1748369 1712960 1681837 1643865 1623197 1491224 1430346 1556511 1556423 1569937 1580990
3422 1580990 1631913 1566005 1523357 1503130 1534286 1530592 1479407 1409828 1380669 1360895 1315788 1298853
3410 1298853 1318799 1300262 1250998 1232150 1289964 1330050 1322500 1352042 1276524 1336325 1353316 1402267
3398 1402267 1453237 1539100 1520216 1514698 1483288 1447609 1394652 1361838 1308698 1225745 1254852 1285511
3386 1285511 1232129 1191935 1184212 1183699 1179390 1097065 1155356 1231754 1244381 1224100 1235605 1305083
3374 1305083 1253680 1236980 1202006 1153838 1147070 1141154 1134037 1115147 1093709 1032030 1028653 1060577
$$ packed form
3457B324086o7009p9181l4928j8209l4652l1101k6028L1804k6557n8520o0349
3446A919356p5220J0103N0122L879m83o2725n3437L397k2987L1822l9961K9206
3434A793072l1282j3421l5409l1123l7972k0668j31973o0878J26165q8J3514J1053
3422A580990N0923o5908m2648k0227L1156l694n1185o9579k9159j9774m5107j6935
3410A298853J9946j8537m9264j8848N7814M0086p550K9542p5518N9801J6991M8951
3398A402267N0970Q5863j8884n518l1410l5679n2957l2814n3140q2953K9107L0659
3386A285511n3382m0194p723n13m309q2325N8291P6398J2627k0281J1505O9478
3374A305083n1403j6700l4974m8168o768n916p117j8890k1438o1679l377L1924
$$ plain form
3362 1060577 1154840 1151821 1147178 1134796 1123000 1078698 1051450 1011729 1015610 958182 955078 1017397
3350 1017397 1019087 1018604 934941 930254 940529 1028869 1046156 1048640 1025628 1029874 1074050 1164437 1156914
3337 1156914 1207958 1260051 1244512 1252576 1213541 1235070 1261065 1204643 1227203 1220202 1157044 1196785
3325 1196785 1123545 1051688 1121814 1162351 1086644 1146118 1162311 1151866 1148525 1143366 1151123 1116142
3313 1116142 1108337 1109278 1155545 1110624 1100697 1087123 1098584 1126794 1143005 1147947 1131899 1201910
3301 1201910 1177656 1208080 1242449 1169896 1149218 1116754 1186567 1176302 1260786 1286074 1315165
3290 1315165 1389047 1388644 1480644 1466594 1425856 1476537 1558686 1675147 1658464 1646875 1660316 1713783
3278 1713783 1849026 1886881 1966607 2001509 2049047 2144745 2138632 2101102 2206818 2198569 2223495
$$ packed form
3362A060577R4263l019m643j2382j1796m4302k7248l9721L881n7428l104O2319
3350A017397J690m83q3663m687J0275Q8340J7287K484k3012M246M4176R0387p523
3337A156914N1044N2093j5539Q064l9035K1529K5995n6422K2560p001o3158L9741
3325A196785p3240p1857P0126M0537p5707N9474J6193j0445l341n159P757l4981
3313A116142p805R41M6267m4921r927j3574J1461K8210J6211M942j6048P0011
3301A201910k4254L0424L4369p2553k0678l2464O9813j0265Q4484K5288K9091
3290A315165P3882m03R2000j4050m0738N0681Q2149J16461j6683j1589J3441N3467
3278A713783J35243L7855P9726L4902M7538R5698o113l7530J05716q249K4926
$$ plain form
3267 2223495 2269977 2256500 2308359 2409449 2453135 2530408 2618148 2707163 2737968 2774426 2830740
3256 2830740 2929987 3021079 3074813 3206150 3280046 3358761 3483555 3608265 3668928 3846482 4096065
3245 4096065 4237246 4316447 4544526 4828483 5029628 5285642 5594496 5937808 6255207 6703867
3235 6703867 7165086 7627015 8189478 8804072 9410319 9931944 10462830 10997145 11524205 12002525
3225 12002525 12445405 12772626 12978988 13139765 13212035 13221845 13190247 13246053 13219532 13185468 13207630
3214 13207630 13304082 13335863 13449574 13563543 13737688 13949185 14193562 14669573 15338690 16221516
3204 16221516 17338385 18752264 20069758 20878753 21537014 22348350 23183035 24048796 24780908
3195 24780908 25060879 24395727 23170549 21742187 20163846 18581480 16985732 15541831
$$ packed form
3267B223495M6482j3477N1859J01090M3686P7273Q7740Q9015L0805L6458N6314
3256B830740R9247R1092N3734J31337P3896P8715J24794J24710O0663J77554K49583
3245D096065J41181P9201K28079K83957K01145K56014L08854L43312L17399M48660
3235F703867M61219M61929N62463O14594O06247N21625N30886N34315N27060M78320
3225A2002525M42880L27221K06362J60777P2270R810l1598N5806k6521l4064K2162
3214A3207630R6452L1781J13711J13969J74145K11497K44377M76011O69117Q82826
3204A6221516J116869J413879J317494Q08995O58261Q11336Q34685Q65761P32112
3195B4780908K79971o65152j225178j428362j578341j582366j595748j443901
$$ plain form
3187 15541831 14320866 13351916 12509017 11818523 11345557 10981987 10716649 10486287 10397245
3178 10397245 10371057 10416813 10516835 10703804 10839771 10978893 11240093 11467435 11622498 11712560
3168 11712560 11751468 11712088 11635950 11508340 11264539 10930534 10388915 9774266 9119950 8406559
3158 8406559 7782671 7237772 6751897 6319519 5828315 5457794 5104851 4803446 4595258 4346860
3148 4346860 4168938 3955529 3782989 3659638 3509008 3354176 3238298 3073663 2980133 2869063
3138 2869063 2720540 2594999 2461456 2396952 2261038 2177199 2050999 1944909 1902202 1798121
3128 1798121 1784910 1790415 1732570 1665143 1592329 1521246 1450802 1438822 1429883 1314824 1275097 1273068
3116 1273068 1206605 1127330 1141287 1081516 1045489 1036542 1016948 960750 847185 803085 826115
$$ packed form
3187A5541831j220965r68950q42899o90494m72966l63570k65338k30362q9042
3178A0397245k6188M5756J00022J86969J35967J39122K61200K27342J55063R0062
3168A1712560L8908l9380p6138j27610k43801l34005n41619o14649o54316p13391
3158H406559o23888n44899m85875m32378m91204l70521l52943l01405k08188k48398
3148D346860j77922k13409j72540j23351j50630j54832j15878j64635r3530j11070
3138B869063j48523j25541j33543o4504j35914q3839j26200j06090m2707j04081
3128A798121j3211N505n7845o7427p2814p1083p0444j1980q939j15059l9727k029
3116A273068o6463p9275J3957n9771l6027q947j9594n6198j13565m4100K3030
$$ plain form
3105 826115 805538 833681 787795 753195 745718 719060 673877 637947 611179 582934 526832 514272
3093 514272 553879 582230 565579 519538 548368 531911 550342 578546 535612 440516 456799 397511
3081 397511 420772 455513 339234 331461 380164 343935 329480 329605 362264 340851 323022 305292
3069 305292 323010 320145 285001 259629 269513 246344 204283 204267 217969 182010 148498 105859 154910
3056 154910 143095 117212 158096 175601 156548 84550 70722 94616 104257 99293 10080 -20728
3044 -20728 -19254 41648 64755 12504 -34792 -8196 69465 91901 99285 68398 19094 10689
3032 10689 47218 -2165 15929 23862 -3352 15059 36768 17756 -4560 -11303 18202 86011
3020 86011 18672 -69366 -52175 -37289 22313 -37576 -114281 -52622 21191 -72356 -136213 -189303
$$ packed form
3105H26115k0577K8143m5886l4600p477k6658m5183l5930k6768k8245n6102j2560
3093E14272L9607K8351j6651m6041K8830j6457J8431K8204m2934r5096J6283n9288
3081C97511K3261L4741j16279p773M8703l6229j4455J25L2659k1413j7829j7730
3069C05292J7718k865l5144k5372R884k3169m2061j6J3702l5959l3512m2639M9051
3056A54910j1815k5883M0884J7505j9053p1998j3828K3894R641m964q9213l0808
3044b0728J474O0902K3107n2251m7296K6596P7661K2436P384l0887m9304q405
3032A0689L6529m9383J8094P933k7214J8411K1709j9012k2316o743K9505O7809
3020H6011o7339q8038J7191J4886N9602n9889p6705O1659P3813r3547o3857n3090
$$ plain form
3008 -189303 -131207 -117887 -150405 -152294 -112243 -78312 -95810 -160727 -169449 -128138 -81454 -72815
2996 -72815 -97771 -97565 -149959 -142406 -69891 -107562 -134575 -149388 -170702 -189461 -126275 -107781
2984 -107781 -96738 -138113 -139252 -101970 -151504 -185252 -133084 -177537 -189243 -101809 -148697 -140894
2972 -140894 -175772 -152068 -116976 -145505 -185507 -163006 -90482 -144021 -135588 -136070 -137378 -103781
2960 -103781 -153000 -180533 -165262 -144275 -198818 -106229 -80554 -100427 -113961 -190103 -174105 -88947
2948 -88947 -124461 -162668 -106756 -84946 -55203 -36243 -99455 -72237 -133294 -115559 -131045 -141614
2936 -141614 -123352 -74954 -51702 -149684 -127701 -87183 -114053 -143232 -129962 -127721 -105199 -110847
2924 -110847 -133845 -147626 -89994 -156665 -123303 -70348 -89198 -44718 -12469 -29219 -34652 -103317
$$ packed form
3008a89303N8096J3320l2518j889M0051L3931j7498o4917q722M1311M6684Q639
2996g2815k4956K06n2394P553P2515l7671k7013j4813k1314j8759O3186J8494
2984a07781J1043m1375j139L7282m9534l3748N2168m4453j1706Q7434m6888P803
2972a40894l4878K3704L5092k8529m0002K2501P2524n3539Q433m82j308L3597
2960a03781m9219k7533J5271K0987n4543R2589K5675j9873j3534p6142J5998Q5158
2948h8947l5514l8207N5912K1810K9743J8960o3212K7218o1057J7735j5486j0569
2936a41614J8262M8398K3252r7982K1983M0518k6870k9179J3270K241K2522n648
2924a10847k2998j3781N7632o6671L3362N2955j8850M4480L2249j6750n433o8665
$$ plain form
2912 -103317 -83444 -114932 -144249 -93873 -97362 -104364 -124471 -125916 -106953 -151161 -99917 -73048
2900 -73048 -148843 -129666 -140215 -158697 -213647 -194192 -193947 -106646 -101402 -121813 -109344 -89865
2888 -89865 -103018 -102957 -69913 -137608 -62160 -55576 -110928 -146789 -153608 -104224 -152449 -173733 -178830
2875 -178830 -142352 -196822 -188161 -168320 -148505 -174207 -238588 -226602 -201029 -177753 -226941 -230285
2863 -230285 -202376 -238368 -236742 -152575 -199239 -234706 -224348 -242965 -167321 -229407 -268699 -232142
2851 -232142 -217981 -242970 -216589 -227484 -228735 -166912 -162643 -201368 -242918 -214589 -266599 -224501
2839 -224501 -193970 -240066 -259583 -235089 -189397 -205235 -208586 -208210 -152836 -176244 -205733 -126957
2827 -126957 -148259 -176416 -192374 -188440 -198074 -230215 -229099 -255211 -265859 -247475 -292845 -288907
$$ packed form
2912a03317J9873l1488k9317N0376l489p002k0107j445J8963m4208N1244K6869
2900g3048p5795J9177j0549j8482n4950J9455K45Q7301N244k0411J2469J9479
2888h9865j3153O1L3044o7695P5448O584n5352l5861o819M9384m8225k1284n097
2875a78830L6478n4470Q661J9841J9815k5702o4381J1986K5573K3276m9188l344
2863b30285K7909l5992J626Q4167m6664l5467J0358j8617P5644o2086l9292L6557
2851b32142J4161k4989K6381j0895j251O1823M269l8725m1550K8329n2010M2098
2839b24501L0531m6096j9517K4494M5692j5838l351L76N5374k3408k9489P8776
2827a26957k1302k8157j5958L934r634l2141J116k6112j0648J8384m5370L938
$$ plain form
2815 -288907 -225037 -242542 -238713 -205688 -173874 -156474 -193520 -165939 -115017 -133016 -162686 -199367
2803 -199367 -112970 -115534 -137223 -72188 -160028 -176913 -175336 -157491 -207032 -205315 -166657 -166289 -187460
2790 -187460 -148131 -169505 -245124 -174797 -190995 -186290 -151281 -157726 -205116 -175630 -191764 -236589
2778 -236589 -230344 -199016 -177078 -231232 -229915 -170836 -88319 -142241 -208851 -263226 -210131 -190727
2766 -190727 -153992 -118677 -141320 -215145 -233371 -233610 -242393 -165324 -147561 -212209 -155296 -119521
2754 -119521 -132495 -169794 -196303 -99817 -122228 -183128 -235610 -184750 -154223 -148980 -151738 -175495
2742 -175495 -177049 -139025 -152414 -206585 -125121 -9030 -48341 -88664 -134567 -177230 -136855 -153609
2730 -153609 -140481 -72787 -29898 -73220 -71434 -124027 -87004 -77367 -131127 -96545 -71605 -60375
$$ packed form
2815b88907O3870j7505L829L3025L1814J7400l7046K7581N0922j7999k9670l6681
2803a99367Q6397k564k1689O5035q7840j6885J577J7845m9541J717L8658L68k1171
2790a87460L9329k1374p5619P0327j6198M705L5009o445m7390K9486j6134m4825
2778b36589O245L1328K1938n4154J317N9079Q2517n3922o6610n4375N3095J9404
2766a90727L6735L5315k2643p3825j8226k39q783P7069J7763o4648N6913L5775
2754a19521j2974l7299k6509R6486k2411o0900n2482N0860L0527N243k758k3757
2742a75495j554L8024j3389n4171Q1464J16091l9311m0323m5903m2663M0375j6754
2730a53609J3128O7694M2889m3322J786n2593L7023R637n3760L4582K4940J1230
$$ plain form
2718 -60375 -56842 -97136 -99482 -152397 -144474 -70485 -183765 -233673 -211239 -111137 -114201 -146568
2706 -146568 -124085 -90223 -65162 -77528 -114363 -97752 -154681 -181026 -173825 -128588 -71666 -52045
2694 -52045 -51047 -78224 -131822 -143691 -157913 -152501 -122325 -79857 -99224 -105158 -71393 -82079 -60122
2681 -60122 -31510 -90893 -134844 -118351 -105334 9989 3691 4787 66688 159245 121412 78796
2669 78796 142564 129044 14841 72018 130216 107074 51589 131566 155011 108985 95352 34220
2657 34220 16087 17855 31650 -12358 -5494 -48765 -51077 -97005 -104733 -38252 -105533 -130313 -7427
2644 -7427 40726 41305 -39710 -78064 -46653 -87007 -94660 -94361 -29678 11856 -79451 -163851 -215195
2631 -215195 -198698 -160911 -191670 -158786 -138314 -156235 -57779 -19081 -5948 14263 -70186 -62855
$$ packed form
2718f0375L533m0294k346n2915P923P3989j13280m9908K2434J00102l064l2367
2706a46568K2483L3862K5061j2366l6835J6611n6929k6345P201M5237N6922J9621
2694e2045R98k7177n3598j1869j4222N412L0176M2468j9367n934L3765j0686K1957
2681f0122K8612n9383m3951J6493J3017J15323o298J096O1901R2557l7833m2616
2669G8796O3768j3520j14203N7177N8198k3142n5485P9977K3445m6026j3633o1132
2657C4220j8133J768J3795m4008O864m3271k312m5928p728O6481o7281k4780J22886
2644g427M8153N79q1015l8354L1411m0354p653K99O4683M1534r1307q4400n1344
2631b15195J6497L7787l0759L2884K0472j7921R8456L8698J3133K0211q4449P331
$$ plain form
2619 -62855 -79784 -112089 -93075 -52441 -65099 -152799 -52395 -56285 -32211 -41978 -22782 9820
2607 9820 -32998 -21502 -62567 -9898 -13352 -4326 17637 -21970 -60948 -73784 -76809 -55946 -5850
2594 -5850 -25745 -27438 -24287 -49687 -27060 -67419 -56568 -17947 16183 16588 -83437 -18600 -45116
2581 -45116 -18956 -7032 -28038 -5572 29855 56121 -11625 23341 64026 513 8091 25133
2569 25133 12845 29476 43859 33516 -11898 28235 59964 60755 113999 94073 85533 108872
2557 108872 96865 70398 84320 116776 179779 133481 89291 144044 103279 68996 48115 43588
2545 43588 58119 58303 130388 101715 109415 71731 105611 84241 45871 118887 98929 46086
2533 46086 470 58047 62349 61156 64514 33970 37376 150624 185152 216462 212084 177705 171553
$$ packed form
2619f2855j6929l2305J9014M0634j2658q7700J00404l890K4074r767J9196L2602
2607I820m2818J1496m1065N2669l454R026K1963l9607l8978j2836l025K0863N0096
2594e850j9895j693L151k5400K2627m0359J0851L8621L4130M05j00025O4837k6516
2581d5116K6160J1924k1006K2466L5427K6266o7746L4966M0685o3513P578J7042
2569B5133j2288J6631J4383j0343m5414M0133L1729P91N3244j9926q540K3339
2557A08872j2007k6467J3922L2456O3003m6298m4190N4753m0765l4283k0881m527
2545D3588J4531J84P2085k8673P700l7684L3880k1370l8370P3016j9958n2843
2533D6086m5616N7577M302j193L358l0544L406J13248L4528L1310m378l4379o152
$$ plain form
2520 171553 120860 104424 122741 153166 215655 182596 199735 197630 167142 197866 256630 175173
2508 175173 149654 202950 230508 178669 145540 152629 171771 187924 199452 292873 344731 277351
2496 277351 296640 245900 303293 325978 365199 307247 276571 267728 281450 346544 420855 436989
2484 436989 461031 414450 405011 477167 481010 509094 546329 521777 478755 521310 514031 477991
2472 477991 442251 501061 551154 494822 551935 630761 630912 646393 636531 680825 699185 726193
2460 726193 742087 765317 869295 852955 915003 951726 952824 942497 956188 1018728 1038486 1079061
2448 1079061 1206895 1289473 1326406 1392635 1482436 1516925 1589103 1612803 1674781 1761413 1828229
2437 1828229 1932151 1990550 2024588 2041833 2096551 2185183 2290230 2375900 2419251 2503770 2575981
$$ packed form
2520A71553n0693j6436J8317L0425O2489l3059J7139k105l0488L0724N8764q1457
2508A75173k5519N3296K7558n1839l3129P089J9142J6153J1528R3421N1858o7380
2496B77351J9289n0740N7393K2685L9221n7952l0676q843J3722O5094P4311J6134
2484D36989K4042m6581r439P2156L843K8084L7235k4552m3022M2555p279l6040
2472D77991l5740N8810N0093n6332N7113P8826J51J5481r862M4294J8360K7008
2460G26193J5894K3230J03978j6340O2048L6723J098j0327J3691O2540J9758M0575
2448A079061J27834Q2578L6933O6229Q9801L4489P2178K3700O1978Q6632O6816
2437A828229J03922N8399L4038J7245N4718Q8632J05047Q5670M3351Q4519P2211
$$ plain form
2426 2575981 2682897 2830815 2929929 3143370 3411453 3709042 4132876 4560504 4839856 5130524
2416 5130524 5499177 6074255 6698512 7367539 8041942 8824699 9605953 10951396 12817186
2407 12817186 15942528 20349394 26941304 31809368 33178141 34714560 37515712 40806278
2399 40806278 45096231 48730044 52046688 50611166 46333358 42870204 38265224 33553301
2391 33553301 29328175 24644604 19846923 16330144 13517871 11546145 9970257 9099707
2383 9099707 8353359 7936401 7450114 7042310 6701098 6297764 5866174 5590374 5218399 4948649
2373 4948649 4739753 4593102 4231112 3880111 3564414 3367165 3194095 3020316 2782752 2669016
2363 2669016 2524377 2378753 2145476 2059252 1954980 1909801 1762562 1720172 1703637 1663427
$$ packed form
2426B575981J06916J47918R9114K13441K68083K97589M23834M27628K79352K90668
2416E130524L68653N75078O24257O69027O74403P82757P81254J345443J865790
2407A2817186L125342M406866O591910M868064J368773J536419K801152L290566
2399D0806278M289953L633813L316644j435522m277808l463154m604980m711923
2391C3553301m225126m683571m797681l516779k812273j971726j575888q70550
2383I099707p46348m16958m86287m07804l41212m03334m31590k75800l71975k69750
2373D948649k08896j46651l61990l51001l15697j97249j73070j73779k37564j13736
2363B669016j44639j45624k33277q6224j04272m5179j47239m2390j6535m0210
$$ plain form
2353 1663427 1674438 1623998 1507248 1483664 1421096 1362563 1294503 1348331 1252964 1201376 1235386
2342 1235386 1200424 1189835 1160055 1080732 1058614 1040990 945008 902303 891086 877546 899542
2331 899542 863094 854099 852433 816954 687402 663719 642103 554791 612570 593939 564169 545489
2319 545489 540756 533105 519161 472182 422032 435543 443079 398542 326606 372524 385343 416496
2307 416496 338515 355291 335628 272464 323634 320205 318592 235906 232539 297011 286007 253335
2295 253335 235524 240446 309989 283202 285980 229275 273989 311728 245409 176506 188673 195976
2283 195976 114253 40242 112970 87416 59139 66597 126318 140450 123074 97391 120547 104685
2271 104685 127082 89530 93603 70144 116778 89528 67091 71936 70986 56959 56912 -2144 89514
$$ packed form
2353A663427J1011n0440j16750k3584o2568n8533o8060N3828r5367n1588L4010
2342A235386l4962j0589k9780p9323k2118j7624r5982m2705j1217j3540K1996
2331H99542l6448q995j666l5479j29552k3683k1616q7312N7779j8631k9770j8680
2319E45489m733p651j3944m6979n0150J3511P536m4537p1936M5918J2819L1153
2307D16496p7981J6776j9663o3164N1170l429j613q2686l367O4472j1004l2672
2295B53335j7811M922O9543k6787K778n6705M4714L7739o6319o8903J2167P303
2283A95976q1723p4011P2728k5554k8277P458N9721J4132j7376k5683K3156j5862
2271A04685K2397l7552M073k3459M6634k7250k2437M845r50j4027m7n9056R1658
$$ plain form
2258 89514 86543 106113 172179 104735 90600 34441 9860 -31569 -38521 -54559 -26113 24417
2246 24417 58097 49585 2139 25781 -1911 30955 57183 25530 3882 -84921 -56423 44407
2234 44407 -14223 -76838 -130983 -77881 -61485 -63371 -48767 -84394 -95194 -102761 -60434 -80435
2222 -80435 -77651 -5854 10197 23847 51773 -8603 20840 -10521 -10053 -10312 -10596 -4577 -35835
2209 -35835 2278 -12819 -9484 -11090 -44476 -8449 -17409 -66464 -59435 -76722 -129298 -165463 -137201
2196 -137201 -194636 -167981 -74026 -71814 -113980 -67187 -31158 -5016 -34196 -33048 -42321 -107557
2184 -107557 -73859 -70297 -93645 -105438 -93512 -125579 -89226 -60002 4870 -20338 -47023 -38283
2172 -38283 -102940 -84436 -99402 -69441 -50488 -34115 -51569 -32567 1039 -30222 -34227 -50045
$$ packed form
2258H9514k971J9570O6066o7444j4135n6159k4581m1429o952j6038K8446N0530
2246B4417L3680q512m7446K3642k7692L2866K6228l1653k1648q8803K8498J00830
2234D4407n8630o2615n4145N3102J6396j886J4604l5627j0800p567M2327k0001
2222h0435K784P1797J6051J3650K7926o0376K9443l1361M68k59k84O019l1258
2209c5835L8113j5097L335j606l3386L6027q960m9055P029j7287n2576l6165K8262
2196a37201n7435K6655R3955K212m2166M6793L6029K6142k9180J148r273o5236
2184a07557L3698L562k3348j1793J1926l2067L6353K9224O4872k5208k6685Q740
2172c8283o4657J8504j4966K9961J8953J6373j7454J9002L3606l1261m005j5818
$$ plain form
2160 -50045 -57392 -107664 -63788 -79821 -147891 -120480 -103634 -58720 -43214 -45405 43618 18501
2148 18501 -55290 -155658 -125119 -94915 -112557 -121426 -62123 -17466 -72152 -13476 51406 34761
2136 34761 86258 111362 138949 69109 37841 95708 150049 168077 227336 194891 180310 156169
2124 156169 117835 99006 106043 87158 50297 17748 3326 -22554 -60559 -84390 -66134 -111566
2112 -111566 -89059 -106105 -125086 -102118 -57902 -43948 -40151 -43261 -78454 -75727 -123102 -122450 -138250
2099 -138250 -120621 -113461 -127066 -81313 -51775 -120169 -113886 -79916 -55754 -17553 -53373 -98178
2087 -98178 -90872 -118649 -73698 -58407 -77248 -81392 -97317 -41145 -69681 -95688 -110816 -117746
2075 -117746 -101937 -93262 -77492 -101176 -115212 -108700 -47437 9573 -50753 -69852 -10967 -37455
$$ packed form
2160e0045p347n0272M3876j6033o8070K7411J6846M4914J5506k191Q9023k5117
2148A8501p3791j00368L0539L0204j7642q869N9303M4657n4686N8676O4882j6645
2136C4761N1497K5104K7587o9840l1268N7867N4341J8028N9259l2445j4581k4141
2124A56169l8334j8829P037j8885l6861l2549j4422k5880l8005k3831J8256m5432
2112a11566K2507j7046j8981K2968M4216J3954L797l110l5193K727m7375O52j5800
2099a38250J7629P160j3605M5753K9538o8394O283L3970K4162L8201l5820m4805
2087i8178P306k7777M4951J5291j8841m144j5925N6172k8536k6007j5128o930
2075a17746J5809Q675J5770k3684j4036O512O1263N7010o0326j9099N8885k6488
$$ plain form
2063 -37455 -49886 -119086 -145088 -136764 -166745 -159711 -99525 -109658 -211285 -182106 -76332 -94913
2051 -94913 -117871 -96948 -130762 -105350 -35003 -74321 -79591 -78034 -8115 -84197 -86903 -68228
2039 -68228 -105319 -124539 -60599 -88569 -95442 -36004 -22116 -46500 -81935 -126134 -168029 -68312
2027 -68312 -79452 -108850 -85573 -39349 -35822 -115383 -60039 -19201 -27218 -124307 -97654 -106893
2015 -106893 -102659 -111483 -59843 -76573 -86507 -66857 -77846 -55487 -88920 -79722 -89306 -81760 -100076
2002 -100076 -62239 -65347 -185314 -149396 -123752 -77195 -109057 -113589 -99344 -60111 -45297 -174450
1990 -174450 -120994 -137815 -112321 -71909 -45304 -9953 -5664 -112073 -68006 -77937 -67930 30003
1978 30003 -292 -104534 -121521 -79190 -52856 -51198 -17847 -12081 -70022 -68859 -56445 -73422
$$ packed form
2063c7455j2431o9200k6002Q324k9981P034O0186j0133j01627K9179J05774j8581
2051i4913k2958K0923l3814K5412P0347l9318n270J557O9919p6082k706J8675
2039f8228l7091j9220O3940k7970o873N9438J3888k4384l5435m4199m1895R9717
2027f8312j1140k9398K3277M6224L527p9561N5344M0838q017r7089K6653r239
2015a06893M234q824N1640j6730r934J9650j0989K2359l3433R198r584P546j8316
2002a00076L7837l108j19967L5918K5644M6557l1862m532J4245L9233J4814j29153
1990a74450N3456j6821K5494M0412K6605L5351M289j06409M4067r931J0007R7933
1978C0003l0295j04242j6987M2331K6334J658L3351N766n7941J163J2414j6977
$$ plain form
1966 -73422 -72013 -86386 10671 -48570 -65069 -60985 -118905 -103169 -95874 -139339 -67484 -99059
1954 -99059 -114747 -99194 -138743 -149708 -105406 -32402 -87633 -81444 -111035 -100134 -74355 -53483
1942 -53483 -50062 -85756 -132342 -137256 -110120 -89080 -50651 -68831 -16973 -39110 -41658 -29853
1930 -29853 -97269 -110836 -139237 -126735 -152386 -136327 -34255 -46456 -91864 -71170 -144209 -165003
1918 -165003 -171241 -60654 -33856 -86459 -41406 -47678 -66377 -34266 -15569 -17616 7013 -8246
1906 -8246 -17987 -84907 -131574 -83963 29175 -11606 -74421 -72757 20139 51877 28933 16186
1894 16186 15684 13049 8963 -1901 -16870 -3377 -48049 -23660 -70074 -101337 -61464 -60606 -98960
1881 -98960 -59074 -12705 -34229 -25489 -33108 -86147 -68369 -102858 -82301 7977 -68579 -102339
$$ packed form
1966g3422J409j4373R7057n9241j6499M084n7920J5736P295m3465P1855l1575
1954i9059j5688J5553l9549j0965M4302P3004n5231O189k9591J0901K5779K0872
1942e3483L421l5694m6586m914K7136K1040L8429j8180N1858k2137k548J1805
1930b9853o7416j3567k8401J2502k5651J6059J02072j2201m5408K0694p3039k0794
1918a65003o238J10587K6798n2603M5053o272j8699L2111J8697k047K4629j5259
1906h246r741o6920m6667M7611J13138m0781o2815J664R2896L1738k2944j2747
1894A6186n02k635m086j0864j4969J3493m4672K4389m6414l1263L9873Q58l8354
1881i8960L9886M6369k1524Q740p619n3039J7778l4489K0557R0278p6556l3760
$$ plain form
1869 -102339 18015 -21575 -53356 -34592 -36161 -101876 -43458 -24123 -35241 -22453 -72529 -60509
1857 -60509 -48445 -50359 -15220 32692 -22524 -65416 -84851 -43214 12087 2884 -66881 -41513
1845 -41513 -56348 -54060 -47795 -6810 918 -125799 -75822 -42244 -42819 -16510 -132104 -144385
1833 -144385 -129549 -58575 6311 20650 -17206 -21034 22061 -23807 -16417 4865 -97405 -115729
1821 -115729 -103527 -35166 -50452 -102658 -6699 -17073 -52840 -74128 -77581 -45435 -40578 -5968
1809 -5968 -28760 -9474 27647 -2134 45489 -13341 -53513 -95344 -87625 -64973 -38282 -64156
1797 -64156 -49011 -28934 -29483 -5929 -14913 -53751 -67521 7095 21824 -19817 -7427 34729
1785 34729 6183 -14182 -20773 -48353 894 -19131 -16983 -50339 9726 18460 -24782 -20187 10697
$$ packed form
1869a02339J20354l9590l1781J8764j569o5715N8418J9335j1118J2788n0076J2020
1857f0509J2064j914L5139M7912n5216m2892j9435M1637N5301r203o9765K5368
1845d1513j4835K288O265M0985P728j26717M9977L3578n75K6309j15594j2281
1833a44385J4836P0974O4886J4339l7856l828M3095m5868P390K1282j02270j8324
1821a15729J2202O8361j5286n2206R5959j0374l5767k1288l453L2146M857L4610
1809e968k2792J9286L7121k9781M7623n8830m0172m1831P719K2652K6691k5874
1797f4156J5145K0077n49K3554q984l8838j3770P4616J4729m1641J2390M2156
1785C4729k8546k0365o591k7580M9247k0025K148l3356O0065Q734m3242M595L0884
$$ plain form
1772 10697 -8611 -71645 -117263 -155644 -94558 -10092 -50479 -49750 -88865 -54657 41267 -9158
1760 -9158 16809 32064 42492 17993 -21456 -14613 -33314 -25318 -1193 -49500 -12375 -26076
1748 -26076 -33321 -17112 -47382 -62386 32706 -20592 -89406 -49777 -65899 -31561 18619 -11032
1736 -11032 48006 -2699 55560 49402 -5663 24485 19635 38601 60976 -41319 -72077 -65937
$$ packed form
1772A0697j9308o3034m5618l8381O1086Q4466m0387P29l9115L4208R5924n0425
1760i158K5967J5255J0428k4499l9449O843j8701P996K4125m8307L7125j3701
1748b6076p245J6209l0270j5004R5092n3298o8814L9629j6122L4338N0180k9651
1736a1032N9038n0705N8259o158n5065L0148m850J8966K2375j02295l0758O140
$$ [...]
##END NTUPLES=NMR SPECTRUM
##END=
