##TITLE=1H_DE-80H_X3
 200.13MHz, d2o
 8 sc
 
 19ns.26.2.2025
##JCAMPDX= 6.0         $$ Bruker NMR JCAMP-DX V2.0
##DATA TYPE= NMR SPECTRUM
##DATA CLASS= NTUPLES
##ORIGIN= UXNMR, Bruker Analytische Messtechnik GmbH
##OWNER= pz
$$ XWIN-NMR		Version 3.5
$$ Tue Mar 17 10:15:56 2026 Russian Standard Time (UT+4h)  Yarkov@DPX200
##.OBSERVE FREQUENCY= 200.1313
##.OBSERVE NUCLEUS= ^1H
##.ACQUISITION MODE= SIMULTANEOUS
##.ACQUISITION SCHEME= undefined
##.AVERAGES= 8
##.DIGITISER RES= 18
##SPECTROMETER/DATA SYSTEM= spect
##.PULSE SEQUENCE= zg30
##.SOLVENT NAME= DMSO
##.SHIFT REFERENCE= (INTERNAL, DMSO, 0, 15.4604)
##AUDIT TRAIL= $$ (NUMBER, WHEN, WHO, WHERE, WHAT)
$$ ##TITLE= Audit trail, XWIN-NMR		Version 3.5
$$ ##JCAMPDX= 5.01
$$ ##ORIGIN= Bruker BioSpin GmbH
$$ ##OWNER= Yarkov
$$ C:/Bruker/XWIN-NMR/data/yarkov2/nmr/H-C/1/pdata/1/auditp.txt
$$ ##AUDIT TRAIL=  $$ (NUMBER, WHEN, WHO, WHERE, WHAT)
(   1,<2026-03-17 10:15:02.89 +0400>,<Yarkov>,<DPX200>,
      <created by zg, POWCHK disabled, PULCHK disabled
       configuration hash MD5:
       00 E9 B6 7A A2 85 ED C7 34 08 36 98 17 FE 4E 26
       data hash MD5: 16K
       5D 27 C5 7E 4C E7 2F 5D 81 3D FA AD FB D1 C3 90>)
(   2,<2026-03-17 10:15:09.23 +0400>,<Yarkov>,<DPX200>,
      <Start of raw data processing
       efp BC_mod = 2 LB = 0.25 FT_mod = 6 PKNL = 1 PHC0 = -5299.148 PHC1 = 6.821927 SI = 16K 
       data hash MD5: 16K
       68 48 00 8D CE 53 7D 16 B7 B2 41 5E FD 01 93 1F>)
$$ ##END=
$$ 
$$ hash MD5
$$ 73 F5 31 00 C5 DA 02 63 10 48 32 CC 28 1F 67 4B
##$RELAX= 
##$RELAX= 
##$RELAX= 
##$RELAX= 
##$RELAX= 
##$RELAX= 
$$ Bruker specific parameters
$$ --------------------------
##$DU= <C:/Bruker/XWIN-NMR>
##$EXPNO= 1
##$NAME= <H-C>
##$PROCNO= 1
##$TYPE= <nmr>
##$USER= <yarkov2>
##$AMP= (0..31)
100 100 100 100 100 100 100 100 100 100 100 100 100 100 100 100 100 100 
100 100 100 100 100 100 100 100 100 100 100 100 100 100 
##$AQSEQ= 0
##$AQ_mod= 1
##$AUNM= <au_zg>
##$AUTOPOS= <>
##$BF1= 200.13
##$BF2= 200.13
##$BF3= 200.13
##$BF4= 200.13
##$BF5= 200.13
##$BF6= 200.13
##$BF7= 200.13
##$BF8= 200.13
##$BYTORDA= 1
##$CFDGTYP= 0
##$CFRGTYP= 5
##$CHEMSTR= <none>
##$CNST= (0..31)
1 1 145 1 1 1 1 1 1 1 1 1 1 1 1 1 1 1 1 1 1 1 1 1 1 1 1 1 1 1 1 1 
##$CPDPRG= <>
##$CPDPRG1= <>
##$CPDPRG2= <>
##$CPDPRG3= <>
##$CPDPRG4= <mlev>
##$CPDPRG5= <mlev>
##$CPDPRG6= <mlev>
##$CPDPRG7= <mlev>
##$CPDPRG8= <mlev>
##$CPDPRGB= <>
##$CPDPRGT= <>
##$D= (0..31)
0 0.7 0 0 0 0 0 0 0 0 0 0.03 0 0 0 0 0 0 0 0 0 0 0 0 0 0 0 0 0 0 0 0 
##$DATE= 1773728102
##$DBL= (0..7)
120 120 120 120 120 120 120 120 
##$DBP= (0..7)
150 150 150 150 150 150 150 150 
##$DBP07= 0
##$DBPNAM0= <>
##$DBPNAM1= <>
##$DBPNAM2= <>
##$DBPNAM3= <>
##$DBPNAM4= <>
##$DBPNAM5= <>
##$DBPNAM6= <>
##$DBPNAM7= <>
##$DBPOAL= (0..7)
0.5 0.5 0.5 0.5 0.5 0.5 0.5 0.5 
##$DBPOFFS= (0..7)
0 0 0 0 0 0 0 0 
##$DE= 6
##$DECBNUC= <off>
##$DECIM= 32
##$DECNUC= <off>
##$DECSTAT= 4
##$DIGMOD= 1
##$DIGTYP= 9
##$DL= (0..7)
0 120 120 120 120 120 120 120 
##$DP= (0..7)
$$ [...]
##$SUBNAM2= <"">
##$SUBNAM3= <"">
##$SUBNAM4= <"">
##$SUBNAM5= <"">
##$SUBNAM6= <"">
##$SUBNAM7= <"">
##$SUBNAM8= <"">
##$SUBNAM9= <"">
##$SW= 18.0517328524113
##$SWIBOX= (0..15)
0 0 2 0 0 0 0 0 0 0 0 0 0 0 0 0 
##$SW_h= 3612.71676300578
##$TD= 16384
##$TD0= 1
##$TE= 0
##$TE2= 300
##$TE3= 300
##$TEG= 300
##$TL= (0..7)
0 120 120 120 120 120 120 120 
##$TP= (0..7)
150 150 150 150 150 150 150 150 
##$TP07= 0
##$TPNAME0= <>
##$TPNAME1= <>
##$TPNAME2= <>
##$TPNAME3= <>
##$TPNAME4= <>
##$TPNAME5= <>
##$TPNAME6= <>
##$TPNAME7= <>
##$TPOAL= (0..7)
0.5 0.5 0.5 0.5 0.5 0.5 0.5 0.5 
##$TPOFFS= (0..7)
0 0 0 0 0 0 0 0 
##$TUNHIN= 0
##$TUNHOUT= 0
##$TUNXOUT= 0
##$USERA1= <user>
##$USERA2= <user>
##$USERA3= <user>
##$USERA4= <user>
##$USERA5= <user>
##$V9= 5
##$VALIST= <valist>
##$VCLIST= <CCCCCCCCCCCCCCC>
##$VD= 0
##$VDLIST= <DDDDDDDDDDDDDDD>
##$VPLIST= <PPPPPPPPPPPPPPP>
##$VTLIST= <TTTTTTTTTTTTTTT>
##$WBST= 1024
##$WBSW= 4
##$XGAIN= (0..3)
0 0 0 0 
##$XL= 0
##$YL= 0
##$YMAX_a= 316234
##$YMIN_a= -256961
##$ZGOPTNS= <>
##$ZL1= 120
##$ZL2= 120
##$ZL3= 120
##$ZL4= 120
##$ABSF1= 0
##$ABSF2= 0
##$ABSG= 0
##$ABSL= 0
##$ALPHA= 0
##$AQORDER= 0
##$ASSFAC= 0
##$ASSFACI= 0
##$ASSFACX= 0
##$ASSWID= 0
##$AUNMP= <proc_1d>
##$AZFE= 0.1
##$AZFW= 0.1
##$BCFW= 0
##$BC_mod= 2
##$BYTORDP= 0
##$COROFFS= 0
##$CY= -3
##$DATMOD= 1
##$DC= 0
##$DFILT= <>
##$DTYPP= 0
##$F1P= 0
##$F2P= 0
##$FCOR= 1
##$FTSIZE= 16384
##$FT_mod= 6
##$GAMMA= 0
##$GB= 0
##$INTBC= 1
##$INTSCL= 3.241238e-09
##$ISEN= 128
##$LB= 0.25
##$LEV0= 0
##$LPBIN= 0
##$MAXI= 10000
##$MC2= 0
##$MEAN= 0
##$ME_mod= 0
##$MI= 1.114404
##$NCOEF= 0
##$NC_proc= -7
##$NLEV= 6
##$NOISF1= 3.799351
##$NOISF2= 2.8
##$NSP= 0
##$NTH_PI= 0
##$NZP= 0
##$OFFSET= 15.46042
##$PC= 1
##$PHC0= -5299.148
##$PHC1= 6.821927
##$PH_mod= 1
##$PKNL= yes
##$PPARMOD= 0
##$PSCAL= 0
##$PSIGN= 0
##$REVERSE= no
##$SF= 200.130012263401
##$SI= 16384
##$SIGF1= 3
##$SIGF2= 2
##$SINO= 0.751879
##$SIOLD= 32768
##$SREGLST= <19F.Aceton>
##$SSB= 0
##$STSI= 16384
##$STSR= 0
##$SW_p= 3612.71676300578
##$SYMM= 0
##$S_DEV= 0
##$TDeff= 16384
##$TDoff= 0
##$TI= <>
##$TILT= no
##$TM1= 0
##$TM2= 0
##$TOPLEV= 0
##$USERP1= <user>
##$USERP2= <user>
##$USERP3= <user>
##$USERP4= <user>
##$USERP5= <user>
##$WDW= 1
##$XDIM= 16384
##$YMAX_p= 314201561
##$YMIN_p= -1225729
$$ End of Bruker specific parameters
$$ ---------------------------------
##NTUPLES= NMR SPECTRUM
##VAR_NAME=  FREQUENCY,     SPECTRUM/REAL,   SPECTRUM/IMAG
##SYMBOL=    X,             R,               I
##VAR_TYPE=  INDEPENDENT,   DEPENDENT,       DEPENDENT
##VAR_FORM=  AFFN,          ASDF,            ASDF
##VAR_DIM=   16384,         16384,           16384
##UNITS=     HZ,            ARBITRARY UNITS, ARBITRARY UNITS
##FACTOR=    0.220516191357247, 1,           1
##FIRST=     3094.09397512169, 0,            0
##LAST=      -518.622787884086, 0,           0
##MIN=       -518.622787884086, -1225729,    0
##MAX=       3094.09397512169, 314201561,    0
$$ Real data points
##PAGE= N=1
##DATA TABLE= (X++(R..R)), XYDATA
$$ [...]
7729H18440j58882r5112o6130L0303k20395n6103m4036j43709M2142L5946L8364
7718A80828l9285j9224n197j52212l7028P3675N8443o9127j49295p3162M4364
7707a87220J27124O0759J24980J02619J4913L1526o5974J446j10025n318j7996
7696G6834k6771J64678q2103r0025K3328k4224O2443j27726j25164K3297p1405
7685a96838L4318Q2351j40591j09637J77947R7229o0383j35621J85186q010p4227
7674a48276m2458J23137r9355L5868N3866P848j8319K4066O793m0560M2878j24073
7662a78585N395O2923r2655j366j6690j55324J8398O574P8187O5471q444k5118
7650b41234J01504M7446Q061q2438m2134J04492r513p1405K881n0163Q7379J02430
$$ y = [818440, 659558, 564446, 498316, 528619, 308224, 252121, 208085, 64376, 106518, 142464, 180828, 141543, 122319, 117122, -35090, -72118, 1557, 60000, -9127, -158422, -231584, -187220, -60096, 663, 125643, 228262, 243175, 274701, 208727, 210173, 100148, 94830, 76834, 50063, 214741, 132638, 42613, 65941, 41717, 104160, -23566, -148730, -125433, -196838, -162520, -80169, -220760, -330397, -152450, -55221, -115604, -251225, -66039, -74049, -148276, -190734, -67597, -166952, -131084, -77218, -69370, -87689, -63623, -56830, -97390, -54512, -178585, -173190, -110267, -202922, -204288, -220978, -376302, -357904, -351330, -273143, -207672, -216116, -241234, -139730, -92284, -84223, -166661, -208795, -104303, -113816, -185221, -182340, -232503, -145124, -42694]
7638d2694k19150o8272M2657o486M0741l4026N6942j14593Q0900J21559j02500
7627b44922P1295k4937k3601l5739o0856k6537J5183O462M3407J15090O4369j087
7615a01873j47982j22358p3974J6527O2667N1410l9065Q5015k495m243m7466r8211
7603d22048q6208P4383M0736Q5816J79542j36146o7615K0036q1680K08528o0416
7592b45072j64369J11602L2728L046J4398o6712O3410j24904P537o496Q1036M9261
7580b44535J8598M6095p2699k7227o7487N9097m0192J5988j6428K7162j04175
7569d05803K4588q0418n4954O9324M1427R7348j36982J00010R1431M9880K8638
7558a75511j0261o8024j20536M7260K9580O0223j07731Q841r9564J12679L8171
$$ y = [-42694, -261844, -330116, -287459, -293945, -253204, -287230, -230288, -344881, -263981, -142422, -244922, -173627, -198564, -222165, -257904, -318760, -345297, -330114, -323652, -280245, -165155, -100786, -101873, -249855, -372213, -446187, -429660, -366993, -315583, -354648, -269633, -272128, -276371, -323837, -422048, -508256, -433873, -393137, -307321, -127779, -263925, -331540, -311504, -393184, -184656, -245072, -409441, -297839, -265111, -262065, -247667, -314379, -250969, -375873, -368336, -374832, -293796, -244535, -225937, -179842, -252541, -279768, -347255, -288158, -328350, -312362, -328790, -301628, -405803, -381215, -461633, -516587, -447263, -405836, -308488, -445470, -345460, -254029, -204149, -175511, -185772, -253796, -374332, -327072, -297492, -237269, -345000, -336159, -435723, -323044, -284873]
7547b84873p311N1884Q6238j63152J17913p1484j21297K0173O5697L470n8846
7536c61588j77663L0447R2180o1457L1099R4059j12111R7006k9353p1564R7847
7525c71098l4261j28667R3527J11683j15242O4752Q4113j09728M9004k1461p3362
7514d50740O0103J9123J72837j07290J5342j923M4381p8250q0103M2167j9638
7503c83991r6938M5057P6593j9394m9271J58200p6753M0873J26907J0057R9888
7492f8772j53058p0559K839J6334m943M6802N361r9689k3193P8425J27819j07014
7480b49648L7361M6413l2543n0395n6103p8037R1683M6721K510n0412k1137j2302
7468c25889j4983r3757J7461J19765J8723O4263K34879j92764j26070l5331j25183
$$ y = [-284873, -292184, -240300, -154062, -317214, -199301, -270785, -392082, -371909, -306212, -302742, -361588, -539251, -508804, -416624, -478081, -446982, -352923, -465034, -368028, -397381, -468945, -371098, -405359, -534026, -440499, -328816, -444058, -379306, -295193, -404921, -355917, -377378, -450740, -390637, -371514, -198677, -305967, -290625, -292548, -248167, -326417, -406520, -364353, -383991, -480929, -435872, -359279, -378673, -427944, -269744, -346497, -305624, -178717, -168660, -68772, -221830, -292389, -289550, -273216, -278159, -231357, -225996, -325685, -348878, -270453, -142634, -249648, -212287, -165874, -198417, -248812, -304915, -382952, -291269, -244548, -242038, -292450, -313587, -325889, -340872, -434629, -417168, -297403, -278680, -214417, 20462, -172302, -298372, -333703, -458886]
7457d58886J02167J47382J20011k55268n9619K67038r9874j9098J5116M8459L2257
7446a60315j22699M3515r0451K3448J94066k7666K3847n5870L0749q9188m6487
7435b77051J2679k951R454R1161j9182j8006l4857M9922r7764J218n536m4915
7423c35828J00695L1947P8294o9677j76218L2364k8559K0274K6938m7945K1829
7412c45886j13264N1307j07430k9754P5378N7064L6683P8022q3142J25584r9672
7401c55110L8985N0285N0728j46500J776l2547J42055p6929Q728R6939l2347k4891
7389b78828M0331N534r5361o1561K1874R6397K9067P230j2881j39322n8006J06150
7377c39376q8635p193O3148R1580M2079j09758j39729m4197O8897J96262p3831
$$ y = [-458886, -356719, -209337, -89326, -344594, -404213, -137175, -237049, -256147, -241031, -192572, -160315, -283014, -239499, -329950, -306502, -112436, -140102, -116255, -172125, -141376, -230564, -277051, -264372, -267323, -257869, -166708, -185890, -203896, -238753, -188831, -286595, -285377, -290913, -335828, -235133, -203186, -124892, -194569, -370787, -338423, -366982, -346708, -319770, -367715, -345886, -459150, -407843, -515273, -545027, -469649, -412585, -375902, -297880, -381022, -255438, -355110, -316125, -265840, -215112, -361612, -359836, -392383, -250328, -327257, -318529, -221590, -253937, -278828, -238497, -232963, -328324, -389885, -368011, -271614, -242547, -235317, -248198, -387520, -445526, -339376, -428011, -435204, -372056, -280476, -238397, -348155, -487884, -532081, -463184, -266922, -340753]
7366c40753j08621K1732O5472N063j04763Q9982m5458o5344Q1624Q3212n0497
7355c68351j04590M2035o4023N6713J09160l4343J0481o2725J2106R8429K4866
7344b80242P3808j43141L5578J20522K5847o8216j1178J53288p8819O7031J82297
7333G6775J6894J28262J9821j0857k5898k00353j45715o4737J3114j3182q1258
7322b87134p4534O4858L292N4452R956r4513n5222m2734l574R2541J00192k963
7310b35383j43359m9357N126R9757k1976o4824P0588k3420J28158j16655j93474
7299e44819P4726J16782j35558M8392j43613L2519N6587L9025R5092J1900k0020
7288c68987J50787q6600J4956L6214m8906Q9359q41J587j94722r0212L6851R9833
$$ y = [-340753, -449374, -427642, -362170, -357107, -461870, -371888, -417346, -482690, -401066, -317854, -368351, -472941, -430906, -494929, -438216, -329056, -363399, -352918, -415643, -403537, -305108, -280242, -206434, -349575, -313997, -193475, -167628, -235844, -247022, -93734, -172553, -105522, 76775, 93669, 221931, 241752, 230895, 204997, 4644, -141071, -205808, -192694, -205876, -287134, -361668, -296810, -293518, -239066, -229110, -323623, -378845, -421579, -425153, -332612, -232420, -235383, -378742, -428099, -422973, -323216, -345192, -410016, -339428, -362848, -234690, -351345, -544819, -470093, -353311, -488869, -440477, -584090, -551571, -494984, -455959, -360867, -348967, -368987, -218200, -304800, -289844, -253630, -302536, -213177, -214018, -212431, -407153, -497365, -460514, -360681]
7276c60681J56229n5825k2676N4009m3004O5710J0208l0438n983o1714J9914j9409
7264b93660K08359L7718j42092j03495q7970J7589R3348j01156l0255L9856o2976
7253d24734Q5828J6653q1771r0599k6096J77462L3903j52468j7146K4726R7411
7242c56831n9040m9011m490M1442O9833O932q0785K2468p2536N7176L4296J2881
7230c77665Q100n8205j0922J51305Q3886p4439j25288l265O3243R321j81523J77884
7218c37568j10951M6021J95527N4976j13077p661m9506o5430N8692j02302J07272
7207c24007M3494r6620j07135k0346J61614J20370m4435j01018j12435R5281N8488
7196c26749N8454J65793L2151l9821J9604k59808m7680K623j8701O5709K4111
$$ y = [-360681, -204452, -260277, -282953, -228944, -271948, -206238, -196030, -226468, -232451, -294165, -274251, -293660, -85301, -47583, -189675, -293170, -381140, -363551, -270203, -371359, -401614, -361758, -424734, -338906, -322253, -404024, -494623, -520719, -343257, -309354, -461822, -478968, -454242, -356831, -415871, -464882, -469372, -427930, -358097, -351165, -431950, -409482, -482018, -424842, -390546, -377665, -369565, -427770, -438692, -287387, -203501, -277940, -403228, -406493, -343250, -333929, -515452, -337568, -448519, -402498, -206971, -151995, -265072, -272733, -322239, -387669, -328977, -431279, -324007, -280513, -377133, -484268, -504614, -343000, -222630, -267065, -368083, -480518, -385237, -326749, -268295, -102502, -70351, -110172, -90568, -350376, -398056, -395433, -414134, -348425, -324314]
7185c24314N1142k3881L5355o4668J2413J2602J17680Q9492j0615j12068j47233
7174c64095P0883M9051O8803j2469m1920l8207M4078O3166J22593r9393p8645
7163b16155n3685R4287Q8084j59461K1687J7797R3142j0402j01287J47902o6165
7152a44256J00730l1234M7066J6791q6015N6390K6361J1448O3709j4181o1300
7141a4491P5315J4105j3234R1787K5768r388M2964l8951j07958q8178J07075n8877
7129B5937L8254J92343k8020l1605J6715J03399L0228J8984j58231P4561P0048
7118C52613M0043M2252j9143k9009J299L3667O6986J32641m94l9629j13784J83525
7106F50967K4987j08291K8558J61926r0531j5583J33384k2700L8036L9041r0791
$$ y = [-324314, -273172, -297053, -261698, -326366, -313953, -301351, -183671, -94179, -104794, -216862, -364095, -293212, -244161, -175358, -187827, -229747, -267954, -223876, -160710, -38117, -137510, -216155, -269840, -175553, -87469, -246930, -225243, -207446, -114304, -124706, -225993, -78091, -144256, -43526, -74760, -27694, -10903, -96918, -40528, -14167, -2719, 60990, 46809, -14491, 60824, 74929, 61695, 153482, 179250, 169862, 212826, 173875, 65917, -22261, 84814, 25937, 64191, 256534, 228514, 196909, 213624, 317023, 347251, 366235, 208004, 282565, 352613, 392656, 434908, 415765, 386756, 388055, 421722, 488708, 621349, 620855, 581226, 467442, 650967, 675954, 567663, 596221, 758147, 667616, 652033, 785417, 762717, 800753, 839794, 749003]
7095G49003m4192L1177m0668K03087k8736j36606r6528j1396P2965J26811J6065
7084H40982K3942j56990k33094K56285p435k4602j22926l5534l5262m864k8342
7073D72160j2131R2578Q9975k2196q3474j19232N3768n5266M5165m1021j41702
7062B78624P2063J4583j4191o7345J10960l5300o4307m3919m6809P175k5203j36551
7050D9780k7494J01361j4121l0217m2807P7953O4017m8647q1615L3555j4916o8031
7038a182p785L4735r6027q0073k7929K1559O7017q8339r1554J23748K10095j62944
7026i8679j14186M0852J5287p995j06323J51191J3477j47967K330n3137n005Q5860
7014b24295m5536n0901O5487m1847K9954m12p0056r4498J10062R3751k1349M7267
$$ y = [749003, 704811, 735988, 695320, 898407, 869671, 733065, 636537, 625141, 698106, 824917, 840982, 864924, 707934, 474840, 731125, 723690, 699088, 576162, 540628, 505366, 500502, 472160, 460029, 552607, 642582, 620386, 536912, 417680, 471448, 416182, 461347, 420326, 278624, 350687, 365270, 351079, 283734, 394694, 359394, 295087, 251168, 204359, 211534, 186331, 49780, 22286, 123647, 109526, 79309, 36502, 114455, 178472, 129825, 48210, 81765, 66849, -1182, -8967, 25768, -70259, -150332, -178261, -156702, -89685, -178024, -269578, -145830, 64265, -98679, -212865, -172013, -156726, -164721, -271044, -119853, -106376, -254343, -252013, -305150, -310155, -224295, -269831, -320732, -255245, -297092, -267138, -267550, -337606, -432104, -322042, -228291, -249640, -202373]
7002b02373R8979k3667k59412j5910K4234k2847J70599L752j16721O3261J05829
6991a74276K1648j0597k02589m5253R8511Q6085Q227n3881P3152j8826j283P0159
6979a48923n8105r5627M142k270n7845K2944o2035K5355J94315K464q1553k6851
6967b83989q2554J87613l5972o1878O0640M3291J69780p2843O4414L3683P745
6956B9930k3240L160K0538j39306L777P505k2764L8072o35n4523q403l7622o5941
6943b49452q5486N9878J6084q0695K760j05011J54025O3942m634j07203o3452
6932c99244J00134j22457o380R2476o2078l8331J95706N4192j85334l4989Q3587
6921c22718r2871p4606j0745K6771K4871n6169J03156L7411r3911j0550n1627
$$ y = [-202373, -103394, -127061, -386473, -402383, -378149, -400996, -230397, -226645, -343366, -280105, -174276, -152628, -163225, -365814, -411067, -312556, -226471, -218244, -272125, -198973, -217799, -219082, -148923, -207028, -302655, -298513, -300783, -358628, -335684, -397719, -372364, -178049, -175585, -257138, -283989, -366543, -178930, -214902, -276780, -216140, -172849, -3069, -75912, -11498, 22185, 29930, 6690, 9850, 30388, -108918, -105141, -97636, -120400, -82328, -82963, -137486, -145889, -183511, -249452, -334938, -275060, -258976, -339671, -336911, -441922, -287897, -223955, -228589, -335792, -399244, -299110, -421567, -427947, -335471, -397549, -435880, -240174, -185982, -371316, -406305, -322718, -415589, -490195, -500940, -474169, -449298, -505467, -402311, -364900, -458811, -469361, -520988]
6910e20988P484p7247R5221j0772M2067Q0026m0758l8433M9669n7928k0159j29452
6898f21270n7956J47547J64472Q836k1685k3358K5391m0162k4950K7886j9562
6887d34811j71823L1713J36893p4023O0566n336l0188j36191J21858J29583j05560
6876d77319j31563m4843P9286m6219n6732Q1768M2088J38629j84399J917J30387
6865d67000N4386j53263q2726J92631j06775K177Q7094n3927J1474O572o2084
6854e71441m3190O1097J66572k3999p6967J8190n7690o0600k18420P6714R969
6843g19765M0793r530J29868P753p8517O0492P3510j64668r7776k2702J10631
6832f69911q5913L4012R3266O3598O1103n272j13471K0031N8118p015K9285r264
$$ y = [-520988, -513504, -590751, -495530, -506302, -464235, -384209, -424967, -463400, -413731, -471659, -491818, -621270, -679226, -531679, -367207, -358371, -380056, -403414, -378023, -418185, -443135, -415249, -434811, -606634, -574921, -438028, -512051, -451485, -456821, -487009, -623200, -501342, -371759, -477319, -608882, -653725, -574439, -620658, -677390, -595622, -553534, -414905, -599304, -597387, -467000, -412614, -565877, -648603, -455972, -562747, -560570, -473476, -527403, -515929, -509357, -571441, -614631, -553534, -386962, -410961, -487928, -469738, -527428, -588028, -806448, -729734, -719765, -678972, -688502, -558634, -550881, -629398, -568906, -495396, -660064, -757840, -780542, -669911, -755824, -721812, -628546, -564948, -503845, -509117, -622588, -602557, -544439, -551454, -522169, -531433]
6820e31433J55895j03542j27512K7377j8995q1972J41488n6206j77293M5099J77237
6809e49857j3867j04527n1895Q7186j06634j4529j6734J73924J19473n3310O1977
6798d68793j56700q3998Q6523p58K5560j9052J88082k6651j33988K7531j5174
6787e77418M696O6240j5486l2103j3093J43873j12117o2429P9158j0367q6506
6776f15552O0943n2094j54269J24838J04468J1387j5430J01961n3995K6064K1232
6765d40447k35376q7023K5679O7618Q8176l9915j6483k1918R4265l014J5343L6786
6753e16309n6355J06016o3597j0636M8321n2099Q2187j92984k4883p3515R7327
6742f56527O1960J2310L7574j04019L9861J62402m0169q7189O2298j03079J29356
$$ y = [-531433, -375538, -479080, -606592, -579215, -598210, -680182, -538694, -594900, -772193, -727094, -549857, -563724, -668251, -720146, -632960, -739594, -754123, -770857, -596933, -477460, -530770, -468793, -625493, -709491, -622968, -623726, -598166, -617218, -429136, -455787, -589775, -562244, -577418, -572722, -506482, -521968, -554071, -567164, -423291, -535408, -597837, -518679, -529046, -615552, -554609, -606703, -760972, -636134, -531666, -520279, -535709, -433748, -487743, -461679, -440447, -675823, -762846, -737167, -669549, -581373, -621288, -637771, -659689, -565424, -568438, -553095, -516309, -572664, -466648, -530245, -540881, -492560, -544659, -462472, -655456, -680339, -753854, -656527, -594567, -582257, -544683, -648702, -608841, -446439, -486608, -573797, -511499, -614578, -485222]
6731d85222j55026n2729N4597j138J62704M6162p5958n7143P6263Q7378j90183
6720e90295J9701J34655K5506k08455o4509L5188l9785J18511J07532o0404L6645
6709d85710N0884r5639p7056M1603J19907m293j15169l1661J17086N798P8643
6698c95607n71j36844n5236J11523Q7295j59828j7113J1618Q0912L6921n3220
6687d90150J5408j43591l226O5878l1542Q41j2811K6803p0626M9146J70020K3372
6675d00478l3527l919O4365M4022K4522m5975k7324n2896Q1165P5095K8115K06082
6663d0753R2230l3317o4666J43734J4986q7604j45526m4993m246j9763J76544
6652a3374K17396J24643L4160O3554J7250L1006j38714J8714k58912j57498O5210
$$ y = [-485222, -640248, -692977, -638380, -639518, -476814, -430652, -506610, -563753, -487490, -400112, -590295, -570594, -435939, -410433, -618888, -683397, -648209, -687994, -569483, -461951, -522355, -485710, -434826, -530465, -607521, -565918, -446011, -450304, -565473, -597134, -480048, -474250, -395607, -396178, -533022, -588258, -476735, -389440, -549268, -566381, -554763, -473851, -436930, -490150, -474742, -618333, -621559, -555681, -587223, -586382, -599193, -572390, -643016, -593870, -423850, -400478, -434005, -437924, -373559, -329537, -305015, -350990, -378314, -431210, -350045, -274950, -246835, -40753, 51477, 18160, -46506, 97228, 112214, 24610, -120916, -165909, -170155, -189918, -13374, 204022, 328665, 362825, 426379, 443629, 474635, 335921, 354635, 95723, -61775, 3435]
6641C435j34575L4517J82481k1530L7981k37364q5715J00849J31265k1281k11710
6630b21647j59889N7871j10387l7444R3138J3726j03449o2786J03061J53646M8942
6619b25218j15858j56729m6761L1893p4504J04268L6141P2664L7663j09558n8758
6608e04757p9134P0879K7180R779l4486k4978Q5149L2628j7127k2936k7988J24438
6596c61353J22307K8534J80910K51920J05335J72412M1621n6933m4952L0392K9755
6585D99948j48623o7798K5157L9088J52750K30993J48013J8871J36329Q2178q8631
6574A028275q0424j81228j28451k91324K3853l8621m4718m1644R6243o5031j21741
6563A55189N0917l8048J387m8737j48097q9036l1848j1446K2546R2744K3032j23660
$$ y = [3435, -131140, -96623, 85858, 64328, 102309, -135055, -220770, -119921, 11344, -9937, -221647, -381536, -323665, -434052, -471496, -378358, -364632, -468081, -530867, -427806, -274160, -225218, -341076, -497805, -544566, -512673, -587177, -482909, -446768, -374104, -336441, -445999, -504757, -583891, -513012, -485832, -476053, -510539, -535517, -450368, -417740, -434867, -457803, -485791, -361353, -239046, -210512, -29602, 222318, 327653, 500065, 541686, 484753, 439801, 470193, 499948, 351325, 283527, 308684, 347772, 500522, 731515, 879528, 898399, 1034728, 1116906, 1028275, 947851, 766623, 638172, 346848, 370701, 332080, 287362, 245718, 341961, 276930, 155189, 206106, 168058, 169445, 120708, -27389, -116425, -148273, -159719, -137173, -44429, -21397, -145057]
6551a45057k26645N3281J02771l3292j6545j36155L8913Q8784j28862Q6101O8443
6540b48263M5885j00552K6736J4510P3020j59966l9398Q1696J7342M674Q9273
6529a95043k8627k4216o5652o9097k2659R1299J23147o124J2484j03835k1919
6518c10242R824N9890k2700j4274M4406N9508k0992M5576j34245O3044Q3434O0190
6506g6581j4734J15580q678n3655R7166j34575P6345N7002j02451l7171J0180
6495g1572J9685l564P3945k9998p8087J3652K565K6141J07380j27842o7239n6912
6483a91846J68510J30802k6234j7131j00294K9097J22576l5346l8597j29280O2437
6472b5306J8050k8581K2948j3405m7180Q4661J46648O3775Q3534j74927j14870
$$ y = [-145057, -371702, -318421, -215650, -248942, -265487, -401642, -362729, -273945, -402807, -316706, -248263, -202378, -302930, -276194, -261684, -188664, -348630, -388028, -306332, -288990, -284316, -195043, -223670, -247886, -313538, -382635, -405294, -313995, -190848, -196972, -184488, -288323, -310242, -300418, -240528, -263228, -277502, -233096, -173588, -194580, -149004, -283249, -220205, -136771, -76581, -91315, 24265, 15587, -38068, 59098, -75477, 868, 57870, -44581, -81752, -71572, -51887, -55451, 18494, -11504, -89591, -75939, -73374, -47233, 60147, -67695, -134934, -191846, -23336, 107466, 81232, 64101, -36193, -7096, 115480, 80134, 41537, -87743, -25306, -7256, -35837, -12889, -26294, -73474, 11187, 157835, 221610, 305144, 130217, 15347]
6461A5347J03934Q9504J45823l5697N7552m7600n21L0051j86933J36062Q7365
6450C94887j45128M403L4399j27436M4504o2010m5118J06151J60383M8790j32362
6439B81463K1857J17121k8265r435P8837P2218L342Q7114k0769o9405P1989M5461
6427F51528J27340Q637K892k4637o9097O9749O8187Q0262o8146J19344K8529l7559
6415I57029m3548q4185n2287J21775l7005P6602Q764K9842Q1286N6219L5519q7271
6403A062740J28791n4567l7268J1365J31925Q7273k2037K7475M4387k1136K00688
6392A559636j6666k6230J7840J3100L9098J59250J81306K1843m4551J9873K9164
6381A953663n6868Q4912J36446N0309J95228J29434l0025O4028M5332J58395K6268
$$ y = [15347, 119281, 208785, 354608, 318911, 376463, 328863, 328342, 358393, 171460, 307522, 394887, 249759, 254162, 288561, 161125, 205629, 143619, 98501, 204652, 365035, 413825, 281463, 303320, 420441, 392176, 382741, 461578, 533796, 537138, 624252, 603483, 534078, 606067, 651528, 778868, 787505, 790397, 765760, 696663, 766412, 834599, 914861, 846715, 966059, 994588, 957029, 913481, 829296, 777009, 898784, 861779, 938381, 947145, 976987, 1058273, 1114492, 1150011, 1062740, 1191531, 1136964, 1099696, 1111061, 1242986, 1330259, 1308222, 1335697, 1380084, 1358948, 1559636, 1542970, 1516740, 1534580, 1547680, 1586778, 1746028, 1927334, 1949177, 1904626, 1924499, 1953663, 1896795, 1981707, 2118153, 2168462, 2363690, 2493124, 2463099, 2527127, 2572459, 2730854, 2757122]
6370B757122J1773J53766J38309J0960M4894J93629J80389K47941K71932K44756
6360D255471L07043L21655N20152N12624J75962L29786N94004O61003R90091J092843
6350I760634J215321J513957J716402J874361K507771L453357M903502O941106
6342C3886411R201347J0739485J0401051P835159L682429p02616m085081n990006
6334F4968179o036878n026865l311202p65692K087613N166494P805848Q379870
6326G3267367O520783K628807k026513n950444q377910r120572q433570p232497
6318D1275451o069221m804858l943413l211246k628411k099916j719230j301625
6310A5497531j089640r21633o57972l38002k88995l70897j72918m06298j89106
$$ y = [2757122, 2768895, 2922661, 3060970, 3071930, 3116824, 3310453, 3490842, 3738783, 4010715, 4255471, 4562514, 4884169, 5404321, 5916945, 6092907, 6422693, 7016697, 7677700, 8667791, 9760634, 10975955, 12489912, 14206314, 16080675, 18588446, 22041803, 26945305, 33886411, 43087758, 53827243, 64228294, 72063453, 75745882, 75043266, 70958185, 64968179, 58931301, 53904436, 50593234, 49827542, 51915155, 57081649, 64887497, 73267367, 79788150, 82416957, 80390444, 74440000, 66062090, 56941518, 48507948, 41275451, 35206230, 30401372, 26457959, 23246713, 20618302, 18518386, 16799156, 15497531, 14407891, 13486258, 12828286, 12490284, 12201289, 11830392, 11657474, 11251176, 11062070]
6301A1062070j47889l78612l07661k50656j0930p9240m8201K9334N1691M8578
6291I968484M0112L29335M91990L59110L30173N34917P14312R08219J052883J064951
6281A5794486J192046J366493J552948J815321K304073K742074L608114M793060
6273C5168615O949402R931560J3566252J6168720J6522529J3541258P690084J115192
6265A20653612n001796q461531r384309q524006o028529k724868J399376O074243
6257H8002192R894569J1647199R975428M891998j577615p450711j1387602j3072827
6249I0922631j2728714j1314677r929599q302526o811497n501107m519685l695563
6241B8119263k935445k486625j981705j697627j458435j077222r88864o98366
$$ y = [11062070, 10914181, 10535569, 10227908, 9977252, 9966322, 9887082, 9838881, 9868215, 9919906, 9968484, 10008596, 10337931, 10829921, 11189031, 11519204, 12054121, 12768433, 13676652, 14729535, 15794486, 16986532, 18353025, 19905973, 21721294, 24025367, 26767441, 30375555, 35168615, 42118017, 52049577, 65615829, 81784549, 98307078, 111848336, 119538420, 120653612, 115651816, 107190285, 97805976, 89281970, 83253441, 80528573, 81927949, 88002192, 97896761, 109543960, 119519388, 124411386, 122833771, 115383060, 103995458, 90922631, 78193917, 66879240, 56949641, 48647115, 41835618, 36334511, 31814826, 28119263, 25183818, 22697193, 20715488, 19017861, 17559426, 16482204, 15493340, 14794974]
6233A4794974q94286o66502n16267o76802m90128m07705n36689m87113m20552
6224I698930m59858l03946l35984m09433l45713l05299j59001k49721j92218j03520
6214F834237o6956l9369K8180j19491j39074j28167k48593j11902n9180l05902
6204E643783l33241j56994j01296j80132j45072J2815j24274j94216j46829j15348
6194D159196j51864j16234j26333Q9435j00399n7157L4920q6734k9315O893j69425
6183C452983r894N7933j21430p2157N078j17839L101P2738k5267O873p8545r5579
6171C077995k6979n1710o197J12371N7159j46728l2032k309n0407j51614n7647
6160B721902l3042N6535j33316j61021J8114j00356j12453J07822M1206o5210
$$ y = [14794974, 13900688, 13234186, 12717919, 12041117, 11550989, 11143284, 10606595, 10119482, 9698930, 9239072, 8935126, 8599142, 8189709, 7843996, 7538697, 7379696, 7129975, 6937757, 6834237, 6767281, 6727912, 6756092, 6636601, 6497527, 6369360, 6120767, 6008865, 5949685, 5643783, 5310542, 5153548, 5052252, 4872120, 4727048, 4739863, 4615589, 4421373, 4274544, 4159196, 4007332, 3891098, 3764765, 3854200, 3753801, 3696644, 3731564, 3644830, 3615515, 3622408, 3452983, 3443089, 3501022, 3379592, 3307435, 3312513, 3194674, 3197775, 3270513, 3245246, 3252119, 3173574, 3077995, 3051016, 2999306, 2993109, 3105480, 3162639, 3015911, 2983879, 2981570, 2931163, 2779549, 2721902, 2688860, 2745395, 2612079, 2451058, 2469172, 2368816, 2256363, 2364185, 2405391, 2340181]
6150B340181n4406p7441R3428r895M0992j42758J49504K5248J07327k302N7311
6139B527189K00011l7252R519o3637k13411K5460Q6998R6480J89757j63116j11517
6128B546481L0034l4030j9920J52256L17330R5653J46631J89548O5422P0876P2080
6117C632361P9483k4732j0066O7938P2309J7838m1519L1396J0091j87913N3098
6106C700284R7398M8354q875P6614J504O1432J65717k0271Q0165K47394m8783
6095D400933J17428R8087P6108J37611J44937K8476Q4993M4412J43938O3515n75
6084E339863k599N4299j41983M7461k6015o8433K00329O0120J25239J15742J87335
6073E891358R1777K42791K43072K14798J61589K06939J19467J74812K22270J62984
$$ y = [2340181, 2285775, 2208334, 2301762, 2291867, 2332859, 2190101, 2339605, 2364853, 2472180, 2469878, 2527189, 2727200, 2689948, 2699467, 2635830, 2422419, 2447879, 2534877, 2631357, 2821114, 2657998, 2546481, 2576515, 2542485, 2522565, 2674821, 2992151, 3087804, 3234435, 3423983, 3489405, 3560281, 3632361, 3711844, 3687112, 3677046, 3744984, 3817293, 3835131, 3793612, 3825008, 3835099, 3647186, 3700284, 3797682, 3846036, 3837161, 3913775, 3915279, 3976711, 4142428, 4122157, 4202322, 4449716, 4400933, 4518361, 4616448, 4692556, 4830167, 4975104, 5003580, 5088573, 5132985, 5276923, 5340438, 5339863, 5337264, 5391563, 5249580, 5297041, 5271026, 5202593, 5402922, 5463042, 5588281, 5704023, 5891358, 5983135, 6225926, 6468998, 6683796, 6845385, 7052324, 7171791, 7346603, 7568873, 7731857]
6063G731857M3839L65572M37980J79573K90168M31277L98862N72386N30162M81170
6053A1462846P97532P73008R27801J092021J156780J598324J773445K117476K457221
6044B4156454L365765M309171N891886Q521782J1919898J5109906J6282355J3618575
6036A03175792P932601R09652n403210r379910j1213345j0828202r412558p663640
6028E8117180o148258m817040l638727k552646j449746p21018R9927J013400J992732
6019D1895804L446960N415307Q419260J2380617J5750084J6638144J3364252O689389
6011A23999817j030656p535970j1792783j3313713j2747607j1286451r415002
6004E6877635p909606o376990n320723m472151l362885k714609k146533k039119
$$ y = [7731857, 7775696, 8141268, 8579248, 8758821, 9048989, 9480266, 9879128, 10451514, 10981676, 11462846, 12260378, 13033386, 13961187, 15053208, 16209988, 17808312, 19581757, 21699233, 24156454, 27522219, 31831390, 37723276, 46245058, 58164956, 73274862, 89557217, 103175792, 111108393, 112018045, 106614835, 97234925, 86021580, 75193378, 65780820, 58117180, 51968922, 47151882, 43513155, 40960509, 39510763, 38789745, 38889672, 39903072, 41895804, 45342764, 50758071, 59177331, 71557948, 87308032, 103946176, 117310428, 123999817, 122969161, 115433191, 103640408, 90326695, 77579088, 66292637, 56877635, 48968029, 42591039, 37270316, 32798165, 29435280, 26720671, 24574138, 22535019]
5996B2535019j508706j089505q73459r03013p22597n42871m17224j98209j53826
5987A6125609j38963k25781K9824j3366O4664P1911J39222M34413N22639N08293
5977A7518465O72033Q60103J127080J326347J917118K396288L233642M997967
5969C4049043P098355R548591J1306247J0615626P078221K201276k269404n684989
5961G3942966p251791p261431o410443n522379m440150l439335k782192k017413
5953C4817832j414341j033724l44674K81490P71624J589913K916880M846633P208139
5944D9639772R979302J1301282J0000675O154672Q61775l734674p151507q607128
5936F8444169q636508p592556o467266n473599m505476l536533l069416k581973
$$ y = [22535019, 21026313, 19936808, 19063349, 18160336, 17437739, 16894868, 16477644, 16279435, 16125609, 15986646, 15760865, 15790689, 15777323, 15841987, 15913898, 16053120, 16487533, 17010172, 17518465, 18190498, 19050601, 20177681, 21504028, 23421146, 25817434, 29051076, 34049043, 41147398, 50695989, 62002236, 72617862, 79696083, 81897359, 79627955, 73942966, 66691175, 59429744, 53019301, 47496922, 43056772, 39617437, 36835245, 34817832, 33403491, 32369767, 32025093, 32306583, 33078207, 34668120, 37585000, 42431633, 49639772, 59619074, 70920356, 80921031, 87075703, 87937478, 84202804, 77051297, 68444169, 59807661, 52215105, 45747839, 40274240, 35768764, 32232231, 29162815, 26580842]
5928B6580842k033210j778707j592074j216931j024438q52380q97720p69076p60318
5919A5655988o42619n76480n66083m81828p81683m59317m14001m48950n63126
5910A0721901m17618k48161l57186m67541k60952m37637k87069k97208k50495
5901G698034j77912k40954j24924k26896k72649j80881k34235j13780l5139k55034
5891E835630k24366j61694k0498L9452j19073k88237n115j56367p5085r7738l5760
5880D691149r567L1998P450M992n1467j38975m7643l5880n458j82576j76940r9558
5868C987525L685j88273j62629j21545k1187l2408p7236r4421j9265J2983j26760
5857C160469Q2665l7423j00628L1568o3279r4497o9053m5907j3558l8614j37676
$$ y = [26580842, 24547632, 22768925, 21176851, 19959920, 18935482, 18083102, 17185382, 16416306, 15655988, 15013369, 14436889, 13870806, 13388978, 12607295, 12147978, 11733977, 11285027, 10721901, 10304283, 10056122, 9698936, 9231395, 8970443, 8532806, 8245737, 7948529, 7698034, 7520122, 7279168, 7154244, 6927348, 6654699, 6473818, 6239583, 6125803, 6090664, 5835630, 5611264, 5449570, 5429072, 5468524, 5349451, 5061214, 5056099, 4899732, 4824647, 4726909, 4691149, 4681582, 4713580, 4721030, 4726022, 4674555, 4535580, 4487937, 4452057, 4446599, 4264023, 4087083, 3987525, 3991210, 3802937, 3640308, 3518763, 3497576, 3465168, 3387932, 3293511, 3274246, 3287229, 3160469, 3243134, 3205711, 3105083, 3136651, 3073372, 2978875, 2909822, 2863915, 2850357, 2811743, 2674067]
5846B674067j22835k1441j47208O5314J9316m3825L4273p7564n9383L8730M4260
5835B403704j04545p6676j08169j61259k22102J60436P5449P7661r0987m8050
5825A905462p6441J8586J05379j02274k0981J3981j25468j70029o3012K0130j5829
5814A489504L6205n0748J9246m6039Q135j22225p75m7282o826J53950l2333j12421
5802A288391P2763N6294K8317K7438k16627n9015l542m4202L12258j83272k66601
5791A012202J66847R7531l3051J83149O7503q3434M0856J1621P0697L53516K03635
5780B091072J58752J20776J90827K63524Q6786L14967M39171M08693L83806P45678
5770E204052Q75459J461473K755772O049444J0354840J0721714N496245P71791
$$ y = [2674067, 2551232, 2529791, 2382583, 2447897, 2467213, 2423388, 2457661, 2380097, 2320714, 2359444, 2403704, 2299159, 2222483, 2114314, 1953055, 1730953, 1891389, 1966838, 2044499, 1953512, 1905462, 1829021, 1847607, 1952986, 1850712, 1829731, 1843712, 1718244, 1548215, 1485203, 1505333, 1489504, 1525709, 1474961, 1494207, 1448168, 1456303, 1334078, 1333303, 1286021, 1279195, 1433145, 1400812, 1288391, 1361154, 1417448, 1445765, 1473203, 1256576, 1197561, 1194019, 1149817, 1462075, 1278803, 1012202, 1179049, 1276580, 1243529, 1426678, 1494181, 1410747, 1451603, 1463224, 1533921, 1887437, 2091072, 2249824, 2370600, 2561427, 2824951, 2911737, 3226704, 3665875, 4074568, 4458374, 5204052, 6079511, 7540984, 10296756, 16346200, 26701040, 37422754, 42918999, 43690790]
5762D3690790l970294p038659o992778n767117m142649l160939k527789j903695
5754H186870j499336r86507p90847o33835n21903m40687l71391j08681o7581k95485
5744B470617o2230n640l1448p7095m502j25405j29244O1283r5987q6706k02277
5733A711366j91294j1843L6251r4965q7763K19171J89231M7491r0084q6704j3682
5722A627175r8333J2843o5436R3991L773j97618L0451l0350r9338k59049n8132
5711I59977O2026J40678L0287j2310m0001J8024R4694j36822Q1723O5043o2569
5700A200750n0753N0300N138l9586P1176n1286j29031j57464q0345j59902O4872
5689G23869K8382q4711J14566j9753m4366j32784j34874K17367k2294j52889J07271
$$ y = [43690790, 39720496, 32681837, 25689059, 19921942, 15779293, 12618354, 10090565, 8186870, 6687534, 5701027, 4910180, 4276345, 3754442, 3313755, 2942364, 2833683, 2766102, 2470617, 2408387, 2402747, 2371299, 2294204, 2289702, 2164297, 2035053, 2096336, 2000349, 1913643, 1711366, 1520072, 1508229, 1544480, 1449515, 1361752, 1580923, 1770154, 1817645, 1727561, 1640857, 1627175, 1528842, 1541685, 1476249, 1570240, 1574013, 1376395, 1406846, 1376496, 1277158, 1018109, 959977, 1022003, 1162681, 1192968, 1180658, 1140657, 1158681, 1253375, 1116553, 1198276, 1263319, 1200750, 1149997, 1200297, 1205435, 1165849, 1237025, 1185739, 1056708, 899244, 818899, 658997, 723869, 752251, 667540, 782106, 762353, 717987, 585203, 450329, 667696, 645402, 492513, 599784]
5678E99784J12534L4967m8465N0828J50404J78947k27954j09861n4414L4851J0359
5667G31980m0359r1487m6573M9808m3675J428k1189J79534r158P6657p3553j10735
5655F02678Q5032K9984L3137J16672N7771Q2631n8939p314j20494J6795Q8285
5644I26238p7115k31999l845J11126o7761l8797m0085Q0500M0705j9608Q5419
5633G64778q048p193O1741m0429p2731k4671o270J2789n2416O6931J3397n9777
5621F48101k6067j80559q822Q046k7678m1421o5988J1090J0620Q193L1078J52807
5609E19400r1086L6832o1270Q179J5229j39569m5303M6490L1910J5921N5711r1571
5597C00873O3134J37648o8073k5450L4806l4725k6673N6005N165Q1598O7239l0168
$$ y = [599784, 712318, 747285, 698820, 749648, 900052, 1078999, 851045, 741184, 686770, 721621, 731980, 691621, 600134, 553561, 603369, 559694, 561122, 539933, 719467, 710309, 786966, 713413, 602678, 687710, 717694, 750831, 867503, 925274, 1007905, 948966, 941652, 821158, 837953, 926238, 849123, 617124, 613279, 724405, 656644, 617847, 577762, 658262, 698967, 679359, 764778, 756730, 749537, 811278, 770849, 698118, 673447, 667177, 679966, 627550, 694481, 707878, 648101, 622034, 441475, 432653, 440699, 413021, 371600, 305612, 316702, 327322, 335515, 366593, 519400, 428314, 465146, 403876, 412055, 427284, 287715, 242412, 288902, 320812, 336733, 392444, 300873, 364007, 501655, 433582, 408132, 442938, 408213, 381540, 437545, 442710, 524308, 591547, 561379]
5585E61379M0369k7642J2107q3600N843n4862M1394J16583M477N2795J07659p5727
5573G00775l8894r6738K8241j70127Q270J03710L6966j6023j89201P7270o603
5562D37646O1164m5041l9423L6097P687l1430J8882P2799p2873r3542P9519K2757
5550D54242j18758J11359O3817J02493j69434l2760M5296O4572P3855k03692k01299
5539A89691L7739m2290l2514r068Q4486R0328N7376n8023r5713J30956j55793
5528A97175k998Q7824j43715R5918J91874j28637o0410O9471k7188m5375m054
5517B29885J9874l8851M7251R8293n0041k514j29304m7748L1030L1924Q3309l129
5505B69979o6582R434n9511N6785o1193J87044n449o4358L1690p1971m9918O2620
$$ y = [561379, 601748, 574106, 586213, 502613, 508456, 453594, 494988, 611571, 616048, 668843, 776502, 700775, 661881, 565143, 593384, 423257, 431527, 535237, 572203, 556180, 366979, 444249, 437646, 498810, 453769, 414346, 450443, 458130, 426700, 445582, 518381, 445508, 351966, 431485, 454242, 335484, 446843, 510660, 613153, 443719, 410959, 456255, 520827, 594682, 390990, 189691, 227430, 185140, 152626, 143558, 228044, 318372, 375748, 317725, 222012, 352968, 197175, 194177, 282001, 138286, 234204, 426078, 297441, 237031, 306502, 279314, 233939, 229885, 249759, 210908, 258159, 356452, 306411, 303897, 174593, 126845, 157875, 189799, 273108, 269979, 203397, 212831, 153320, 210105, 148912, 335956, 330507, 266149, 297839, 225868, 175950, 238570]
5493B38570J32093n2162K2147Q5141J01977o53N1100L7828j52171k7878O6153
5482E02145R166j61097n155J14569J10669n5503l1673o2281J2171n3718K4862
5471D04155J25141j20551R9978j30495P974Q9431R0751m9089p900m3799N3348
5460E18944J41138M6124o6090P838M3671o632q4107q2699o3128J20829M5969k1431
5448F00426l1760L1685J25953O1577j74534J13329l4544o006J4666l2569j10820
5437E57403j8893Q5847L311J09518j4696n2365K785K11919o0888P0372k1780j32777
5425G39756J7153k0847n9198L7879P0879K3566N6561N1848k4190l3712P321J27418
5413I94434J01014j61197K0591Q099O114M1721l8888N6767J7220J29014r6970
$$ y = [238570, 370663, 318501, 340648, 425789, 527766, 527113, 578213, 616041, 463870, 435992, 502145, 511311, 350214, 345059, 459628, 570297, 514794, 483121, 420840, 433011, 379293, 404155, 529296, 408745, 508723, 378228, 386202, 475633, 566384, 517295, 509395, 465596, 518944, 660082, 706206, 640116, 647954, 691625, 684993, 600886, 518187, 455059, 575888, 621857, 600426, 568666, 600351, 726304, 787881, 613347, 726676, 692132, 686126, 700792, 668223, 557403, 538510, 624357, 627668, 737186, 722490, 670125, 672910, 884829, 823941, 894313, 872533, 739756, 756909, 736062, 676864, 714743, 785622, 809188, 865749, 917597, 893407, 859695, 867016, 994434, 1095448, 934251, 954842, 962941, 969055, 1010776, 971888, 1028655, 1045875, 1174889, 1077919]
5402A077919O70J39403k9918r3118l2065J188K36711N8477l7403j38194m9888
5391A133782J68270R6551n2286J42655J78835j4096j7567m7560J7566R1112r7632
5380A599630M1090R3228O7635J21540N3075l3322P2618l5716j02909q3939M1217
5369A834147L810K6740J07623Q9221m805J91389J56377j6684n6722N3547N9515
5358B444158m8877J91448J6516L1145J18548L1870L9895N6879J15820L3150R6764
5347C127316K4588l0991l4716R2064K00131Q4924K3108M6280J66723O5485J50313
5336C915225J4838J29389J97771K0686J23473J86242J22308J76755P9829o112
5326D960404L5357J40401l8817R218L3934K43686J48546J53162J53831K32814
$$ y = [1077919, 1078589, 1217992, 1188074, 1094956, 1062891, 1064079, 1300790, 1359267, 1321864, 1183670, 1133782, 1302052, 1398603, 1346317, 1488972, 1667807, 1653711, 1636144, 1588584, 1606150, 1697262, 1599630, 1640720, 1733948, 1801583, 1923123, 1976198, 1942876, 2015494, 1979778, 1876869, 1792930, 1834147, 1837957, 1864697, 1972320, 2061541, 2056736, 2248125, 2404502, 2387818, 2331096, 2384643, 2444158, 2395281, 2586729, 2603245, 2634390, 2752938, 2784808, 2824703, 2881582, 2997402, 3030552, 3127316, 3151904, 3120913, 3086197, 3178261, 3378392, 3463316, 3486424, 3532704, 3699427, 3764912, 3915225, 3930063, 4059452, 4257223, 4277909, 4401382, 4587624, 4709932, 4886687, 4966516, 4960404, 4995761, 5136162, 5097345, 5106563, 5140497, 5384183, 5532729, 5685891, 5839722, 6072536]
5316F072536K05057k7461J22971J15945K31990K05514R8751n447J52030J11103
5306G282989J64110M24523K6031J39113K04721K58390J21667J71582J75587J36894
5296I105607K52647K33504R8046K01909J65521J53600L52110K25649J84656K32403
5286A1205652J53959O8943J82797L50392J93844K56571K53470K44001N39622L52703
5276A3801954L45669M08935K96642L44884N20884M81772L71361M95302M90910
5267A7558313L70472O54061O65438N34307N21751N21859P32077P66169Q06492
5258B3130939P36395P78253R20828Q47590Q13113R77360J257880J148516J311277
5249C1922151J319890J424557J353362J439082J743560J989068J965346J998493
$$ y = [6072536, 6277593, 6250132, 6373103, 6489048, 6721038, 6926552, 7025303, 7019856, 7171886, 7282989, 7447099, 7871622, 7897653, 8036766, 8241487, 8499877, 8621544, 8793126, 8968713, 9105607, 9358254, 9591758, 9689804, 9891713, 10057234, 10210834, 10562944, 10788593, 10973249, 11205652, 11359611, 11428554, 11611351, 11961743, 12155587, 12412158, 12665628, 12909629, 13449251, 13801954, 14147623, 14556558, 14853200, 15198084, 15718968, 16200740, 16572101, 17067403, 17558313, 17928785, 18582846, 19248284, 19782591, 20304342, 20826201, 21558278, 22324447, 23130939, 23867334, 24645587, 25566415, 26414005, 27227118, 28204478, 29462358, 30610874, 31922151, 33242041, 34666598, 36019960, 37459042, 39202602, 41191670, 43157016, 45155509]
5241D5155509K115505K321938K474658K732935K831212K919172L224264L468144
5233F7243337L421760L703412L940873L916699M067096M071826M245066M161623
5225I8771692M179912L936737L640581L699137L353121L262435K940679K700509
5217A26484803K799689K954837K663557J732474L13462j597347k988296l843758
5209A28519421m126493l696263k855030j498245L24814K358687L842219L905269
5201A26774379K537264O00274p49647j646821j894918k052880k064696j860548
5193A19642407q99917R25288L190265L657588K411200O50583m41309o19910J60607
5184A28676802Q48752P33853m35992q83619q21765o53351q73515j636209k463507
$$ y = [45155509, 47271014, 49592952, 52067610, 54800545, 57631757, 60550929, 63775193, 67243337, 70665097, 74368509, 78309382, 82226081, 86293177, 90365003, 94610069, 98771692, 102951604, 106888341, 110528922, 114228059, 117581180, 120843615, 123784294, 126484803, 129284492, 132239329, 134902886, 136635360, 136948822, 135351475, 132363179, 128519421, 124392928, 120696665, 117841635, 116343390, 116668204, 119026891, 122869110, 126774379, 129311643, 129911917, 129162270, 127515449, 125620531, 123567651, 121502955, 119642407, 118742490, 119667778, 122858043, 126515631, 128926831, 129577414, 129136105, 128516195, 128676802, 129525554, 130259407, 129823415, 128939796, 128118031, 127464680, 126591165, 124954956, 122491449]
5175A22491449k223133o72071R17507Q97448r01105l314219n469697n950218n120397
5166A00655564l601588k642976j672762o08056O57030J208037P54833j106618
5158I3643464l658528o134567p222942p243648o492779n129231l902554k348573
5150E1510642j047670P3688N55462N5521j187726k564084l412474l872485l786243
5141C6324631l366962k677577k304135j979929j792749j316229j167167j032180
5133B0687703q77107q01281o84916p15470n24775n51064n93106l91022m41399
5124A5107563m16420m44249k96915l28929k55543k80801k38217k34843k03895
5115A2407751m41718l32882k61563k62460k02949k38017j92417j80583j43973
$$ y = [122491449, 120268316, 119596245, 120513752, 121411200, 120510095, 117195876, 111726179, 105775961, 100655564, 97053976, 94411000, 92738238, 92130182, 92787212, 93995249, 94750082, 93643464, 89984936, 83850369, 76627427, 69383779, 62891000, 57761769, 53859215, 51510642, 50462972, 50536660, 51092122, 51147643, 49959917, 47395833, 43983359, 40110874, 36324631, 32957669, 30280092, 27975957, 25996028, 24203279, 22887050, 21719883, 20687703, 19810596, 19009315, 18324399, 17608929, 17084154, 16533090, 15939984, 15548962, 15107563, 14691143, 14246894, 13949979, 13621050, 13365507, 13084706, 12846489, 12611646, 12407751, 11966033, 11633151, 11371588, 11109128, 10906179, 10668162, 10475745, 10295162, 10151189]
5106A0151189j65943j93896j85509n4127j76360j99157j24871r6811k12761k32501
5096H509253q4190l5477j03166n0330j87396J04656p9367k14794k19999k6006
5086G613184m8248o4077j53312m7076j67590k84657m3029j7543k85263j28809
5076F373580m8713k61090o4160j03942j23490j05367q3988q5793L1247j3069k3259
5065E491956o9050j50725k0980P1245j94792j52260Q770j61689k7054q2258r9306
5054D613857n7619n7064j57729o019k2753K6633o9958p4512J9628m952O9635j11103
5042D168044j55902j0841N4366N0946P1178M8630q6330J01605Q9610j89133L353
5031D145526J11314J1887j4839J9295o6243M5491p9562p5460p4247k8754q0655
$$ y = [10151189, 9985246, 9791350, 9605841, 9551714, 9375354, 9176197, 9051326, 8954515, 8741754, 8509253, 8425063, 8389586, 8286420, 8236090, 8048694, 8153350, 8073983, 7859189, 7639190, 7613184, 7564936, 7500859, 7347547, 7300471, 7132881, 6848224, 6805195, 6787652, 6502389, 6373580, 6324867, 6063777, 5999617, 5895675, 5772185, 5666818, 5582830, 5497037, 5528284, 5515215, 5491956, 5422906, 5272181, 5251201, 5322446, 5127654, 4975394, 4984164, 4822475, 4795421, 4713163, 4613857, 4556238, 4499174, 4341445, 4335426, 4312673, 4339306, 4269348, 4194836, 4214464, 4209512, 4279147, 4168044, 4012142, 4001301, 4055667, 4106613, 4177791, 4226421, 4140091, 4241696, 4331306, 4142173, 4145526, 4256840, 4268727, 4253888, 4273183, 4206940, 4252431, 4172869, 4097409, 4023162, 3994408, 3913753]
5020C913753r109n3502L177J06667O6446K4634m7978P2386R1884J35259p8795
5009D224822L4364J44016Q6533J06949j1094K4036J88011p5048L8646Q0940o2147
4998D780028j41738M9445q6097j14731r181P0391n0387q5464p6774o372K0363
4987D349483M2204K8660N3341J81929M2388J41958J82540J93774J81633L65585
4977E763495K90669J09387K5692J6898k73341l28428j69043j16125j45282p6589
4967E097333K8912Q633R522j34966j44899P8978k0091j412p680j8680N5960N4294
4955E005904P554J40585k4672m4366j27690L6607L2284o894Q222O026R7076M4871
4943E175507M9788Q2836L1851R8957j3620p8565J03270j0936P5562o6707O6729
$$ y = [3913753, 3904644, 3851142, 3854319, 3960986, 4027432, 4052066, 4004088, 4076474, 4168358, 4303617, 4224822, 4259186, 4403202, 4489735, 4596684, 4585590, 4609626, 4797637, 4722589, 4761235, 4842175, 4780028, 4638290, 4687735, 4601638, 4486907, 4477726, 4548117, 4497730, 4412266, 4335492, 4329120, 4349483, 4391687, 4420347, 4473688, 4655617, 4698005, 4839963, 5022503, 5216277, 5397910, 5763495, 6054164, 6163551, 6189243, 6206141, 5932800, 5604372, 5435329, 5319204, 5173922, 5097333, 5126245, 5134878, 5144400, 5009434, 4864535, 4943513, 4923422, 4922010, 4914330, 4895650, 4951610, 5005904, 5013458, 5154043, 5129371, 5085005, 4957315, 4993922, 5026206, 5019312, 5027534, 5033560, 5130636, 5175507, 5225295, 5308131, 5339982, 5438939, 5425319, 5346754, 5450024, 5439088, 5514650, 5447943, 5514672]
4932E514672L7650R4840K03842l5377j1871m2258M8557L7501K33941L7782J33718
4921F252997K16391O9365L48983J13823J2528J33906J04083k2402K02679J23171
4911G555524M0526J55345K07317J31172K50402L57242K04000K38048K22896P5329
4901I437801K56031K13178k6337J70209J10411Q8137R4259O6719O7584J72589
4891A0650581N02324J57209K6173K36834L27444K34308L70282L42925K66366L06791
4881A3421237J24462L48732K08213K31399K29964J63556K22665M29932L21894
4872A5702054K10176J84352L61930K93500K44233K75272M00360N00627L03549
4863A8476053M01615M38329N95751N27339N15501O49979N62778N42580P01332
$$ y = [5514672, 5552322, 5647162, 5851004, 5815627, 5803756, 5761498, 5810055, 5847556, 6081497, 6119279, 6252997, 6469388, 6538753, 6887736, 7001559, 7014087, 7147993, 7252076, 7229674, 7432353, 7555524, 7596050, 7751395, 7958712, 8089884, 8340286, 8697528, 8901528, 9139576, 9362472, 9437801, 9693832, 9907010, 9880673, 10050882, 10161293, 10249430, 10343689, 10410408, 10477992, 10650581, 11152905, 11310114, 11336287, 11573121, 11900565, 12134873, 12505155, 12848080, 13114446, 13421237, 13545699, 13894431, 14102644, 14334043, 14564007, 14727563, 14950228, 15380160, 15702054, 15912230, 16096582, 16458512, 16752012, 16996245, 17271517, 17671877, 18172504, 18476053, 18877668, 19315997, 19911748, 20439087, 20954588, 21604567, 22167345, 22709925, 23411257]
4854B3411257P42301P41165Q85657R28706R27364J160553J476551J536411J586640
4845C3396605J747300K167213K500275K695196K994556L467613M437235N449345
4837E8855338P711931J1417355J2983350J0340210P199181M575746K157464J849168
4829A17089743K624299K932925K858658K354536K118706J649296J211108J183701
4821A34022972R39674M45697K3268J210J60609M81262R31247J474705K443557
4812A40924201L604171M913660O260907P033021Q142536R050995R623410J0488155
4804B00041056J1003220J1265785J0766234R289831O878842M123624J510844k15380
4796B54664056j152349l96092K636571P564193J0429649P547338n06331r416391
$$ y = [23411257, 24153558, 24894723, 25780380, 26709086, 27636450, 28797003, 30273554, 31809965, 33396605, 35143905, 37311118, 39811393, 42506589, 45501145, 48968758, 53405993, 58855338, 66567269, 77984624, 90967974, 101308184, 108507365, 113083111, 115240575, 117089743, 119714042, 122646967, 125505625, 127860161, 129978867, 131628163, 132839271, 134022972, 134962646, 135408343, 135431611, 135432821, 135593430, 136074692, 137005939, 138480644, 140924201, 144528372, 149442032, 155702939, 162735960, 170878496, 179929491, 189552901, 200041056, 211044276, 222310061, 233076295, 242366126, 249244968, 253368592, 254879436, 254664056, 253511707, 253115615, 255752186, 263316379, 273746028, 281293366, 280787035, 271370644]
4788B71370644j6458252j9948485j9096571j5841124j1821848q316537n468313
4781A74419514k745702j11470K299557N326055R054695J3924888J9526941K3135865
4773B44830343K1174453J6041123J2104004J0258271P909170J884197p142139
4766C07059422j5985417k3129411k6330015k5096806k1725706j7728893j3739812
4759A63323362j0669765p567219m508530j279908K455951P556416J4541092K2087777
4751A85939176K4961088J9872183J0074745J2232q049183j1536708j1285377r627534
4743B00360622p575619o350210n968063n894721n540093n315992m574047l902019
4735A55239858l216040k382054j478668n79565M50173J556639K631042M084522
$$ y = [271370644, 254912392, 234963907, 215867336, 200026212, 188204364, 179887827, 174419514, 171673812, 171562342, 173861899, 179187954, 188242649, 202167537, 221694478, 244830343, 266004796, 282045919, 294149923, 304408194, 312317364, 314201561, 307059422, 291074005, 267944594, 241614579, 216517773, 194792067, 177063174, 163323362, 152653597, 145086378, 140577848, 139297940, 141753891, 149310307, 163851399, 185939176, 210900264, 230772447, 240847192, 240859424, 232810241, 221273533, 209988156, 200360622, 192785003, 186434793, 180466730, 174572009, 169031916, 163715924, 159141877, 155239858, 152023818, 149641764, 148163096, 147583531, 148033704, 149590343, 152221385, 156305907]
4727A56305907N979563P679008R204891J0440539J0834433J0936455J0727913
4720B22108709R999543R809727Q966240P516189N135890J850730j582060m688176
4712B59116792o963141q426846r261936r451070r589796r504892r102263q140324
4704A88676524p451157o107651m781556l644135k236060j226787m04284J98664
4696A63023558N29910N35300M71867J14872N7954p56660j976840l423901m996196
4687A53579864o419682p292207q279000q620426q443332q017094p689907p392013
4679I1426203o731152o174306n599408m949471m682879m280281l622002l278949
4671E2107755k907851k590038k233561j882545j734705j555094j329086j213676
$$ y = [156305907, 162285470, 169964478, 179169369, 189609908, 200444341, 211380796, 222108709, 232108252, 241917979, 250884219, 258400408, 263536298, 265387028, 263804968, 259116792, 252153651, 243726805, 234464869, 225013799, 215424003, 205919111, 196816848, 188676524, 181225367, 175117716, 170336160, 166692025, 164455965, 163229178, 162824894, 163023558, 163553468, 164088768, 164560635, 164675507, 164733461, 163976801, 161999961, 158576060, 153579864, 147160182, 139867975, 131588975, 122968549, 114525217, 106508123, 98818216, 91426203, 84695051, 78520745, 72921337, 67971866, 63288987, 59008706, 55386704, 52107755, 49199904, 46609866, 44376305, 42493760, 40759055, 39203961, 37874875, 36661199]
4663C6661199j229886j141711r81071p86139o53502o51787n88704m62644m35095
4654B9730660l92092n27061m25522n75544n73975n92035o08546l39453m08054
4645B5288378l34486k67409l99425m44455n96543m82683m75821n62174m68348
4636B1257034k14763k14479k98558m3535j88585P4622L49948Q49785J834146K069102
4626B5474717J059801J12522o95624j418444j524621j510745j124781p50565p64026
4617A8858234n06248m69002k85146j31282R8945M28685P34900R03073O27875L64197
4607B0624231J63548R7051L71212Q86376J538077J556167J266904Q78995J42393
4598B7524954l56372l60238L03188J120100J511086J622204P84179k31552j076863
$$ y = [36661199, 35431313, 34289602, 33308531, 32522392, 31868890, 31217103, 30628399, 30165755, 29730660, 29338568, 28811507, 28385985, 27810441, 27236466, 26644431, 26035885, 25696432, 25288378, 24953892, 24686483, 24287058, 23842603, 23246060, 22763377, 22287556, 21725382, 21257034, 21042271, 20827792, 20529234, 20485699, 20297114, 20371736, 20721684, 21571469, 23405615, 25474717, 26534518, 26647040, 25951416, 24532972, 23008351, 21497606, 20372825, 19622260, 18858234, 18351986, 17882984, 17597838, 17466556, 17565501, 17994186, 18729086, 19632159, 20260034, 20624231, 20787779, 20884830, 21256042, 22142418, 23680495, 25236662, 26503566, 27382561, 27524954, 27168582, 26808344, 27111532, 28231632, 29742718, 31364922, 32149101, 31917549, 30840686]
4589C0840686j379355j355976p77954j32227J31814J41072n39445r26861j368023
4580B4633731j601170j272430r23018p00064l65209n40729o25339j045710r23509
4571A6636553r02271r25096q22917n18189n49599l63030k64446k22930j60829
4562A1907246j92904P6558j81647j23653j15465m9409k8545o8052p6317Q7782
4552A1235594p8145J73806M20414Q3893P7233J70614J37223L98022L14878L47645
4542A3281177M35637P39343N96703M29606P60279Q14781R01240J054978J273936
4533B0287680J686036K040628K456290L299591M590121O501962J0067946J5446127
4525F6376381K0660691K1657369J6252214P333883j949402q890866j1768807j0960274
$$ y = [30840686, 29461331, 28105355, 27327401, 27195174, 27326988, 27468060, 26928615, 26001754, 24633731, 23032561, 21760131, 20837113, 20137049, 19771840, 19231111, 18605772, 17560062, 16636553, 15734282, 14809186, 13986269, 13468080, 12918481, 12555451, 12291005, 12068075, 11907246, 11714342, 11790900, 11609253, 11485600, 11370135, 11320726, 11292181, 11224129, 11147812, 11235594, 11157449, 11331255, 11751669, 11835562, 11912795, 12083409, 12220632, 12618654, 12933532, 13281177, 13716814, 14456157, 15052860, 15482466, 16242745, 17057526, 17958766, 19013744, 20287680, 21973716, 24014344, 26470634, 29770225, 34360346, 40862308, 50930254, 66376381, 87037072, 108694441, 124946655, 132280538, 130331136, 121440270, 109671463, 98711189]
4517I8711189p422127k566673L501182J0476574J5609164J4986438Q850138K28236
4509A42374121p806782j2711431j3518066j0957542o502292l35325O686975J2086140
4501A09315798J2753079P974685N47216o369325j0905882j2079358j0385989p127620
4493H3722604k156640L071181Q977852J2524881J0478725M036255l556788r968842
4485A07129228j3827687j3943746j2462157j0055299q127574o583886n320533
4478C6808346m222855l135140k596816k117104j636792j465592j302603r08712
4470A9422732p33561p23738o39332n50446n29107m73762m51436l04624k33054
4461A4783672n74051n98357k84823k16627k68212j14407l19639m61042l94029
$$ y = [98711189, 91289062, 88722389, 92223571, 102700145, 118309309, 133295747, 142145885, 142374121, 134567339, 121855908, 108337842, 97380300, 90878008, 90542683, 97229658, 109315798, 122068877, 130043562, 130590778, 124221453, 113315571, 101236213, 90850224, 83722604, 81565964, 84637145, 93614997, 106139878, 116618603, 120654858, 117098070, 107129228, 93301541, 79357795, 66895638, 56840339, 48712765, 42128879, 36808346, 32585491, 29450351, 26853535, 24736431, 23099639, 21634047, 20331444, 19422732, 18689171, 17965433, 17326101, 16775655, 16246548, 15772786, 15321350, 15016726, 14783672, 14209621, 13611264, 13326441, 13109814, 12841602, 12727195, 12407556, 11946514, 11552485]
4452A1552485k82232k70337j78732j70631k34967k34126j17144j12599k46898
4443I704819k08362l1951k33552k02724r6637m3687K1498j39378J04692J94986
4433I069704M5919J85280J42379m6702o3434j04467l48457j15247l15182l21803
4423H127990r7947l3605j56634j78442j73915j02043j41539J07165r9611q3924
4413G167495J92136L9809Q5666j06898N5479k0535J2562n7214k8402l2165k43459
4402G064474k09954j44802k00497o1321r2930k17017p3252m2641l4837P3664l467
4391F057420J21742J63109K4620j5250r8562p5545k43880j74143n9598j41597
4381E558316j99085o5461R654K12375Q8773L60894N01367N31954M11530K10063
$$ y = [11552485, 11270253, 10999916, 10821184, 10650553, 10415586, 10181460, 10064316, 9951717, 9704819, 9496457, 9464506, 9230954, 9028230, 8931593, 8887906, 8909404, 8770026, 8874718, 9069704, 9115623, 9300903, 9443282, 9396580, 9333146, 9228679, 8880222, 8764975, 8449793, 8127990, 8030043, 7996438, 7839804, 7661362, 7487447, 7385404, 7243865, 7351030, 7251419, 7167495, 7359631, 7399440, 7485106, 7378208, 7433687, 7413152, 7425714, 7368500, 7340098, 7307933, 7064474, 6854520, 6709718, 6509221, 6447900, 6354970, 6137953, 6064701, 6022060, 5987223, 6060887, 6057420, 6179162, 6342271, 6366891, 6351641, 6253079, 6177534, 5933654, 5759511, 5699913, 5558316, 5359231, 5293770, 5303424, 5515799, 5604572, 5965466, 6466833, 6998787, 7410317, 7620380]
4371G620380J02703j83715k88522m06118k44429m57828j65165k62009k12051n8042
4361E445204j93618j97466j25297j45692n6680j01198K799O0170J17994J01671
4351D907887P9599n707K3375J66025k57343j6351N4200k29544j14697o5681k9180
4340D512583P8025n59q5068Q889J15248p0955k02997r9714K9781J23188j8991
4329D389430j8617j26443l7024K620M5955r1546J09219j47044P9126J73786j18016
4318D261446r3730J17489N8480n055p1010J63061n3197j10087J2786J7687n7816
4307D240054p4411k6410J50804P1228q1314j89263j24101P3099j23434r923J29082
4296D035411q8825J07044J45697r7011J68647m0846P8881j99033o8965M8563L5367
$$ y = [7620380, 7723083, 7539368, 7250846, 6844728, 6600299, 6142471, 5977306, 5715297, 5503246, 5445204, 5251586, 5054120, 4928823, 4783131, 4726451, 4625253, 4628052, 4688222, 4806216, 4907887, 4987486, 4981779, 5005154, 5171179, 4913836, 4897485, 4951685, 4722141, 4607444, 4541763, 4512583, 4590608, 4590049, 4504981, 4513870, 4629118, 4558163, 4355166, 4255452, 4285233, 4408421, 4389430, 4370813, 4244370, 4207346, 4209966, 4255921, 4164375, 4273594, 4126550, 4205676, 4379462, 4261446, 4167716, 4285205, 4343685, 4338630, 4267620, 4430681, 4377484, 4267397, 4280183, 4297870, 4240054, 4165643, 4139233, 4290037, 4361265, 4279951, 4090688, 3966587, 4039686, 3916252, 3906329, 4035411, 3946586, 4053630, 4199327, 4102316, 4270963, 4230117, 4308998, 4109965, 4041000, 4089563, 4124930]
4285D124930j45792k00405j6260O9915k4378m0438J58851R7165K0621J3438k16419
4274C841228K2219J20667K0264L964k4989k6863J3203J07452n3499r6242J05671
4263D033075l5888p9165N299K8494r0440o5288j20656N5991R4332m4979L5742
4252C816517N6375K0761P6925r0377M1814K7169j31892J30783P280n7055P4652
4241C972952l4225M6258J34939Q2415J25063m2265l4010N915j35639J50214L5105
4230D306722J49087k1547m1186L5429P7773L7719J36817N2818p8075L6711M0613
4219D732881K00298J06408o2442R7767q6778L2496J82948j1549K7230J26517J98248
4208E544024J4979m8641O1301O8667n9784J9168O5622J12939o319k1264J8607
$$ y = [4124930, 3979138, 3778733, 3762473, 3832388, 3808010, 3767572, 3926423, 4023588, 4044209, 4057647, 3841228, 3863447, 3984114, 4004378, 4008342, 3983353, 3956490, 3969693, 4077145, 4023646, 3927404, 4033075, 3997187, 3918022, 3923321, 3951815, 3861375, 3796087, 3675431, 3731422, 3825754, 3780775, 3816517, 3872892, 3893653, 3970578, 3880201, 3922015, 3949184, 3817292, 3948075, 3955355, 3898300, 3972952, 3938727, 3984985, 4119924, 4202339, 4327402, 4285137, 4251127, 4257042, 4121403, 4271617, 4306722, 4455809, 4434262, 4393076, 4428505, 4506278, 4543997, 4680814, 4733632, 4655557, 4692268, 4732881, 4933179, 5039587, 4977145, 5074912, 4988134, 5020630, 5203578, 5192029, 5219259, 5345776, 5544024, 5559003, 5510362, 5571663, 5640330, 5580546, 5599714, 5665336, 5778275, 5771956, 5750692, 5769299]
4197E769299P3992J63983J83221P7105P8453j11786J40293J25085J63821O7690
4187F731156l3266L669J33179J89564J11046J00889Q2113J11608P39J59862R4684
4176G685243K01403K49784L8159J54223R1600J66950K58160L04592J16014M3594
4166I309722K76251J59815J60444J84242J54122J95273K09530J39064K16440K56877
4156A1261780K58312L90968M14435K98774K44637M92772N50965N76993Q48561
4147A5338197Q20239Q76268R78498Q84555Q45188J112550J253415J342992J607000
4138B5058902J653253J695414J584750J667821J607626J291250J079393J133380
4130C6771789Q09420Q47871P23589P18251Q25408J142451J492938J626643K185797
$$ y = [5769299, 5843291, 6007274, 6190495, 6267600, 6346053, 6234267, 6374560, 6499645, 6663466, 6731156, 6697890, 6701559, 6834738, 7024302, 7135348, 7236237, 7318350, 7429958, 7430697, 7590559, 7685243, 7886646, 8136430, 8174589, 8328812, 8420412, 8587362, 8845522, 9150114, 9266128, 9309722, 9585973, 9745788, 9906232, 10090474, 10244596, 10439869, 10649399, 10788463, 11004903, 11261780, 11520092, 11911060, 12325495, 12624269, 12868906, 13361678, 13912643, 14489636, 15338197, 16158436, 17034704, 18013202, 18897757, 19742945, 20855495, 22108910, 23451902, 25058902, 26712155, 28407569, 29992319, 31660140, 33267766, 34559016, 35638409, 36771789, 37581209, 38429080, 39152669, 39870920, 40696328, 41838779, 43331717, 44958360, 47144157]
4121D7144157K391966K352659K082984J996749J831155J605264J544412J735854
4113F2685200J831840J852219J873587J794874J751644J439401J500659J707927
4105G6437351J704324J895777K072135J925409J819956J519562J698765K111117
4097I1184396K979807M068594M929127N553215N277137M266268K969352J883500
4089A23111396J307978J314642J671819J696968J473366R62404L97339J80388
4081A32116300L7853P1168L57620N62598N15019N59958M04529J58178M6374J10899
4071A34940496M76334J329717K843400M410718O004771P186068P382299P106513
4063A71680316O214446N349089M782118M705800M989507M902196M589293L915994
$$ y = [47144157, 49536123, 51888782, 53971766, 55968515, 57799670, 59404934, 60949346, 62685200, 64517040, 66369259, 68242846, 70037720, 71789364, 73228765, 74729424, 76437351, 78141675, 80037452, 82109587, 84034996, 85854952, 87374514, 89073279, 91184396, 94164203, 98232797, 103161924, 108715139, 113992276, 118258544, 121227896, 123111396, 124419374, 125734016, 127405835, 129102803, 130576169, 131538573, 131935912, 132116300, 132154153, 132225321, 132582941, 133145539, 133660558, 134220516, 134625045, 134783223, 134829597, 134940496, 135416830, 136746547, 139589947, 144000665, 150005436, 157191504, 164573803, 171680316, 177894762, 183243851, 188025969, 192731769, 197721276, 202623472, 207212765, 211128759]
4055B11128759L175479K390603J494037M87020r28515j279881j447450j411655
4047B13608397m88766N62678J793372K861344L808815M174708L813986K864696
4039B32999230J685084M39027p89990j609300j666993j249159q06921K38501J287506
4030B30526985K003343K142361J569366Q13094k6375m89512p29623j070231j203150
4021B33536258j916207k324390k591341k641551k341258k342921l341369n023397
4013B11013824o447000p668304q202884p792011o661958n212533l865037k376343
4005A62787754j480356j042403p77241p88157r41977q88364j212271j621172k070631
3996A51965182k262625k549259k625477k357765k131552j334403n36160P5853
$$ y = [211128759, 214304238, 216694841, 218188878, 218675898, 217747383, 216467502, 215020052, 213608397, 213119631, 213682309, 215475681, 218337025, 222145840, 226320548, 230134534, 232999230, 234684314, 235123341, 234333351, 232724051, 231057058, 229807899, 229000978, 229239479, 230526985, 232530328, 234672689, 236242055, 237055149, 237028774, 236539262, 235809639, 234739408, 233536258, 231620051, 229295661, 226704320, 224062769, 221721511, 219378590, 216037221, 211013824, 204566824, 196898520, 188695636, 180903625, 174241667, 169029134, 165164097, 162787754, 161307398, 160264995, 159487754, 158699597, 157757620, 156869256, 155656985, 154035813, 151965182, 149702557, 147153298, 144527821, 142170056, 140038504, 138704101, 138167941, 138243794]
3988A38243794J61766n21127j694791l253817m607882n167850n189341m612724
3980A13358028l711779l027652k506148k044431k284732k313869k303891k499912
3972I2665614k590908k549354k455553k359222k128880k007040j707111j555067
3964G5312479j536774j274399r84694o41918n23523j060972j740087k523885l019006
3955F2007221l253035k789955k297819k160236j773696j601618j548688j576554
3947D5005620j514640j288077j284268j149622r61780j219792j190453j347900
3939C5049088j505630j488295j383743j393107j350561j260631j102204q66028
3931B4698889o99549j56506L71996L96967j1044o82703j048838j343449j373028
$$ y = [138243794, 138405560, 137884433, 136189642, 132935825, 128327943, 123160093, 117970752, 113358028, 109646249, 106618597, 104112449, 102068018, 99783286, 97469417, 95165526, 92665614, 90074706, 87525352, 85069799, 82710577, 80581697, 78574657, 76867546, 75312479, 73775705, 72501306, 71516612, 70874694, 70351171, 69290199, 67550112, 65026227, 62007221, 58754186, 55964231, 53666412, 51506176, 49732480, 48130862, 46582174, 45005620, 43490980, 42202903, 40918635, 39769013, 38807233, 37587441, 36396988, 35049088, 33543458, 32055163, 30671420, 29278313, 27927752, 26667121, 25564917, 24698889, 23999340, 23842834, 24214830, 24611797, 24600753, 23918050, 22869212, 21525763, 20152735]
3922B0152735j054881q39578q07256p75732l91301m13328m96066l88403m07208
3913A4578982j96990k68753l97162m81557k24734k04531k23559j41333j74708
3904A2265655k68444j53493j55822k60517j45661k04535k41324j25653k84052
3895A0426154j01362k55336k70761n3366o8999l2003o0356k33188j54680j58771
3885I037332j17296l2370k12029p3375j1440j31714K7739l3652j47227L4695n007
3874H335656j71259j19750j40484n5478Q2983L092j70431j75594m2454K7496o3677
3863G510100p4572j9047j93445j68576l9784Q5613j09307n1030M3302j20771j55233
3852F707250N903j3712q5848R2712K6624k709r7389M1253O4206p2478p2305q3846
$$ y = [20152735, 19097854, 18258276, 17451020, 16675288, 16283987, 15870659, 15374593, 14986190, 14578982, 14381992, 14113239, 13716077, 13234520, 13009786, 12805255, 12581696, 12440363, 12265655, 11997211, 11843718, 11687896, 11427379, 11281718, 11077183, 10835859, 10710206, 10426154, 10324792, 10069456, 9798695, 9745329, 9676330, 9644327, 9583971, 9350783, 9196103, 9037332, 8920036, 8887666, 8675637, 8602262, 8590822, 8459108, 8486847, 8453195, 8305968, 8340663, 8335656, 8164397, 8044647, 7904163, 7848685, 7931668, 7934760, 7764329, 7588735, 7546281, 7573777, 7510100, 7435528, 7416481, 7223036, 7054460, 7014676, 7100289, 6990982, 6939952, 6983254, 6862483, 6707250, 6713153, 6699441, 6613593, 6706305, 6732929, 6730220, 6632831, 6674084, 6738290, 6665812, 6593507, 6509661]
3840F509661Q0731J9888m5288m3366n8614j32730j8663n2165K807K4071P4122
3829F360454K948J7812k46502p4002j0930j24539L3658r335o2941j2441j6106
3818E858076o8096r8585m8728L3470L3220K0501p3088j08254r636J81273Q9106
3807E809259j15038k4080p0295K8834M2462r6699j16871L2691q5235j99949m966
3796E200113P0649r0602l1306Q6742j31190j26009j77414P0937Q4278q8217J28342
3785D996323j170N2137K4547j12547l767J4069P7064k3367r8679j43612l8566
3774D742432K4888o9779N9502j65456n6117J30956J00363J6528l0687o4466j22984
3763D565180n5567J03860J8138q6050q3384N9001P2410j12581R4121j0470k1514
$$ y = [6509661, 6590392, 6610280, 6564992, 6521626, 6463012, 6330282, 6311619, 6259454, 6262261, 6286332, 6360454, 6363402, 6381214, 6134712, 6060710, 6049780, 5925241, 5958899, 5949564, 5886623, 5874182, 5858076, 5789980, 5691395, 5642667, 5676137, 5709357, 5729858, 5656770, 5548516, 5538880, 5720153, 5809259, 5694221, 5670141, 5599846, 5628680, 5671142, 5574443, 5457572, 5490263, 5405028, 5205079, 5200113, 5270762, 5180160, 5148854, 5235596, 5104406, 4978397, 4800983, 4871920, 4956198, 4867981, 4996323, 4995153, 5047290, 5071837, 4959290, 4955523, 4969592, 5046656, 5023289, 4924610, 4780998, 4742432, 4767320, 4697541, 4757043, 4591587, 4535470, 4666426, 4766789, 4783317, 4752630, 4688164, 4565180, 4509613, 4613473, 4631611, 4545561, 4462177, 4521178, 4593588, 4481007, 4575128, 4564658, 4543144]
3752D543144L173q7137j18839K6422m2303j54085r1948R1990N6841R8320j11219
3741D214359M4024J31726K9089j29007K6881K3763j61951L4410n3507P7046j63496
3730D073337q2813J64010L2922j09547p0407k6592K70276j23401j02899m5698
3720C979188k731k9001R5602n6369J19596J75282p4471J8630l8918n6388j7214
3709D113206j01103M3228R2718p9441N4117j90130l8880L7668j65183p68J6384
3698C781816o1818O1461j77925M991N8169r609j14543j87504o7L04392k7656k9507
3686C602200K424j59456k2954Q463n6701l7861l7794R1020J8406q7345p8329L1060
3674C273133j47784N9596J7364m7970k0320P2100J03944j7180q5577J02047J8976
$$ y = [4543144, 4546317, 4459180, 4340341, 4366763, 4324460, 4170375, 4078427, 4170417, 4227258, 4325578, 4214359, 4258383, 4390109, 4419198, 4290191, 4317072, 4340835, 4178884, 4213294, 4159787, 4236833, 4073337, 3990524, 4154534, 4187456, 4077909, 4007502, 3980910, 4251186, 4127785, 4024886, 3979188, 3976457, 3947456, 4043058, 3986689, 4106285, 4281567, 4207096, 4225726, 4186808, 4130420, 4113206, 4012103, 4055331, 4148049, 4068608, 4122725, 3932595, 3893715, 3931383, 3766200, 3765432, 3781816, 3719998, 3781459, 3603534, 3608525, 3666694, 3657085, 3542542, 3355038, 3354971, 3659363, 3631707, 3602200, 3604624, 3445168, 3422214, 3430677, 3373976, 3336115, 3298321, 3389341, 3407747, 3320402, 3242073, 3273133, 3125349, 3184945, 3202309, 3154339, 3134019, 3206119, 3310063, 3292883, 3207306, 3309353, 3328329]
3663C328329k2263j90195M3896o011j4573J13498P547k470p4765j3729k1434J4224
3651C162054K0414L2371O8785Q7012K6006K647o3142n9140r908j08793k1043J94534
3639C331797o0249p2110l509R059J30482m1036r4191j26262N5112J44156R8179
3628C371428k3571j69811J18240q6632j01684n7445J86129L8654m9659j59355
3618C066294o2117Q0862P2702j7577J8020P9270q1327L687j614P9892N8212k16077
3606C080227r5683K5562k7258L8531N2845m9612O4966R9530J16409m9035K9953
3595C286435Q4876J3828j97613L5663J7497m2904p3711J73366J06999k8897K9864
3584C405403K7868L7122m3970R5425R2793m9954K7763K2509J12243q9521M3973
$$ y = [3328329, 3306066, 3115871, 3159767, 3153756, 3139183, 3252681, 3260228, 3257758, 3182993, 3169264, 3147830, 3162054, 3182468, 3214839, 3283624, 3370636, 3396642, 3399289, 3336147, 3277007, 3267099, 3158306, 3137263, 3331797, 3271548, 3199438, 3195929, 3204988, 3335470, 3294434, 3200243, 3073981, 3129093, 3273249, 3371428, 3347857, 3178046, 3296286, 3209654, 3107970, 3050525, 3236654, 3275308, 3225649, 3066294, 3004177, 3085039, 3157741, 3140164, 3158184, 3237454, 3156127, 3159814, 3158200, 3238092, 3296304, 3080227, 2984544, 3010106, 2982848, 3021379, 3074224, 3024612, 3089578, 3189108, 3305517, 3256482, 3286435, 3371311, 3385139, 3187526, 3223189, 3240686, 3197782, 3124071, 3297437, 3404436, 3375539, 3405403, 3433271, 3470393, 3426423, 3521848, 3614641, 3564687, 3592450, 3614959, 3727202, 3637681, 3681654]
3573C681654J91867n8448j2435k3914K8048J00283L4896O4895k724j71670J0692
3562C843144N2733O1613J21100j5994J1631Q2193M3623q1881N5932K65167P6206
3551D515467L9918J82565J4699L3625J25092M8678J40920J2016J57995Q0608L9130
3540E390713N6538j2151Q2044L89k3397J28083J43566M0954m5161J11507Q8794
3529E961879J79559Q5271P8108K01410J88499Q6294J69337K43260K41158J49944
3519G584719Q6692P5691K46066K42095J39337K07466M30039M55682L74273M20316
3509A0262376P32735O17203R48695R35405Q50160P30405O23946O84323M72246
3500A6857494J92142J62617J2949k09364k27003l94922l63126j56563k59412r1427
$$ y = [3681654, 3873521, 3815073, 3802638, 3778724, 3806772, 3907055, 3941951, 4006846, 4004122, 3832452, 3843144, 3895877, 3957490, 4078590, 4062596, 4074227, 4156420, 4200043, 4118162, 4174094, 4439261, 4515467, 4555385, 4737950, 4752649, 4786274, 4911366, 4960044, 5100964, 5112980, 5270975, 5351583, 5390713, 5447251, 5435100, 5517144, 5517533, 5494136, 5622219, 5765785, 5806739, 5761578, 5873085, 5961879, 6141438, 6226709, 6304817, 6506227, 6694726, 6781020, 6950357, 7193617, 7434775, 7584719, 7671411, 7747102, 7993168, 8235263, 8374600, 8582066, 9012105, 9467787, 9842060, 10262376, 10995111, 11612314, 12561009, 13496414, 14346574, 15076979, 15700925, 16385248, 16857494, 17049636, 17212253, 17225202, 17015838, 16788835, 16393913, 16030787, 15874224, 15614812, 15523385]
3490A5523385k536q6309j0663j06316o9728j23318m87357m78443n89055n82393
3480A2987267n90523q20318o21149o29671n75632m78195n60905o22319l40830
3471G747725l63379l28648k21547j28826j35585j07790j50943k47836j97185J922
3461E867908k03687o3367j04021m0959j02608o9855p7075q7785j12778k37741
3451D768032K8146o0703j45765M4109q4304p2122j29876j45489k3982p315r9671
3440D071060n4124n2393j10434r2807O7375l0929k9331q5729O0163p6612r9457
3429C566782O9023j51775r1010k4368O6521o1355m0054J3729N4265j2250l9517
3418C349991J4573o8758j04027q0608K6908J01427J4046j32347j28382p8420J4112
$$ y = [15523385, 15520849, 15434540, 15423877, 15317561, 15247833, 15124515, 14637158, 14158715, 13569660, 12987267, 12396744, 11576426, 10955277, 10325606, 9749974, 9271779, 8710874, 8088555, 7747725, 7384346, 7055698, 6834151, 6705325, 6569740, 6461950, 6311007, 6063171, 5865986, 5867908, 5664221, 5600854, 5496833, 5455874, 5353266, 5283411, 5206336, 5118551, 5005773, 4768032, 4796178, 4735475, 4589710, 4633819, 4549515, 4477393, 4347517, 4202028, 4178046, 4170731, 4071060, 4016936, 3964543, 3854109, 3761302, 3828677, 3797748, 3768417, 3682688, 3742851, 3666239, 3566782, 3635805, 3484030, 3393020, 3368652, 3435173, 3373818, 3333764, 3347493, 3401758, 3389508, 3349991, 3364564, 3295806, 3191779, 3111171, 3138079, 3239506, 3253552, 3121205, 2992823, 2914403, 2928515]
3407B928515n8764q696r360j1248p8682k2661p3739l3296J8602k7722J44508j44299
3395B623158j0240J42788j14483j52011K4192N1254M6277j05798N684r384P1539
3384B572976n0970J0251j29017K2082J33554J47861N3121k167q0258j860n4110
3373B621463m0697K6864j3657r6623M3173q4459j25674O0773K6887n6723o0894
3362B300433o0106K2398L2972n1853J00395K2640p9334n2793Q9843R064o2170
3351B271489O9421N5630n6962K0349J16428Q8103k390p4135o7995p8336p5425
3340B266177j03503n0328k7070j37020Q7443Q1741J17316j46453j79862p0322
3330A838119L8701R5027l4340j20092J5048R9794k6045l4283o3659m3379J63227
$$ y = [2928515, 2869751, 2861055, 2851695, 2840447, 2761765, 2739104, 2665365, 2632069, 2650671, 2622949, 2767457, 2623158, 2612918, 2755706, 2641223, 2489212, 2513404, 2564658, 2610935, 2505137, 2510821, 2501437, 2572976, 2522006, 2532257, 2403240, 2425322, 2558876, 2706737, 2759858, 2757691, 2677433, 2675573, 2621463, 2580766, 2607630, 2593973, 2497350, 2540523, 2456064, 2330390, 2391163, 2418050, 2361327, 2300433, 2240327, 2262725, 2295697, 2243844, 2344239, 2366879, 2287545, 2234752, 2324595, 2333659, 2271489, 2340910, 2396540, 2339578, 2359927, 2476355, 2564458, 2562068, 2487933, 2419938, 2341602, 2266177, 2162674, 2112346, 2085276, 1948256, 2035699, 2117440, 2234756, 2088303, 1908441, 1838119, 1876820, 1971847, 1937507, 1817415, 1832463, 1932257, 1906212, 1871929, 1808270, 1764891, 1928118]
3319A928118J02477p6432m8146J01632N7644J6216N7961l6387J1631l6759p8908
3308A999047K7804K8000o9585m9577J21689K5663O5394j09158j09544o431j46651
3297A776651N9921O9602j48405j6311k0072j10082N6659J42721r9796j0546l6378
3286A663964O6400j9507R7099l2698n3951J0194p4903j3357P5085K3326K2237
3275A763889o0741p2425q65j52860O5646J1683o9301j5006P8571L798M2143M6323
3263A640855m6865j5272Q881J03421q5974N7997J05475N8621Q272r4829k8110
3252A712472j0693n66L432J05918O4717Q243q5462J3516M8912K317O36N7463J34245
3239B055150O1484p900j93601m1034Q3376R7668n8688J2763J01025N4051N5396
$$ y = [1928118, 2030595, 1954163, 1906017, 2007649, 2065293, 2081509, 2139470, 2103083, 2114714, 2077955, 1999047, 2026851, 2054851, 1985266, 1935689, 2057378, 2083041, 2148435, 2039277, 1929733, 1923302, 1776651, 1836572, 1906174, 1757769, 1741458, 1721386, 1611304, 1667963, 1810684, 1710888, 1700342, 1663964, 1730364, 1710857, 1807956, 1775258, 1721307, 1731501, 1656598, 1643241, 1718326, 1741652, 1763889, 1703148, 1630723, 1629858, 1476998, 1542644, 1554327, 1485026, 1470020, 1548591, 1552389, 1594532, 1640855, 1593990, 1578718, 1587599, 1691020, 1605046, 1663043, 1768518, 1827139, 1835411, 1740582, 1712472, 1701779, 1701213, 1704645, 1810563, 1875280, 1883523, 1798061, 1811577, 1860489, 1862806, 1863442, 1920905, 2055150, 2116634, 2108734, 1915133, 1874099, 1957475, 2055143, 1996455, 2009218, 2110243, 2164294, 2219690]
3228B219690q062P3266J6672j50781n3290J62358j00584R8435R0902r0788R104
3217B266922k55K9224M037m2915p944r0301J61134O2852J02659j51634J9048J84601
3205B537428J39535o4026J11761J07066O4149J80687J41246l8495K62821L33836
3195C776008K26082J75136J60390J55737K57280M62303L56967K63155K80279L5989
3185F149326N0877P6174j04945J23110O9182j01962r3261n398J34254J9168j17773
3174F198752K2610l2820N2804P0727j17506J90926K50491J55124J56859K55325
3164G203292M90396P06308R60091J443238J421336R07097M28375l41211q66275
3155A2352647j030347r30405r30810q70662p03481n15992l35354k86399l32321
$$ y = [2219690, 2211628, 2284894, 2301566, 2150785, 2097495, 2259853, 2159269, 2257704, 2348606, 2257818, 2266922, 2266667, 2295891, 2299928, 2257013, 2249069, 2158768, 2319902, 2382754, 2485413, 2333779, 2352827, 2537428, 2676963, 2612937, 2724698, 2831764, 2895913, 3076600, 3217846, 3179351, 3442172, 3776008, 4002090, 4177226, 4337616, 4493353, 4750633, 5212936, 5569903, 5833058, 6113337, 6149326, 6200203, 6276377, 6171432, 6294542, 6363724, 6261762, 6168501, 6163103, 6297357, 6316525, 6198752, 6221362, 6188542, 6241346, 6312073, 6194567, 6385493, 6635984, 6791108, 6947967, 7203292, 7693688, 8399996, 9360087, 10803325, 12224661, 13131758, 13560133, 13218922, 12352647, 11322300, 10391895, 9461085, 8590423, 7886942, 7370950, 7035596, 6749197, 6416876]
3146F416876k85024k44117o7486j55723p1531j71057P8738l342K18611P0654J43620
3135E930219J35616K32293L38435J65896K41983K61530K80560K2481j59920j61701
3125G287392k25176k64949m90147n94076k56268q9190l54850l06377k44638j62853
3115D298868p6631j66750j23566n1283j3770j09461j18096K6046j71502P2413
3105C566268L34j90768j0138j78346m5338j12548O8269J3139k30172j58727J03128
3094B825101j6126j62565n5231J1892j66604j80518o100L0351n9045j68489j11628
3083A941038J2163J055m3815K2181k8091K1055K03j56732n1440J39738J1921j80106
3071A689170j45278Q9615O5954K5328l4600p5239J2686J18882j02930n8541q5516
$$ y = [6416876, 6131852, 5887735, 5820249, 5664526, 5592995, 5421938, 5500676, 5497334, 5715945, 5786599, 5930219, 6065835, 6298128, 6636563, 6802459, 7044442, 7305972, 7586532, 7609013, 7449093, 7287392, 7062216, 6797267, 6307120, 5713044, 5456776, 5367586, 5012736, 4706359, 4461721, 4298868, 4222237, 4055487, 3931921, 3880638, 3866868, 3757407, 3639311, 3665357, 3493855, 3566268, 3566602, 3375834, 3365696, 3187350, 3142012, 3029464, 3097733, 3110872, 2880700, 2721973, 2825101, 2808975, 2646410, 2591179, 2603071, 2436467, 2255949, 2249849, 2280200, 2221155, 2052666, 1941038, 1953201, 1954256, 1910441, 1932622, 1904531, 1925586, 1925789, 1769057, 1717617, 1857355, 1869276, 1689170, 1543892, 1633507, 1699461, 1724789, 1690189, 1614950, 1627636, 1746518, 1643588, 1585047, 1499531]
3060A499531r7284J09341p0450q4669K12226j194k09482j23035Q5665M3203j8962
3049A344890j0008j39489O3057m9283j06403Q1769M9756m9176m9646o1558p2097
3038A001812K9341R4278M029J6203m1167R002N9909r520J6378q8815p8628J58496
3026A171318o8889l9940Q6623j1689j34323k5140l4418K1980O9762J9754j29931
3015I25107m4672k6886m7059L0933M8223M41P1753k2945Q4119K4268k2180o7366
3003I53736m6175L475K0436j51593l0915N0031l7881N2831j17582R2877J76297
2992I65537k39p5756o2820Q8300J5846m9217m5767N900m4288j39906J21075J28632
2980I07297j91769M153l3308q2490J4836j14424Q7223N5406Q0363J40555J33749
$$ y = [1499531, 1402247, 1511588, 1441138, 1356469, 1568695, 1567501, 1358019, 1234984, 1320649, 1363852, 1344890, 1334882, 1195393, 1258450, 1209167, 1102764, 1184533, 1234289, 1185113, 1135467, 1073909, 1001812, 1031153, 1125431, 1129460, 1145663, 1104496, 1113498, 1173407, 1163887, 1180265, 1091450, 1012822, 1171318, 1102429, 1062489, 1149112, 1137423, 1003100, 977960, 943542, 965522, 1035284, 1055038, 925107, 880435, 853549, 806490, 837423, 885646, 886087, 957840, 934895, 1019014, 1043282, 1021102, 953736, 907561, 911036, 931472, 779879, 748964, 798995, 761114, 813945, 696363, 789240, 965537, 965298, 889542, 826722, 915022, 930868, 881651, 835884, 841784, 797496, 657590, 778665, 907297, 715528, 719681, 686373, 603883, 618719, 504295, 591518, 646924, 727287, 867842, 1001591]
2969A001591q4940m3679o3760M5582R7793p4575j39701q717p4102m7329J15246
2958G23409J10458J11104k34657l8479r370k5830j2465j03722J36914R958j12812
2947E54508l0671M9304J72697N4880j9450J7801m2383j26724J16168L2804o8595
2936G10339L5343j04188J4517l5592J27336Q2620r6458P660o4000k0243j49299
2925E08035R4237J62324j96475o2880m3460J34681l7061n2044O1823k0681j5370
2914E33129J53595K4286M3147p5804l2004o1730J0046j0959o781m4639N1558j3395
2902E70449J8097j13321j22986J27513M4229J17240k5466j27035j9343M061J1991
2891D85429L1588q5434O1050N9956k2451N73k5522Q845Q7288N2691M6809j0831
$$ y = [1001591, 916651, 872972, 809212, 854794, 952587, 878012, 738311, 729594, 655492, 608163, 723409, 833867, 944971, 710314, 671835, 662465, 636635, 624170, 520448, 657362, 667320, 554508, 523837, 573141, 745838, 800718, 781268, 799069, 756686, 629962, 746130, 778934, 710339, 745682, 641494, 656011, 620419, 747755, 830375, 733917, 741577, 677577, 657334, 508035, 602272, 764596, 568121, 505241, 461781, 596462, 559401, 507357, 569180, 548499, 533129, 686724, 711010, 754157, 678353, 646349, 584619, 594665, 583706, 576925, 532286, 583844, 570449, 588546, 475225, 352239, 479752, 523981, 641221, 615755, 488720, 469377, 473438, 485429, 517017, 431583, 492633, 552589, 530138, 530711, 505189, 514034, 601322, 654013, 700822, 689991]
2879F89991j29788L1319J451k4911O9146M4273P3489l3547o8489j25681M5349
2868E72602q1410J62575Q1185k4978j32760J1391N9525j07293L9395j01188J1289
2857D90333K2187j5219n8960o946O0406L5242N1780j00846o2533n8465N6995o300
2845D07674J42378R243j28830o762l4259j18935N8585K22293N9643m9437R691
2834E71284R859j54717K7404J45425K7906j18554p5061L8844m100k0747J27727
2823E75270r2970J09139j13851p3993m859J00489L7710l8742P1207j30543l1072
2812D07785L1317K7348j7295L7625o0212l7662o3840J90865M8689m8483j04440
2801D11697j10862j3583R4410J04830j6310n0314J9262k28126j2610J85600n5588
$$ y = [689991, 560203, 591522, 592973, 568062, 637208, 681481, 754970, 721423, 652934, 527253, 572602, 491192, 653767, 734952, 709974, 577214, 588605, 648130, 540837, 580232, 479044, 490333, 512520, 497301, 438341, 431395, 491801, 527043, 578823, 477977, 415444, 356979, 413974, 407674, 550052, 559295, 430465, 423703, 389444, 270509, 329094, 551387, 611030, 561593, 571284, 581143, 426426, 453830, 599255, 627161, 508607, 433546, 472390, 468290, 447543, 575270, 482300, 591439, 477588, 403595, 398736, 499225, 536935, 498193, 569400, 438857, 407785, 439102, 466450, 449155, 486780, 426568, 388906, 325066, 515931, 564620, 516137, 411697, 300835, 287252, 381662, 486492, 470182, 419868, 439130, 211004, 198394, 383994, 328406]
2790C28406r754R2533N7951n629p0462k5161k568p6894o81N6578M0742l6182P1677
2777D20556L6383p6652j88135P0557K06147j09892L1634o314k03661J07214J33400
2766D21237J64336j59244m7968L8285R8000m7063L5470J7666j60606k1299J3817
2755C52631J54312O8145l4582j653l0399j7219m4003q0062j31654J68075K789
2744D06380r5910k5973J01555n6407n8343L0014l5493J6325m4112Q852K7640J02078
2732C76606L7117J20183n9930o1124j15647J06606N236K3698L358j03591k6804
2721C05708p48K5309M1252n2123M36M3102j59986n6873K33074K6744n7154K3106
2709C71847J25553j82421p72J48383L0706o0188q6397N9441l3270O4024Q615j35752
$$ y = [328406, 318652, 411185, 469136, 463507, 393045, 367884, 365316, 288422, 287741, 344319, 385061, 348879, 420556, 456939, 380287, 192152, 262709, 468856, 358964, 390598, 384284, 180623, 287837, 421237, 585573, 426329, 378361, 416646, 514646, 467583, 503053, 520719, 360113, 338814, 352631, 506943, 575088, 540506, 538853, 508454, 491235, 447232, 367170, 235516, 403591, 406380, 310470, 284497, 386052, 329645, 271302, 301316, 265823, 282148, 238036, 246888, 274528, 376606, 413723, 533906, 473976, 412852, 297205, 403811, 409047, 432745, 436103, 332512, 305708, 304960, 330269, 371521, 319398, 319834, 362936, 202950, 146077, 379151, 405895, 348741, 371847, 497400, 314979, 314207, 462590, 493296, 433108, 346711, 406152, 372882, 436906, 445521, 309769]
2697C09769O1770j66045j0527J46514j1126m9463j00566J21828J37930O1686k09263
2686B92507J5048k0469p4519J49400j33501M9236J10685j34142J39450L2013j18520
2675C07188Q7873K3543m650J10844J0281l7527j24375m982K58985o826j45605
2664D74749p7442M5682N7395q9283j3556L8481L3534J3853k21851o8306J54574
2653C47830l6141M3657J52372m8076j11388o7930p274J13282j5673k1044P902
2642C57517j07364O4083K3491P49m7103K3677J11774L852L0845j28362j1667M0858
2630C62350R8284J8867K25368K85678J51313J95405l8777L525o4665n3594k22084
2619I61670k51992o6658q5159j57209N9177J52516K6774r2229o3111R5312j33369
$$ y = [309769, 371539, 205494, 194967, 341481, 330355, 280892, 180326, 302154, 440084, 501770, 292507, 307555, 287086, 212567, 361967, 228466, 277702, 388387, 254245, 393695, 425708, 307188, 395061, 418604, 413954, 524798, 535079, 497552, 373177, 368195, 627180, 620354, 474749, 397307, 442989, 500384, 411101, 397545, 436026, 469560, 483413, 261562, 193256, 347830, 311689, 355346, 507718, 459642, 348254, 280324, 273050, 386332, 370659, 349615, 357517, 250153, 314236, 337727, 338476, 291373, 315050, 426824, 430676, 461521, 333159, 321492, 362350, 460634, 479501, 704869, 990547, 1141860, 1337265, 1298488, 1302013, 1237348, 1183754, 961670, 709678, 643020, 557861, 400652, 459829, 612345, 639119, 546890, 483779, 579091, 445722]
2608D45722K0044r9882N3679N1842J28215m4952o7616q6001O1509O1299r5280
2597D28579J32050k4481j57196M7996O2992N7925m1592M9189L6340k6753j15002
2586D50047K5614j28839p953l8906n6950J50849r4779m4861O0947j31564L6069
2575B19674j853o2144J01605Q6166M9943l5178m3466l6484N5927J16282j65090
2564B85382n9099J4532k4941J03467k2744r1163M3441J64260m7009J16898o4783
2553D18241K1610J10134r1961j22650j5749L702J6896J1889J11633j59191p4035
2542B30519j4140J78578j6719n7156m4469N9247j13091K9276K40773J5916L2649
2531E41383p8456j293q691Q2346j15895o0189J25674q334J89252K7021n5855m5817
$$ y = [445722, 465766, 365884, 419563, 471405, 599620, 554668, 487052, 401051, 462560, 523859, 428579, 560629, 536148, 378952, 426948, 489940, 547865, 506273, 555462, 591802, 565049, 450047, 475661, 346822, 338869, 299963, 243013, 393862, 299083, 254222, 315169, 183605, 219674, 217821, 155677, 257282, 343448, 393391, 358213, 314747, 278263, 334190, 450472, 285382, 226283, 240815, 215874, 319341, 296597, 205434, 248875, 413135, 366126, 483024, 418241, 439851, 549985, 458024, 335374, 319625, 323327, 340223, 352112, 463745, 304554, 230519, 216379, 394957, 378238, 321082, 276613, 335860, 222769, 252045, 492818, 508734, 541383, 462927, 461634, 452943, 535289, 419394, 359205, 484879, 476545, 665797, 692818, 636963, 591146]
2519E91146k0083R4553j26730K5656J46198j96782P4752P2123r6483m4209N7173
2508E77314o481j338k01179J79439L9869L4631N4776q909j6476L9343n2922l2122
2496F05945Q1707j95467m62J06548M2203m5302j1073J77J10833n7729j1582J36819
2484G62617p7047j51620J41636Q086N110k7073k4225R82J02316M052R33N3858
2472G99625L3342r5479o5550n4873J67898n2645j24061n6500L2481J13677M2123
2461G40038L7971R1518J53428m1805m3322r5515m7595P3371j6300q2473j07704
2450F61612J0243P3794r9320Q913k0183j8552Q2312L0065J25348K19509n6148
2439A017593J49654J84887J56093k3047J1762m9561L7034K0525k8299j34121j02102
$$ y = [591146, 571063, 665616, 538886, 564542, 710740, 513958, 588710, 660833, 564350, 520141, 577314, 570833, 569495, 368316, 547755, 587624, 622255, 677031, 668122, 651646, 690989, 638067, 605945, 687652, 492185, 491723, 598271, 640474, 595172, 584099, 584276, 695109, 637380, 625798, 762617, 685570, 533950, 675586, 683672, 688782, 661709, 637484, 638466, 740782, 744834, 745767, 799625, 832967, 737488, 671938, 617065, 784963, 732318, 608257, 551757, 584238, 697915, 740038, 778009, 869527, 1022955, 981150, 937828, 842313, 794718, 868089, 851789, 769316, 661612, 671855, 745649, 646329, 655242, 635059, 616507, 698819, 728884, 854232, 1073741, 1017593, 1167247, 1352134, 1508227, 1485180, 1496942, 1447381, 1484415, 1504940, 1476641, 1342520, 1240418]
2428A240418O9831J18377k9999p9676J23513P5528n1894K4689m189l2487J78539
2417A632650J7993J71821J0752j2942r0327j3366O4225J29344J30832J06969J04674
2406B252625R2718j02033n7164O1519M3100j16502r7037L5290K14202K23079O9983
2395B619780M5502J31944Q2616j3910m7799K60254Q8594Q0997R9181J62487L7121
2384C546767J18435J90631K63916L81857N59999N28003P55322R04100J149707
2375H398737J622710J987551J446032J129207L08353K57630M84837J213235J479475
2366A8327767K213683L128202M751716O751742J3575701K8943854M8052525M6711027
2358A72456217K5260473J160844k1281281l2008818l2560487k5382741j8549656
$$ y = [1240418, 1310249, 1428626, 1398627, 1318951, 1442464, 1517992, 1466098, 1490787, 1486598, 1454111, 1632650, 1650643, 1822464, 1833216, 1820274, 1729947, 1716581, 1780806, 1910150, 2040982, 2147951, 2252625, 2345343, 2243310, 2186146, 2247665, 2290765, 2174263, 2077226, 2112516, 2326718, 2549797, 2619780, 2665282, 2797226, 2879842, 2865932, 2818133, 3078387, 3166981, 3247978, 3347159, 3509646, 3546767, 3665202, 3855833, 4119749, 4501606, 5061605, 5589608, 6344930, 7249030, 8398737, 10021447, 12008998, 13455030, 14584237, 14892590, 15150220, 15635057, 16848292, 18327767, 20541450, 23669652, 28421368, 35173110, 48748811, 77692665, 125745190, 172456217, 197716690, 198877534, 177596253, 145587435, 113026948, 87644207, 69094551]
2351F9094551j3630527j0947556q795491o828376m437129k733583j288490j116139
2343A9317260j008182j371746j553145j548097j248329j304528r30762o89314
2335I663157m95934k20667l46925n10050l08585m36208n51429l30954k36914j12045
2325F113446j74121k70355l75130j99859j92989k76200k2059j17379j18350j48447
2315D218557k031M9855j58058j72214k39572j58950l03099m5800j62051n6722
2305B969915L583Q1386m3652k41746j0682j51764O2955o4256j76796J97501l9177
2294B587267j34047p3327r4119o030J9155l3892j20169j60903k0877j66380j25478
2283A671200j10664j59666m5934R0751O4430J05620j2791j56688j08132J34028
$$ y = [69094551, 55464024, 44516468, 35720977, 28892601, 24455472, 21721889, 20433399, 19317260, 18309078, 16937332, 15384187, 13836090, 12587761, 11283233, 10352471, 9663157, 9167223, 8946556, 8599631, 8089581, 7780996, 7344788, 6793359, 6462405, 6225491, 6113446, 5939325, 5668970, 5293840, 5093981, 4900992, 4624792, 4602733, 4485354, 4367004, 4218557, 4216526, 4266381, 4108323, 3936109, 3696537, 3537587, 3234488, 3188688, 3026637, 2969915, 2973498, 3054884, 3011232, 2769486, 2758804, 2607040, 2669995, 2605739, 2428943, 2626444, 2587267, 2453220, 2379893, 2285774, 2279744, 2298899, 2265007, 2144838, 1983935, 1963058, 1796678, 1671200, 1560536, 1400870, 1354936, 1445687, 1510117, 1615737, 1602946, 1446258, 1338126, 1472154]
2273A472154O5713J00275J017l0523J5057o4199q0241M8701L8938N9459r5874
2262A530477j23991r0662r671K1740k7287r8914n9665n0627j36694n1441l1053
2251H72212K0824J676m188Q0504k0770N9108M6104j6171M1124P5052p7363j00410
2239I77702j30944l1966J45296j5478r449j5100P1776n4041p6493j42986l5429
2228F82888k6151l0695J9202k6452P6693O0229K0394k0204J8535m0745N4788k90635
2216D97847J0769M4529n2667J24701J9770J1040L9702n8628K6538r8850R7342
2205F62093o861q6335j85732j5645P1022J49636j26785O290q9848l211o765P518
2193C75377J56116q5254M7392j3652K203m475J5926K577L3684Q1060j83286n5729
$$ y = [1472154, 1537867, 1638142, 1639159, 1608636, 1623693, 1559494, 1479253, 1527954, 1566892, 1626351, 1530477, 1406486, 1315824, 1306153, 1327893, 1300606, 1201692, 1142027, 1091400, 954706, 903265, 872212, 893036, 894712, 890524, 971028, 950258, 1009366, 1055470, 1039299, 1080423, 1155475, 1078112, 977702, 846758, 814792, 960088, 944610, 935161, 920061, 991837, 937796, 861303, 718317, 682888, 656737, 626042, 645244, 618792, 695485, 755714, 776108, 755904, 774439, 733694, 788482, 497847, 508616, 553145, 500478, 625179, 644949, 655989, 695691, 637063, 663601, 564751, 662093, 655232, 568897, 383165, 367520, 438542, 588178, 461393, 467683, 377835, 374624, 367859, 375377, 531493, 446239, 493631, 479979, 482182, 477707, 493633, 496210, 529894, 610954, 427668, 371939]
2181C71939R6692M3089l8266j52301J08596l7385R1843m1759O8851P9723K6269
2170F17291L0620J01895j29982o2629o7862K9183j05868R517L1546K3812M6293
2159E23816j77598N2013j9113l2386K2813R4162o4267j23213J02460J08688j529
2148D85846r0553L7678o3076J07486r2393O4308m115M5058K0492j0722j09796
2137C90213P8719k9471k06034M1246Q3787K6053j01509O1154Q7516K557n314j40579
2125B88338m062J42123o7536j4821q5185o9025J28276l8006K2875K536p4198J33573
2113C64888j60673r0266M7247J94091p001K396J04379k0487P783j12805P1210
2102D00762j33732L7482J05175q6639P746L7980M5974K3058j1960L2931K17026
$$ y = [371939, 468631, 511720, 473454, 321153, 429749, 392364, 484207, 442448, 511299, 591022, 617291, 647911, 749806, 619824, 557195, 489333, 518516, 412648, 422165, 453711, 477523, 523816, 346218, 398231, 379118, 346732, 369545, 463707, 399440, 276227, 378687, 487375, 485846, 395293, 432971, 369895, 477381, 384988, 449296, 445181, 490239, 510731, 500009, 390213, 468932, 439461, 233427, 274673, 358460, 384513, 283004, 344158, 431674, 434231, 428917, 288338, 284276, 426399, 358863, 344042, 258857, 189832, 318108, 280102, 302977, 305513, 231315, 364888, 204215, 113949, 161196, 355287, 348286, 350682, 455061, 434574, 442357, 329552, 400762, 267030, 304512, 409687, 323048, 330794, 368774, 414748, 437806, 425846, 458777, 675803]
2091F75803J53760K74925K31352j0783j75150r5173q3862j98482o4457o1810J00055
2080G46178j31458j77068J522m511k6369J3303J94503p5579j75539m4841n6936
2069B63205P1000L0711j9743K1214n0626J5699J6208m1755l0819L4349j94832
2058A14611J5922O9040m7278N5107L8272j5942O3330n9310q4502O8134P6371p8658
2046B15097R5669K4035K8329O9173j64701q3304R509k8965j1007Q9693k2509m1072
2034A79947k7141M2399J01049q9829L4038J85093q7097k41605J21016p1846M2590
2023A88614J04537o474j57996P0064r814L4026L7069Q2308M199j60737p363p0445
2011A07988m5794r34J41439M921r6629P4336M3405J7498J25177q6679j21056n8986
$$ y = [675803, 829563, 1104488, 1335840, 1325057, 1149907, 1054734, 970872, 772390, 707933, 646123, 746178, 614720, 437652, 439174, 434663, 408294, 421597, 616100, 540521, 364982, 320141, 263205, 334205, 364916, 345173, 366387, 315761, 331460, 347668, 305913, 275094, 309443, 114611, 130533, 199573, 152295, 207402, 245674, 229732, 293062, 233752, 149250, 217384, 293755, 215097, 310766, 334801, 363130, 432303, 267602, 184298, 193807, 164842, 153835, 243528, 221019, 179947, 152806, 195205, 296254, 206425, 240463, 425556, 338459, 96854, 217870, 146024, 188614, 293151, 286677, 128681, 198745, 188931, 222957, 260026, 342334, 346533, 185796, 178433, 107988, 62194, 61260, 202699, 207620, 110991, 185327, 228732, 246230, 371407, 284728, 163672, 104686]
1999A04686Q0766m0343l292K6312O4481J8141o4775r831N0445q3293k3706J14858
1987B34449M9748j17112j21233K1556j0379M6437K3623n0409R7593o50l5276K8576
1975A66923n3350K3284M8334m4274N4308J55313k532P150m8861o6722O0281R7214
1963C97068J7271q6825M36K5399L6059o3716Q3613j00836k4596j24686J14875
1952B74062O7363J3128n003j38630K9433P9173L097l8257j9088m5686l9084m0090
1940A40418l2909K5447j112J01061J5174o441M0045m4188P4801r3821N0347K2460
1928B91282L1710o3472l5879J6442r5379O2432m7919L5396K5767j611k8692r2122
1916I7955L5543n9999j12057n3332J37918J75725j8553m8717j14281M928R8918
$$ y = [104686, 185452, 145109, 141817, 168129, 232610, 250751, 185976, 176145, 226590, 143297, 119591, 234449, 284197, 167085, 45852, 67408, 57029, 103466, 127089, 76680, 174273, 173623, 138347, 166923, 113573, 136857, 185191, 140917, 195225, 350538, 348006, 355156, 306295, 239573, 299854, 397068, 414339, 327514, 327950, 353349, 389408, 325692, 409305, 308469, 283873, 159187, 274062, 341425, 354553, 349550, 210920, 240353, 319526, 322623, 284366, 265278, 219592, 180508, 140418, 107509, 132956, 131844, 232905, 248079, 241638, 281683, 237495, 312296, 218475, 268822, 291282, 322992, 259520, 223641, 240083, 144704, 207136, 159217, 194613, 220380, 218769, 190077, 97955, 133498, 73499, -38558, -91890, 46028, 221753, 203200, 154483, 40202, 45130, 144048]
1905A44048P4755J06988j21100J2084o5890J2925M3257J1899J7066J3274l5158
1894B14148O48N0224o8012k868j511P6417P635j12283N2546L1062j72845R2477
1882A67638J22636q6494L2513k3690M2718l2205L4878j5824q3457P1143J40591
1871C70447l4856J12915k31283j08337q950l9104J93224J14623l056L494j55641
1860B13476j97558k329M3669K38376k3161m6186m9549L0028m4724R963P1234j32604
1848A10635m4641M413n3309J08124K6683J0097n834p9898R7533N343j14742l0954
1836C3450P0713Q0578L7751R336n6889O5440J1080j79583m8140j644k4079J96614
1824A94627n7296K2209J13753k6506k4743j9726j14331J7088J740j03838O6103
$$ y = [144048, 218803, 325791, 204691, 216775, 150885, 163810, 207067, 218966, 236032, 249306, 214148, 214796, 265020, 197008, 194140, 192629, 269046, 276681, 164398, 216944, 248006, 75161, 167638, 290274, 203780, 236293, 212603, 255321, 223116, 257994, 242170, 158713, 229856, 370447, 335591, 448506, 217223, 108886, 99936, 60832, 254056, 368679, 365623, 369117, 213476, 15918, 13589, 57258, 295634, 272473, 226287, 176738, 206766, 162042, 172005, 243239, 110635, 65994, 70407, 17098, 125222, 151905, 162002, 156168, 76270, 173803, 179146, 64404, 33450, 104163, 184741, 222492, 231828, 174939, 240379, 251459, 71876, 23736, 22092, -1987, 194627, 137331, 159540, 273293, 246787, 222044, 202318, 87987, 105075, 106815, 2977, 69080]
$$ [...]
##END NTUPLES=NMR SPECTRUM
##END=
