##TITLE=1H_DE-80H_X3
 200.13MHz, d2o
 8 sc
 
 19ns.26.2.2025
##JCAMPDX= 6.0         $$ Bruker NMR JCAMP-DX V2.0
##DATA TYPE= NMR SPECTRUM
##DATA CLASS= NTUPLES
##ORIGIN= UXNMR, Bruker Analytische Messtechnik GmbH
##OWNER= pz
$$ XWIN-NMR		Version 3.5
$$ Tue Mar 17 10:07:31 2026 Russian Standard Time (UT+4h)  Yarkov@DPX200
##.OBSERVE FREQUENCY= 200.1313
##.OBSERVE NUCLEUS= ^1H
##.ACQUISITION MODE= SIMULTANEOUS
##.ACQUISITION SCHEME= undefined
##.AVERAGES= 8
##.DIGITISER RES= 18
##SPECTROMETER/DATA SYSTEM= spect
##.PULSE SEQUENCE= zg30
##.SOLVENT NAME= DMSO
##.SHIFT REFERENCE= (INTERNAL, DMSO, 0, 15.4604)
##AUDIT TRAIL= $$ (NUMBER, WHEN, WHO, WHERE, WHAT)
$$ ##TITLE= Audit trail, XWIN-NMR		Version 3.5
$$ ##JCAMPDX= 5.01
$$ ##ORIGIN= Bruker BioSpin GmbH
$$ ##OWNER= Yarkov
$$ C:/Bruker/XWIN-NMR/data/yarkov2/nmr/H-C/1/pdata/1/auditp.txt
$$ ##AUDIT TRAIL=  $$ (NUMBER, WHEN, WHO, WHERE, WHAT)
(   1,<2026-03-17 10:06:05.71 +0400>,<Yarkov>,<DPX200>,
      <created by zg, POWCHK disabled, PULCHK disabled
       configuration hash MD5:
       00 E9 B6 7A A2 85 ED C7 34 08 36 98 17 FE 4E 26
       data hash MD5: 16K
       48 BF A4 A6 2E 39 4E 2D 49 85 48 5F 7F CE FB F2>)
(   2,<2026-03-17 10:06:14.17 +0400>,<Yarkov>,<DPX200>,
      <Start of raw data processing
       efp BC_mod = 2 LB = 0.25 FT_mod = 6 PKNL = 1 PHC0 = -5299.148 PHC1 = 6.821927 SI = 16K 
       data hash MD5: 16K
       12 20 16 7D 39 C9 08 73 B7 2D F0 33 6C FB C3 B6>)
$$ ##END=
$$ 
$$ hash MD5
$$ D8 50 E6 52 38 FF CD 21 54 17 BC 91 5F A0 16 C6
##$RELAX= 
##$RELAX= 
##$RELAX= 
##$RELAX= 
##$RELAX= 
##$RELAX= 
$$ Bruker specific parameters
$$ --------------------------
##$DU= <C:/Bruker/XWIN-NMR>
##$EXPNO= 1
##$NAME= <H-C>
##$PROCNO= 1
##$TYPE= <nmr>
##$USER= <yarkov2>
##$AMP= (0..31)
100 100 100 100 100 100 100 100 100 100 100 100 100 100 100 100 100 100 
100 100 100 100 100 100 100 100 100 100 100 100 100 100 
##$AQSEQ= 0
##$AQ_mod= 1
##$AUNM= <au_zg>
##$AUTOPOS= <>
##$BF1= 200.13
##$BF2= 200.13
##$BF3= 200.13
##$BF4= 200.13
##$BF5= 200.13
##$BF6= 200.13
##$BF7= 200.13
##$BF8= 200.13
##$BYTORDA= 1
##$CFDGTYP= 0
##$CFRGTYP= 5
##$CHEMSTR= <none>
##$CNST= (0..31)
1 1 145 1 1 1 1 1 1 1 1 1 1 1 1 1 1 1 1 1 1 1 1 1 1 1 1 1 1 1 1 1 
##$CPDPRG= <>
##$CPDPRG1= <>
##$CPDPRG2= <>
##$CPDPRG3= <>
##$CPDPRG4= <mlev>
##$CPDPRG5= <mlev>
##$CPDPRG6= <mlev>
##$CPDPRG7= <mlev>
##$CPDPRG8= <mlev>
##$CPDPRGB= <>
##$CPDPRGT= <>
##$D= (0..31)
0 0.7 0 0 0 0 0 0 0 0 0 0.03 0 0 0 0 0 0 0 0 0 0 0 0 0 0 0 0 0 0 0 0 
##$DATE= 1773727565
##$DBL= (0..7)
120 120 120 120 120 120 120 120 
##$DBP= (0..7)
150 150 150 150 150 150 150 150 
##$DBP07= 0
##$DBPNAM0= <>
##$DBPNAM1= <>
##$DBPNAM2= <>
##$DBPNAM3= <>
##$DBPNAM4= <>
##$DBPNAM5= <>
##$DBPNAM6= <>
##$DBPNAM7= <>
##$DBPOAL= (0..7)
0.5 0.5 0.5 0.5 0.5 0.5 0.5 0.5 
##$DBPOFFS= (0..7)
0 0 0 0 0 0 0 0 
##$DE= 6
##$DECBNUC= <off>
##$DECIM= 32
##$DECNUC= <off>
##$DECSTAT= 4
##$DIGMOD= 1
##$DIGTYP= 9
##$DL= (0..7)
0 120 120 120 120 120 120 120 
##$DP= (0..7)
$$ [...]
##$SUBNAM2= <"">
##$SUBNAM3= <"">
##$SUBNAM4= <"">
##$SUBNAM5= <"">
##$SUBNAM6= <"">
##$SUBNAM7= <"">
##$SUBNAM8= <"">
##$SUBNAM9= <"">
##$SW= 18.0517328524113
##$SWIBOX= (0..15)
0 0 2 0 0 0 0 0 0 0 0 0 0 0 0 0 
##$SW_h= 3612.71676300578
##$TD= 16384
##$TD0= 1
##$TE= 0
##$TE2= 300
##$TE3= 300
##$TEG= 300
##$TL= (0..7)
0 120 120 120 120 120 120 120 
##$TP= (0..7)
150 150 150 150 150 150 150 150 
##$TP07= 0
##$TPNAME0= <>
##$TPNAME1= <>
##$TPNAME2= <>
##$TPNAME3= <>
##$TPNAME4= <>
##$TPNAME5= <>
##$TPNAME6= <>
##$TPNAME7= <>
##$TPOAL= (0..7)
0.5 0.5 0.5 0.5 0.5 0.5 0.5 0.5 
##$TPOFFS= (0..7)
0 0 0 0 0 0 0 0 
##$TUNHIN= 0
##$TUNHOUT= 0
##$TUNXOUT= 0
##$USERA1= <user>
##$USERA2= <user>
##$USERA3= <user>
##$USERA4= <user>
##$USERA5= <user>
##$V9= 5
##$VALIST= <valist>
##$VCLIST= <CCCCCCCCCCCCCCC>
##$VD= 0
##$VDLIST= <DDDDDDDDDDDDDDD>
##$VPLIST= <PPPPPPPPPPPPPPP>
##$VTLIST= <TTTTTTTTTTTTTTT>
##$WBST= 1024
##$WBSW= 4
##$XGAIN= (0..3)
0 0 0 0 
##$XL= 0
##$YL= 0
##$YMAX_a= 253499
##$YMIN_a= -200169
##$ZGOPTNS= <>
##$ZL1= 120
##$ZL2= 120
##$ZL3= 120
##$ZL4= 120
##$ABSF1= 0
##$ABSF2= 0
##$ABSG= 0
##$ABSL= 0
##$ALPHA= 0
##$AQORDER= 0
##$ASSFAC= 0
##$ASSFACI= 0
##$ASSFACX= 0
##$ASSWID= 0
##$AUNMP= <proc_1d>
##$AZFE= 0.1
##$AZFW= 0.1
##$BCFW= 0
##$BC_mod= 2
##$BYTORDP= 0
##$COROFFS= 0
##$CY= -3
##$DATMOD= 1
##$DC= 0
##$DFILT= <>
##$DTYPP= 0
##$F1P= 0
##$F2P= 0
##$FCOR= 1
##$FTSIZE= 16384
##$FT_mod= 6
##$GAMMA= 0
##$GB= 0
##$INTBC= 1
##$INTSCL= 3.241238e-09
##$ISEN= 128
##$LB= 0.25
##$LEV0= 0
##$LPBIN= 0
##$MAXI= 10000
##$MC2= 0
##$MEAN= 0
##$ME_mod= 0
##$MI= 1.114404
##$NCOEF= 0
##$NC_proc= -8
##$NLEV= 6
##$NOISF1= 3.799351
##$NOISF2= 2.8
##$NSP= 0
##$NTH_PI= 0
##$NZP= 0
##$OFFSET= 15.46042
##$PC= 1
##$PHC0= -5299.148
##$PHC1= 6.821927
##$PH_mod= 1
##$PKNL= yes
##$PPARMOD= 0
##$PSCAL= 0
##$PSIGN= 0
##$REVERSE= no
##$SF= 200.130012263406
##$SI= 16384
##$SIGF1= 3
##$SIGF2= 2
##$SINO= 0.751879
##$SIOLD= 32768
##$SREGLST= <19F.Aceton>
##$SSB= 0
##$STSI= 16384
##$STSR= 0
##$SW_p= 3612.71676300578
##$SYMM= 0
##$S_DEV= 0
##$TDeff= 16384
##$TDoff= 0
##$TI= <>
##$TILT= no
##$TM1= 0
##$TM2= 0
##$TOPLEV= 0
##$USERP1= <user>
##$USERP2= <user>
##$USERP3= <user>
##$USERP4= <user>
##$USERP5= <user>
##$WDW= 1
##$XDIM= 16384
##$YMAX_p= 482460943
##$YMIN_p= -2249723
$$ End of Bruker specific parameters
$$ ---------------------------------
##NTUPLES= NMR SPECTRUM
##VAR_NAME=  FREQUENCY,     SPECTRUM/REAL,   SPECTRUM/IMAG
##SYMBOL=    X,             R,               I
##VAR_TYPE=  INDEPENDENT,   DEPENDENT,       DEPENDENT
##VAR_FORM=  AFFN,          ASDF,            ASDF
##VAR_DIM=   16384,         16384,           16384
##UNITS=     HZ,            ARBITRARY UNITS, ARBITRARY UNITS
##FACTOR=    0.220516191357247, 1,           1
##FIRST=     3094.09397512177, 0,            0
##LAST=      -518.622787884009, 0,           0
##MIN=       -518.622787884009, -2249723,    0
##MAX=       3094.09397512177, 482460943,    0
$$ Real data points
##PAGE= N=1
##DATA TABLE= (X++(R..R)), XYDATA
$$ [...]
5115B9751060o64819j012911p23401r33812n82818o25490q52668o47708n32471
$$ 29751060 29086241 28073330 27349929 26416117 25833299 25207809 24355141 23707433 23174962
5106B3174962m89659n99393n94317j72529m54866q23918m53625k00519m30692
$$ 23174962 22685303 22085910 21491593 21319064 20864198 20040280 19586655 19386136 18955444
5097A8955444o10846J25313m56857m54881k60916l79648l24707j56966j54044
$$ 18955444 18344598 18469911 18013054 17558173 17297257 16917609 16592902 16435936 16281892
5088A6281892m08595m07696l06882k70653k67058n06724k08545j76207o7930l33551
$$ 16281892 15873297 15465601 15158719 14888066 14621008 14114284 13905739 13729532 13661602 13328051
5078A3328051m56828j88152m59876n76025k66783j81383L0255q8393j34865k56127
$$ 13328051 12871223 12683071 12223195 11647170 11380387 11199004 11229259 11140866 11006001 10749874
5068A0749874J12600L4244L0478m00414k5044J06075l20257K7564k21911l36500
$$ 10749874 10862474 10896718 10927196 10526782 10501738 10607813 10287556 10315120 10093209 9756709
5058I756709j34815k85869J29477m31419j47440j55076l8902j60299j49996j32812
$$ 9756709 9621894 9336025 9465502 9034083 8886643 8731567 8692665 8532366 8382370 8249558
5048H249558r8184J00234K80915j66359j81872n5761j62378k1492K76616l9698
$$ 8249558 8151374 8251608 8532523 8366164 8184292 8128531 7966153 7944661 8221277 8181579
5038H181579j31009j97418N1053Q5602K8260o1279l4486J77334J34135K36412
$$ 8181579 8050570 7853152 7904205 7989807 8018067 7956788 7922302 8099636 8233771 8470183
5028H470183l37727k3866Q9221M3779l55105Q4983L2321r7977r5161n2792j27086
$$ 8470183 8132456 8108590 8197811 8241590 7886485 7971468 8003789 7905812 7810651 7757859 7630773
5017G630773j45603J53070L3542n0811J5545K96294K77405p4364k06715J08890
$$ 7630773 7485170 7638240 7671782 7620971 7636516 7932810 8210215 8135851 7929136 8038026
5007H038026K90439P8570n4659Q095K58350Q3743l7047k48531j30944P4765j23771
$$ 8038026 8328465 8407035 8352376 8360471 8618821 8702564 8665517 8416986 8286042 8360807 8237036
4996H237036r2149N09061j3712l30510J59031K6769N497M4065J04374r978J31476
$$ 8237036 8144887 8653948 8640236 8309726 8468757 8495526 8501023 8545088 8649462 8639484 8770960
4985H770960K46507M65208R44915M66805L95193p0153l06547n61263k14347l17368
$$ 8770960 9017467 9482675 10427590 10894395 11289588 11219435 10912888 10351625 10137278 9819910
4975I819910r0392j85496J30545l49617j84112J18210l01377j24136Q1429j31750
$$ 9819910 9729518 9544022 9674567 9324950 9140838 9259048 8957671 8833535 8914964 8783214
4965H783214l0138l4855o6916J09619J50698O0498P9958k70231K1799K95263R5479
$$ 8783214 8753076 8718221 8651305 8760924 8911622 8972120 9052078 8781847 8803646 9098909 9194388
4954I194388R2958l92305j73679J64378R4489J84796q3491m3586K42320J0959
$$ 9194388 9287346 8895041 8721362 8885740 8980229 9165025 9081534 9037948 9280268 9291227
4944I291227K94724j1971J50160K25653L7155J3193M675K1153j10050R3518K189
$$ 9291227 9585951 9573980 9724140 9949793 9986948 10000141 10004816 10025969 9915919 10009437 10011626
4933A0011626R086p7981L00397O7290j49207J67601L25133L38642M3990K11768
$$ 10011626 10020712 9942731 10243128 10310418 10161211 10328812 10653945 10992587 11036577 11248345
4923A1248345q4310K57339J23265O77241L48153J30150L05996K10217K78163K67275
$$ 11248345 11164035 11421374 11544639 12221880 12570033 12700183 13006179 13216396 13494559 13761834
4913A3761834K14478M49297J65932L84887N2029K59263N79411N73212M32457M17006
$$ 13761834 13976312 14425609 14591541 14976428 15028457 15287720 15867131 16440343 16872800 17289806
4903A7289806O17466L08416L80338L52715L13781K30441J03843O0054J69860L94535
$$ 17289806 17907272 18215688 18596026 18948741 19262522 19492963 19596806 19656860 19826720 20221255
4893B0221255J83405J56286K05137O84338N19635L72224N45497M71195N86057
$$ 20221255 20404660 20560946 20766083 21450421 21970056 22342280 22887777 23358972 23945029
4884B3945029N80370O91790K45848O61632J90967L07461K32961N38031N01013
$$ 23945029 24525399 25217189 25463037 26124669 26315636 26623097 26856058 27394089 27895102
4875B7895102M42831M91838N98951O81037N73127N98382N08205M56213N70820
$$ 27895102 28337933 28829771 29428722 30109759 30682886 31281268 31789473 32245686 32816506
4866C2816506J023906Q99811J090012J075814J453020J324788R84897P66138J016062
$$ 32816506 33840412 34740223 35830235 36906049 38359069 39683857 40668754 41434892 42450954
4857D2450954J014119J243266J157351J145857J468341K259076K421356K171154
$$ 42450954 43465073 44708339 45865690 47011547 48479888 50738964 53160320 55331474
4849E5331474K326685K444751K411990L435188L412271M103168M430850N388594
$$ 55331474 57658159 60102910 62514900 65950088 69362359 73465527 77896377 83284971
4841H3284971O575497P598287R140898J1106668J5206569K2147558K7326835K3256654
$$ 83284971 89860468 97458755 106599653 117706321 132912890 155060448 182387283 205643937
4833B05643937J2469305J441522j549115J96211J765453J283022J529494J293023
$$ 205643937 218113242 219554764 218005649 218201860 219967313 221250335 222779829 224072852
4825B24072852N47087N47448O87768J014514N27633k6514L14145K49983O34322
$$ 224072852 224619939 225167387 225855155 226869669 227397302 227370788 227684933 227934916 228569238
4816B28569238J476146K966225M457634O139914Q729802J0281360J2230691J3805020
$$ 228569238 230045384 233011609 237469243 243609157 252338959 262620319 274851010 288656030
4808B88656030J4771362J5769180J6955940J7605642J7577507J6131362J3643137
$$ 288656030 303427392 319196572 336152512 353758154 371335661 387467023 401110160
4801D01110160R173430M378175k60062m508184o485596p417850o831894m057082
$$ 401110160 410283590 414661765 414401703 409893519 403407923 395990073 389158179 385101097
4793C85101097J291370J0244205J6912619J3460837j151690j9108024k9150702
$$ 385101097 386392467 396636672 413549291 427010128 425858438 406750414 377599712
4786C77599712k9262192k4135897j8713127j2974474q010810l555065L84246M558978
$$ 377599712 348337520 324201623 305488496 292514022 284503212 280948147 281332393 285891371
4778B85891371Q386665J2417840J6748432K2467367L0138905L4549059K9683165
$$ 285891371 294278036 306695876 323444308 345911675 376050580 410599639 440282804
4771D40282804J7940218P948134O687147Q847701P54939j7997538l6481853m5658370
$$ 440282804 458223022 466171156 472858303 481706004 482460943 464463405 427981552 382323182
4763C82323182m4305089l8400058l1275556k4217208j8054790j2060269o681026
$$ 382323182 338018093 299618035 268342479 244125271 226070481 214010212 207329186
4756B07329186j972790K639675Q534390J5829032K5965617L7710391M2507324
$$ 207329186 205356396 207996071 216530461 232359493 258325110 296035501 338542825
4749C38542825L2919895J1599023r302767k0086305k0346978j7212418j3472502
$$ 338542825 371462720 383061743 373758976 353672671 333325693 316113275 302640773
4742C02640773r620345p896480p279749p147742p236817p140262o602734n466865
$$ 302640773 293020428 285123948 277844199 270696457 263459640 256319378 249716644 244249779
4734B44249779m332233l098211j753408m13872J185358K717443M446160O476133
$$ 244249779 239917546 236819335 235065927 234652055 235837413 238554856 243001016 249477149
4726B49477149Q668558J1606208J4092643J6049427J7185779J7548553J7075643
$$ 249477149 258145707 269751915 283844558 299893985 317079764 334628317 351703960
4719C51703960J5816652J4873514J4285045J2922556J0164522N002784j053840
$$ 351703960 367520612 382394126 396679171 409601727 419766249 424769033 423715193
4712D23715193o674462j1333504j4003271j5705997j5739930j5783809j5563613
$$ 423715193 417040731 405707227 391703956 375997959 360258029 344474220 328910607
4705C28910607j5218883j4171119j2557954j0470217q588336o364775m065887
$$ 328910607 313691724 299520605 286962651 276492434 267904098 261539323 257473436
4698B57473436k389380j220133J69191Q68131P02309O15240K51994k25881j091406
$$ 257473436 255084056 253863923 254033114 254901245 255603554 256218794 256470788 256244907 255153501
4689B55153501k499474m566522p455773r556689j2133941j3686388j4686652j4136534
$$ 255153501 252654027 248087505 240631732 231075043 218941102 205254714 190568062 176431528
4681A76431528j3332217j2852781j1720848j0660111r927530r076104q181608
$$ 176431528 163099311 150246530 138525682 127865571 117938041 108861937 100680329
4674A00680329p671743o707885n796589m809594n066702l957319l313776l232021
$$ 100680329 93008586 86300701 80504112 75694518 70627816 66670497 63356721 60124700
4666F0124700k447370k648021j994134j749175j932761j746995j364723j638429
$$ 60124700 57677330 55029309 53035175 51286000 49353239 47606244 46241521 44603092
4658D4603092j176858p49636q59809p93192q21286j123610j187420o88461l20606
$$ 44603092 43426234 42676598 41816789 41023597 40202311 39078701 37891281 37202820 36882214
4649C6882214n42991n16458n67041m16540r6274n48903o30452o26616p78006o42610
$$ 36882214 36339223 35822765 35255724 34839184 34742910 34194007 33563555 32936939 32158933 31516323
4639C1516323n83805l29815l00486j71707k95916K2752j58731p2313j80832K89079
$$ 31516323 30932518 30602703 30302217 30130510 29834594 29857346 29698615 29626302 29445470 29734549
4629B9734549J505536K890987M634300L820572J755961j787561l460190l389015
$$ 29734549 31240085 34131072 38765372 42585944 44341905 42554344 39094154 35705139
4621C5705139k443340k226344j448112j206204j043505p06902l42666O5096L55476
$$ 35705139 33261799 31035455 29587343 28381139 27337634 26630732 26288066 26353162 26708638
4612B6708638Q94909K057692J811428J628027J348200Q03791L27012M58054J012056
$$ 26708638 27603547 29661239 31472667 33100694 34448894 35252685 35579697 36037751 37049807
4603C7049807K041324L221806L597144K411798Q57491m57774m42601M31P52725
$$ 37049807 39091131 42312937 45910081 48321879 49179370 48721596 48278995 48279426 49032151
4594D9032151K498705L669288K841580J012183j889497l232273k849837k167682
$$ 49032151 51530856 55200144 58041724 59053907 57164410 53932137 51082300 48914618
4586D8914618q90428j88093M30648n61482j408283k806667l049909k695304j850438
$$ 48914618 48024190 47836097 48266745 47705263 46296980 43490313 40440404 37745100 35894662
4577C5894662j339304j055586j147157j202703j753474j988238j746980j556074
$$ 35894662 34555358 33499772 32352615 31149912 29396438 27408200 25661220 24105146
4569B4105146j310275j161269r08046q78396n76943l88097j36100k15340k34986
$$ 24105146 22794871 21633602 20725556 19847160 19270217 18882120 18746020 18530680 18295694
4560A8295694N9409r3386J61537J29590K04524L21321J21426K51663L43397J41137
$$ 18295694 18355103 18261717 18423254 18552844 18757368 19078689 19200115 19451778 19795175 19936312
4550A9936312J44619L47890L08197L21711P5386N40222P83936P18840J122568
$$ 19936312 20080931 20428821 20737018 21058729 21134115 21674337 22458273 23177113 24299681
4541B4299681J119828J199881J188404J599225J692538J835864J453817J928869
$$ 24299681 25419509 26619390 27807794 29407019 31099557 32935421 34389238 36318107
4533C6318107K593986K922746M253874N215880O635427Q882677J2390180J7729595
$$ 36318107 38912093 41834839 46088713 51304593 57940020 66822697 79212877 96942472
4525I6942472K6409255L4604155L4823014K3672678M430885j2365595k0193606
$$ 96942472 123351727 157955882 192778896 216451574 220882459 208516864 188323258
4518A88323258j9932545j5390367r102422j341434Q324164J9053134K6868354
$$ 188323258 168390713 153000346 143897924 142556490 150880654 169933788 196802142
4511A96802142K4932728J0690208p659136k0399417k3658916k0295815j4164289
$$ 196802142 221734870 232425078 224765942 204366525 180707609 160411794 146247505
4504A46247505o797595K108942J3305356K1764268K1717530J1113563m807769
$$ 146247505 139449910 141558852 154864208 176628476 198346006 209459569 204651800
4497B04651800j7182338k1363628j9112388j4564165q354129j549044P409133
$$ 204651800 187469462 166105834 146993446 132429281 124075152 122526108 129935241
4490A29935241J7087671K1698285J6741833L138941j2981301k2823800k4589165
$$ 129935241 147022912 168721197 185463030 188601971 175620670 152796870 128207705
4483A28207705k1795514j8323936j4971421j1369291r079881p142704n232455
$$ 128207705 106412191 88088255 73116834 61747543 52667662 45524958 40292503
4476D0292503l711006l161239k615772j957707j712440j244760j025890j035831
$$ 40292503 36581497 33420258 30804486 28846779 27134339 25889579 24863689 23827858
4468B3827858j022138p05537n70775q99040o42332p06530l85334n62303k65192
$$ 23827858 22805720 22100183 21529408 20630368 19988036 19281506 18896172 18333869 18068677
4459A8068677n07112m25081q52342n18939l9497n6131m88150n67452j10295k06338
$$ 18068677 17561565 17136484 16284142 15765203 15725706 15669575 15181425 14613973 14503678 14297340
4449A4297340K5321m40077l03677l10979j27782q0910m27401j68798j10050J57665
$$ 14297340 14322661 13882584 13578907 13267928 13140146 13059236 12631835 12463037 12352987 12510652
4439A2510652k07486J39375L935m67356N3307j66474l1771L93748K82547K43697
$$ 12510652 12303166 12442541 12446476 11979120 12032427 11865953 11834182 12227930 12510477 12754174
4429A2754174K07171L18308N17447k11093l73285n11615m60370n13044n02486
$$ 12754174 12961345 13279653 13797100 13586007 13212722 12701107 12240737 11727693 11225207
4420A1225207m83213k80968l98425l08293m710j93637o4328R7255K03371L22946
$$ 11225207 10741994 10461026 10062601 9754308 9749598 9555961 9491633 9588888 9792259 10115205
4410A0115205M4071K03695J27222L69717K16577R3596L03212j73695o00203k60420
$$ 10115205 10159276 10362971 10490193 10859910 11076487 11170083 11473295 11299600 10699397 10438977
4400A0438977l97427l85734m31671k44953l65225k46248j26088L93140K16084
$$ 10438977 10041550 9655816 9224145 8979192 8613967 8367719 8241631 8634771 8850855
4391H850855o9314J93236P4714K00216J70366j77945k59639k86277k24208k47445
$$ 8850855 8781541 8974777 9049491 9249707 9420073 9242128 8982489 8696212 8472004 8224559
4381H224559k71607q0367J21030J22054J32566L52477J2085N11954J036851J458325
$$ 8224559 7952952 7872585 7993615 8115669 8248235 8600712 8612797 9124751 10161602 11619927
4371A1619927J308742Q09778l82575j033665q25631q48551p49494p36019m66265
$$ 11619927 12928669 13738447 13355872 12322207 11496576 10648025 9898531 9162512 8696247
4362H696247p87236l25642J78716O5989r1994n46622k65467K3162Q271J8320l9353
$$ 8696247 7909011 7583369 7762085 7828074 7736080 7189458 6923991 6947153 6955424 6973744 6934391
4351F934391J77443K37454Q2910j78012M2294J45817M8156p4247q44802k31433
$$ 6934391 7111834 7349288 7432198 7254186 7296480 7442297 7490453 7416206 6571404 6339971
4341F339971Q2039J08396K74276j7630l07492J87789l7067j84746l44733j89259
$$ 6339971 6422010 6530406 6804682 6787052 6479560 6667349 6630282 6445536 6100803 5911544
4331E911544n68J8650K2734j6489L10472J84321J59583J67570k55123l25533N249
$$ 5911544 5910976 5929626 5952360 5935871 6246343 6430664 6590247 6757817 6502694 6177161 6182410
4320F182410J84571j30933K3099j77626O6320R3859j22611q8741J40091j58406
$$ 6182410 6366981 6236048 6259147 6081521 6147841 6241700 6119089 6030348 6170439 6012033
4310F012033j27273j56491k80266M24471Q7533l67135q3128q7555J9946j19K0208
$$ 6012033 5884760 5728269 5448003 5872474 5960007 5592872 5509744 5422189 5442135 5442016 5462224
4299E462224K47951r8987Q3125n63J81135J26866j95764K3009m6328J42056K11774
$$ 5462224 5710175 5611188 5694313 5693750 5874885 6001751 5805987 5828996 5782668 5924724 6136498
4288F136498p7044k36955L6618O8417J73322N2275l04237o0770N9932L0359J11547
$$ 6136498 6059454 5822499 5859117 5927534 6100856 6153131 5848894 5788124 5848056 5878415 5989962
4277E989962k1736K19069P7785n0543j68128j11953J75140m2837J85357q7989
$$ 5989962 5968226 6187295 6265080 6214537 6046409 5934456 6109596 6066759 6252116 6164127
4267F164127J02507j02056j87930j20431m5495K05853L92742j98241k79663N6128
$$ 6164127 6266634 6164578 5976648 5856217 5810722 6016575 6409317 6211076 5931413 5987541
4257E987541j62349P0685J30021k35512K40763N5244l42092j11138L58036n2539
$$ 5987541 5825192 5895877 6025898 5790386 6031149 6086393 5744301 5633163 5991199 5938660
4247E938660J79611r3133N0801J99305R1618n3386M0528K65607P3414l28200J67562
$$ 5938660 6118271 6025138 6075939 6275244 6366862 6313476 6354004 6619611 6693025 6364825 6532387
4236F532387Q2797J1449J0120K8971j57300R8089J65732m10864M7787K19692J6390
$$ 6532387 6615184 6626633 6636753 6665724 6508424 6606513 6772245 6361381 6409168 6628860 6645250
4225F645250R3789L04544J12130J08960K42745j29048j25116j1074J23104K38813
$$ 6645250 6739039 7043583 7155713 7264673 7507418 7378370 7253254 7242180 7365284 7604097
4215G604097j1441K52442J46168K13110J89978k38514j35038L95560J68492J48290
$$ 7604097 7592656 7845098 7991266 8204376 8394354 8155840 8020802 8416362 8584854 8733144
4205H733144J92742N12258j49173K36531l7879p466j43027K82566J95083j01157
$$ 8733144 8925886 9438144 9288971 9525502 9487623 9480157 9337130 9619696 9814779 9713622
4195I713622L02735L9698K95940L52319k00701k757p8062L03943L44954Q4520
$$ 9713622 10016357 10056055 10351995 10704314 10503613 10500856 10422794 10726737 11071691 11156211
4185A1156211M2143J66923M20297o1069n799M23510K16090J89388Q5850K67789
$$ 11156211 11198354 11365277 11785574 11724505 11718706 12142216 12358306 12547694 12633544 12901333
4175A2901333M82492K59944P1904L07395M10275L50807J36982L79960L18742M72609
$$ 12901333 13383825 13643769 13715673 14023068 14433343 14784150 14921132 15301092 15619834 16092443
4165A6092443N44378J3941l377M22414O87291O45356N33036J13935N34869R40905
$$ 16092443 16636821 16650762 16647385 17069799 17757090 18402446 18935482 19049417 19584286 20525191
4155B0525191K99673M38697O05749P61827Q01083R76689J060886J264497J488036
$$ 20525191 20824864 21263561 21869310 22631137 23432220 24408909 25469795 26734292 28222328
4146B8222328J220502J572377J583234K266154J834033J758975K304013K400742
$$ 28222328 29442830 31015207 32598441 34864595 36698628 38457603 40761616 43162358
4138D3162358K634879L095097K633118K527381K702172K500247K246636J821436
$$ 43162358 45797237 48892334 51525452 54052833 56755005 59255252 61501888 63323324
4130F3323324J944462J503292J163362R44670O23169J660179J996226K975365
$$ 63323324 65267786 66771078 67934440 68879110 69502279 71162458 73158684 76134049
4122G6134049L243528M105877M130571L821258L325728K946429K586605K671462
$$ 76134049 79377577 83483454 87614025 91435283 94761011 97707440 100294045 102965507
4114A02965507K527564K621515L213114L156550L319381K977854K748695K241911
$$ 102965507 105493071 108114586 111327700 114484250 117803631 120781485 123530180 125772091
4106A25772091K455180K669041K901903L488185L162232K979931K662166K534214
$$ 125772091 128227271 130896312 133798215 137286400 140448632 143428563 146090729 148624943
4098A48624943K978565L663297N337185P281304Q985514R358354Q014959N848489
$$ 148624943 151603508 155266805 160603990 167885294 176870808 186229162 194244121 200092610
4090B00092610L241663R48924K96596M26752J002955J519625K425728L078350
$$ 200092610 203334273 204283197 204579793 205006545 206009500 207529125 209954853 213033203
4082B13033203M216312M781408L728806J786869m88784p58826o39133m19601k25559
$$ 213033203 217249515 222030923 225759729 227546598 227057814 226298988 225659855 225240254 225014695
4073B25014695l37930k50952o5763J258206L697978N952851Q268742J0816997
$$ 225014695 224676765 224425813 224360050 225618256 229316234 235269085 243537827 254354824
4065B54354824J1846775J1839814J0745708Q948910P599976P224702P281633P510160
$$ 254354824 266201599 278041413 288787121 297736031 305336007 312560709 319842342 327352502
4057C27352502P297351O166666M998325L900431K657815R44595j294304k325054
$$ 327352502 334649853 340816519 345814844 349715275 352373090 353317685 352023381 349698327
4049C49698327l102498l013481j945638m69761J932214L813812N749476P466649
$$ 349698327 346595829 343582348 341636710 341166949 343099163 346912975 352662451 360129100
4041C60129100Q108537P082307N138389K369445l59627k372906l472300l633963
$$ 360129100 368237637 375319944 380458333 382827778 382468151 380095245 376622945 372988982
4033C72988982k763497j320298L22259J906855L175402L196602K210800J073535
$$ 372988982 370225485 368905187 369227446 371134301 374309703 377506305 379717105 380790640
4025C80790640r80387j847447j948306j965989k410009k955019m230634n418223
$$ 380790640 379810253 377962806 376014500 374048511 371638502 368683483 364452849 359034626
4017C59034626m923352l934289l698468m694630p483061j0628557j2436683j3342618
$$ 359034626 354111274 350176985 346478517 341783887 334300826 323672269 311235586 297892968
4009B97892968j2852528j1037090q753560o154269l609909j861310j388383q42559
$$ 297892968 285040440 274003350 265249790 259095521 255485612 253624302 252235919 251393360
4001B51393360p37005j443025k180087k558286k669397l387700m079746m267381
$$ 251393360 250656355 249213330 247033243 244474957 241805560 238417860 234338114 230070733
3993B30070733m867700m579294l575964k363560p73133R9948J04130j000068l222949
$$ 230070733 225203033 220623739 217047775 214684215 213911082 214011030 214115160 213115092 209892143
3984B09892143n559611p725185q778872q794735p447182o287136m442718l437998
$$ 209892143 204332532 196607347 187828475 179033740 171586558 165299422 160856704 157418706
3976A57418706l315345k867564l167699l852603m388751m285905m097982l872989
$$ 157418706 154103361 151235797 148068098 144215495 139826744 135540839 131442857 127569868
3968A27569868l647940l472601k917458k576148k554585j910948j263742o3345
$$ 127569868 123921928 120449327 117531869 114955721 112401136 110490188 109226446 109163101
3960A09163101N17254j020199k921325n134821o213194n526128m996018m208399
$$ 109163101 109680355 108660156 105738831 100604010 94390816 88864688 83868670 79660271
3952G9660271l792707k978976k274116k477744k249567k147397k176757k110164
$$ 79660271 75867564 72888588 70614472 68136728 65887161 63739764 61563007 59452843
3944E9452843j944857j307864j632685j635738j662506j983343k131171k272994
$$ 59452843 57507986 56200122 54567437 52931699 51269193 49285850 47154679 44881685
3936D4881685k339518k426898k060421j879492j156330n30488L79984J389194
$$ 44881685 42542167 40115269 38054848 36175356 35019026 34488538 34868522 36257716
3928C6257716J074815l85768k362193k555199k458379k185113j672185j499826
$$ 36257716 37332531 36946763 34584570 32029371 29570992 27385879 25713694 24213868
3920B4213868j311603r90501r37366l57087n08657j80388o09756n48253n63808
$$ 24213868 22902265 21911764 20974398 20617311 20108654 19928266 19318510 18770257 18206449
3911A8206449m74473k27416m76107m23427k05806l94953m86381j81578l32476
$$ 18206449 17731976 17504560 17028453 16605026 16399220 16004267 15517886 15336308 15003832
3902A5003832k37102j31480j71180k57286k75824k93492m14298j66788k08506
$$ 15003832 14766730 14635250 14464070 14206784 13930960 13637468 13223170 13056382 12847876
3893A2847876r4589K05413m11854j11412o1392j10479m05566p7257j03503k10224
$$ 12847876 12753287 12958700 12546846 12435434 12374042 12263563 11857997 11780740 11677237 11467013
3883A1467013j24479l3950j24452l13175m9788k16102J5238j8302K2419m6869
$$ 11467013 11342534 11308584 11184132 10870957 10821169 10605067 10620305 10602003 10624422 10577553
3873A0577553l56063L844k14874J52621J28457q2610j50425N0396j66444m02982
$$ 10577553 10221490 10225334 10010460 10163081 10291538 10208928 10058503 10108899 9942455 9539473
3863I539473j22647N5225j0790j02542k69767K4322L5304k63086o0622r8372K90355
$$ 9539473 9416826 9472051 9461261 9358719 9088952 9113274 9148578 8885492 8824870 8726498 9016853
3852I016853j64350j05355J62713k33107j24815J14990j91334k93008l0594J54738
$$ 9016853 8852503 8747148 8909861 8676754 8551939 8666929 8475595 8182587 8151993 8306731
3842H306731j08017J47562j70212J19806o0960k11203o5534j20490J32599L46906
$$ 8306731 8198714 8346276 8176064 8295870 8234910 8023707 7958173 7837683 7970282 8317188
3832H317188n9139j85174J29172M5916k18269p7411r9001j57673K412k2705l15128
$$ 8317188 8258049 8072875 8202047 8247963 8029694 7952283 7853282 7695609 7698021 7675316 7360188
3821G360188k1006K42268R8137j21498l65138j13126O78Q8072J22633L07833q0868
$$ 7360188 7339182 7581450 7679587 7558089 7192951 7079825 7080503 7168575 7291208 7599041 7518173
3810G518173l7572n5859J5703O8587l8148l9573k6387j91106J16836k0110k41818
$$ 7518173 7480601 7424742 7440445 7509032 7470884 7431311 7404924 7213818 7330654 7310544 7068726
3799G068726m84030J69062J44238J40754J69315m24715k11972N0981K14421j91492
$$ 7068726 6584696 6753758 6897996 7038750 7208065 6783350 6571378 6622359 6836780 6645288
3789F645288k84005J82183L89728R479k66413P3886K04627K42518l20410j70878
$$ 6645288 6361283 6543466 6933194 6942673 6676260 6750146 6954773 7197291 6876881 6706003
3779F706003n5782J2598q4946K77406k2625l02224j33787K99019m655j54728J4063
$$ 6706003 6650221 6662819 6577873 6855279 6832654 6530430 6396643 6695662 6691007 6536279 6550342
3768F550342m2209k40787K86168J10969j12705l11837j86334k48519L1674K24273
$$ 6550342 6508133 6267346 6553514 6664483 6551778 6239941 6053607 5805088 5836762 6061035
3758F061035r5319J28986K83144K94704k86287k1209m0051j51315K8251L598k10035
$$ 6061035 5965716 6094702 6377846 6672550 6386263 6365054 6325003 6173688 6201939 6205537 5995502
3747E995502J08230J35852k82845o8646o994m4779K10313j90689K44856k4423
$$ 5995502 6103732 6239584 5956739 5888093 5881099 5836320 6046633 5855944 6100800 6076377
3737F076377K59092q6708j57850J58203N1276j34202J15759k47753j17322J3664
$$ 6076377 6335469 6248761 6090911 6249114 6300390 6166188 6281947 6034194 5916872 5930536
3727E930536O1989l0738k70323j6030m6971j1336J8798m9637p0017R9282J68190
$$ 5930536 5992525 5961787 5691464 5675434 5628463 5617127 5635925 5586288 5516271 5615553 5783743
3716E783743j83435k05551J17135L60927L30383p1240k91143J52882k87270p5192
$$ 5783743 5600308 5394757 5511892 5872819 6203202 6131962 5840819 5993701 5706431 5631239
3706E631239n9119R2079j59503P5351M2961j36848l3882Q4713L3528n7005p4867
$$ 5631239 5572120 5664199 5504696 5580047 5623008 5486160 5452278 5536991 5570519 5513514 5438647
3695E438647k23668R7814r7218j56606Q1045J18172j47167K02990k11282k04508
$$ 5438647 5214979 5312793 5215575 5058969 5140014 5258186 5111019 5314009 5102727 4898219
3685D898219j16162Q7353K98726k94233k51858L3376k2768P9838P2353k44559
$$ 4898219 4782057 4869410 5168136 4873903 4622045 4655421 4632653 4712491 4784844 4540285
3675D540285j84706j85168J5452O2339k30238M50383J14438j08915K8790p6683
$$ 4540285 4355579 4170411 4185863 4248202 4017964 4468347 4582785 4473870 4502660 4425977
3665D425977l30422k58905J42876L14627J61802J73960j34025j56208j49352p7583
$$ 4425977 4095555 3836650 3979526 4294153 4455955 4629915 4495890 4339682 4190330 4112747
3655D112747K5202K78649k17255m6131m9057j29901J41944L57674O1394m3578
$$ 4112747 4137949 4416598 4199343 4153212 4104155 3974254 4116198 4473872 4535266 4491688
3645D491688l1711l70540J38892r1435J81802J28221j14692N383j84368q4116
$$ 4491688 4459977 4089437 4228329 4136894 4318696 4446917 4332225 4337608 4153240 4069124
3635D069124J0741p345K51529J11266L76799n5608q0135n6547j15914M8359k856
$$ 4069124 4079865 4072520 4324049 4435315 4812114 4756506 4676371 4619824 4503910 4552269 4549413
3624D549413j62944j05352K09824r8391J08530k915n8703j4783J38348J47212
$$ 4549413 4386469 4281117 4490941 4392550 4501080 4498165 4439462 4424679 4563027 4710239
3614D710239K3057j75917q2795O0194K6742j06603M1475J51239Q5092K01182j52739
$$ 4710239 4733296 4557379 4474584 4534778 4561520 4454917 4496392 4647631 4732723 4933905 4781166
3603D781166O3516M0484O0298m430j81294K321K5552J83329R5721n1193J52334
$$ 4781166 4844682 4885166 4945464 4941034 4759740 4762061 4787613 4970942 5066663 5015470 5167804
3592E167804J03380J41658k10408k32211K60697J90777p2781k7402K43165J07535
$$ 5167804 5271184 5412842 5202434 4970223 5230920 5421697 5348916 5321514 5564679 5672214
3582E672214K88502j39648J23612L47677j31490J97619J2677L42116R4033J26439
$$ 5672214 5960716 5821068 5944680 6292357 6160867 6358486 6371163 6713279 6807312 6933751
3572F933751l1186q807M46010l9794J97928l0905q0479J07194n9706K17700J28759
$$ 6933751 6902565 6893758 7339768 7299974 7497902 7466997 7386518 7493712 7434006 7651706 7780465
3561G780465R1359j3348N5610j54524J26106O61024l6261N564M46974l5908J5463
$$ 7780465 7871824 7858476 7914086 7759562 7885668 8546692 8510431 8515995 8962969 8927061 8942524
3550H942524J85939K56022M03203J84906J72121K05259J86772J95502N10191j20835
$$ 8942524 9128463 9384485 9787688 9972594 10144715 10349974 10536746 10732248 11242439 11121604
3540A1121604J80887M62992J69455L05L15740M53508J08050O4368R4972J26340
$$ 11121604 11302491 11765483 11934938 11935243 12250983 12704491 12812541 12876909 12971881 13098221
3530A3098221L48501Q3716M59600P4937L85684K15425K90688L04827K72072P28526
$$ 13098221 13446722 13530438 13990038 14064975 14450659 14666084 14956772 15261599 15533671 16262197
3520A6262197M69127K40439O02230N78850N61758N53668L47630L00181J81327
$$ 16262197 16731324 16971763 17573993 18152843 18714601 19268269 19615899 19916080 20097407
3511B0097407Q38518P89397J050464Q82934J034573J652040J861258K064054K494585
$$ 20097407 20935925 21725322 22775786 23658720 24693293 26345333 28206591 30270645 32765230
3502C2765230K308384K108659K122909K423123J755032J599181Q71906J81108
$$ 32765230 35073614 37182273 39305182 41728305 43483337 45082518 45954424 46135532
3494D6135532o20408p88015j339731j491481j592855j603024j033814p95458n39023
$$ 46135532 45515124 44727109 43387378 41895897 40303042 38700018 37666204 36870746 36331723
3485C6331723l28885m78980n49983n28457o45946p46865q20051q77449j271116
$$ 36331723 36002838 35523858 34973875 34445418 33799472 33052607 32232556 31355107 30083991
3476C0083991j365709k060255j598338j711788j411395j350365j412232j266059
$$ 30083991 28718282 26658027 25059689 23347901 21936506 20586141 19173909 17907850
3468A7907850j021056r61209j053867p48595p26472l29951m07666m16194p20905
$$ 17907850 16886794 15925585 14871718 14123123 13396651 13066700 12659034 12242840 11521935
3459A1521935o8034k17052l17070m30460l22288k49811m09117m3032k55720k02162
$$ 11521935 11453901 11236849 10919779 10489319 10167031 9917220 9508103 9465071 9209351 9007189
3449I007189p8469j7073n24600J5571n6479j63450k45846O6368j18502l23816
$$ 9007189 8928720 8911647 8387047 8402618 8346139 8182689 7936843 8003211 7884709 7560893
3439G560893k87277j81265j04285q6061j18330p1490k87993l82848L3032l19739
$$ 7560893 7273616 7092351 6988066 6902005 6783675 6712185 6424192 6041344 6074376 5754637
3429E754637k6249o839Q1732p5818k7613j95501j87784k80655J79500P9524O1927
$$ 5754637 5728388 5721549 5803281 5727463 5699850 5504349 5316565 5035910 5215410 5294934 5356861
3418E356861j36198k1657j5066j31331k37320j70630j16167J37917M5901r3520
$$ 5356861 5220663 5199006 5183940 5052609 4815289 4644659 4528492 4666409 4712310 4618790
3408D618790Q9944j84200k22386n3885J27872j79550n1197J0774j96145R8376
$$ 4618790 4708734 4524534 4302148 4248263 4376135 4196585 4145388 4156162 3960017 4058393
3398D058393Q1579o9553r5032j96772j36373J22591J08857J25622l38201l00315
$$ 4058393 4139972 4070419 3975387 3778615 3642242 3764833 3873690 3999312 3661111 3360796
3388C360796O4120R0877R435j57254K28705M56J46214J21230J5685j83044L33110
$$ 3360796 3424916 3515793 3525228 3367974 3596679 3597135 3743349 3864579 3880264 3697220 4030330
3377D030330M5376j07298l41123L3776K19055o2271n9212m4667n4301j08869k19816
$$ 4030330 4075706 3968408 3627285 3661061 3880116 3817845 3758633 3713966 3659665 3550796 3330980
3366C330980j22377J93458j838q8685K18625P1427o922m1014j97177k87L24005
$$ 3330980 3208603 3402061 3400223 3311538 3530163 3601590 3594668 3553654 3356477 3356190 3680195
3355C680195k33717j318K97612l27766p200M7838N4049j05151n3500M95047J47346
$$ 3680195 3446478 3445160 3742772 3415006 3407806 3455644 3509693 3404542 3351042 3846089 3993435
3344C993435k23345l2947J9049j57680l20932j80961j38419l6690J66929k61755
$$ 3993435 3770090 3737143 3756192 3598512 3277580 3096619 2958200 2921510 3088439 2826684
3334B826684j69154j08200p0649K46699O0006k33084R186N9617K96873l3480p142
$$ 2826684 2657530 2549330 2478681 2725380 2785386 2552302 2561488 2621105 2917978 2884498 2877356
3323B877356k23438n8063j03553j54050N4345J05865O3020J13915J17502j13367
$$ 2877356 2653918 2595855 2492302 2338252 2392597 2498462 2561482 2675397 2792899 2679532
3313B679532M8662P1568J47597P5525p6865k30529K0254N4560m81778p0732L22347
$$ 2679532 2728194 2799762 2947359 3022884 2946019 2715490 2735744 2790304 2308526 2237794 2560141
3302B560141k51789j19390L4453K77699J30444P0921k86016k15970J73868J64782
$$ 2560141 2308352 2188962 2223415 2501114 2631558 2702479 2416463 2200493 2374361 2539143
3292B539143O4022l7940m08239J62095K09141j26396l91532L44846J25413N6675
$$ 2539143 2603165 2565225 2156986 2319081 2528222 2401826 2010294 2355140 2480553 2537228
3282B537228j92661N8228r5402j63146J53153J6875J27836k22704q1897j15421
$$ 2537228 2344567 2402795 2307393 2144247 2297400 2314275 2442111 2219407 2137510 2022089
3272B022089O8247L9030O4709j01496L23831J26652O9657j30529L0703j82773
$$ 2022089 2090336 2129366 2194075 2092579 2416410 2543062 2612719 2482190 2512893 2330120
3262B330120n5437J98194K4760K3331l18621K04153J33349J2547J71206J14242
$$ 2330120 2274683 2472877 2497637 2520968 2202347 2406500 2539849 2552396 2723602 2837844
3252B837844q3101j21385K27326k5679j01967R0618k96047n7023J50976N3305
$$ 2837844 2754743 2633358 2860684 2835005 2733038 2823656 2527609 2470586 2621562 2674867
3242B674867P5079M8444K06573P4525r4397J29782j5947Q6551K08016q7557n6494
$$ 2674867 2749946 2798390 3004963 3079488 2985091 3114873 3098926 3185477 3393493 3305936 3249442
3231C249442r794r0014j18587L93600J52422j75973K31026P0386N8086j50469
$$ 3249442 3239648 3149634 3031047 3424647 3577069 3401096 3632122 3702508 3760594 3610125
3221C610125l2563m2657L99174J79374J65974l8841J32145R8881j55627K14194
$$ 3610125 3577562 3534905 3934079 4113453 4279427 4240586 4372731 4471612 4315985 4530179
3211D530179J14781k2804r0348P6222M41648Q9330l4518K08254K2877J67025J96773
$$ 4530179 4644960 4622156 4531808 4608030 5049678 5139008 5104490 5312744 5335621 5502646 5699419
3200E699419J04481L83139R3643R4684O65230L96332M61224L00054M16935P51163
$$ 5699419 5803900 6187039 6280682 6375366 7040596 7436928 7898152 8198206 8615141 9366304
3190I366304N67694N04067N82355R89570J046933R72622J161819O23853L51438
$$ 9366304 9933998 10438065 11020420 12009990 13056923 14029545 15191364 15815217 16166655
3181A6166655K251j31151k39333j58645j01771M718L03044J46911k34416J37937
$$ 16166655 16168906 16037755 15798422 15639777 15538006 15542724 15845768 15992679 15758263 15896200
3171A5896200K99310J92346l29659j38047L56817Q1777L188J22020K87198N31904
$$ 15896200 16195510 16387856 16058197 15920150 16276967 16358744 16361932 16483952 16771150 17303054
3161A7303054O32751J256779J384620K160478K789411M440910M724017L073051
$$ 17303054 17935805 19192584 20577204 22737682 25527093 29968003 34692020 37765071
3153C7765071J10314k035381l181701l413387l026729k704477k321445k192319
$$ 37765071 37875385 35840004 32658303 29244916 26218187 23513710 21192265 18999946
3145A8999946j242309j266709q20053p90627l84996l54910m99203k85661J802
$$ 18999946 17757637 16490928 15670875 14880248 14495252 14140342 13641139 13355478 13357280
3136A3357280r872m4916j6151j60673J81108N63671M96856N58290M54511O80779
$$ 13357280 13347408 13302492 13286341 13125668 13306776 13870447 14367303 14925593 15380104 16060883
3126A6060883P96813R22533L38428j44109q7107p48707j077154p41783j173557
$$ 16060883 16857696 17780229 18118657 17974548 17887441 17138734 16061580 15319797 14146240
3117A4146240r41693p24458j092061q31185j008374l44699n72955o53740k37908
$$ 14146240 13204547 12480089 11388028 10556843 9548469 9203770 8630815 7977075 7739167
3108G739167j1421J6521p8759k02507l32140k36400j71093K678k78087k73247
$$ 7739167 7727746 7744267 7665508 7463001 7130861 6894461 6723368 6726046 6447959 6174712
3098F174712k05817R8107k3853j74049n08588M4263m51l14639l81012l94807j97609
$$ 6174712 5968895 6067002 6043149 5869100 5360512 5404775 5404324 5089685 4708673 4313866 4116257
3087D116257M6846R071k64871J40504j2535k69449k18487j53229l5603N079j1126
$$ 4116257 4163103 4172174 3907303 4047807 4035272 3765823 3547336 3394107 3358504 3363583 3352457
3076C352457j55685k51529l3892M6941O7682J0568R0763o7837m94630k1145j33206
$$ 3352457 3196772 2945243 2911351 2958292 3025974 3036542 3127305 3059468 2564838 2543693 2410487
3065B410487j29993K17215O5520p0994l90329J69329P938m1336k30726j23190
$$ 2410487 2280494 2497709 2563229 2492235 2101906 2271235 2279173 2237837 2007111 1883921
3055A883921K17543K0912j43240n0301Q3570k1407j50413J61318l3581k2185m4626
$$ 1883921 2101464 2122376 1979136 1928835 2012405 1990998 1840585 2001903 1968322 1946137 1901511
3044A901511k61831K79785J79801k39856k32203Q0908J06453j47632j29445J44980
$$ 1901511 1639680 1919465 2099266 1859410 1627207 1708115 1814568 1666936 1537491 1682471
3034A682471k28124j19790J2831M7674n3299n4718K35638M6536j52883j148L2730
$$ 1682471 1454347 1334557 1347388 1395062 1341763 1287045 1522683 1569219 1416336 1415188 1447918
3023A447918k00138n3678R4614J03649J8185M2475l08190j24991J74203K01856
$$ 1447918 1247780 1194102 1288716 1392365 1410550 1453025 1144835 1019844 1194047 1395903
3013A395903j6439Q3967q8656r7240Q1632j07943j60245j59376j7592P6224N3253
$$ 1395903 1379464 1463431 1374775 1277535 1359167 1251224 1090979 931603 914011 990235 1043488
3002A043488j30825l3492K6618N1515j01067K03173o9160l1239q1611J04927K38031
$$ 1043488 912663 879171 905789 957304 856237 1059410 990250 959011 877400 982327 1220358
2991A220358j02749j44264j95117k41076p1983k2766J44635R3939j2276o1105
$$ 1220358 1117609 973345 778228 537152 465169 442403 587038 680977 668701 607596
2981F07596J45568J3272R5836N5810j16595R1407K9402k93456M8801J95467l2321
$$ 607596 753164 766436 862272 918082 801487 892894 922296 628840 677641 873108 840787
2970H40787J11720j32438k5016k8774m0528j0576N8311n4021k14517r9514J11242
$$ 840787 952507 820069 795053 766279 725751 715175 773486 719465 504948 405434 516676
2959E16676R005k77414k8189q3722N8806N1311K72858J22355j53733j68318J60287
$$ 516676 525681 248267 220078 136356 195162 246473 519331 641686 487953 319635 479922
2948D79922J24670j88072J98367J16412K16667k3616o3570p2371n2162l01890
$$ 479922 604592 416520 614887 731299 947966 924350 860780 788409 736247 434357
2938D34357O9928P9230j17967j07750q9259n5047K40516P2145j71718k56762J41394
$$ 434357 504285 583515 465548 357798 268539 213492 454008 526153 354435 97673 239067
2927B39067o0071j77247K3000Q1783j19060K29250R2755l67989J81392O5302J0161
$$ 239067 178996 1749 24749 106532 -12528 216722 309477 -58512 122880 188182 198343
2916A98343K4008J15461n3606J22950j90525K69192k56745j27452P5293L06239
$$ 198343 222351 337812 284206 407156 216631 485823 229078 101626 176919 483158
2906D83158j58865j67269K59197K2745M2871j1717j61719k65990K54010m122M4264
$$ 483158 324293 157024 416221 438966 481837 470120 308401 42411 296421 292299 336563
2895C36563O1013L15208R5339q8487J0126p4737o81K6914j45178P2563j09065
$$ 336563 397576 712784 808123 719636 729762 655025 654344 681258 536080 608643 499578
2884D99578k15188Q1753J87487o1023j21255J41014O9313k885N1094k03334Q827
$$ 499578 284390 366143 553630 492607 371352 512366 581679 578794 629888 426554 435381
2873D35381j58450K3952J88096k19511n6363R2714k37160J43367k1202K13436
$$ 435381 276931 300883 488979 269468 213105 305819 68659 212026 190824 404260
2863D04260k12524o5219J79446j36162q3133r6930K20853K67905l18937j11763
$$ 404260 191736 126517 305963 169801 86668 -10262 210591 478496 159559 47796
2853D7796J95115p3146J82947l5224l17321R3636K07734n4825J44546m3613j20633
$$ 47796 242911 169765 352712 317488 167 93803 301537 246712 391258 347645 227012
2842B27012N2079L01366k7570l02910J99572l9050m4909J26730k06133M0509m8533
$$ 227012 279091 580457 552887 249977 449549 410499 365590 492320 286187 326696 278163
2831B78163k5805Q5885k7594J63325j76942q4911J6654P53J64662J14911M5833
$$ 278163 252358 338243 310649 473974 297032 212121 228775 229528 394190 509101 554934
2820E54934j99620M2719j31189Q3645j06516K65115o7927L3077J37441r4460l65220
$$ 554934 355314 398033 266844 350489 243973 509088 441161 474238 611679 517219 151999
2809A51999K2419K3054m0603n7588M5788O9319K47635K28145l97583j90084j02793
$$ 151999 174418 197472 156869 99281 145069 214388 462023 690168 292585 102501 -292
2798b92K93389k13290k04925K73799l4622K86937J46607n5485j6829k08168j42427
$$ -292 293097 79807 -125118 148681 114059 400996 547603 492118 475289 267121 124694
2787A24694j07138p5453q6373J32144J09761J24442n2545l17223m414L89125K2635
$$ 124694 17556 -57897 -144270 -12126 97635 222077 169532 -147691 -152105 237020 259655
2776B59655n77866J08743K29191n7657O8701L40899Q0674j04693j8878k6522p3435
$$ 259655 -318211 -209468 19723 -37934 30767 371666 452340 347647 328769 302247 228812
2765B28812k52693O8919Q3211j35129k9506J90335J77596K23103k75049k18294
$$ 228812 -23881 45038 128249 -6880 -36386 153949 331545 554648 279599 61305
2755F1305j439K28788r4770j5171Q4195r289q2646k5861k3211R1289j03770m2664
$$ 61305 59866 288654 193884 178713 262908 253619 170973 145112 121901 213190 109420 66756
2743F6756L00813j77802j53953K26842n8300l61195R8218j62804p618L74268N5632
$$ 66756 367569 189767 35814 262656 204356 -156839 -58621 -221425 -229043 145225 200857
2732B00857j10969P6981Q6390J86164P4499l22288n1681J13884l3658m7516p8524
$$ 200857 89888 166869 253259 439423 513922 191634 139953 253837 220179 172663 94139
2721I4139O8730n6078Q6019R1676L9903p8421j87579j31451N4026j8917j91992
$$ 94139 162869 106791 192810 284486 324389 245968 58389 -73062 -19036 -37953 -229945
2710b29945N2431J0506P5203O3220j92866J92510K89060l37023J20911k35359
$$ -229945 -177514 -167008 -91805 -28585 -221451 -28941 260119 -76904 44007 -191352
2700a91352j46346M10173M6156J5328j23438J6173L37173k21363J11240L7506
$$ -191352 -337698 72475 118631 133959 10521 26694 363867 142504 253744 291250
2690B91250l25271o7242J31588j80064J00657J04701K86124k3853j91314K4381
$$ 291250 -34021 -101263 30325 -149739 -49082 55619 341743 317890 126576 150957
2680A50957j129J04312j34188l226j53104j95716J25622J9659j15590J50846K2458
$$ 150957 149828 254140 119952 116726 -36378 -232094 -106472 -86813 -202403 -51557 -29099
2669b9099K28712j44050l1180k11449K89341K24657j88008k70729J73140r1782
$$ -29099 199613 55563 24383 -187066 102275 326932 138924 -131805 41335 -50447
2659e0447j32033K76029j42760l2395J95747r8118p2757M1658j87688J63340Q6857
$$ -50447 -182480 93549 -49211 -81606 114141 16023 -56734 -15076 -202764 -39424 47433
2648D7433l5898L32436J77611k54586o1791P6389k60962q4138L05945J56295j55625
$$ 47433 11535 343971 521582 266996 205205 281594 20632 -63506 242439 398734 243109
2637B43109j71809J72811K63623k91345j88371p4890P2554J79186R0041J76092
$$ 243109 71300 244111 507734 216389 28018 -46872 25682 204868 294909 471001
2627D71001r724k22202J03644M84100l5093L50312M19113L42774K56247K58498
$$ 471001 461277 239075 342719 826819 791726 1142038 1561151 1903925 2160172 2418670
2617B418670k9369o13340k75512l0375n50673k89338P4380m9178j87228j16798
$$ 2418670 2389301 1775961 1500449 1470074 919401 630063 704443 655265 468037 351239
2607C51239l41930K5830L03431q6947j59212K45719L8511j6278P2734l11736J45602
$$ 351239 9309 35139 338570 251623 92411 338130 376641 360363 433097 121361 266963
2596B66963n2084k0396Q5775j88152J8134n9751L2037N6072R829K95948K0531
$$ 266963 214879 194483 280258 92106 110240 50489 82526 138598 148427 444375 464906
2585D64906m8111N6643k08724q7986j04633Q9701j84159J37537K2611J53861j4366
$$ 464906 416795 473438 264714 176728 72095 161796 -22363 115174 137785 291646 277280
2574B77280M7804J41181J42782j63920j97897J34429R4367j32079j86164L13781
$$ 277280 325084 466265 609047 445127 247230 381659 476026 343947 157783 471564
2564D71564Q175p499j71487J08271R5378m9137j22798J64909m1121k00908M4056
$$ 471564 479739 472240 300753 409024 504402 455265 332467 497376 456255 255347 299403
2553B99403K74052O1299j58141j6895q4673j83819q0470L1238J27343K6202L8722
$$ 299403 573455 634754 476613 459718 375045 191226 110756 141994 269337 295539 334261
2542C34261r0223P9541k16873l4056M80260J65272r0352j16391J13976k03396
$$ 334261 244038 323579 106706 72650 552910 718182 627830 511439 625415 422019
2532D22019k13289K47953K70779L8876J3019j29248m6348J91910j30459Q8269
$$ 422019 208730 456683 727462 766338 779357 650109 603761 795671 665212 753481
2522G53481J35417l18635m82732J49029J07617k30284k49545J07310Q6871J46386
$$ 753481 888898 570263 87531 236560 344177 113893 -135652 -28342 58529 204915
2512B04915O212J40039P3002O304o7197j26691l1953J34085J28550l86912O3865
$$ 204915 211127 351166 424168 430472 363275 236584 204631 338716 467266 80354 144219
2501A44219J31641O2366J62617K8628J7097p5344O9976M0990l2763l05555n5860
$$ 144219 275860 338226 500843 529471 546568 471224 541200 582190 549427 243872 188012
2490A88012J79779O7811p3399M7725K76057K80511Q2563j96956j80013J16198
$$ 188012 367791 435602 362203 409928 685985 966496 1049059 852103 672090 788288
2480G88288q8244Q845q76R637k9242k12912J44821K65282m2628j161j77700p5465
$$ 788288 700044 708889 708013 717650 688408 475496 620317 885599 842971 841810 664110 588645
2468E88645M63151L75309L1424P2423p9558j40283J99443k05079O4829j556N6644
$$ 588645 1051796 1427105 1458529 1530952 1451394 1311111 1510554 1305475 1370304 1368748 1425392
2457A425392P7593j8309r2140j05543j1553J06816o6227l0149l11282J77060J19663
$$ 1425392 1502985 1484676 1392536 1286993 1275440 1382256 1316029 1285880 974598 1151658 1271321
2446A271321k1282M5962k30576L07188M92057J12947l0416J57531J06040j48334
$$ 1271321 1250039 1296001 1065425 1372613 1864670 1977617 1947201 2104732 2210772 2062438
2436B062438L17620j3230K949K46212L584j85343j02620N5548O7574j48807P4200
$$ 2062438 2380058 2366828 2369777 2615989 2619573 2434230 2331610 2387158 2454732 2305925 2380125
2425B380125L92397J31164j2268Q4144Q7285J10289J41141L37988J3603j50865
$$ 2380125 2772522 2903686 2891418 2975562 3062847 3173136 3314277 3652265 3665868 3515003
2415C515003Q0578l91777j39501K66529J09082K60808L51836Q066k77336M74463
$$ 3515003 3595581 3203804 3064303 3330832 3439914 3700722 4052558 4060624 3783288 4257751
2405D257751R649k5039N63150J48950N2121J01985j90315o3857J09657K70111
$$ 4257751 4267400 4242361 4805511 4954461 5006582 5108567 4918252 4854395 4964052 5234163
2395E234163K38924J79353R3654K05712N50292N26230L34890L80335L59914L88199
$$ 5234163 5473087 5652440 5746094 5951806 6502098 7028328 7363218 7743553 8103467 8491666
2385H491666L71058M69673N13810L35130J84472L65734M30065L65866L06564N43923
$$ 8491666 8862724 9332397 9846207 10181337 10365809 10731543 11161608 11527474 11834038 12377961
2375A2377961Q45323J235639J569175K102582K097954L516289M988201N674693
$$ 12377961 13223284 14458923 16028098 18130680 20228634 23744923 28733124 34407817
2367C4407817L876980J650625o677L29461J214296K688682M569566O281799R394730
$$ 34407817 38284797 39935422 39928745 40258206 41472502 44161184 48730750 55012549 64407279
2358F4407279J3904127J9173928L0214659N9729880J05417443J18659027O5631707
$$ 64407279 78311406 97485334 127699993 187429873 292847316 411506343 477138050
2351D77138050k4601329q8852197q4453233o7963137n2200318l6263845k7396201
$$ 477138050 452536721 363684524 279231291 211268154 159067836 122803991 95407790
2344I5407790j9836380j5217273j0714219o582711l523354j950232m49039j095842
$$ 95407790 75571410 60354137 49639918 43057207 39533853 37583621 37134582 36038740
2336C6038740k999742l342810k667672k440028k131655j705172j526708j417909
$$ 36038740 33038998 29696188 27028516 24588488 22456833 20751661 19224953 17807044
2328A7807044r51380j238498j097763j076255p37238o93532p05294o04127m34615
$$ 17807044 16855664 15617166 14519403 13443148 12705910 12012378 11307084 10702957 10268342
2319A0268342o88203j06732k52396l78195l46754p2434j85360k5872l54872m43565
$$ 10268342 9580139 9473407 9221011 8842816 8496062 8423628 8238268 8212396 7857524 7413959
2309G413959l9448j57955l17883m7611l83587l94529l39366n7246j45702K154
$$ 7413959 7374511 7216556 6898673 6851062 6467475 6072946 5733580 5676334 5530632 5532786
2299E532786J63704k79797l02101k9143l39593j19475K8469j89288j38164j96188
$$ 5532786 5696490 5416693 5114592 5085449 4745856 4626381 4654850 4465562 4327398 4131210
2289D131210k01858n74898k95980j22437k42039j23076q0240j80404j17660j5359
$$ 4131210 3929352 3354454 3058474 2936037 2693998 2570922 2490682 2310278 2192618 2177259
2279B177259K29688P4394R7008j8188M2679l55435k48071j63572k47738K78451
$$ 2177259 2406947 2481341 2578349 2560161 2602840 2247405 1999334 1835762 1588024 1866475
2269A866475Q2640k43190J06858L17103j66388N5794j463J06927l1549n2770M0891
$$ 1866475 1949115 1705925 1812783 2129886 1963498 2019292 2017829 2124756 2093207 2040437 2081328
2258B081328m1802l04622m5364j35416j90879K9155O1047P3299k01325M2052K00277
$$ 2081328 2039526 1734904 1689540 1554124 1363245 1392400 1453447 1526746 1325421 1367473 1567750
2247A567750j40734j25432k21136J28986N7883J19498J30408j87004m7516N1054
$$ 1567750 1427016 1301584 1080448 1209434 1267317 1386815 1517223 1330219 1282703 1333757
2237A333757j39874m1682K90565K82266O8817m66436o997J51304L4k63077j18797
$$ 1333757 1193883 1152201 1442766 1725032 1793849 1327413 1320416 1471720 1471754 1208677 1089880
2226A089880J05919o4996k20582K07237J64362l09532j42622J39818J12186j61401
$$ 1089880 1195799 1130803 910221 1117458 1281820 972288 829666 969484 1081670 920269
2216I20269J29055r4891J17812l4061J73986k5530k08646l4636j33428l03430
$$ 920269 1049324 954433 1072245 1038184 1212170 1186640 977994 943358 809930 506500
2206E06500k07258R9196O7157K22944k6446Q9424J51434k6468J03883o4112j69509
$$ 506500 299242 398438 465595 688539 662093 751517 902951 876483 980366 916254 746745
2195G46745q8516o0151L3039J06006K43621n3346m07904P0514R0240J48818j66498
$$ 746745 658229 598078 631117 737123 980744 927398 519494 590008 680248 829066 662568
2184F62568l0906j75797j62279J22858k9090J5243N0683J27536P1777J48193k42411
$$ 662568 631662 455865 293586 416444 387354 402597 453280 580816 652593 800786 558375
2173E58375l06088J95822l7563j13683q7955q8042J79388K31807k75069j20259
$$ 558375 252287 448109 410546 296863 208908 120866 300254 532061 256992 136733
2163A36733q1278J10558K57877j75527k59102R5941N363P3725Q943l28338L50514
$$ 136733 55455 166013 423890 248363 -10739 85202 90565 164290 173233 -155105 195409
2152A95409j80696J0265R2260K44561M6219k22902o4229J9909p7989P3277j65134
$$ 195409 14713 24978 117238 361799 408018 185116 120887 140796 62807 136084 -29050
2141b9050L29421K31615M7040k26781J34454O559j37149k04043l01028J86967
$$ -29050 300371 531986 579026 352245 486699 493258 356109 152066 -148962 38005
2131C8005J99855k62583J07126j31073j37432j74954j55409K40193Q1130P7922
$$ 38005 237860 -24723 82403 -48670 -186102 -361056 -516465 -276272 -195142 -117220
2121a17220K90369j61344j41625K51132j08663Q3450J50914k23590l2666J72250
$$ -117220 173149 11805 -129820 121312 12649 96099 247013 23423 -9243 163007
2111A63007L3694J66193p6120p0993R692j29655q9799J27252j42681J73946j40329
$$ 163007 196701 362894 286774 215781 225473 95818 6019 133271 -9410 164536 24207
2100B4207J18004P0391P9905J68714j55219N2590K9989j33084q7413L40792j41998
$$ 24207 142211 212602 292507 461221 306002 358592 388581 255497 168084 508876 366878
2089C66878j22095K01876Q1797L61499L23684M37817K82812N502j83533l01940
$$ 366878 244783 446659 528456 889955 1213639 1651456 1934268 1939770 1756237 1454297
2079A454297k92144j58189m17267M0686l68677p5172J40055l7500k03985p7464
$$ 1454297 1162153 1003964 586697 627383 258706 183534 323589 286089 82104 4640
2069D640R8546J64709K06289k65656k04220k9991j81098J1378Q7817j11175L85041
$$ 4640 103186 267895 474184 208528 4308 -25683 -206781 -195403 -107586 -218761 166280
2058A66280K64203n2114l26843k17149P8404J04646N6912j17655j19842l943L5148
$$ 166280 430483 378369 51526 -165623 -87219 17427 74339 -43316 -163158 -167101 -131953
2047a31953j12230K05032L49978l20739n123N3543q0544K31644J24607k37218
$$ -131953 -244183 -39151 310827 -9912 -15035 38508 -42036 189608 314215 76997
2037G6997j53246K4177k6226Q9049K48708q0654r6903k11361j9325J16110J68519
$$ 76997 -76249 -52072 -78298 10751 259459 178805 81902 -129459 -148784 -32674 135845
2026A35845k54536J21311M0767J1398J59509k65996k13329J6486l2760M68507
$$ 135845 -118691 2620 43387 54785 214294 -51702 -265031 -248545 -281305 187202
2016A87202o1133J0361J36192k37343m6576L4929J27850k05955J86464k00921
$$ 187202 126069 136430 272622 35279 -11297 23632 151482 -54473 131991 -68930
2006f8930Q7539m0627r174j82787J69437P9455j69531k10817M23848K82419j30090
$$ -68930 18609 -22018 -31192 -213979 -44542 34913 -134618 -345435 78413 360832 230742
1995B30742j8339j43212j24589o1323L3970O9613j58522L27990k15494p5853L0922
$$ 230742 212403 69191 -55398 -116721 -82751 -13138 -171660 156330 -59164 -135017 -104095
1984a04095o459J42252J32210j12558k37602M5341Q410K14616K3999M3244l38166
$$ -104095 -110554 31698 163908 51350 -186252 -140911 -132501 82115 106114 149358 -188808
1973a88808j79002J88084j90570N4648J31849J9900N6102r2175O1790o6530R6938
$$ -188808 -367810 -179726 -370296 -315648 -183799 -163899 -107797 -199972 -138182 -204712 -107774
1962a07774o2736L3713R4284j18198J716k7339r6575K5201j1666J16039n3686
$$ -107774 -170510 -136797 -42513 -160711 -158995 -186334 -282909 -257708 -269374 -153335 -207021
1951b07021O9517q2278Q2231J6514j33282k28469J52919p1047J3633J86501k09496
$$ -207021 -137504 -219782 -137551 -121037 -254319 -482788 -329869 -400916 -387283 -200782 -410278
1940d10278K52491K41829j2360k46780o1868j86833m5058K29433J00641K74141
$$ -410278 -157787 84042 71682 -175098 -236966 -423799 -468857 -239424 -138783 135358
1930A35358n9439k21368j0741L62j06718J52227N846k579J62450R3953l80830
$$ 135358 75919 -145449 -156190 -155828 -262546 -110319 -104473 -107052 55398 149351 -231479
1919b31479m6487K8905J09717J15567j51257j43158N7825k1441M3457K6231K63089
$$ -231479 -277966 -249061 -139344 -23777 -175034 -318192 -260367 -281808 -238351 -212120 50969
1908E0969m1043j30997j05162J80345J22259O8552K11470j74957j49646k64715
$$ 50969 9926 -121071 -226233 -45888 76371 144923 356393 181436 31790 -232925
1898b32925R6411J14645P7879j39825j55036j251J46386n3585P6923n054N5151
$$ -232925 -136514 -21869 56010 -83815 -238851 -240102 -93716 -147301 -70378 -75432 -20281
1887b0281j81783O1629K29004j92789k92087K86370J73218p5656K2624N5649N5618
$$ -20281 -202064 -140435 88569 -104220 -396307 -109937 63281 -12375 10249 65898 121516
1876A21516j82179N3206L54782j2959k70367j23454p4779o8992K7049J24301P8038
$$ 121516 -60663 -7457 347325 334366 63999 -59455 -134234 -203226 -176177 -51876 26162
1865B6162m5234j4002k28093J25069J73926q7804j91603L31903j29516j23363
$$ 26162 -19072 -33074 -261167 -136098 37828 -49976 -241579 90324 -39192 -162555
1855a62555J31385j93680J3092K57207M7130j84398o9998n3842J97713P8115J6172
$$ -162555 -31170 -224850 -211758 45449 92579 -91819 -161817 -215659 -17946 60169 76341
1844G6341K8396k66049K4875J11519l07708m0731p743J85273K11337R2260j11757
$$ 76341 104737 -161312 -136437 -24918 -332626 -373357 -381100 -195827 15510 107770 -3987
1833c987n0767k23453Q5143l8059K51694M5273j06777n7347m3318J23097k0869
$$ -3987 -54754 -278207 -193064 -231123 20571 65844 -40933 -98280 -141598 -18501 -39370
1822c9370j67121k6134J27934j24429m5703J74948l24879K68156M1806L411J12899
$$ -39370 -206491 -232625 -104691 -229120 -274823 -99875 -424754 -156598 -114792 -111381 1518
1811A518j8197J10962J3422l39204k2801L1230p2857P9171j66611K02806o4824
$$ 1518 -16679 94283 107705 -231499 -254300 -223070 -295927 -216756 -383367 -180561 -245385
1800b45385K69147k76467j16922o7257J96944R6227l44895p4980J96495J85321
$$ -245385 23762 -252705 -369627 -436884 -239940 -143713 -488608 -563588 -367093 -181772
1790a81772L5014L4722K3124r6487M4895P6616j02925k0913j57672O2856l024
$$ -181772 -146758 -112036 -88912 -185399 -140504 -63888 -166813 -187726 -345398 -282542 -285566
1779b85566O8185L38134l2567R3394Q4941m42030N4839k03422k83936L17690n1051
$$ -285566 -217381 120753 88186 181580 266521 -175509 -120670 -324092 -608028 -290338 -341389
1768c41389J15203J50724o1579j10649R1013j96808n1180J39712K44630o4399
$$ -341389 -226186 -75462 -137041 -247690 -156677 -353485 -404665 -264953 -20323 -84722
1758h4722j36570o2391r158j5114J94977R6671l04783j64858O730J71125K91674
$$ -84722 -221292 -283683 -292841 -307955 -112978 -16307 -321090 -485948 -479218 -308093 -16419
1747a6419q515l69221r290J20287J51676q8579k0726K08315r7383p8390j39067
$$ -16419 -24934 -394155 -403445 -283158 -131482 -220061 -240787 -32472 -129855 -208245 -347312
1736c47312P1680j10051j67026K22813M9639M0511p5762l9570O9617J75498j18388
$$ -347312 -275632 -385683 -552709 -329896 -280257 -239746 -315508 -355078 -285461 -109963 -228351
1725b28351j3320j80810K38595J34500P1041j8097l31177o6296k6464L27365q4218
$$ -228351 -241671 -422481 -183886 -49386 21655 3558 -327619 -393915 -420379 -93014 -177232
1714a77232l28179J66174M64482k10090p9015J69610J28547j16110k8789J96187
$$ -177232 -505411 -339237 125245 -84845 -163860 5750 134297 18187 -10602 185585
1704A85585R9823p3497j28197r7808K05216k88753n6903P1230k83220J71785J28677
$$ 185585 285408 211911 83714 -14094 191122 -97631 -154534 -83304 -366524 -194739 -66062
1693f6062p3707q5689K18640R7718k84877J83197K09734j34618k9681k72085K9178
$$ -66062 -139769 -225458 -6818 90900 -193977 -10780 198954 64336 34655 -237430 -208252
1682b08252M6712j08438J53071J46678l2392j75001l8884R1476p0669J14919J44375
$$ -208252 -161540 -269978 -116907 29771 -2621 -177622 -216506 -125030 -195699 -80780 63595
1671F3595K51201m2556l03193r8191J84665K3434k41711k80427k8765J98486m8835
$$ 63595 314796 272240 -30953 -129144 55521 78955 -162756 -443183 -471948 -273462 -322297
1660c22297P8912m0328k47279L73611p1438O6944J24177J26621k0857j05580K07984
$$ -322297 -243385 -283713 -530992 -157381 -228819 -161875 -37698 88923 68066 -37514 170470
1649A70470k50460q8936K04151j47712j03948j17553K71011r4642m3463m0847
$$ 170470 -79990 -168926 35225 -112487 -216435 -333988 -62977 -157619 -201082 -241929
1639b41929k81396K73454O0615j36618Q8185J852p1583K90756J28134j38641J10424
$$ -241929 -523325 -249871 -189256 -325874 -237689 -235837 -307420 -16664 111470 -27171 83253
1628H3253j52256j46437q7601N5569o2934M7761o3011j21856L65680J6680j40046
$$ 83253 -69003 -215440 -303041 -247472 -310406 -262645 -325656 -447512 -81832 -65152 -205198
1617b05198p934j92389R4604J68936q554l14913J21544J56460j18687j01997R5258
$$ -205198 -213132 -405521 -310917 -141981 -150535 -465448 -343904 -187444 -306131 -408128 -312870
1606c12870R4465m3832J7837o8909J27887L7957J02750j09996J04346L49o4452
$$ -312870 -218405 -262237 -244400 -313309 -185422 -147465 -44715 -154711 -50365 -50016 -114468
1595a14468m7805J33775j89184j6045Q4543r5358M6427n940R069P1389k04383
$$ -114468 -162273 -28498 -217682 -233727 -149184 -244542 -198115 -204055 -194986 -123597 -327980
1584c27980L2777J66375j17879M5352K75611n4370l7144j498j61408n9973J04754
$$ -327980 -295203 -128828 -246707 -201355 74256 19886 -17258 -18756 -180164 -240137 -135383
1573a35383J67105N998k50817J1730P9813q9606m0284J59624o8711J06747o6806
$$ -135383 31722 37720 -213097 -201367 -121554 -211160 -251444 -91820 -160531 -53784 -120590
1562a20590k15880J30863J34888k20379J64692O2445j03019J9616K54755j64809
$$ -120590 -336470 -205607 -70719 -291098 -126406 -63961 -166980 -147364 107391 -57418
1552e7418k44147K24022L2514P4374j46995N6051M8980j22354n2684L4527J00800
$$ -57418 -301565 -77543 -45029 29345 -117650 -61599 -12619 -134973 -187657 -153130 -52330
1541e2330J4879r0629p4413k26382J60737J4198j14124M76976J29041k8237k16031
$$ -52330 -37451 -128080 -202493 -428875 -268138 -253940 -368064 108912 237953 209716 -6315
1530f315j64614p9744Q5007l625j23173J8390K74992N2060J16068o2478j43164
$$ -6315 -170929 -250673 -165666 -169291 -292464 -274074 918 52978 169046 106568 -36596
1519c6596k8756m3509k8714j36175L15103L7367j57174l06821M367K48532O2349
$$ -36596 -65352 -108861 -137575 -273750 41353 78720 -78454 -385275 -380908 -132376 -70027
1508g0027k16201q8107j30136L066M47808q5864M9556L6849j39610m1458K0519
$$ -70027 -286228 -374335 -504471 -501405 -53597 -139461 -89905 -53056 -192666 -234124 -213605
1497b13605Q5612K6697M0526j09706L0418k9815J57597l02681K94905K9314n4735
$$ -213605 -127993 -101296 -60770 -170476 -140058 -169873 -12276 -314957 -20052 9262 -45473
1486d5473l7076l25533j32447K20459K45147K3909m3264k8816N4532J36722m3610
$$ -45473 -82549 -408082 -540529 -320070 -74923 -51014 -94278 -123094 -68562 68160 24550
1475B4550j82553q7417m7152O8361J28948J02877q1337q1088K82640l46426L9025
$$ 24550 -158003 -245420 -292572 -224211 -95263 7614 -73723 -154811 127829 -218597 -179572
1464a79572K8626N3381K09095l37128K1909q7289O7070K58245L2328k96883j8856
$$ -179572 -150946 -97565 111530 -225598 -203689 -290978 -223908 34337 66665 -230218 -249074
1453b49074q4481k09030K310J23927N1756O8784N2412J53528J08842o0235j76194
$$ -249074 -333555 -542585 -540275 -416348 -364592 -295808 -243396 -89868 18974 -41261 -217455
1442b17455k6187K72988j08264j02566k17975j9098K75558J65517j65243j88976
$$ -217455 -243642 29346 -78918 -181484 -399459 -418557 -142999 22518 -142725 -331701
1432c31701J8751K23097O9059k00549M46467r5709j38653n1360j16937j23905
$$ -331701 -312950 -89853 -20794 -221343 225124 129415 -9238 -60598 -177535 -301440
1422c01440o1990J97903J21924k48961J53273L08569k65965k6834M3588m7887
$$ -301440 -363430 -165527 -43603 -292564 -139291 169278 -96687 -123521 -79933 -127820
1412a27820K77458o6089j90928J92360j3934J4062j42842K82506J0356m16179
$$ -127820 149638 83549 -107379 84981 71047 85109 -57733 224773 235129 -181050
1402a81050N5271L9368N7470k10336j7534j7179j96351j70236R9120K82284n1447
$$ -181050 -125779 -86411 -28941 -239277 -256811 -273990 -470341 -640577 -541457 -259173 -310620
1391c10620R7428n1513j33716p7166p8618j80109L2047L19312J37900L68245J23006
$$ -310620 -213192 -264705 -398421 -475587 -554205 -734314 -702267 -382955 -245055 123190 246196
1380B46196m697k54119l6906j43427l5673L15114k93087j88695M2049Q9643K95877
$$ 246196 241499 -12620 -49526 -192953 -228626 86488 -206599 -395294 -353245 -263602 32275
1369C2275k02826l25110Q5834Q3971J32209j5059K65795k66973L4209J01017l62513
$$ 32275 -170551 -495661 -409827 -325856 -193647 -208706 57089 -209884 -175675 -74658 -437171
1358d37171J80232J87892N0815j54867J72708J44012j80994J74217R2363m10895
$$ -437171 -256939 -69047 -18232 -173099 -391 143621 -37373 136844 229207 -181688
1348a81688k34723O3633J76380J64391k80452L1802M5515o2230q8455N3688J81809
$$ -181688 -416411 -352778 -176398 -12007 -292459 -260657 -215142 -277372 -365827 -312139 -130330
1337a30330j08940m5275j56500L10726J88195q1739p7632r0259j03764K6918J32822
$$ -130330 -239270 -284545 -441045 -130319 57876 -23863 -101495 -191754 -295518 -268600 -135778
1326a35778M473o7059J38188l83978M6199K54928j01316Q812j59527m071J36273
$$ -135778 -131305 -198364 -60176 -444154 -397955 -143027 -244343 -235531 -395058 -399129 -262856
1315b62856J16474j50184M456R7491j2259j02229J79054J24112l88434j20383
$$ -262856 -146382 -296566 -292110 -194619 -206878 -309107 -130053 -5941 -394375 -514758
1305e14758J24765K36802K3129l303j49241m05920J45084L01730J78223j45655
$$ -514758 -389993 -153191 -130062 -133365 -282606 -688526 -543442 -241712 -63489 -209144
1295b09144j5983K38142K3596l07159j40021n0242n8786m7634k9942K83669J72024
$$ -209144 -225127 13015 36611 -270548 -410569 -460811 -519597 -567231 -597173 -313504 -141480
1284a41480j98689l36266K9170J10666q0697R9103P8851J83417L3824J03790m7413
$$ -141480 -340169 -676435 -647265 -536599 -617296 -518193 -439342 -255925 -222101 -118311 -165724
1273a65724j42598j01562l5155J55594J23527O3778K1150k32115p7018J50214
$$ -165724 -308322 -409884 -445039 -289445 -165918 -102140 -80990 -313105 -390123 -239909
1263b39909J33664K08173M772j59719K7286j96224Q1016J61147l47642j77841
$$ -239909 -106245 101928 106700 -53019 -25733 -221957 -140941 20206 -327436 -505277
1253e05277J87228K44787l8403m9079j15250m8564J5322j87633k7150q8826j4410
$$ -505277 -318049 -73262 -111665 -160744 -275994 -324558 -309236 -496869 -524019 -612845 -627255
1242f27255J58138L4786J20423J03394J35201j3525J20376K8017L5475k43839
$$ -627255 -469117 -434331 -313908 -210514 -75313 -88838 31538 59555 95030 -148809
1232a48809R15j95454Q4610O7466m6790N0339k5150L32251k40385k94898K50456
$$ -148809 -147894 -343348 -258738 -191272 -238062 -187723 -212873 119378 -121007 -415905 -165449
1221a65449J38542k8236j30262K19463o3783j47236j6627o1047K58945l5302k31583
$$ -165449 -26907 -55143 -185405 34058 -29725 -176961 -193588 -254635 4310 -30992 -262575
1210b62575j92716j1387j23325L37604J8795N9451P0886j10601N6158J1379p3148
$$ -262575 -455291 -466678 -590003 -252399 -233604 -174153 -103267 -213868 -157710 -146331 -219479
1199b19479j79737J62719J52903L6604j573M5350j51352N7810M7365k43778R017
$$ -219479 -399216 -236497 -83594 -46990 -48563 -3213 -154565 -96755 -49390 -293168 -284151
1188b84151n8146J29861k08173J71366L9091q2953j95726J90252K49798l05057
$$ -284151 -342297 -212436 -420609 -249243 -210152 -293105 -488831 -298579 -48781 -353838
1178c53838J94028o8218n0847Q6154o4725n4846J55323J56258j76932J01338o4855
$$ -353838 -159810 -228028 -278875 -192721 -257446 -312292 -156969 -711 -177643 -76305 -141160
1167a41160N0567n2988j83947K59606M0274q1545L7821O8677j60560l69636M15745
$$ -141160 -90593 -143581 -327528 -67922 -27648 -109193 -71372 -2695 -163255 -532891 -117146
1156a17146r041n8116l03814J83573K05863k41126o8197P7987J56765m4299P4706
$$ -117146 -126187 -184303 -488117 -304544 -98681 -339807 -408004 -330017 -173252 -217551 -142845
1145a42845k12642J06329j06949J1867j7038K45033j7547k86226j92994J69907
$$ -142845 -355487 -249158 -356107 -344240 -361278 -116245 -133792 -420018 -613012 -443105
1135d43105K51543K35721l85446j78367J11808j41561L80504j28584n2513R5522
$$ -443105 -191562 44159 -341287 -519654 -407846 -549407 -168903 -297487 -350000 -254478
1125b54478j92658K4579J68808O6943K97798j35720l21681J21856J66059N6165
$$ -254478 -447136 -422557 -253749 -186806 110992 -24728 -346409 -224553 -58494 -2329
1115b329l05466K72330q0473J26886j9393l76783r9897J50143L03612M24303k79676
$$ -2329 -307795 -35465 -115938 10948 -8445 -385228 -485125 -334982 -31370 392933 113257
1104A13257j59967q6673j83544K1359J6860n4038K77455k5399k57471O2387j6713
$$ 113257 -46710 -133383 -316927 -295568 -278708 -332746 -55291 -80690 -338161 -275774 -292487
1093b92487r1133P5618j02905J78490m008j21439j2832j26504K49512k4067l9194
$$ -292487 -383620 -308002 -410907 -232417 -236425 -357864 -370696 -497200 -247688 -271755 -310949
1082c10949j151J40510l33104q0902N5117L38476j89456j19166K65524r7328O140
$$ -310949 -312100 -171590 -504694 -585596 -530479 -192003 -381459 -500625 -235101 -332429 -326289
1071c26289p7815j79055j3958N75208j780q9629j15346J22526p7888k06380K03308
$$ -326289 -404104 -583159 -597117 -21909 -23689 -113318 -228664 -106138 -184026 -390406 -187098
1060a87098J2623K462Q7217J22240k41148r7768l73085L15525M6160n2338J69452
$$ -187098 -174475 -172013 -84796 37444 -203704 -301472 -674557 -359032 -312872 -365210 -195758
1049a95758m3271k11859j24238Q7276J21090M8811k7374K48409P6512l5666j03893
$$ -195758 -239029 -450888 -575126 -487850 -366760 -317949 -345323 -96914 -20402 -56068 -159961
1038a59961j33317K5627k41081L2189L11927r0606q6170K85898j25840J26811
$$ -159961 -293278 -267651 -508732 -476543 -164616 -255222 -341392 -55494 -181334 -54523
1028e4523j10339l39610J13064j40451m0919L36543K3886o741j827M4425j22693
$$ -54523 -164862 -504472 -391408 -531859 -572778 -236235 -212349 -219090 -220917 -176492 -299185
1017b99185l00674L5614K47986K6822j08107R2499l22924j01886L74909K24420
$$ -299185 -599859 -564245 -316259 -289437 -397544 -305045 -627969 -729855 -354946 -130526
1007a30526Q755j73130l1891j42731P4384K54754k51642Q6885K18593l3578M7800
$$ -130526 -121771 -294901 -326792 -469523 -395139 -140385 -392027 -305142 -86549 -120127 -72327
996g2327r2594m4349M6775J34919m0757j64209o9784m3143l954j32999J19810
$$ -72327 -164921 -209270 -162495 -27576 -68333 -232542 -302326 -345469 -349423 -482422 -362612
985c62612R0031m5740L138J20909j07608K68346J50468k37349j14536K2669p0380
$$ -362612 -272581 -318321 -315183 -194274 -301882 -33536 116932 -120417 -234953 -212284 -282664
974b82664J71377P5802m3545k4543n0162K16846j04791k85836j20513J49264J92318
$$ -282664 -111287 -35485 -79030 -103573 -153735 63111 -41680 -327516 -448029 -298765 -106447
963a06447P5941J0657J94658r2797O0272j65279k69721k6175K0344k14471K7334
$$ -106447 -30506 -19849 174809 82012 142284 -22995 -292716 -318891 -298547 -513018 -485684
952d85684J74745j4963K31839J37497j74846m3485J1263O1822O1708k00484j93103
$$ -485684 -310939 -325902 -94063 43434 -131412 -174897 -163634 -101812 -40104 -240588 -433691
941d33691p7485M0483Q545K42553k5756l26180q90L18639O0619J07253j99601
$$ -433691 -511176 -470693 -462148 -219595 -245351 -571531 -572421 -253782 -193163 -85910 -285511
930b85511k2610m1152j18540k982L99458R9k0474j79649l28776p9085L3160K471
$$ -285511 -308121 -349273 -467813 -470795 -71337 -71238 -91712 -271361 -600137 -679222 -646062 -643591
918f43591o668J84714K39749L1182j45445J27644K0704j0353M8960j45950Q1883
$$ -643591 -650259 -465545 -225796 -194614 -340059 -212415 -191711 -202064 -153104 -299054 -217171
907b17171j07024j98318l2546L63775J48279k44484k08215K91995J0158j60266
$$ -217171 -324195 -522513 -555059 -191284 -43005 -287489 -495704 -203709 -193551 -353817
897c53817Q4993j97828J65967N4250j12341l3415J53826R7045j17106j17779M1426
$$ -353817 -268824 -466652 -300685 -246435 -358776 -392191 -238365 -141320 -258426 -376205 -334779
886c34779M7895J47968k63295o2959Q8975Q1844R9950Q226l05841K86860K6213
$$ -334779 -286884 -138916 -402211 -465170 -376195 -294351 -194401 -186175 -492016 -205156 -178943
875a78943p8075K78224j35387n548J41984j69354j13874o4223O2419K05618j14126
$$ -178943 -257018 21206 -114181 -119729 22255 -147099 -260973 -325196 -262777 -57159 -171285
864a71285J52595J036k13129l3460j6624P2378j18267P2578O9488K709l19150
$$ -171285 -18690 -17654 -230783 -264243 -280867 -208489 -326756 -254178 -184690 -181981 -501131
853e01131J41618O7275m7972J10704k14240J37354l206m8134p2813J41848J57094
$$ -501131 -359513 -292238 -340210 -229506 -443746 -306392 -309598 -357732 -430545 -288697 -131603
842a31603J01332k17897p8666L05912j07387J2201P1576l8904l23804Q9094m3245
$$ -131603 -30271 -248168 -326834 -20922 -128309 -116108 -44532 -83436 -407240 -318146 -361391
831c61391J5248J58392j0703j62746O1786J17169k40150q9813J51410J96253k92178
$$ -361391 -346143 -187751 -198454 -361200 -299414 -182245 -422395 -512208 -360798 -164545 -456723
820d56723J64115P3376j35272J75014L56085l44394j34588K5590K5644M8410k55178
$$ -456723 -292608 -219232 -354504 -179490 176595 -167799 -302387 -276797 -251153 -202743 -457921
809d57921Q6134j20279K82728j17861r3197j0334l99619L60511N2402L2980j61987
$$ -457921 -371787 -492066 -209338 -327199 -420396 -430730 -830349 -469838 -417436 -384456 -546443
798e46443J00262J71044j80974J29764k52L1375L60561k97289L9703J40943j42317
$$ -546443 -446181 -275137 -456111 -326347 -326599 -295224 65337 -231952 -192249 -51306 -193623
787a93623P194k93905J19897K56760l8813J14044l0695r3483J56451J32190p0230
$$ -193623 -186429 -480334 -360437 -103677 -142490 -28446 -59141 -152624 3827 136017 65787
776F5787k2113j98356n9878J72826l00225J63821L1303J6792j16764l4103k14648
$$ 65787 43674 -154682 -214560 -41734 -341959 -178138 -146835 -130043 -246807 -280910 -495558
765d95558p0307Q7445L53982j46138j8716N1967j36144K40252L834n8254k5298
$$ -495558 -565865 -478420 -124438 -270576 -289292 -237325 -373469 -133217 -129383 -187637 -212935
754b12935q7926m0524M50689l5170q5113j227p0057r5127R6485j43945k07369
$$ -212935 -300861 -341385 109304 74134 -10979 -12206 -82263 -177390 -80905 -224850 -432219
743d32219R9123j67107k9930j0118l5007R1192k384K5177L22612o0853j14677
$$ -432219 -333096 -500203 -530133 -540251 -575258 -484066 -486450 -461273 -138661 -199514 -314191
732c14191O2076j23700J47771q0780j06418m4522P2862J08716p5797q1399J804
$$ -314191 -252115 -375815 -228044 -308824 -415242 -459764 -386902 -278186 -353983 -435382 -433578
721d33578L10752k10394q290K25192n0602J34478j64466j78201K2411L1231N8933
$$ -433578 -122826 -333220 -341510 -116318 -166920 -32442 -196908 -375109 -352698 -321467 -262534
710b62534O6585j09859J26532k9302j88702K37943R7713n7182J1971r7453j26446
$$ -262534 -195949 -305808 -179276 -208578 -397280 -159337 -61624 -118806 -106835 -204288 -330734
699c30734m1803k17596j23394R296J45386L37792j29900Q2410Q1875J2023l24597
$$ -330734 -372537 -590133 -713527 -704231 -558845 -221053 -350953 -268543 -186668 -174645 -499242
688d99242K68862p2597r2655q6154r3610K20039R8719n5421L5977J69185O3360
$$ -499242 -230380 -302977 -395632 -481786 -575396 -355357 -256638 -312059 -276082 -106897 -43537
677d3537J40558m9187j80206K7055j45831J4754j02701J4495O4558M7145J44092
$$ -43537 97021 47834 -132372 -105317 -251148 -236394 -339095 -324600 -260042 -212897 -68805
666f8805l8242k5860k06852J66398k6464j66253M03216M8604k37043K78008j43263
$$ -68805 -107047 -132907 -339759 -173361 -199825 -366078 37138 85742 -151301 126707 -16556
655a6556m80542R501Q1853k10146L21480j9468j55389J00990L2529k80749J10682
$$ -16556 -497098 -487597 -405744 -615890 -294410 -313878 -469267 -368277 -335748 -616497 -505815
644e05815J94400r7996P3175Q0257l17537r1260M18028K40535r2074j02733j26254
$$ -505815 -311415 -409411 -336236 -255979 -573516 -664776 -246748 -6213 -98287 -201020 -327274
633c27274L69697j38538k99466L3477Q5263j36012m277J9465J45473J11556k60324
$$ -327274 42423 -96115 -395581 -362104 -276841 -412853 -417130 -397665 -252192 -140636 -400960
622d00960j0398n4673J04345r6838J38076J29183l19081k251L78266j80762j6850
$$ -400960 -411358 -466031 -361686 -458524 -320448 -191265 -510346 -512597 -134331 -315093 -331943
611c31943L4098o7252L26594o5444M3410M5728k7591l62339J68093J57606K39950
$$ -331943 -297845 -365097 -38503 -103947 -60537 -14809 -42400 -404739 -236646 -79040 160910
600A60910k96259k37270j83321Q329J87630J78409J8682K5322P328j61191J00060
$$ 160910 -135349 -372619 -555940 -547611 -359981 -181572 -162890 -137568 -130240 -291431 -191371
589a91371N0570k54691J53385j56051j65719K8719R9151J35791q68J6156j73706
$$ -191371 -140801 -395492 -242107 -398158 -563877 -535158 -436007 -300216 -301084 -284928 -458634
578d58634K55660n1720j37R0966j10069k7691J82928k85192J27260L7893l8847
$$ -458634 -202974 -254694 -254831 -163865 -273934 -301625 -118697 -403889 -276629 -238736 -277583
567b77583o2665J24664k39644J38441l02296k2873K84393j51864Q4660N4833J91586
$$ -277583 -340248 -215584 -455228 -316787 -619083 -641956 -357563 -509427 -424767 -369934 -178348
556a78348L4098r2523K890J29452j01418j06420K50208j11860j3992J08166q0865
$$ -178348 -144250 -236773 -233883 -104431 -205849 -312269 -62061 -173921 -187913 -79747 -160612
545a60612l2382k2312L354M0877l71972j34767L71025k2899N3732K50319j65540
$$ -160612 -192994 -215306 -211952 -171075 -543047 -677814 -306789 -329688 -275956 -25637 -191177
534a91177j66902l41953M23035J20387Q8323q5583j62504Q5853l25627j56533
$$ -191177 -358079 -700032 -276997 -156610 -68287 -153870 -316374 -230521 -556148 -712681
524g12681J51074K84229N0891k30807k3095K57528P1538j79932L06969m0444k57951
$$ -712681 -561607 -277378 -226487 -457294 -480389 -222861 -151323 -331255 -24286 -64730 -322681
513c22681J06160K66201k5544j94200R1725k63445j63088L0854N8322m4454K23674
$$ -322681 -216521 49680 24136 -170064 -78339 -341784 -504872 -474018 -415696 -460150 -236476
502b36476L5748l16331k90531J95624J27335k09601J99076J82906j15895o0345
$$ -236476 -200728 -517059 -807590 -611966 -484631 -694232 -495156 -312250 -428145 -488490
492d88490j80169J36209p957J01613p1604J37495j7332J86448M9694J39025K26044
$$ -488490 -668659 -532450 -540407 -438794 -510398 -372903 -390235 -203787 -154093 -15068 210976
481B10976l21452p5373R3888j34809n742n0802j7678J51349j87199J09331R3160
$$ 210976 -110476 -185849 -91961 -226770 -232512 -283314 -300992 -149643 -336842 -227511 -134351
470a34351l7241q4794j7483k2703p6499j18288L9246m1600O8533J83943J48569
$$ -134351 -171592 -256386 -273869 -296572 -373071 -491359 -452113 -493713 -425180 -241237 -92668
459i2668n2253j26649M6961J73644J02435j40980k12448R6784j13951k25796J71906
$$ -92668 -144921 -271570 -224609 -50965 51470 -89510 -301958 -205174 -319125 -544921 -373015
448c73015J48875p0659M2735R624J7984r763j51879J81396l2150q4868O496j25422
$$ -373015 -224140 -294799 -252064 -242440 -224456 -234219 -386098 -204702 -236852 -321720 -315224 -440646
436d40646j46228K21877Q4034l81707L2003M61072J16208o7443j19702L36233
$$ -440646 -586874 -364997 -280963 -662670 -630667 -169595 -53387 -120830 -240532 95701
426I5701j22015l70379M8936r4864m5863L8918L1337J64632j1714J55467k08673
$$ 95701 -26314 -396693 -347757 -442621 -488484 -449566 -418229 -253597 -265311 -109844 -318517
415c18517J38804J364P0993J6038k06229k45252p1919K34375K74205o722j1065
$$ -318517 -179713 -178349 -107356 -91318 -297547 -542799 -614718 -380343 -106138 -112860 -123925
404a23925j04132l7897N4895k23369n412Q8819j92234J13594o3020J50717j22884
$$ -123925 -228057 -265954 -211059 -434428 -439840 -351021 -543255 -429661 -492681 -341964 -464848
393d64848j55291K04678J67602M1098M501j33977o8310K83629J0783j46154J27128
$$ -464848 -620139 -415461 -247859 -206761 -202260 -336237 -404547 -120918 -110135 -256289 -129161
382a29161J71527j8283J55057k45949j75360p4794J39941J9800R2240k42668j38087
$$ -129161 42366 24083 179140 -66809 -242169 -316963 -177022 -157222 -64982 -307650 -445737
371d45737J9491p5669K29060K67574p9155j8831l00344L39006j9892k7933k37958
$$ -445737 -426246 -501915 -272855 -5281 -84436 -103267 -403611 -64605 -84497 -112430 -350388
360c50388j0419Q1658n0295J08477j07545J0959M4948r9891k3756J20969J0687
$$ -350388 -360807 -279149 -329444 -220967 -328512 -317553 -272605 -372496 -396252 -275283 -264596
349b64596o6460K2013l388J37583j44156l07994p1607L8075J99256J97461J13072
$$ -264596 -331056 -309043 -312431 -174848 -319004 -626998 -698605 -660530 -461274 -263813 -150741
338a50741r0610j49017R2831O7593J50381j49359k39255O4165K22496j06356J9885
$$ -150741 -241351 -390368 -297537 -229944 -79563 -228922 -468177 -404012 -181516 -287872 -267987
327b67987J76551L8613l74294J57083J26538q2348k05213J42152j39673k8857
$$ -267987 -91436 -52823 -427117 -270034 -143496 -225844 -431057 -288905 -428578 -457435
317d57435K83564k01448R8399L2671K35672j33594m4922o6008K130L967N0104
$$ -457435 -173871 -375319 -276920 -244249 -8577 -142171 -187093 -253101 -250971 -247004 -196900
306a96900l60467N7161Q8079q2695J28328N207J7807j68502J46202J82629j45058
$$ -196900 -557367 -500206 -412127 -494822 -366494 -361287 -343480 -511982 -365780 -183151 -328209
295c28209J28126o2944J1422l9138K15819j84996J29224Q6602k51933J2382k06075
$$ -328209 -200083 -263027 -251605 -290743 -74924 -259920 -130696 -44094 -296027 -283645 -489720
284d89720J99700J26072J84517L3510l19499l22033M3984k7623j1623L5054o0733
$$ -489720 -290020 -163948 20569 54079 -265420 -587453 -543469 -571092 -582715 -547661 -608394
273f08394K87242K6561j27113m5763J0694L29977j4782r1012l9666j83298j08499
$$ -608394 -321152 -294591 -421704 -467467 -456773 -126796 -141578 -232590 -272256 -455554 -564053
262e64053Q18l9615N5604K93387k53803m5824l2900K81620L2233l52906J71649
$$ -564053 -563235 -602850 -547246 -253859 -507662 -553486 -586386 -304766 -272533 -625439 -453790
251d53790j32306L5392K71000M5246p3256k6820l8743N5212J67039K8693j3258
$$ -453790 -586096 -550704 -279704 -234458 -307714 -334534 -373277 -318065 -151026 -122333 -135591
240a35591n3106O8721p9416k91409k67395K61618J56986j68358j43994R9126Q2433
$$ -135591 -188697 -119976 -199392 -490801 -758196 -496578 -339592 -507950 -651944 -552818 -470385
229d70385j49701J2696J8182Q8843K6838J05113l1925q9429J50067n9360K4865
$$ -470385 -620086 -607390 -589208 -500365 -473527 -368414 -400339 -489768 -339701 -399061 -374196
218c74196k88694q5210p0368K50498K39435M6739j21799Q385J00791k12379j19970
$$ -374196 -662890 -748100 -818468 -567970 -328535 -281796 -403595 -395210 -294419 -506798 -626768
207f26768m8311O1780k3188j7688K43530J39499j74612J56726J31237J0445q2088
$$ -626768 -675079 -613299 -636487 -654175 -410645 -271146 -445758 -289032 -157795 -147350 -229438
196b29438l38008j88223J21587J19756n2200Q7390o6347k01427J1041J27426J13156
$$ -229438 -567446 -755669 -634082 -514326 -566526 -479136 -545483 -746910 -735869 -608443 -495287
185d95287l0110Q7810K21024j14508r0255K42782k82699o030Q6930o071K53622
$$ -495287 -525397 -437587 -216563 -331071 -421326 -178544 -461243 -467273 -380343 -386414 -132792
174a32792Q0300n27309k44485K22733j91339L97628O3908j27824L5575r121M6175
$$ -132792 -52492 -579801 -824286 -601553 -792892 -395264 -331356 -459180 -423605 -432726 -386551
163c86551J40873L699M5515k2239l32184p9034Q1342j05461j67395K85292J74057
$$ -386551 -245678 -241979 -196464 -218703 -550887 -629921 -548579 -654040 -821435 -536143 -362086
152c62086j78228J7067Q5367o0213j48450j73922K41768J05568o881j45641J43943
$$ -362086 -540314 -523247 -437880 -498093 -646543 -820465 -578697 -473129 -480010 -625651 -481708
141d81708J68789m6483j10106Q5639k56259L799J10361r6569q8249J41228J26557
$$ -481708 -312919 -359402 -469508 -383869 -640128 -636329 -525968 -622537 -710786 -569558 -443001
130d43001L25814k30273o1685l08888j68605L2167P6684J88226k7882n190J13774
$$ -443001 -117187 -347460 -409145 -718033 -886638 -854471 -777787 -589561 -617443 -622633 -508859
119e08859k54396l0608J09414j01290J18132J66852J46180j95496o2227P7097
$$ -508859 -763255 -793863 -684449 -785739 -667607 -500755 -354575 -550071 -612298 -535201
109e35201K06212r2065j25768m3356R8624j31604K2596q9924l01398L4173K27527
$$ -535201 -328989 -421054 -546822 -590178 -491554 -623158 -600562 -690486 -991884 -957711 -730184
98g30184P5637j47309k43155J03969O9391Q5259K48809l8562j00847R9263j8910
$$ -730184 -654547 -801856 -1045011 -941042 -871651 -786392 -537583 -576145 -676992 -577729 -596639
87e96639l21137M8557N7582o5113O7345q1010k72528P857K66160j13565P4772
$$ -596639 -917776 -869219 -811637 -876750 -809405 -890415 -1162943 -1155086 -888926 -1002491 -927719
76i27719J27673m8171J01133p7157N0169q6106r9393O0937m7888J12033p1502
$$ -927719 -800046 -848217 -747084 -824241 -774072 -860178 -959571 -898634 -946522 -834489 -905991
65i05991R5377J71920K5162j24910j28333K07993n0665k74965j4943j36714M6813
$$ -905991 -810614 -638694 -613532 -738442 -866775 -658782 -709447 -984412 -999355 -1136069 -1089256
54a089256J28367j5546K04352N1659o9242J07044j19757q6945l4446L7418m7101
$$ -1089256 -960889 -976435 -772083 -720424 -789666 -682622 -802379 -889324 -923770 -886352 -933453
43i33453k34905P0254J05887r1635J08652Q7212J0469l49013M9236J17913Q9524
$$ -933453 -1168358 -1098104 -992217 -1083852 -975200 -887988 -877519 -1226532 -1177296 -1059383 -969859
32i69859j24342j45639L3859J03563K42736O9189j88815o9462M8068R4355j7492
$$ -969859 -1094201 -1239840 -1205981 -1102418 -859682 -790493 -979308 -1048770 -1000702 -906347 -923839
21i23839m9849k33146K04036M7526k68217K59597O1j3305j16632J0131J9350M7355
$$ -923839 -973688 -1206834 -1002798 -955272 -1223489 -963892 -963831 -977136 -1093768 -1083637 -1064287 -1016932
9a016932J5381j67209n9285j29423R1972q5920J43293P9479J74628
$$ -1016932 -1001551 -1168760 -1228045 -1357468 -1265496 -1351416 -1208123 -1128644 -954016
0i54016
$$ -954016
$$ Imaginary data points
##PAGE= N=2
##DATA TABLE= (X++(I..I)), XYDATA
16383c590786J89955R0486J97800j02240j20284K41547j7132K04474J88441k90778
$$ -3590786 -3400831 -3310345 -3112545 -3214785 -3335069 -3093522 -3110654 -2906180 -2717739 -3008517
16373c008517K38063J84404K95P0826R1400L1922j13117J33968K09811j6899o3641
$$ -3008517 -2770454 -2586050 -2585755 -2514929 -2423529 -2391607 -2504724 -2370756 -2160945 -2177844 -2241485
16362b241485K42515l9412K2535O8777R756J70097K31464m6680O802J59183j32537
$$ -2241485 -1998970 -2038382 -2015847 -1947070 -1937314 -1767217 -1535753 -1582433 -1575631 -1416448 -1548985
16351a548985J00334J68573K19903k26702Q6347J47451K35295J03960O1476r5762
$$ -1548985 -1448651 -1280078 -1060175 -1286877 -1200530 -1053079 -817784 -713824 -652348 -748110
16341g48110Q5819l5429R0445o3681J36612J46510j34802l9214P4445K28139n3389
$$ -748110 -662291 -697720 -607275 -670956 -534344 -387834 -522636 -561850 -487405 -259266 -312655
16330c12655O3202J45579K870Q3615N215M193K9348L7225m0585J50749l2630L960
$$ -312655 -249453 -103874 -101004 -17389 -12174 -7981 21367 58592 18007 168756 136126 140086
16318A40086J13586K13467O0551R2292k5133j47121J89779n9036j3967M0622K16947
$$ 140086 253672 467139 527690 619982 594849 447728 637507 578471 564504 605126 822073
16307H22073N4932Q8559R5223j9565M870J20473O4521K99909m7192j40252J99122
$$ 822073 877005 965564 1060787 1041222 1046092 1166565 1231086 1530995 1483803 1343551 1542673
16296A542673R9352J07037K07737j55422Q2557k6570m6327m9642J99119J04885
$$ 1542673 1642025 1749062 1956799 1801377 1883934 1857364 1811037 1761395 1960514 2065399
16286B065399k21626O4959R7389J9037J02444J29993J35782J6632J469k61546
$$ 2065399 1843773 1908732 2006121 2025158 2127602 2257595 2393377 2410009 2411478 2149932
16276B149932J66342Q0921J35759J74807o090p3794M2487k1171J92066r9938l35977
$$ 2149932 2316274 2397195 2532954 2707761 2701671 2627877 2670364 2649193 2841259 2741321 2405344
16265B405344K36963L23927j76333K1041J76921K2458n5654L76867R7045l16280
$$ 2405344 2642307 2966234 2789901 2810942 2987863 3010321 2954667 3331534 3428579 3112299
16255C112299L00142N9793J01841N8861j62432j80441K42849J08914k79541O337
$$ 3112299 3412441 3472234 3574075 3632936 3470504 3290063 3532912 3641826 3362285 3368622
16245C368622K7868J04481m5741r1525J61311P2282j3577n6838J09496l9154R6361
$$ 3368622 3396490 3500971 3455230 3363705 3525016 3597298 3583721 3526883 3636379 3597225 3693586
16234C693586K27232K33551k26922k58930K76179M36193N3087m1149J64724j44012
$$ 3693586 3920818 4154369 3927447 3668517 3944696 4380889 4433976 4392827 4557551 4413539
16224D413539m4106j5906m2973K25274J20249J4045q3943M976R3273l49334J41375
$$ 4413539 4369433 4353527 4310554 4535828 4656077 4670122 4586179 4591155 4684428 4335094 4476469
16213D476469J16327j31798L2540j14893q8239J70772J91505J18578o2481J9838
$$ 4476469 4592796 4460998 4493538 4378645 4290406 4461178 4652683 4771261 4708780 4728618
16203D728618L0914Q4537l2255L608k6081j55429K54961K80410j56854n8833J76187
$$ 4728618 4759532 4844069 4811814 4815422 4789341 4633912 4888873 5169283 5012429 4953596 5129783
16192E129783J6802j61859L35702J62203l51067l9450J05820l5348k5014Q1548
$$ 5129783 5146585 4984726 5320428 5482631 5131564 5092114 5197934 5162586 5137572 5219120
16182E219120Q3017J72935l82499j33094L35044M0636j03079K8645K51264J26997
$$ 5219120 5302137 5475072 5092573 4959479 5294523 5335159 5232080 5260725 5511989 5638986
16172E638986J01566r3533P1993n5052k19363J20215L772J52272j77541J25614
$$ 5638986 5740552 5647019 5719012 5663960 5444597 5564812 5568584 5720856 5543315 5668929
16162E668929J02834k09889l73950Q4553M41199j08429k67160J00806J47886M4783
$$ 5668929 5771763 5561874 5187924 5272477 5713676 5605247 5338087 5438893 5586779 5631562
16152E631562J65226K75661k34754J24666k98144j24084J0555L29659q6247k3142
$$ 5631562 5796788 6072449 5837695 5962361 5664217 5540133 5550688 5880347 5794100 5770958
16142E770958K20994l05388o3071R9565L60808p7581j44804j231j85351J8794
$$ 5770958 5991952 5686564 5623493 5723058 6083866 6006285 5861481 5860250 5674899 5693693
16132E693693K71812M6999J38346j14785l14640L31632n0753K8997k25262K443
$$ 5693693 5965505 6012504 6150850 6036065 5721425 6053057 6002304 6031301 5806039 5808482
16122E808482K98221K5512k4882M9823j09087J64386q507k20904l0772J33176
$$ 5808482 6106703 6132215 6107333 6157156 6048069 6212455 6203948 5983044 5952272 6085448
16112F085448k5848k02696J94397J48382p0696p5111P1951o7874j07491k18250
$$ 6085448 6059600 5856904 6051301 6199683 6128987 6053876 6125827 6057953 5950462 5732212
16102E732212K3957K16769o9415R447L15075l61385n4631k5531J84336P7282K09077
$$ 5732212 5756169 5972938 5903523 5912970 6228045 5866660 5812029 5786498 5970834 6048116 6257193
16091F257193O1709k34595K4522J77549k36996j33106J64008N2777j10753K37144
$$ 6257193 6318902 6084307 6108829 6286378 6049382 5916276 6080284 6133061 6022308 6259452
16081F259452q7685O9910K78233n8637l66175J22042l6681k48204K34984o8001
$$ 6259452 6171767 6241677 6519910 6461273 6095098 6217140 6180459 5932255 6167239 6099238
16071F099238J14144K06639l00588j8718M8988O1560n0444J89821P4340Q9616
$$ 6099238 6213382 6420021 6119433 6100715 6149703 6211263 6160819 6350640 6424980 6514596
16061F514596L9436k42211l14662L0742K27717J268J70568J00260k0934l1554
$$ 6514596 6554032 6311821 5997159 6027901 6255618 6256886 6427454 6527714 6506780 6475226
16051F475226k44172j84752M47952n4240k53213l3446K24590J0324j48641k31710
$$ 6475226 6231054 6046302 6494254 6440014 6186801 6153355 6377945 6388269 6239628 6007918
16041F007918L0457L24541M9356J63941k27173J42072J03726o2666j55853j94567
$$ 6007918 6038375 6362916 6412272 6576213 6349040 6491112 6594838 6532172 6376319 6181752
16031F181752r1085J48494j11609o2411M41112j29222J32342k0677k52979o7612
$$ 6181752 6090667 6239161 6127552 6065141 6506253 6377031 6509373 6488696 6235717 6168105
16021F168105K43348J736K08680k04593l0594q6923N4719J20078l7240Q5265l6501
$$ 6168105 6411453 6413189 6621869 6417276 6386682 6299759 6354478 6474556 6437316 6522581 6486080
16010F486080q6815q0671m2196l3214R810j17131l2061l9154o5874K26192Q0349
$$ 6486080 6399265 6318594 6276398 6243184 6252994 6135863 6103802 6064648 5998774 6224966 6305315
15999F305315r1178r8153l7928K32759L8768J83852q3085m1060r7924K29588j02051
$$ 6305315 6214137 6115984 6078056 6310815 6349583 6533435 6450350 6409290 6311366 6540954 6438903
15988F438903k74163k8516J51307J26575k05936K38884P9210k19411M9621N8245
$$ 6438903 6164740 6136224 6287531 6414106 6208170 6447054 6526264 6306853 6356474 6414719
15978F414719k07563J41546p2521K55260j4069J9660J59137M1842r9804l56264
$$ 6414719 6207156 6348702 6276181 6531441 6517372 6537032 6696169 6738011 6638207 6281943
15968F281943j50192J84675m757m8530q0204K98071l9494k42346N2765k0496j05355
$$ 6281943 6131751 6316426 6311669 6263139 6182935 6481006 6441512 6199166 6251931 6231435 6126080
15957F126080J09859N3887m28554K12266J62673K02985K6724j81323o8128Q6509
$$ 6126080 6235939 6289826 5861272 6073538 6236211 6439196 6465920 6284597 6216469 6302978
15947F302978j67493L6587J82958l9598P8388M40j41634j00308l0733L50296L5408
$$ 6302978 6135485 6172072 6355030 6315432 6393820 6394260 6252626 6152318 6121585 6471881 6507289
15936F507289p1492Q95P6007k05270N4209N4753j85909k08338K05083m960j9924
$$ 6507289 6435797 6436692 6512699 6307429 6361638 6416391 6230482 6022144 6227227 6222267 6202343
15925F202343J63534k58233J11566q9105m0420J79933K75144k54892q5113k1795
$$ 6202343 6365877 6107644 6219210 6130105 6089685 6269618 6544762 6289870 6204757 6182962
15915F182962J20877j26748J7545j06514J23044L50708r3100j84092J12715K31775
$$ 6182962 6303839 6177091 6194636 6088122 6211166 6561874 6468774 6284682 6397397 6629172
15905F629172q2250o1753k1165J07074L7782l04251j65583j80102j0866K60630
$$ 6629172 6546922 6485169 6464004 6571078 6608860 6304609 6139026 5958924 5948058 6208688
15895F208688K67039j77108j91722R5980p7235J08889J84166J23751j8156O1454
$$ 6208688 6475727 6298619 6106897 6202877 6125642 6234531 6418697 6542448 6524292 6585746
15885F585746M6159l214l07754k63773R6897Q1067K6970K29205l7553J8823l24136
$$ 6585746 6631905 6628691 6320937 6057164 6154061 6235128 6262098 6491303 6453750 6472573 6148437
15874F148437K521J35724R560J83887M0737j11919J42535k74233j49435J04627
$$ 6148437 6150958 6286682 6296242 6480129 6520866 6408947 6551482 6277249 6127814 6232441
15864F232441q8417L12738J43135l11154J9890O4133q8535p0036j55905L04781
$$ 6232441 6144024 6456762 6599897 6288743 6308633 6372766 6284231 6214195 6058290 6363071
15854F363071j8555q290j08272K7480J93615k55027K6728M6431J5946L9185L2188
$$ 6363071 6344516 6336226 6227954 6255434 6449049 6194022 6220750 6267181 6283127 6322312 6354500
15843F354500K13878Q6780p4343Q5511j13144L3476K61795K7085k47230m2476
$$ 6354500 6568378 6655158 6580815 6666326 6553182 6586658 6848453 6875538 6628308 6585832
15833F585832l0568j26342J45602J15992j37739m01479l5078O9075K66367J6074
$$ 6585832 6555264 6428922 6574524 6690516 6552777 6151298 6116220 6185295 6451662 6467736
15823F467736Q634j92439L06K04061K29264N4967k42576l3279J5697L201j16319
$$ 6467736 6476370 6283931 6284237 6488298 6717562 6772529 6529953 6496674 6512371 6515572 6399253
15812F399253k7394j49585K46726O4488Q6931K86562k5339k56457j00331j02876
$$ 6399253 6371859 6222274 6469000 6533488 6620419 6906981 6881642 6625185 6524854 6421978
15802F421978K48757J2055M4520j39202l13123J60104J3883j90812j74762m1481
$$ 6421978 6670735 6682790 6727310 6588108 6274985 6435089 6448972 6258160 6083398 6041917
15792F041917K65356J92269j92332J79759L0229j01442P1106J22851j06101k0301
$$ 6041917 6307273 6499542 6307210 6486969 6517198 6415756 6486862 6609713 6503612 6483311
15782F483311R0422K47087l41973L1455L34542j63862j91523r4802J49811j27289
$$ 6483311 6573733 6820820 6478847 6510302 6844844 6680982 6489459 6394657 6544468 6417179
15772F417179J12321l8216p2305P0983k26391J30434J15695j51510j50332K45032
$$ 6417179 6529500 6491284 6418979 6489962 6263571 6394005 6509700 6358190 6207858 6452890
15762F452890j0385J05134q9523j57711r7003J10028J99945k2409q1194L47989
$$ 6452890 6442505 6547639 6458116 6300405 6203402 6313430 6513375 6490966 6409772 6757761
15752F757761l62361j63783J65016k05488O7155k4341L20775m3943k75256K68957
$$ 6757761 6395400 6231617 6396633 6191145 6258300 6233959 6554734 6510791 6235535 6504492
15742F504492j10992j27813l8059J62015K26390p6334R3292j28777l6020j81287
$$ 6504492 6393500 6265687 6227628 6389643 6616033 6539699 6632991 6504214 6468194 6286907
15732F286907l4733R8653N9246K36059J39749l5118N8986k27710k52514k60756
$$ 6286907 6252174 6350827 6410073 6646132 6785881 6750763 6809749 6582039 6329525 6068769
15722F068769K24037r7137J24680j38874J9490K68523q8930K29038M8166j75304
$$ 6068769 6292806 6195669 6320349 6181475 6200965 6469488 6380558 6609596 6657762 6482458
15712F482458L953J50675k76893q2671L10909K7570k4414j91838p5147J05784
$$ 6482458 6486411 6637086 6360193 6277522 6588431 6616001 6591587 6399749 6324602 6430386
15702F430386J49333k76526l1307J23438K32086K94842j07019j76056R8607k93024
$$ 6430386 6579719 6303193 6271886 6395324 6627410 6922252 6815233 6639177 6737784 6444760
$$ [...]
##END NTUPLES=NMR SPECTRUM
##END=
