##TITLE=31P_DE-80H_X3
 64 sc D2O
 26.2.2025
##JCAMPDX= 6.0         $$ Bruker NMR JCAMP-DX V2.0
##DATA TYPE= NMR FID
##DATA CLASS= NTUPLES
##ORIGIN= UXNMR, Bruker Analytische Messtechnik GmbH
##OWNER= root
$$ XWIN-NMR		Version 3.5
$$ Fri Apr  3 11:34:36 2026 Russian Standard Time (UT+4h)  Yarkov@DPX200
##.OBSERVE FREQUENCY= 81.013821
##.OBSERVE NUCLEUS= ^31P
##.DELAY= (6, 6)
##.ACQUISITION MODE= SIMULTANEOUS
##.ACQUISITION SCHEME= undefined
##.AVERAGES= 64
##.DIGITISER RES= 17
##SPECTROMETER/DATA SYSTEM= spect
##.PULSE SEQUENCE= zgpg30
##.SOLVENT NAME= CDCl3
##.SHIFT REFERENCE= (INTERNAL, CDCl3, 0, 243.863)
##AUDIT TRAIL= $$ (NUMBER, WHEN, WHO, WHERE, WHAT)
$$ ##TITLE= Audit trail, XWIN-NMR		Version 3.5
$$ ##JCAMPDX= 5.01
$$ ##ORIGIN= Bruker BioSpin GmbH
$$ ##OWNER= Yarkov
$$ C:/Bruker/XWIN-NMR/data/yarkov2/nmr/P31/2/audita.txt
$$ ##AUDIT TRAIL=  $$ (NUMBER, WHEN, WHO, WHERE, WHAT)
(   1,<2026-04-03 11:34:02.29 +0400>,<Yarkov>,<DPX200>,
      <created by zg, POWCHK disabled, PULCHK disabled
       configuration hash MD5:
       00 E9 B6 7A A2 85 ED C7 34 08 36 98 17 FE 4E 26
       data hash MD5: 32K
       80 6E 66 BA 1F 06 7A E0 80 AA 4E 41 C0 B3 D5 A8>)
$$ ##END=
$$ 
$$ hash MD5
$$ 1B 65 9A 11 34 31 D8 DF 01 1F 79 6C AD D6 D1 ED
##$RELAX= 
##$RELAX= 
##$RELAX= 
##$RELAX= 
##$RELAX= 
##$RELAX= 
##$RELAX= 
##$RELAX= 
$$ Bruker specific parameters
$$ --------------------------
##$DU= <C:/Bruker/XWIN-NMR>
##$EXPNO= 2
##$NAME= <P31>
##$PROCNO= 1
##$TYPE= <nmr>
##$USER= <yarkov2>
##$AMP= (0..31)
100 100 100 100 100 100 100 100 100 100 100 100 100 100 100 100 100 100 
100 100 100 100 100 100 100 100 100 100 100 100 100 100 
##$AQSEQ= 0
##$AQ_mod= 1
##$AUNM= <au_zg>
##$AUTOPOS= <>
##$BF1= 81.014009
##$BF2= 200.13
##$BF3= 200.13
##$BF4= 200.13
##$BF5= 200.13
##$BF6= 200.13
##$BF7= 200.13
##$BF8= 200.13
##$BYTORDA= 1
##$CFDGTYP= 0
##$CFRGTYP= 5
##$CHEMSTR= <none>
##$CNST= (0..31)
1 1 145 1 1 1 1 1 1 1 1 1 1 1 1 1 1 1 1 1 1 1 1 1 1 1 1 1 1 1 1 1 
##$CPDPRG= <waltz16>
##$CPDPRG1= <>
##$CPDPRG2= <waltz16>
##$CPDPRG3= <>
##$CPDPRG4= <mlev>
##$CPDPRG5= <mlev>
##$CPDPRG6= <mlev>
##$CPDPRG7= <mlev>
##$CPDPRG8= <mlev>
##$CPDPRGB= <>
##$CPDPRGT= <>
##$D= (0..31)
0 1 0 0 0 0 0 0 0 0.06 0 0.03 2e-05 3e-06 0 0 0.0002 0 0 0 0 0 0 0 0 0 
0 0 0 0 0 0 
##$DATE= 1775201641
##$DBL= (0..7)
120 120 120 11 120 120 24 19 
##$DBP= (0..7)
150 150 150 150 150 150 150 150 
##$DBP07= 0
##$DBPNAM0= <>
##$DBPNAM1= <>
##$DBPNAM2= <>
##$DBPNAM3= <>
##$DBPNAM4= <>
##$DBPNAM5= <>
##$DBPNAM6= <>
##$DBPNAM7= <>
##$DBPOAL= (0..7)
0.5 0.5 0.5 0.5 0.5 0.5 0.5 0.5 
##$DBPOFFS= (0..7)
0 0 0 0 0 0 0 0 
##$DE= 6
##$DECBNUC= <off>
##$DECIM= 4
##$DECNUC= <off>
##$DECSTAT= 4
##$DIGMOD= 1
##$DIGTYP= 9
##$DL= (0..7)
0 0 52 120 120 21 21 25 
##$DP= (0..7)
150 150 150 150 150 150 150 150 
##$DP07= 0
##$DPNAME0= <>
##$DPNAME1= <>
##$DPNAME2= <>
##$DPNAME3= <>
##$DPNAME4= <>
##$DPNAME5= <>
##$DPNAME6= <>
##$DPNAME7= <>
##$DPOAL= (0..7)
0.5 0.5 0.5 0.5 0.5 0.5 0.5 0.5 
##$DPOFFS= (0..7)
0 0 0 0 0 0 0 0 
$$ [...]
##$SUBNAM1= <"">
##$SUBNAM2= <"">
##$SUBNAM3= <"">
##$SUBNAM4= <"">
##$SUBNAM5= <"">
##$SUBNAM6= <"">
##$SUBNAM7= <"">
##$SUBNAM8= <"">
##$SUBNAM9= <"">
##$SW= 400.765351723535
##$SWIBOX= (0..15)
0 1 3 0 0 0 0 0 0 0 0 0 0 0 0 0 
##$SW_h= 32467.5324675325
##$TD= 32768
##$TD0= 1
##$TE= 0
##$TE2= 300
##$TE3= 300
##$TEG= 300
##$TL= (0..7)
0 120 53 12 22 120 120 120 
##$TP= (0..7)
150 150 150 150 150 150 150 150 
##$TP07= 0
##$TPNAME0= <>
##$TPNAME1= <>
##$TPNAME2= <>
##$TPNAME3= <>
##$TPNAME4= <>
##$TPNAME5= <>
##$TPNAME6= <>
##$TPNAME7= <>
##$TPOAL= (0..7)
0.5 0.5 0.5 0.5 0.5 0.5 0.5 0.5 
##$TPOFFS= (0..7)
0 0 0 0 0 0 0 0 
##$TUNHIN= 0
##$TUNHOUT= 0
##$TUNXOUT= 0
##$USERA1= <user>
##$USERA2= <user>
##$USERA3= <user>
##$USERA4= <user>
##$USERA5= <user>
##$V9= 5
##$VALIST= <valist>
##$VCLIST= <CCCCCCCCCCCCCCC>
##$VD= 0
##$VDLIST= <DDDDDDDDDDDDDDD>
##$VPLIST= <PPPPPPPPPPPPPPP>
##$VTLIST= <TTTTTTTTTTTTTTT>
##$WBST= 1024
##$WBSW= 4
##$XGAIN= (0..3)
0 0 0 0 
##$XL= 0
##$YL= 0
##$YMAX_a= 42077
##$YMIN_a= -55775
##$ZGOPTNS= <>
##$ZL1= 120
##$ZL2= 120
##$ZL3= 120
##$ZL4= 120
##$ABSF1= 60
##$ABSF2= -190
##$ABSG= 5
##$ABSL= 3
##$ALPHA= 0
##$AQORDER= 0
##$ASSFAC= 0
##$ASSFACI= 0
##$ASSFACX= 0
##$ASSWID= 0
##$AUNMP= <proc_1d>
##$AZFE= 0.1
##$AZFW= 0.5
##$BCFW= 1
##$BC_mod= 2
##$BYTORDP= 1
##$COROFFS= 0
##$CY= 9.86611175537109
##$DATMOD= 1
##$DC= 1
##$DFILT= <>
##$DTYPP= 0
##$F1P= 182.462994727601
##$F2P= 168.069089081705
##$FCOR= 0.5
##$FTSIZE= 0
##$FT_mod= 0
##$GAMMA= 1
##$GB= 0
##$INTBC= 1
##$INTSCL= 1
##$ISEN= 30
##$LB= 1.5
##$LEV0= 0
##$LPBIN= 0
##$MAXI= 11.51145
##$MC2= 0
##$MEAN= 0
##$ME_mod= 0
##$MI= 1.244541
##$NCOEF= 0
##$NC_proc= 0
##$NLEV= 6
##$NOISF1= 0
##$NOISF2= 0
##$NSP= 1
##$NTH_PI= 0
##$NZP= 1
##$OFFSET= 243.8632
##$PC= 1.4
##$PHC0= 1739.601
##$PHC1= 73.15952
##$PH_mod= 0
##$PKNL= yes
##$PPARMOD= 0
##$PSCAL= 0
##$PSIGN= 0
##$REVERSE= no
##$SF= 81.0140731611343
##$SI= 65536
##$SIGF1= 0
##$SIGF2= 0
##$SINO= 80
##$SIOLD= 65536
##$SREGLST= <31P.CDCl3>
##$SSB= 0
##$STSI= 0
##$STSR= 0
##$SW_p= 25641.0256410257
##$SYMM= 0
##$S_DEV= 0
##$TDeff= 0
##$TDoff= 0
##$TI= <>
##$TILT= no
##$TM1= 0
##$TM2= 0
##$TOPLEV= 0
##$USERP1= <user>
##$USERP2= <user>
##$USERP3= <user>
##$USERP4= <user>
##$USERP5= <user>
##$WDW= 1
##$XDIM= 64
##$YMAX_p= 0
##$YMIN_p= 0
$$ End of Bruker specific parameters
$$ ---------------------------------
##NTUPLES= NMR FID
##VAR_NAME=  TIME,          FID/REAL,        FID/IMAG
##SYMBOL=    X,             R,               I
##VAR_TYPE=  INDEPENDENT,   DEPENDENT,       DEPENDENT
##VAR_FORM=  AFFN,          ASDF,            ASDF
##VAR_DIM=   16384,         16384,           16384
##UNITS=     SECONDS,       ARBITRARY UNITS, ARBITRARY UNITS
##FACTOR=    3.08e-05,      1,               1
##FIRST=     0,             0,               0
##LAST=      0.5045964,     0,               0
##MIN=       0,             -55775,          0
##MAX=       0.5045964,     42077,           0
$$ Real data points
##PAGE= N=1
##DATA TABLE= (X++(R..R)), XYDATA
$$ plain form
0 0 0 0 0 0 0 0 0 0 0 0 0 0 0 0 0 0 0 0 0 0 0 0 0 0 0 0 0 0 0 1 -1 2 -3 5 -4 5 -7 9 -13 13 -12 13 -13 16 -16 16 -19 24 -25 29
50 29 -28 26 -34 38 -42 52 -60 67 -78 93 -121 159 -223 330 -575 1315 -16150 -55775 -54308 -16577
70 -16577 27464 42077 21833 -17383 -36957 -24639 8205 33977 28375 708 -29287 -33432 -11657
83 -11657 18343 32005 17798 -8149 -24875 -19327 2449 20220 19366 -216 -17311 -19756 -2152
96 -2152 18201 24845 11633 -11832 -26140 -19766 1010 18558 21047 5870 -12576 -18034 -6630
109 -6630 10166 17359 9023 -7517 -19468 -14000 1795 18939 19298 6784 -10353 -17842 -8701 4744
123 4744 13235 8014 -3635 -12721 -8562 1488 13849 11926 514 -11152 -16210 -5568 7525
136 7525 15458 8388 -3132 -10044 -7125 3085 8406 6633 -4575 -13802 -14800 -2429 12383 16072
$$ packed form
0@%%%%%%%%%%%%%%%%%%%%%%%%%%%%%JkLnQrRj2J6k2K6k5K5k6K9l2L2l5M3m9N4
50B9n7N4o0P2q0R4j12J27j45J71k14K80l82N53r05J890j7465l9625J467L7731
70a6577M4041J4613k0244l9216j9574J2318L2844K5772n602k7667k9995m145K1775
83a1657L0000J3662j4207k5947j6726N548K1776J7771q54j9582j7095k445J7604
96b152K0353O644j3212k3465j4308O374K0776J7548K489j5177j8446n458J1404
109f630J6796P193q336j6540j1951N468J5795J7144L59j2514j7137p489R141J3445
123D744Q491n221j1649r086M159J0050J2361j923j1412j1666n058J0642J3093
136G525P933p070j1520o912K919J0210N321j773j1208r227r98J2371J4812L689
$$ plain form
150 16072 11926 -5288 -13122 -11841 -1113 9031 9568 730 -10504 -10941 -2633 10925 17099 6991
164 6991 -4759 -14475 -12820 -1274 10938 13642 5066 -5720 -12155 -3755 6910 12667 6036 -6708
178 -6708 -12947 -13085 -546 12215 14932 6932 -4526 -12612 -8781 85 7302 8773 146 -5952 -6021
193 -6021 -1381 5708 7794 2660 -3972 -7390 -3973 -119 4309 4657 2396 -2852 -2499 -355 3286 1609
209 1609 -1314 -3931 -2927 1389 3934 5302 1626 -2307 -4741 -1786 -476 1327 1560 191 -373 -191
225 -191 2749 3760 3086 -1097 -2941 -3641 -3657 -1480 723 3006 3041 3085 3041 -515 -1187 -2707 -2846 -256
243 -256 1529 1458 290 320 -3110 -811 3446 3373 3650 -2938 -6643 -6245 -1798 5007 7418 5641 386
260 386 -4894 -5947 -2682 1321 4460 2226 -2890 -3992 -4157 1980 5351 5486 311 -4540 -4701 -2247
$$ packed form
150A6072m146j7214p834J281J0728J0144N37q838j1234m37Q308J3558O174j0108
164F991j1750r716J655J1546J2212K704q576j0786o435Q400J0665N757o631j2744
178f708o239j38J2539J2761K717q000j1458q086L831Q866P217J471q627o098o9
193f021M640P089K086n134o632l418L417L854M428L48k261n248L53K144L641j677
209A609k923k617J004M316K545J368l676l933k434K955J310J803K33j369n64J82
225a91K940J011o74m183j844p00j6K177K203K283L5M4m4l556o72j520j39K590
243b56J785p1j168L0l430K299M257p3K77o588l705L98M447O805K411j777n255
260C86n280j053L265M003L139k234n116j102j65O137L371J35n175m851j61K454
$$ plain form
276 -2247 1963 4112 2402 -823 -3039 -1836 595 3154 1900 -1953 -3777 -4762 -881 2976 5549
291 5549 1961 -2397 -4863 -2612 393 3226 2788 -215 -1761 -2149 1602 3610 1008 -924 -6235 -5082
307 -5082 -1026 2611 6100 4021 -132 -3371 -2703 -337 3471 2836 -531 -5091 -4203 -908 3189 6070
323 6070 3126 -1811 -5061 -4070 -448 2033 2846 -99 -2593 -3141 2206 5100 6006 961 -4976 -6714
339 -6714 -4982 2275 7155 5032 -1247 -6903 -4120 910 9104 7452 932 -8298 -10371 -4495 3085
354 3085 12199 7902 147 -9942 -10896 -3413 5985 11750 4771 -4374 -11423 -8080 2725 9291 10189
369 10189 1790 -7385 -11340 -5971 5419 11158 7426 -911 -9178 -7617 -661 7783 7210 892 -5969
384 -5969 -7766 -1829 6561 8410 4614 -5665 -9923 -6642 516 8101 7153 -154 -6511 -7724 -881
$$ packed form
276b247M210K149j710l225k216J203K431K559j254l853j824r85L881L857K573
291E549l588m358k466K251L005K833m38l003j546l88L751K008k602j932n311J153
307e082M056L637L489k079m153l239O68K366L808o35l367m560Q88L295M097K881
323F070k944m937l250R91L622K481Q13k945k494n48N347K894R06n045n937j738
339f714J732P257M880k123o279n656K783N030Q194j652o520r230k073N876P580
354C085R114m297p755j0089r54P483R398N765o979r145p049L343J0805O566Q98
369A0189q399r175l955N369J1390N739l732q337q267J561O956Q444n73o318o861
384e969j797N937Q390J849l796j0279m258L281P158P585r48p307o357j213O843
$$ plain form
399 -881 7185 8620 2444 -7134 -11033 -6048 4028 10942 7990 -824 -8020 -8717 88 7926 9413
414 9413 1842 -7391 -12009 -6154 6290 12558 9798 -2012 -10748 -10226 -1706 7802 10235 3754 -7975
429 -7975 -11860 -7311 4560 12786 9955 624 -12355 -11326 -2987 8198 12768 4525 -3971 -11858
443 -11858 -8420 2931 12151 10573 -162 -9539 -12689 -3465 7921 13270 6827 -4634 -13445 -10449
457 -10449 2100 12631 13639 3636 -9638 -12635 -7781 5511 11276 8801 -2508 -12130 -10772
470 -10772 -1596 9155 11832 5425 -5688 -11932 -9038 1644 10059 9257 -125 -8083 -9827 -1810
484 -1810 6736 9257 5219 -4505 -9767 -6874 2487 9489 7861 1458 -7651 -7239 -382 6672 8050
499 8050 95 -6882 -9792 -4825 4596 7974 6417 -2524 -6874 -6600 -385 7836 8327 1858 -8754
$$ packed form
399h81Q066J435o176r578l899M985J0076O914k952q814p196o97Q805P838J487
414I413p571r233m618N855J2444O268k760j1810q736N22Q520R508K433o481j1729
429g975l885M549J1871Q226k831r331j2979J029Q339J1185M570q243q496p887
443a1858L438J1351R220j578j0735r377l150R224J1386N349o443j1461q811K996
457a0449J2549J0531J008j0003j3274k997M854J3292N765k475j1309r622J358
470a0772R176J0751K677o407j1113o244K894J0682Q415q02r382p958j744Q017
484a810Q546K521m038r724n262K893R361P002j628o403r109M12O857P054J378
499H050p955o977k910M967R421L378j557q941m350K74O215Q221M91o469j0612
$$ plain form
514 -8754 -10513 -4220 5015 11465 6487 -690 -8704 -8963 -3133 6867 9859 3106 -4246 -9941 -4900
529 -4900 2238 8820 7833 645 -6647 -9148 -1549 2895 7748 3303 -3366 -5836 -4838 2103 5605 6270
545 6270 938 -3909 -6138 -1118 5242 4840 2632 -4536 -6675 -5150 1254 5052 5836 826 -5369 -3944
561 -3944 -2953 3083 4604 2971 118 -4527 -3458 -658 4430 5360 1463 -3325 -3693 -3305 -617 2188
577 2188 1763 725 -1282 -1965 30 1756 3490 1999 -438 -3183 -3521 -1242 472 339 1599 742
593 742 429 -615 -1027 -159 -427 -98 449 -570 764 -1497 1540 832 782 1175 679 -1138 -2488 -1918
611 -1918 -901 450 1879 565 772 -1242 278 -27 442 1187 -1086 -915 -2250 -363 124 1330 504
628 504 -1551 745 -18 1024 1040 -97 -1366 -1270 -109 -17 1906 346 -912 -2799 -620 1787 3547
$$ packed form
514h754j759O293R235O450m978p177q014k59N830J0000K992o753p352n695N041
529d900P138O582r87p188p292k501P599M444M853m445o669k470R98O941L502O65
545F270n332m847k229N020O360m02k208p168k139J525O404L798P84n010o195J425
561c944R91O036J521j633k853m645J069K800N088R30l897m788l68L88K688K805
577B188m25j038k007o83J995J726J734j491k437k745l38K279J714j33J260q57
593G42l13j044m12Q68k68L29N47j019J334k261L037p08n0L93m96j817j350N70
611a918J017J351J429j314K07k014J520l05M69P45k273J71j335J887M87J206q26
628E04k055K296p63J042J6j137j269R6J161R2J923j560j258j887K179K407J760
$$ plain form
645 3547 2484 -1270 -3181 -3565 -1976 1827 4227 3259 364 -4269 -4172 251 3978 4415 2648 -2798
661 -2798 -5494 -5366 -37 5204 5939 360 -3252 -5022 -2103 3243 4401 3627 -1108 -3463 -5078 -251
677 -251 4321 5324 2926 -2007 -4406 -1797 936 4235 2147 207 -3763 -2253 464 3080 4220
692 4220 637 -3095 -5932 293 1561 4423 1822 -2853 -4304 -3162 3695 5546 6355 -130 -5835
707 -5835 -6561 -2316 4527 6161 4190 -3039 -6368 -5417 1142 7417 6849 1340 -5038 -6585 -3347 3532
723 3532 5916 2568 -37 -5249 -3190 1394 6140 5092 -708 -4306 -6833 -1433 4080 6909 2742
738 2742 -2586 -5301 -3638 2875 6792 6132 62 -6371 -6865 -3532 3399 5818 3372 -2146 -6551 -5826
754 -5826 1167 5106 6248 1566 -5832 -7695 -3656 3319 7046 4338 -907 -5194 -3204 -721 5068
$$ packed form
645C547j063l754j911l84J589L803K400r68k895m633R7M423L727M37j767n446
661b798k696J28N329N241P35n579l612j770K919N346J158p74m735k355j615M827
677b51M572J003k398m933k399K609K733L299k088j940l970J510K717K616J140
692D220l583l732k837O225J268K862k601m675j451J142O857J851Q09o485n705
707e835p26M245O843J634j971p229l329R51O559O275n68n509o378j547L238O879
723C532K384l348k605n212K059M584M746j048n800l598k527N400N513K829m167
738B742n328k715J663O513L917o60o070o433m94L333O931K419k446n518m405P25
754e826O993L939J142m682p398j863M039O975L727k708n245m287J990K483N789
$$ plain form
769 5068 5088 1586 -4404 -5218 -3238 1123 4823 3365 1414 -3041 -3083 -9 3476 5374 182 -2396
785 -2396 -3986 -2046 3415 3748 3584 -1016 -3736 -4214 1450 3106 2362 -1015 -4843 -3573 -539 4560
801 4560 5306 1804 -3364 -7627 -2972 1860 6950 4275 -2423 -5924 -7096 536 5770 8588 2526
816 2526 -4483 -7284 -6726 2502 6905 6639 -181 -6862 -8022 -3973 5197 8101 5718 -1524 -6664 -7336
832 -7336 151 4621 6572 2832 -3277 -6503 -2985 2931 6157 4562 -1402 -5539 -5488 -1418 4464 5188
848 5188 1947 -5250 -4571 -2256 2591 7707 3565 -986 -6091 -5626 -1291 5244 5489 1456 -2046 -5250
864 -5250 -1430 2261 4852 3581 -1435 -4636 -5576 787 4390 5196 2315 -2725 -3786 -2330 1769 4362
880 4362 2724 -1619 -3700 -4301 -1913 1742 3919 1324 -2001 -3069 -1587 1224 4104 1336 -622
$$ packed form
769E068K0l502n990q14J980M361L700j458j951m455m2L074L485J898n192k578
785b396j590J940N461L33j64m600k720m78N664J656p44l377l828J270L034N099
801D560P46l502n168m263M655M832N090k675o698l501j172P632N234K818o062
816B526p009k801N58R228M403k66o820o681j160M049R170K904k383p242n140o72
832g336P487M470J951l740o109l226L518N916L226j595n964m137N1M070N882P24
848E188l241p197O79K315M847N116m142m551n105M65M335O535K45m033l502l204
864e250L820L691K591j271n016l201r40O363L603Q06k881n040j061J456M099K593
880D362j638m343k081o01K388L655K177k595l325j068J482K811K880k768j958
$$ plain form
895 -622 -2714 -1043 1796 3063 3023 -1225 -2514 -2574 515 3060 3322 1205 -3162 -3859 -2569 662 3932
912 3932 3341 1407 -2492 -4433 -2303 2471 4474 2431 -1073 -4835 -3403 -357 3167 5088 3092
927 3092 -870 -3914 -2913 -613 2493 2060 755 -2187 -2827 -1020 1994 3557 2660 -451 -2275 -2389
943 -2389 -1244 1556 1027 965 -597 -594 331 1158 1887 634 201 -1174 -2648 -401 -168 733 -829 -879 -830
962 -830 255 2027 1209 183 -2208 -2401 -1896 -192 3180 -583 649 -2596 -614 42 1494 3408
978 3408 346 -516 -3292 -1615 -792 323 2632 1073 526 -685 3 308 917 511 -1277 -889 -295
995 -295 -485 -989 -338 -32 1154 1960 1221 132 -1760 -2453 -653 1829 1822 125 -1248 -1026 -671 903
1013 903 2195 3048 -223 -1802 -2326 -596 921 2963 404 -696 -2297 -1002 1008 1022 2132 -1794
$$ packed form
895f22k092J671K839J267m0m248j289o0L089K545K62k117m367o97J290L231L270
912C932n91j934l899j941K130M774K003k043l504l762J432L046L524J921j996
927C092l962l044J001K300L106m33j305k942o40J807L014J563q97l111j824j14
943b389J145K800n29o2j562LR25Q27P29j253m33j375j474K247K33R01j562n0M9
962h30J085J772q18j026k391j93N05J704L372l763J232l245J982O56J452J914
978C408l062q62k776J677Q23J115K309j559n47j211O88L05O09m06j788L88N94
995b95j90n04O51L06J186Q06p39j089j892o93J800K482pj697j373K22L55J574
1013I03J292Q53l271j579n24J730J517K042k559j100j601J295K010J4J110l926
$$ plain form
1029 -1794 -1538 -2810 264 1604 2213 327 -1731 -1770 -1337 1832 2241 2266 -1141 -3190 -3440 -1802 2770
1046 2770 3003 1876 190 -3410 -1214 -91 3739 2485 -246 -2322 -2465 -34 6 3611 897 -855
1062 -855 -2347 -2182 1399 1744 2567 80 -3340 -4213 -246 1729 3262 3860 -1128 -1987 -2360 -314 1725
1079 1725 2489 -1015 -2887 -1161 -1197 954 1457 2205 621 -1472 -740 589 1952 51 -2573 -1604 -1977
1096 -1977 2367 1607 2601 -13 -3423 -4054 -717 2129 4454 1861 -2285 -4146 -4233 902 4679 5301
1112 5301 2215 -3033 -6554 -4746 1371 4605 4469 155 -4243 -5039 -1343 3754 4598 4092 -1263 -4060
1128 -4060 -4605 -1462 4256 4019 2376 -2778 -4515 -2749 1712 4371 3746 -301 -5718 -4473 -72 1523
1144 1523 4802 166 -1718 -4894 -1257 1497 4516 2122 -2041 -4212 -4385 1188 3489 4374 1219
$$ packed form
1029a794K56j272L074J340O09j886k058l9M33L169M09K5l407k049k50J638M572
1046B770K33j127j686l600K196J123L830j254k731k076j43K431M0L605k714j752
1062h55j492J65L581L45Q23k487l420q73L967J975J533N98m988q59l73K046K039
1079A725P64l504j872J726l6K151N03P48j584k093P32J329J363j901k624R69l73
1096a977M344p60R94k614l410o31L337K846K325k593m146j861q7N135L777O22
1112E301l086n248l521J808O117L234j36m314m398p96L696N097Q44n06n355k797
1128d060n45L143N718k37j643n154j737J766M461K659o25m047n417J245M401J595
1144A523L279m636j884l176L637K754L019k394m163k171j73N573K301Q85l155
$$ plain form
1159 1219 -3815 -4130 -3219 3103 3646 2694 -1077 -4939 -4498 -926 3917 5182 2167 -2732 -4697 -2168
1175 -2168 1104 3327 1800 -1260 -3961 -3663 46 2105 3895 642 -1162 -3319 199 2489 1413
1190 1413 780 -2894 -3421 -2927 1550 3489 2884 1006 -2412 -3964 -548 2343 2693 1441 -1827 -4529
1206 -4529 -2366 558 3603 3435 1663 -3626 -4486 -1136 1688 3108 1965 408 -3461 -2425 -117
1221 -117 2972 3648 712 -1422 -4333 -3398 659 2453 2047 284 -2318 -4071 -252 1663 3204 2284
1237 2284 -472 -2625 -3141 614 1708 3542 554 -906 -1812 -587 1220 1049 1714 -1184 -249 -81
1253 -81 125 1303 539 912 -1674 132 949 1752 837 -968 -1297 -2490 -653 879 2916 1240 -1954
1270 -1954 -1831 -3204 289 2644 3458 1116 -2031 -2520 -2008 452 2779 1966 -989 -1436 -2160 -1168 -149
$$ packed form
1159A219n034l15R11O322N43r52l771l862M41L572M843J265l015m899j965K529
1175b168L272K223j527l060k701K98L709K059J790l253j804k157L518K290j076
1190A413o33l674n27M94M477J939o05j878l418j552L416K891L50j252l268k702
1206d529K163K924L045j68j772n289q60L350K824J420j143j557l869J036K308
1221a17L089O76k936k134k911R35M057J794m06j763k602j753L819J915J541r20
1237B284k756k153n16L755J094J834k988j460r06J225J807j71O65k898R35J68
1253h1K06J178p64L73k586J806Q17Q03r15j805l29j193J837J532K037j676l194
1270a954J23j373L493K355Q14k342l147m89N12K460K327q13k955m47p24R92J019
$$ plain form
1287 -149 2128 845 -249 -982 -625 -956 1704 1181 1406 -1049 -407 194 -95 357 -931 -1597 -1403 674
1305 674 1443 1676 57 1280 -1629 -2036 -171 402 1638 774 -1678 -2274 -820 2153 1054 1574 -1260
1322 -1260 -832 -214 -152 851 131 282 -1346 -689 -671 2090 1564 173 1756 -161 497 -1326 -137 -522
1340 -522 -1035 1011 -397 1857 281 -230 -1249 -625 -45 -1331 769 -908 -267 -988 14 1142 830
1357 830 2452 -126 -254 -1776 -838 1242 382 1983 -395 -845 -238 -171 1195 132 1025 -166 36
1374 36 -338 -576 22 724 -114 -148 662 658 -9 -48 -785 -671 938 -84 -320 314 -1839 -415 -383 1366
1394 1366 1480 587 -848 -1641 -1288 45 1289 1228 984 -472 -1051 -1481 219 2260 2074 474 -2153
1411 -2153 -2684 -1975 498 2611 1650 965 -1803 -1758 -196 497 2999 1197 -57 -2556 -1203 -115 1171
$$ packed form
1287a49K277j283j094p33L57l31K660n23K25k455O42O01k89M52j288o66J94K077
1305F74P69K33j619J223k909m07J865N73J236q64k452n96J454K973j099N20k834
1322a260M28O18O2J003p20J51j628O57J8K761n26j391J583j917O58j823J189l85
1340e22n13K046j408K254j576n11j019O24N80j286K100j677O41p21J002J128l12
1357H30J622k578j28j522R38K080q60J601k378m50O07O7J366j063Q93j191K02
1374C6l74k38N98P02q38l4Q10mo67l9p37J14J609j022k36O34k153J424L2J749
1394A366J14q93j435p93L53J333J244o1k44j456n79m30J700K041j86j600k627
1411b153n31P09K473K113r61o85k768M5J562O93K502j802j254k499J353J088J286
$$ plain form
1428 1171 2761 206 258 -1960 914 123 2140 1612 -646 -2020 -1783 40 1667 1816 467 -1328
1444 -1328 -2095 -1473 1625 2203 514 -1751 -2961 -1237 -835 2350 1864 485 -1664 -1660 452 391 2181
1461 2181 854 -1248 -1958 -2449 489 2133 2241 271 -1629 -2119 -1334 601 1712 1281 254 -2602
1477 -2602 -952 1159 1229 1983 809 -468 -2322 -503 2299 293 1052 -1353 -1760 -907 317 3662
1493 3662 1320 88 -4006 -985 -460 2254 1966 1320 -1303 -3060 -963 466 3112 2237 621 -2300
1509 -2300 -3177 -17 980 1796 1316 -1000 -3013 -2603 1962 2347 2876 281 -1573 -3428 -2905 1063 2976
1526 2976 2765 -968 -1620 -2601 -79 2491 1464 801 -1956 -1913 -2414 -241 1649 1389 5 34 -583 850
1544 850 1146 57 -1001 -1251 -1215 -931 1578 1495 1589 -808 -1616 261 377 2249 1071 -439 -2481 -1924
$$ packed form
1428A171J590k555N2k218K874p91K017n28k258j374K37J823J627J49j349j795
1444a328p67O22L098N78j689k265j210J724M02L185m86j379k149MK112o1J790
1461B181j327k102p10m91K938J644J08j970j900m90P85J935J111m31j027k856
1477b602J650K111P0P54j174j277j854J819K802k006P59k405m07Q53J224L345
1493C662k342j232m094L021N25K714k88o46k623j757K097J429K646q75j616k921
1509b300q77L160R97Q16m80k316k013M10M565L85N29k595j854j855N23L968J913
1526B976k11l733o52r81K522K570j027o63k757M3n01K173J890k60j384K9o17J433
1544H50K96j089j058k50L6K84K509q3R4k397q08J877J16J872j178j510k042N57
$$ plain form
1562 -1924 -343 2476 2553 1624 -642 -3952 -2295 232 2419 2092 674 -2973 -2405 -1772 2136 2910 2728
1579 2728 -777 -2348 -1263 -1545 1464 1645 1035 -1462 -2477 -1201 242 4059 1254 160 -1541 -2786
1595 -2786 202 132 3495 -110 -2365 -2282 -2108 1530 1699 2422 -1846 -1709 -2249 -632 764 1911 2397
1612 2397 -1460 -855 -2110 2117 3028 843 732 -1022 -2031 -2216 286 1904 2185 106 -1498 -1268
1628 -1268 -892 2198 2125 13 146 -2000 -287 26 1141 1528 -384 83 -1793 558 -39 -2 -888 765
1646 765 -243 -283 -264 368 185 -1067 479 -461 1724 1762 79 -1273 -1583 -163 550 1111 405 240 -718
1665 -718 -966 215 763 1203 -323 -1530 -878 -1217 169 1136 1733 267 -553 -1275 -1402 -207 684 631
1683 631 -231 606 -1335 -836 451 247 314 -195 714 -1098 -101 -773 120 1088 -758 -76 -767 -140 -314
$$ packed form
1562a924J581K819P7r29k266l310J657K527K187l27j418l647N68O33L908P74j82
1579B728l505j571J085k82L009J81o10k497j015J276J443L817k805j094j701j245
1595b786K988p0L363l605k255Q3J74L638J69P23m268J37n40J617J396J147M86
1612B397l857O05j255M227R11k185j11j754j009j85K502J618K81k079j604K30
1628a268L76L090p3k112J33k146J713L13J115L87j912M67j876K351n97L7q86J653
1646G65j008m0J9O32j83j252J546r40K185L8j683j352l10J420P13N61p06j65r58
1665g18k48J181N48M40j526j207O52l39J386R67N97j466q20p22j27J195Q91n3
1683F31q62Q37j941M99J287k04O7n09R09j812R97o72Q93R68j846O82o91O27j74
$$ plain form
1702 -314 306 330 653 -764 -863 -262 -558 -913 -138 440 735 0 269 -1860 -149 1074 -267 -783 -572
1721 -572 -643 -552 93 -1108 686 610 986 275 -536 -430 -1372 785 214 84 639 295 80 -490 41 229
1741 229 722 -651 -166 -876 -1597 -554 144 643 1236 1558 644 1713 -1612 -1051 962 -585 1447 44
1759 44 -210 -751 -1266 -176 394 1088 -556 -226 -1820 -307 -525 -594 780 32 -736 -1348 580 375 763
1778 763 667 -1489 -1168 -376 -720 426 -704 1618 -1662 850 986 1218 1264 -1872 -1494 -2126 590 629
1796 629 1455 548 -989 -1348 -1666 1026 2188 1607 -403 -1332 -882 -1011 1438 1873 2516 77 -1417 -1712
1814 -1712 -1185 1725 1140 567 -572 -1529 -1198 -1449 3302 1263 1401 -1076 -455 -782 181 3179 1775
1831 1775 -68 -157 -243 -1580 -126 827 225 55 9 176 496 171 -670 120 -1512 674 759 710 752 -859
$$ packed form
1702c14O20K4L23j417r9O01k96l55P75N78K95p35K69k129J711J223j341n16K11
1721e72p1R1O45j201J794p6L76p11q11J06r42K157n71j30N55l44k15n70N31J88
1741B29M93j373M85p10p21J043O98M99N93L22r14J069l325N61K013j547K032j403
1759D4k54n41n15J090N70O94j644L30j594J513k18o9J374p48p68o12J928k05L88
1778G63r6k156L21P92l44J146j130K322l280K512J36K32M6l136L78o32K716L9
1796F29Q26r07j537l59l18K692J162n81k010r29M50j29K449M35O43k439j494k95
1814a712N27K910n85n73j139r57L31k51M751k039J38k477O21l27R63K998j404
1831A775j843q9q6j337J454R53o02j70m6J67L20l25q41P90j632K186Q5m9M2j611
$$ plain form
1851 -859 290 70 1205 50 921 -170 -1807 -335 -1454 1490 836 599 -1086 -974 56 -363 1290
1868 1290 -50 -299 -165 -1325 283 291 2048 -181 116 -432 -1025 651 -85 1341 -134 -1424 -1080
1885 -1080 265 837 276 -80 -287 -659 191 262 936 -159 1195 -476 -557 231 1253 1659 122 -24
1903 -24 -1282 -803 -924 1121 1153 525 -1361 -572 141 810 3223 257 -1472 -2160 -2099 1452 702 1991
1921 1991 1182 593 -1377 -1253 373 298 1182 -827 -1011 -1882 -142 -1403 -89 153 -150 -348 -1245 -103
1939 -103 211 -247 -1299 -103 -67 298 1214 229 -161 95 -455 1754 447 690 -1579 -842 -1642 -573
1957 -573 1176 1344 2138 -1368 -1647 -2293 226 1501 703 -281 -1438 -2627 -1226 948 942 2345 962
1974 962 -1814 -1063 -1143 1496 1066 1138 -574 -1731 -816 -644 954 647 293 127 -385 -402 -172 818 -180
$$ packed form
1851h59J149k20J135j155Q71j091j637J472j119K944o54k37j685J12J030m19J653
1868A290j340k49J34j160J608QJ757k229K97n48n93J676p36J426j475j290L44
1885a080J345N72n61l56k07l72Q50P1O74j095J354j671q1P88J022M06j537j46
1903b4j258M79j21K045L2o28j886P89P13O69K413k966j729o88O1L551p50J289
1921A991q09n89j970J24J626p5Q84k009j84q71J740j261J314K42l03j98q97J142
1939a03L14m58j052J196L6L65R16r85l90K56n50K209j307K43k269P37q00J069
1957e73J749J68P94l506k79o46K519J275p98r84j157j189J401K174oJ403j383
1974I62k776P51q0K639m30P2j712j157R15J72J598l07l54j66n12j7K30R90r98
$$ plain form
1993 -180 -696 179 -1388 -696 201 780 -108 528 -1462 70 1381 501 628 -2025 -702 320 1083 772
2011 772 1234 -135 -436 194 -462 -77 643 550 -309 -714 -190 -480 727 900 -603 -726 -920 -1336 -497
2030 -497 382 744 537 -490 134 -676 -166 623 -1027 -102 -2131 194 -851 693 785 230 1138 -910
2048 -910 1367 -925 138 -1149 -795 -250 -903 609 604 644 111 -1007 -210 303 928 273 1017 -1320 -1272
2067 -1272 5 -525 1421 1158 590 -407 -854 -974 -994 713 -219 1217 -1151 -547 417 -145 1088 438
2085 438 711 -25 -911 364 39 472 -3 -750 -482 -375 160 613 -125 331 9 159 937 -1191 -1531
2104 -1531 -764 878 1043 109 -108 -602 -768 7 316 1348 1942 -1225 -909 -174 -761 76 215 1224
2122 1224 -173 -54 -915 -622 -504 -436 -249 -393 -542 526 16 -215 -535 286 468 669 -404 -1473 -118
$$ packed form
1993a80n16Q75j567O92Q97N79q88O36j990J532J311q80J27k653J323J022P63l11
2011G72M62j369l01O30o56L85P20r3q59m05N24k90J207J73j503j23j94m16Q39
2030d97Q79L62k07j027O24q10N10P89j650R25k029K325j045J544R2n55R08k048
2048i10K277k292J063j287L54N45o53J512nM0n33j118P97N13O25o55P44k337M8
2067a272J277n30J946k63n68r97m47j20k0J707r32J436k368O04R64n62J233o50
2085D38K73p36q86J275l25M33m75p47K68J07N35M53p38M56l22J50P78k128l40
2104a531P67J642J65r34k17m94j66P75L09J032N94l167L16P35n87Q37J39J009
2122A224j397J19q61K93J18O8J87j44j49J068n10k31l20Q21J82K01j073j069J355
$$ plain form
2141 -118 -245 1037 -225 1188 -246 -135 -329 -1243 -395 1290 356 -733 -741 -360 -924 -1151 217 512
2159 512 -660 -93 -1013 -420 1322 732 1131 -926 -1102 -524 325 599 224 725 -573 -1415 -1459 649 802
2178 802 231 526 -1590 672 149 -106 590 -245 -823 -493 -136 -282 358 1033 -77 201 -970 477
2196 477 1232 1457 -314 -610 -1605 -151 781 1207 1190 346 -1169 -2052 -241 -69 1572 692 666 -845 -856
2215 -856 183 246 691 855 396 104 -1491 566 784 1312 400 -555 -406 -1694 432 -610 916 -15
2233 -15 -56 1225 -129 1430 -8 1102 -1426 -715 162 361 1906 -1482 -538 -16 -240 916 675 -131
2251 -131 -1579 599 -566 1414 1158 525 1608 -1246 19 -235 142 -18 1015 0 -1049 -1344 140
2268 140 483 1915 -64 -337 -1425 -966 1155 1046 508 -498 -923 -191 -145 874 2155 -201 -401 -1161
$$ packed form
2141a18j27J282j262J413j434J11j94r14Q48J685r34j089qL81n64k27J368K95
2159E12j172N67r20N93J742n90L99k057j76N78Q49K74l75N01j298q42m4K108J53
2178H02n71K95k116K262n23k55O96q35n78L30L57j46O40O75j110K78j171J447
2196D77P55K25j771k96r95J454R32M26j7q44j515q83J811J72J641q80k6j511j1
2215h56J039O3M45J64m59k92j595K057K18N28r12r55J49j288K126j042J526r31
2233a5m1J281j354J559j438J110k528P11Q77J99J545l388R44N22k24J156k41q06
2251a31j448K178j165J980k56o33J083k854J265k54L77j60J033j015j049k95J484
2268A40L43J432j979k73j088M59K121j09n38j006m25P32M6J019J281k356k00p60
$$ plain form
2286 -1161 -1134 300 1473 -453 -161 368 -359 -299 509 688 -169 -471 -838 -824 -38 312 -358 -638 -919 -794
2306 -794 1223 895 -395 579 -1364 -1028 152 -660 -77 110 -221 -2003 351 -127 952 874 -698 688
2324 688 -1585 -242 -955 506 107 -789 -148 -480 434 -37 290 1205 -602 -886 -230 1783 850 659
2342 659 -119 -792 -96 -286 1028 74 1359 -343 -524 -212 198 284 189 -123 354 719 -412 1190 495
2361 495 -185 -815 -1212 344 525 1871 204 -307 -644 -391 -723 498 2026 -586 127 -1656 -169
2378 -169 239 1123 1723 327 -528 -413 -1077 -758 518 315 470 449 -714 -556 88 661 -326 -352 424 -418
2398 -418 668 295 410 -312 420 1066 639 554 156 -70 536 -87 571 294 913 -1373 -108 -421 -502 760
2418 760 -1165 508 318 171 -751 991 867 -633 1485 -591 806 289 -762 2241 -327 963
$$ packed form
2286a161K7J434J173j926K92N29p27O0Q08J79q57l02l67J4P86L50o70k80k81J25
2306g94K017l28j290R74j943L36J180q12N83J87l31j782K354m78J079p8j572J386
2324F88k273J343p13J461l99q96O41l32R14m71L27R15j807k84O56K013r33j91
2342F59p78o73O96j90J314r54J285j702j81L12M10Q6r5l12M77L65j131J602o95
2361D95o80o30l97J556J81J346j667n11l37K53l32J221J528k612P13j783J487
2378a69M08Q84O00j396q55J15o64L19J276k03J55k1j163J58O44N73r87k6P76q42
2398d18J086l73J15p22P32O46m27q5l98k26O06o23O58k77O19k286J265l13q1J262
2418G60j925J673j90j47r22J742j24j500K118k076J397n17j051L003k568J290
$$ plain form
2434 963 -485 -192 -1151 -558 831 -142 1427 419 -354 -889 692 -482 39 98 372 535 -80 901
2452 901 211 377 1419 -187 121 287 -545 -1501 579 77 118 -841 -500 838 -407 74 -375 160 468
2471 468 667 -114 98 -179 -262 -129 -724 803 313 -885 69 -1298 482 -246 763 -908 -131 610
2489 610 -1486 1421 -1398 1251 -96 -149 -782 -951 366 -818 121 -360 -110 590 -68 316 -559 621
2507 621 -1196 167 866 -17 113 -1370 352 -370 1070 -632 735 138 -72 192 -677 -168 144 1
2525 1 -919 -636 296 -70 565 -289 684 -275 -424 48 -876 1356 -460 326 870 574 448 -354 628 110
2545 110 639 -288 -1667 -1246 -713 -7 484 392 85 -95 -1590 -518 -90 864 -51 -680 -1170 -2185 146
2564 146 573 1196 634 676 -1139 -1889 968 -146 751 1445 -236 -192 -1767 585 -300 602 247 486 -617
$$ packed form
2434I63j448K93r59N93J389r73J569j008p73n35J581j174N21N9K74J63o15R81
2452I01o90J66J042j606L08J66q32r56K080n02M1r59L41J338j245M81m49N35L08
2471D68J99p81K12k77q3J33n95J527m90j198R54j367J780p28J009j671P77P41
2489F10k096K907k819K649j347n3o33j69J317j184R39m81K50P00o58L84q75J180
2507F21j817J363O99q83J30j483J722p22J440j702J367n97k10K64q69N09L12j43
2525Ar20K83R32l66O35q54R73r59j49M72r24K232j816P86N44k96j26q02R82n18
2545A10N29r27j379M21N33P06M91r2l07j80j495J072M28R54r15o29m90j015K331
2564A46M27O23n62M2j815p50K857j114Q97O94j681M4j575K352q85R02l55K39j103
$$ plain form
2583 -617 -1617 137 -347 1013 -285 448 105 -741 1089 -318 1203 -503 223 95 603 1212 102
2600 102 292 -1023 -149 -174 473 983 46 1394 -1633 -334 108 756 1402 -18 1534 -521 -519 692
2618 692 193 -883 -219 1538 292 768 -327 676 -825 142 1162 -1048 -17 474 496 129 -510
2635 -510 761 604 1047 40 817 -1287 502 762 -297 790 -1501 629 -228 631 798 2288 426
2652 426 -54 -929 -477 1072 947 526 -235 -789 -906 577 13 1181 2176 -1190 -253 -1864 158 -399
2670 -399 394 940 850 -155 -2903 644 -150 762 576 -406 -355 -2613 231 -194 1239 457 -292 211 -1128
2689 -1128 349 -743 654 43 -1417 733 -596 535 -783 -21 517 -291 686 -112 516 -842 -493
2706 -493 -23 22 419 -686 -564 479 -1015 84 -349 1374 218 -879 -724 -336 -690 1197 278 -92
$$ packed form
2583f17j000J754m84J360j298P33l43q46J830j407J521j706P26j28N08O09j110
2600A02J90j315Q74k5O47N10r37J348l027J299M42O48O46j420J552k055KJ211
2618F92m99j076O64J757j246M76j095J003j501R67J020k210J031M91K2l67o39
2635e10J271j57M43j007P77k104J789K60j059J087k291K130q57Q59J67J490j862
2652D26m80q75M52J549j25m21p61n54j17J483n64J168R95l366R37j611K022n57
2670c99P93N46r0j005k748L547p94R12j86r82N1k258K844m25J433p82p49N03j339
2689a128J477j092J397o11j460K150j329J131j318P62N38q08R77p98O28j358L49
2706d93M70M5L97j105J22J043j494J099m33J723j156j097J55L88l54J887r19l70
$$ plain form
2724 -92 -396 -713 885 -91 621 -681 -1648 -1079 -5 -1010 528 899 814 -53 129 218 458 -665 83
2743 83 222 674 110 64 1183 455 -573 345 717 -1079 37 -521 -147 -194 -405 928 -164 1371 -530
2762 -530 1735 -325 61 572 325 369 -1178 -311 -702 -136 -187 20 530 -722 566 814 -778 -346 -442
2781 -442 411 -166 1314 -117 1134 -194 -1115 540 19 1215 -303 -730 -1526 -159 -75 -851 1197
2798 1197 -602 872 774 -657 101 -990 1494 -639 -793 982 1016 -455 689 1088 687 -552 -1671
2815 -1671 -1016 201 770 1113 828 363 -250 506 144 1115 454 893 -364 -1032 -364 -516 683 591 277
2834 277 174 253 -582 -654 -91 112 625 248 1043 163 -1427 364 -583 618 -1215 530 161 -27 -955
2853 -955 344 581 70 1045 -1151 520 1181 -1260 -24 -568 413 -122 323 -1871 -1288 472 -719
$$ packed form
2724i2l04l17J598r76P12j302r67N69J074j005J538L71q5q67J82Q9K40j123P48
2743H3J39M52n64m6J119p28j028R18L72j796J116n58L74m7k11J333j092J535j901
2762e30K265k060L86N11k47M4j547Q67l91N66n1K07N10j252J288K48j592M32r6
2781d42Q53n77J480j431J251j328r21J655n21J196j518m27p96J367Q4p76K048
2798A197j799J474r8j431P58j091K484k133j54J775L4j471J144L99m01j239j119
2815a671O55J217N69L43k85m65o13P56l62R71o61M39j257o68O68j52J199r2l14
2834B77j03P9q35p2N63K03N13l77P95q80j590J791r47J201j833J745l69j88r28
2853i55J299K37n11R75k196J671O61k441J236n44R81n35M45k194N83J760j191
$$ plain form
2870 -719 1403 19 958 -333 -70 1553 209 1013 -227 464 -456 -195 457 334 1463 83 502
2887 502 119 797 406 -1705 -698 -923 395 -840 -301 -109 96 -237 -287 915 29 601 -332 -68 302
2906 302 -252 1181 318 863 -662 490 -290 81 -270 479 -572 -26 512 -1002 1604 -111 -128 -323
2924 -323 208 704 -741 190 -354 727 624 -652 676 -435 -446 -1016 -953 711 -318 1169 -159 320
2942 320 -320 -883 -908 781 736 18 -371 -408 823 -1036 -1465 1287 -918 200 -620 -320 -612 563 1237
2961 1237 332 -268 -601 655 -829 1845 -152 863 -215 -900 25 -807 875 396 139 116 -866 206
2979 206 -212 789 81 376 759 150 297 -654 679 -674 -859 726 -1085 -257 -1752 1132 192 1018
2997 1018 490 112 241 -457 -347 -150 381 -569 -244 -744 -770 -331 -274 981 812 854 -787 -741 -2080 942
$$ packed form
2870g19K122j384R39j291K63J623j344Q04j240O91r20K61O52j23J129j380M19
2887E02l83O78l91k111J007k25J318j235N39J92K05l33n0J202q86N72r33K64L70
2906C02n54J433q63N45j525J152p80L71l51P49j051N46N38j514K606j715j7j95
2924c23N31M96j445R31n44J081j03j276J328j111j1n70O3J664j029J487j328M79
2942C20o40n63k5J689m5p18l89l7J231j859m29K752k205J118q20L00k92J175O74
2961A237r05o00l33J256j484K674j997J015j078o85R25q32J682m79k57k3r82J072
2979B06m18J001p08K95L83o09J47r51J333j353j85J585j811Q28j495K884r40Q26
2997A018n28l78J29o98J10J97N31r50L25n00k6M39N7J255j69M2j641M6j339L022
$$ plain form
3017 942 181 449 954 786 919 -1320 327 302 917 -541 -375 1180 -555 7 323 -132 81 -1308
3035 -1308 1055 -1124 -236 -215 -80 -15 645 131 -1207 1361 -841 286 74 -1410 -146 -1112 762
3052 762 -782 -92 175 -7 842 -1295 1217 -758 -260 67 1682 -63 794 323 -861 -79 -1160
3069 -1160 2 112 -474 625 -447 485 -273 -217 486 -67 1077 -816 961 552 655 -566 455
3086 455 556 -422 -1155 828 -584 595 337 -740 960 169 -33 312 -320 -794 -191 -312 -91 1388
3104 1388 34 -1006 955 950 616 -314 68 -1070 -429 -444 -1195 365 -299 550 -377 219 -224 711 238
3123 238 -744 718 -168 -1358 -631 -687 1377 -240 193 -152 823 437 15 -15 -305 1391 -142 -327 -150
3142 -150 -552 667 235 988 79 874 89 -705 731 -63 1295 -317 518 -55 1136 -767 -53 67
$$ packed form
3017I42p61K68N05j68J33k239J647k5O15j458J66J555j735N62L16m55K13j389
3035a308K363k179Q88K1J35O5O60n14j338K568k202J127k12j484J264r66J874
3052G62j544O90K67j82Q49k137K512j975M98L27J615j745Q57m71j184P82j081
3069a160J162J10n86J099j072R32p58N6P03n53J144j893J777m09J03j221J021
3086D55J01r78p33J983j412J179k58j077J700p91k02L45o32m74O03j21K21J479
3104A388j354j040J961nl34r30L82j138O41j5p51J560o64Q49r27N96m43R35m73
3123B38r82J462q86j190P27n6K064j617M33l45R75l86m22l0k90J696j533j85J77
3142a50m02J219m32P53r09P95p85p94J436p94J358j612Q35n73J191j903P14J20
$$ plain form
3160 67 -370 424 -83 -1049 -210 -413 91 321 1765 -643 -787 -653 252 -317 -536 280 -82 -111 -171 273
3180 273 77 546 460 -251 -196 77 501 572 -30 537 -806 1071 579 -518 -146 1188 -281 30 6 60
3200 60 -101 442 96 -1281 -26 357 408 733 59 8 -500 641 -186 1211 -1056 529 1027 55 1137
3219 1137 -24 853 -483 -395 -70 -1149 331 -193 717 256 762 666 -1107 676 -1989 154 -140 46
3237 46 -341 -451 926 -718 928 -435 125 1005 -77 643 -1169 748 -260 -81 -186 484 -433 -578
3255 -578 295 -413 383 -160 -91 -985 -959 310 1000 318 -836 613 -711 -1985 729 127 -89 856 592
3274 592 -497 -130 414 -147 1218 309 -153 -805 -149 -330 420 -909 175 -21 -1500 -358 1016 625
3292 625 913 221 1000 -1076 -82 -1340 1 -232 93 333 -532 -777 -674 918 -1085 345 -124 656
$$ packed form
3160F7m37P94n07r66Q39k03N04K30J444k408j44J34R05n69k19Q16l62k9o0M44
3180B73j96M69q6p11N5K73M24P1o02N67j343J877m92j097L72J334j469L11k4N4
3200F0j61N43l46j377J255L83N1L25o74n1n08J141q27J397k267J585M98r72J082
3219A137j161Q77j336Q8L25j079J480n24R10m61N06r6j773J783k665K143k94J86
3237D6l87j10J377j644J646j363N60Q80j082P20j812J917j008J79j05O70r17j45
3255e78Q73p08P96n43O9q94K6J269O90o82j154J449j324j274K714o02k16R45k64
3274E92j089L67N44n61J365r09m62o52O56j81P50j329J084j96j479J142J374l91
3292F25K88o92P79k076R94j258J341k33L25K40q65k45J03J592k003J430m69P80
$$ plain form
3310 656 365 -1756 -990 261 69 154 -35 -260 -30 426 -807 119 87 219 -378 -912 1053 -626 964
3329 964 25 405 796 -424 -220 -1182 1104 -877 880 165 -460 -399 -134 337 -593 361 -427 272 525
3348 525 -454 458 -1386 -893 -1002 80 -26 364 494 -783 948 -1156 -105 -966 235 385 -1037
3365 -1037 -701 889 421 61 -499 -792 654 -1430 248 208 0 619 -56 515 669 1142 178 330 -24
3384 -24 -349 1078 -813 189 122 368 301 -217 572 -1773 152 -351 -308 1131 126 892 -164 804 -303
3403 -303 -1435 -29 826 768 -927 -116 -1684 -865 -66 -224 742 -337 978 -1318 56 435 135 1119
3421 1119 391 217 -776 -383 57 -188 379 179 518 -314 -377 -80 -437 295 54 770 -598 524 122
3440 122 878 -104 -521 181 -439 439 -526 533 -266 -90 435 -114 -74 -856 35 -702 130 -393 -194 -784
$$ packed form
3310F56k91k121P66J251j92Q5j89k25K30M56j233R26l2J32n97n34J965j679J590
3329I64r39L80L91j220K04r62K286j981J757p15o25O1K65M71r30R54p88O99K53
3348E25r79R12j844M93j09J082j06L90J30j277J731k104J051q61J201J50j422
3365a037L36J590m68l60n60k93J446k084J678m0k08O19o75N71J54M73r64J52l54
3384b4l25J427j891J002o7K46o7n18P89k345J925n03M3J439j005P66j056R68j107
3403c03j132J406Q55n8j695Q11j568Q19P99j58R66j079J315k296J374L79l00R84
3421A119p28j74r93L93M40k45N67k00L39q32o3K97l57P32k41P16j368J122m02
3440A22P56r82m17P02o20Q78r65J059p99J76N25n49M0p82Q91p37Q32n23J99n90
$$ plain form
3460 -784 17 595 -308 1701 -894 432 -1477 -208 753 -221 607 664 692 -891 332 -888 60 568
3478 568 -633 -349 -1103 -320 -820 -698 -18 -561 827 -1692 -233 -149 262 1029 -325 730 -1453 203
3496 203 -1276 322 -778 -520 -306 -303 1350 -1201 681 -725 -555 -354 -282 506 -148 252 -1162 -257
3514 -257 -575 -632 542 -562 1265 -632 -41 -632 -1194 -306 -52 804 -705 230 467 -13 681 -419
3532 -419 538 -485 -680 -65 -21 17 -217 1494 801 343 354 10 50 39 279 -24 695 -74 518 -237 -724
3553 -724 -363 1564 93 219 -260 -845 -495 -976 1624 -168 1258 937 -227 -35 671 1168 -385 317
3571 317 251 -1241 396 -492 709 -256 -50 185 257 756 -664 859 -65 1114 104 -1255 -15 -147
3589 -147 248 -959 539 -1024 -28 15 -381 1255 192 707 -802 78 -68 -608 309 -256 -69 260
$$ packed form
3460g84Q01N78r03K009k595J326j909J269R61r74Q28N7K8j583J223j220R48N08
3478E68j201K84p54P83n00J22O80n43J388k519J459Q4M11P67j354J055k183J656
3496B03j479J598j100K58K14LJ653k551J882j406J70K01P2P88o54M00j414R05
3514b57l18n7J174j104J827j897N91n91n62Q88K54Q56j509R35K37m80O94j100
3532d19R57j023j95O15M4L8k34J711o93m58J1l44M0j1K40l03P19p69N92p55m87
3553g24L61J927j471J26m79n85L50m81K600j792J426l21j164J92P06M97j553P02
3571C17o6j492J637q88J201r65K06K35P2M99j420J523r24J179j010j359J240j32
3589a47L95j207J498j563R96M3l96J636j063N15j509Q80j46n40R17n65J87L29
$$ plain form
3607 260 6 1196 -608 1201 -258 -565 272 952 -666 -636 110 -546 -825 -703 1298 684 773 401 598
3626 598 976 612 -261 -95 -222 -489 -976 244 -214 -351 456 -27 217 290 10 180 426 -22 -1180 -820
3646 -820 685 -195 -74 758 158 1287 -203 -663 -1225 -188 -208 32 383 -1026 785 -1273 918 633
3664 633 11 -290 -40 522 724 956 -948 -990 134 -269 -388 -231 911 -389 -476 182 196 778 59 -176
3684 -176 -1033 943 -838 12 291 -601 552 -1359 956 -320 362 -863 -517 1109 -917 -500 -71
3701 -71 -145 383 421 0 -1666 -89 -1172 -626 914 484 -686 -537 -68 9 654 -845 405 276 32
3720 32 101 -663 -305 1087 660 519 818 -937 -314 870 -760 59 -3 407 -179 389 -366 301 643 249
3740 249 802 -930 -90 -44 -225 705 -255 285 -108 381 252 832 769 -1351 244 656 273 -978 -310
$$ packed form
3607B60k54J190j804J809j459l07Q37O80j618L0P46o56k79J22K001o14Q9l72J97
3626E98L78l64q73J66j27k67m87J220m58j37Q07m83K44P3k80J70K46m48j158L60
3646h20J505q80J21Q32o00J129j490m60n62J037k0K40L51j409J811k058K191k85
3664F33o22l01K50N62K02K32j904m2J124m03j19J57J142j300q7O58J4N82p19k35
3684a76q57J976j781Q50K79q92J153j911K315j276O82j225L46J626k026M17M29
3701g1p4N28L8m21j666J577j083N46J540m30j170J49M69P7O45j499J250j29k44
3720C2O9p64L58J392m27j41K99j755O23J184j630Q19o2M10n86N68p55O67L42l94
3740B49N53j732Q40M6j81R30r60N40l93M89j29N80o3k120J595M12l83j251O68
$$ plain form
3759 -310 -332 92 661 -940 -216 -482 491 -1164 -68 438 -232 556 -1062 644 88 649 1829 -326
3777 -326 409 -197 935 -2 -216 -24 -1436 -139 -670 353 -613 91 -970 -551 -790 -1019 382 -309
3795 -309 -266 -767 171 -4 1306 -101 -385 514 462 502 277 976 318 742 397 -319 243 -474 480 364
3815 364 -27 -157 -622 -1142 -107 654 1016 682 1207 192 -676 -659 101 -762 -266 -7 -64 63 -811 356
3835 356 -404 618 -551 491 677 -766 -1122 -523 916 -447 644 -865 -1037 1542 -1516 551
3851 551 -380 497 -499 -90 548 322 -687 -1196 125 -2368 -63 -176 -1619 175 -626 1014 -803
3868 -803 346 -251 233 358 -1150 1246 200 113 936 597 -375 -104 951 -116 -98 -880 -466 989
3886 989 -215 666 -747 -149 -874 202 122 161 -369 -843 -1025 -872 663 47 -21 384 -750 -71 -390
$$ packed form
3759c10k2M24N69j601P24k66R73j655J096N06o70P88j618J706n56N61J180k155
3777c26P35o06J132r37k14J92j412J297n31J023r66P04j061M19k39k29J401o91
3795c09M3n01R38j75J310j407k84Q99n2M0k25O99o58M24l45p16N62p17R54j16
3815C64l91j30m65n20J035P61L62l34N25j015q68J7P60q63M96K59n7J27q74J167
3835C56p60J022j169J042J86j443l56N99J439j363J091j509j72K579l058K067
3851E51r31Q77r96M09O38k26j009n09J321k493K305j13j443J794q01J640j817
3868h03J149n97M84J25j508K396j046q7Q23l39r72K71J055j067J8p82M14J455
3886I89j204Q81j413N98p25J076q0L9n30m74j82J53J535o16o8M05j134O79l19
$$ plain form
3905 -390 -216 -369 713 649 -709 -603 319 -170 -435 262 -753 884 -454 297 53 617 559 -84 110
3924 110 -973 -114 -660 -1192 -446 109 208 -879 1508 849 -155 562 -976 682 -1285 841 -323
3941 -323 355 -118 204 768 -1387 117 -280 67 1061 242 202 -64 -278 -854 -932 -665 -409 290 -809 -301
3961 -301 -259 849 -511 124 -333 -84 67 -348 1428 640 344 1275 -1592 -625 873 -269 -431 154
3979 154 -413 -827 355 -1162 -762 154 -242 85 365 680 -728 -445 -1293 155 -596 362 382 324 73
3998 73 -71 -538 37 -47 -838 659 -593 951 4 735 1145 167 966 128 -502 -292 -995 170 -825
4017 -825 11 -176 -658 1245 -549 -42 -124 -92 -783 953 114 1008 265 -904 219 -504 709 -1325
4035 -1325 -241 -373 413 1166 -477 951 -731 789 -531 -231 -306 -65 -219 -257 1054 -104 71 608
$$ packed form
3905c90J74j53J082o4j358J06R22m89k65O97j015J637j338P51k44N64n8o43J94
3924A10j083Q59n46n32P46N55R9j087K387o59j004P17j538J658j967K126j164
3941c23O78m73L22N64k155J504l97L47R94q19m0k66k14n76p8K67K56O99j099N08
3961c01M2J108j360O35m57K49J51m15J776p88k96R31k867R67J498j142j62N85
3979A54n67m14J182j517M00R16l96L27K80L15j408K83q48J448p51R58K0n8k51
3998G3j44m67N75q4p91J497j252J544r47P31M10r78P99q38o30K10p03J165r95
4017h25Q36j87m82J903j794N07q2L2o91J736q39Q94p43j169J123p23J213k034
4035a325J084j32P86P53j643J428j682J520j320L00p5K41j54l8J311j158J75N37
$$ plain form
4053 608 -417 681 -1372 702 70 1068 340 -599 -147 -1698 235 624 986 731 -536 831 -196
4070 -196 446 -405 399 -1097 -1688 -1671 -612 453 196 565 295 552 812 -226 369 -1526 7 120
4088 120 376 470 784 -606 992 252 -353 -1098 -447 93 -1225 -264 -1039 -1441 158 -116 271 -171 -1059
4107 -1059 -31 -1035 -201 -766 1338 -994 -213 154 -1241 -506 -277 126 175 1163 -1808 141 -368 5
4125 5 601 -1296 998 -648 752 -750 -1047 461 -94 656 -1553 218 -301 -650 -364 -1176 -371 -525
4143 -525 614 842 705 -151 -434 271 -1440 965 -728 -599 282 654 -215 -383 -9 -970 -410 -127 801
4162 801 1151 -817 1254 -156 -502 62 80 32 -1606 517 -833 -1073 -938 406 -120 -327 749 -620
4180 -620 -145 -305 -199 27 1349 -831 1042 -81 1501 1351 -340 -574 -170 -6 -84 500 81 400
$$ packed form
4053F08j025J098k053K074o32R98p28r39M52j551J933L89L62k55j267J367j027
4070a96O42q51Q04j496n91J7J059J065k57L69k70K57K60j038N95j895J533J13
4088A20K56R4L14j390J598p40o05p45O51N40j318R61p75m02J599k74L87m42q88
4107a059J028j004Q34n65K104k332P81L67j395P35K29M03M9R88k971J949n09L73
4125EN96j897K294j646J400j502k97J508n55P50k209J771n19l49K86q12Q05j54
4143e25J139K28j37q56k83P05j711K405j693J29Q81L72q69j68L74r61N60K83R28
4162H01L50j968K071j410l46N64J8m8j638K123j350k40J35J344n26k07J076j369
4180f20M75j60J06K26J322k180J873j123J582j50j691k34M04J64p8N84m19L19
$$ plain form
4198 400 777 -533 600 -736 1019 430 -525 238 -237 1192 -156 356 -124 116 887 -553 -213 -91
4216 -91 559 -531 878 -1088 -293 850 -1274 706 -1219 -214 468 -636 1107 -283 481 -310 -1357
4233 -1357 -581 -1089 -357 -23 991 -324 287 739 133 16 664 596 -419 108 -179 -175 774 -469 798
4252 798 -306 627 -1775 -795 481 -787 1142 456 215 -891 390 -1229 -388 1469 456 -402 684
4269 684 -229 -805 -466 63 -187 -549 70 290 -769 745 -937 311 -419 1371 -442 -1173 308 -918
4287 -918 113 -248 1009 466 -392 588 -1 -40 -1320 475 -512 -594 384 -407 1580 151 47 -115 736
4306 736 -7 384 -5 -1543 1316 46 121 -224 -325 711 -506 1288 -363 1021 723 -803 958
4323 958 -804 962 -638 453 -307 268 615 -199 424 -372 -308 -401 -997 224 62 35 823 377 126
$$ packed form
4198D00L77j310J133j336J755n89r55P63m75J429j348N12m80K40P71j440L40J22
4216i1O50j090J409j966P95J143k124J980j925J005O82j104J743j390P64p91j047
4233a357P76n08P32L34J014j315O11M52o06j17O48o8j015N27k87MR49j243J267
4252G98j104R33k402R80J276j268J929o86k41j106J281j619Q41J857j013q58J086
4269F84r13n76L39N29k50l62O19K20j059J514j682J248p30J790j813p31J481j226
4287i18J031l61J257n43q58R80n89l9j280J795r87q2R78p91J987j429j04j62Q51
4306G36p43L91l89j538K859j270P5l45j01J036j217J794j651J384k98j526J761
4323I58j762J766j600J091p60N75L47q14O23p96O4r3n96J221j62k7P88m46k51
$$ plain form
4342 126 607 -173 138 1150 21 350 -254 -187 -1189 -654 336 227 -91 110 -345 287 -29 -243 -102
4361 -102 1043 -702 874 857 550 -8 -486 -726 -907 434 -626 1204 765 101 -922 1194 -17
4378 -17 397 1821 618 346 -113 737 249 -846 277 -387 -260 -697 1201 -80 -71 -611 385 2018 -268
4397 -268 1522 -141 511 -683 -284 926 -847 -942 -881 -79 95 211 815 554 768 -812 107 263 1066
4416 1066 578 -513 -581 -1024 -41 -1391 486 394 440 1270 -312 283 -13 1193 -36 -573 474 -767
4434 -767 1332 -52 -68 816 281 222 -160 -711 -149 659 564 -14 -165 -379 -735 -887 318 378 340 -603 980
4455 980 -769 599 -249 1325 264 509 752 -78 -246 452 906 -100 -615 -672 -862 -92 -616 438
4473 438 1121 -445 697 -1003 915 -559 755 361 -1152 1168 -742 1654 147 -310 651 -767
$$ packed form
4342A26M81p80L11J012j129L29o04O7j002N35R90j09l18K01m55O32l16k14J41
4361a02J145j745J576j7l07n58m78k40j81J341j060J830m39o64j023K116j211
4378a7M14J424j203k72m59Q50m88j095J123o64J27m37J898j281Rn40R96J633k286
4397b68J790j663O52j194L99J210j773r5O1Q02J74J16O04k61K14j580R19J56Q03
4416A066m88j091o8m43R83j350J877r2M6Q30j582N95k96J206j229n37J047j241
4434g67K099j384j6Q84n35n9l82n51N62Q08r5n78j51k14l56j52J205O0l8r43J583
4455I80j749J368q48J574j061K45K43q30j68O98M54j006n15n7j90P70n24J054
4473D38O83j566J142j700J918j474J314l94j513K320j910K396j507m57R61j418
$$ plain form
4489 -767 959 -968 1637 -430 -161 353 -242 847 -99 603 -796 1433 -999 419 644 -291 157
4506 157 32 582 -622 -561 588 550 10 -18 193 -128 223 -701 91 260 -498 626 -24 -120 -61 -279 889
4527 889 -271 -695 348 -325 -429 278 -263 380 391 -884 734 138 -259 -469 -320 -52 262 -340 -233
4546 -233 -151 -989 408 1091 1255 146 279 1024 177 279 -172 1241 624 -394 515 508 -266 -830 224
4565 224 -1182 12 513 -1405 -12 923 956 -780 -264 -767 409 565 499 71 -1492 -541 -744 -1034
4583 -1034 730 -429 77 328 668 -927 115 -171 64 1443 -615 330 -866 -114 -179 -97 468 -1215
4601 -1215 1061 674 -133 -370 -165 -700 -443 1700 -820 -429 101 -908 264 -17 -202 -944 700 16
4619 16 -82 670 -353 252 144 151 -82 -707 -787 587 475 -175 408 -30 -834 -226 512 542 -234 360 938
$$ packed form
4489g67J726j927K605k067K69N14n95J089r46P02j399K229k432J418K25r35M48
4506A57j25N50j204O1J149l8n40k8K11l21L51r24P92J69p58J124o50r6N9k18J168
4527H89j160m24J043o73j04P07n41O43J1j275J618n96l97k10J49K68L14o02J07
4546b33Q2q38J397O83J64j109J33P45q47J02m51J413o17j018R09pp74n64J054
4565B24j406J194N01j918J393R35L3j736N16n03J176J56o6m28j563R51k03k90
4583a034J764j159N06K51L40j595J042k86K35J379k058R45j196P52o5Q2N65j683
4601a215K276l87q07k37K05n35K57K143k520L91N30j009J172k81j85p42J644o84
4619A6r8P52j023O05j08Pk33o25q0J374j12o50N83m38q04O08P38L0p76N94N78
$$ plain form
4640 938 750 -43 372 -822 -160 -227 -492 136 -639 539 -1615 732 284 46 -250 363 915 -317 696
4659 696 -719 4 -1026 -442 -26 -238 914 -38 499 308 -14 1223 -380 -528 -142 2122 -809 185
4677 185 -287 -588 970 -279 1401 -1235 654 -55 -1255 1126 -392 1288 337 -567 -1545 -1040 400
4694 400 137 11 -290 707 404 -1500 884 -254 -36 -380 -407 203 -433 63 70 -632 1141 -313 -347 391
4714 391 -882 322 283 -782 535 -257 190 187 -201 123 -337 1569 1055 -148 217 767 -832 -195 -272
4733 -272 126 -305 -34 529 432 -85 -1997 473 -24 -1154 -484 -63 298 -385 782 -180 527 -70 6
4752 6 299 -921 -23 206 242 664 -801 354 -491 417 -391 188 686 1280 -473 -695 1317 166 -392
4771 -392 497 -285 802 -634 76 -444 -989 59 -623 783 -459 1838 -596 973 587 -1124 823
$$ packed form
4640I38j88p93M15j194O62o7k65O28p75J178k154K347m48k38k96O13N52j232J013
4659F96j415P23j030N84M16k12J152r52N37j91l22J237j603j48L86K264k931R94
4677A85m72l01J558j249J680k636J889p09j200K381j518J680r51r04r78N05J440
4694D00k63j26l01R97l03j904K384j138K18l44k7O10o36M96Pp02J773j454l4P38
4714C91j273J204l9j065J317p92M47ll88L24m60J906n14j203L65N50j599O37p7
4733b72L98m31K71N63r7n17j912K470m97j130O70M21L61o83J167r62P07n97P6
4752FK93j220Q98K29L6M22j465J155q45R08q08N79M98N94j753k22K012j151n58
4771c92Q89p82J087j436P10n20n45J048o82J406j242K297k434J569l86j711J947
$$ plain form
4788 823 -431 -659 -690 -72 481 713 463 593 1010 37 -836 114 376 470 -185 244 -956 -324 -715 707
4808 707 33 -91 277 7 245 347 102 -639 8 -946 -380 -143 10 -383 -62 704 -39 872 -160 163
4828 163 -128 -1024 870 125 274 -1009 623 47 -207 -115 -301 -543 -1530 -462 512 371 603 901 904 -368
4848 -368 239 455 980 778 -970 183 378 699 -529 -1274 -558 -231 553 726 295 -338 299 195 -309
4867 -309 548 -144 657 126 1234 122 -446 137 -743 -14 -1202 835 72 -468 276 235 790 -532 251
4886 251 -347 -108 -392 233 80 210 838 -778 612 -178 -198 -213 -338 -12 47 503 -460 -135 355 481
4906 481 -590 -182 -437 -843 1820 -786 593 -590 466 -501 -748 1135 -899 1482 -900 937
4922 937 988 317 1133 -263 843 -168 454 -52 45 -683 -183 961 -772 583 -183 -1210 -97 617
$$ packed form
4788H23j254k28l1O18N53K32k50J30M17r73q73R50K62R4o55M29j200O32l91J422
4808G07o74j24L68k70K38J02k45p41O47r54N66K37J53l93L21P66p43R11j032L23
4828A63k91q96J894p45J49j283J632n76k54R2j86k42r87J068R74j41K32K98Lj272
4848c68O07K16N25k02j748J153J95L21j228p45P16L27P84J73m31o33O37j04n04
4867c09Q57o92Q01n31J108j112n68N83q80P29j188K037p63n40P44m1N55j322P83
4886B51n98K39k84O25j53J30O28j616J390p90k0j5j25L26N9M56r63L25M90J26
4906D81j071M08k55m06K663k606J379j183J056r67k47J883k034K381k382J837
4922I37N1o71Q16j396J106j011O22n06R7p28N00J144j733J355p66j027J113P14
$$ plain form
4940 617 1356 -630 285 -542 1024 -263 573 41 -606 941 -760 171 30 -450 897 -1022 1487
4957 1487 -1836 96 435 188 -401 -87 -305 -225 1651 -871 -458 290 -148 -561 -711 150 -760 485
4975 485 254 -93 716 231 943 -374 -45 -1132 -929 446 -12 1031 76 1201 -178 -1363 -835 -632
4993 -632 355 -476 -530 242 467 -596 302 388 33 352 1016 174 177 519 -880 -452 -454 -1376 -8 72 774
5014 774 -1472 -283 -128 519 211 -1001 629 -590 678 176 4 1592 -346 -320 -719 547 -781
5031 -781 269 36 -304 -718 672 1156 -662 1326 1064 90 1058 -1391 1262 -763 238 -848 -1037
5048 -1037 152 -695 532 -215 247 -346 1349 -984 385 -102 -980 648 403 -116 -154 -158 -222 -746 1107
5067 1107 337 282 -784 -171 -345 -743 479 -253 569 -1217 352 -312 407 2 -680 -234 -405 402 -408
$$ packed form
4940F17P39j986R15q27J566j287Q36n32o47J547j701R31j41m80J347j919K509
4957A487l323J932L39k47n89L14k18Q0J876k522M13P48m38m13j50Q61r10J245
4975D85k31l47Q09m85P12j317L29j087K03J375m58J043r55J125j379j185N28K03
4993f32R87q31n4P72K25j063Q98Q6l55L19O64q42LL42j399M28kr22J368Q0P02
5014G74k246J189J55O47l08j212J630j219J268n02j72J588j938K6l99J266j328
5031g81J050k33l40m14J390M84j818J988k62r74R68k449K653k025J001j086j89
5048a037J189q47J227p47M62n93J695k333J369m87q78J628k45n19l8mo4n24J853
5067A107p70n5j066O13j74l98J222p32Q22j786J569o64P19m05o82M46j71Q07q10
$$ plain form
5086 -408 -647 186 -337 -516 -149 -451 530 933 72 927 -1052 610 -9 -769 293 -247 -351 -586 -124
5105 -124 100 -444 -773 -61 946 145 243 1260 -938 375 -255 -531 -867 1286 -698 284 232 -1411
5123 -1411 28 1 153 -406 387 880 384 388 -320 63 569 -363 608 97 746 6 -33 -710 77 233 681
5144 681 1411 207 1045 -14 -266 -116 -1117 180 -255 -773 -1105 235 626 389 224 193 1130 -752
5162 -752 -8 483 716 265 -250 827 389 972 -481 -531 492 -407 778 -271 -1537 220 308 -157
5180 -157 -590 -1170 -325 -878 -87 -53 -121 498 -679 12 251 -517 -67 -34 253 -540 -344 76 659 -119 370
5201 370 -20 486 736 -1654 -1099 -69 -103 439 -867 151 -391 512 -749 -990 -58 147 509 -324 1209
5220 1209 -1315 179 336 -1347 97 -166 726 -350 -400 -691 415 511 13 -2 185 -117 14 -58 79
$$ packed form
5086d08k39Q33n23j79L67l02R81M03q61Q55j979J662o19p60J062n40j04k35M62
5105a24K24n44l29P12J007q01R8J017k198J313o30k76l36K153j984R82n2j643
5123a411J439k7J52n59P93M93m96Mp08L83N06r32R71n11O49p40l9o77P87J56M48
5144F81P30j204Q38j059k52J50j001J297m35n18l32J340L91k37j65l1R37j882
5162g52P44M91K33m51n15J077m38N83j453n0J023q99J185j049j266J757Q8m65
5180a57m33n80Q45n53P91L4o8O19j177O91K39p68M50L3K87p93J96M20N83p78M89
5201C70l90N06K50k390N55J030l4N42j306J018n42R03j261k41R32K05L62q33J533
5220A209k524J494J57j683J444k63Q92j076n0k91J106R6m98j5J87l02J31p2J37
$$ plain form
5239 79 -824 1215 -126 -301 -578 -109 233 327 414 -162 1616 -393 519 -80 -1449 678 -243 -728 -321
5258 -321 -727 29 -509 663 1083 -986 -109 -247 -586 -375 -1580 1023 -326 -359 -255 -382 96 -601 1173
5277 1173 -1254 -530 -506 -953 -895 -1016 502 828 401 237 -1250 277 756 -68 -1012 -113 -523 -159 183
5296 183 -1676 1006 -206 1108 276 -686 336 -1059 714 -99 1040 -524 409 364 323 1269 -567
5313 -567 1239 -1027 646 -516 472 331 -521 797 -34 725 -226 -80 1537 -139 662 -220 668 -1010
5331 -1010 19 785 -608 197 239 -178 -362 402 -202 433 958 -897 408 -617 -594 252 403 299 -1024
5350 -1024 -295 -728 836 -248 212 621 -453 243 -34 -369 315 599 148 197 232 542 -50 -677 299
5369 299 -111 1021 -476 259 477 -79 797 89 2008 -48 -914 61 -360 146 -630 1058 -683 586
$$ packed form
5239G9r03K039j341j75k77M69L42R4Q7n76J778k009R12n99j369K127r21m85M07
5258c21m06P56n38J172M20k069Q77j38l39K11j205K603j349l3J04j27M78o97J774
5277A173k427P24K4m47N8j21J518L26m27j64j487J527M79q24r44Q99m10L64L42
5296A83j859K682j212J314q32r62J022j395J773q13J139j564R33m5m1R46j836
5313e67J806k266J673j162R88j41q52J318q31P59r51J46J617j676Q01q82Q88j678
5331a010J029P66j393Q05M2m17j84P64o04O35N25j855J305j025K3Q46J51j04j323
5350a024P29m33J564j084M60M09j074O96k77l35O84K84m51M9L5L10n92o27R76
5369B99m10J132j497P35K18n56Q76p08J919k056q66R75m21N06p76J688j741J269
$$ plain form
5387 586 208 -313 -194 234 -75 -375 1228 -1338 471 1010 -1095 1346 -450 -159 35 542 -1168 -119
5405 -119 373 -1367 460 -695 -46 -313 -256 524 -215 672 -318 -306 -733 467 -224 -850 -946 -252 1017
5424 1017 36 273 435 -9 33 -567 661 195 643 239 -203 150 -822 518 25 860 -270 -983 338
5443 338 -747 -686 -739 -291 -29 1535 59 -1016 -1304 -45 1197 347 126 457 387 373 766 -6 -808
5462 -808 433 -619 -117 -55 -38 809 -398 546 -1015 853 -1401 249 455 -492 -368 -601 1093 -1055
5480 -1055 1542 -564 332 363 -1391 823 -440 1368 -905 1098 -205 -225 522 -244 817 -583 -530
5497 -530 -343 362 96 -994 356 127 128 -911 -287 957 -320 252 566 596 -624 381 347 508 220
5516 220 313 -337 -64 269 -1383 -1000 755 -819 -258 918 262 -606 -475 -483 -201 76 -410 555 109 396
$$ packed form
5387E86l78n21J19M28l09l00J603k566J809N39k105K441j796K91J94N07j710J049
5405a19M92j740J827j155O49k67N7P80p39Q87r90J2m27J200o91o26r6O94J269
5424A017r81K37J62m44M2o00J228m66M48m04m42L53r72J340m93Q35j130p13J321
5443C38j085O1n3M48K62J564j476j075k88J259J242q50k21L31p0j4L93p72q02
5462h08J241j052N02O2J7Q47j207R44j561J868k254J650K06r47J24k33J694k148
5480a055K597k106Q96L1j754K214j263J808k273K003j303k0P47p66J061j400N3
5497e30J87P05k66j090J350k29Jj039O24J244j277N72L14L0j220J005l4J61k88
5516B20R3o50K73L33j652L83J755j574N61J176o56q68J31qK82K77m86R65m46K87
$$ plain form
5536 396 -977 314 -632 -248 -391 -62 283 -156 1270 315 219 48 122 360 97 373 304 697 -541 -29
5556 -29 1419 -225 768 -184 1356 176 287 -37 -253 188 -1450 1274 -82 785 -171 -187 158 -701
5574 -701 568 -363 1242 -1434 -357 535 -141 -9 593 -253 -708 -184 252 -519 754 -458 -269 358
5592 358 -203 -331 -85 172 -1383 995 -562 -933 -1287 528 -936 332 848 -293 764 873 -265
5609 -265 -664 79 768 -889 -537 383 -643 -418 -660 323 218 249 -201 -105 -100 -936 217 650 -564 -297
5629 -297 895 -519 -146 764 23 192 630 35 17 877 952 350 -631 -28 -212 -258 1205 -253 605 97
5649 97 -652 245 -64 681 -1347 59 -714 82 -323 -1024 118 530 850 -1055 637 580 304 268 202 374
5669 374 -216 903 -611 -880 -574 -675 465 -237 431 545 -314 922 -739 -293 -85 217 -1768 -306
$$ packed form
5536C96j373J291r46L84j43L29L45m39J426r55r6j71P4K38k63K76o9L93j238N12
5556b9J448j644R93r52J540j180J11l24k16M41j638K724j356Q67r56j6L45q59
5574g01J269r31J605k676J077Q92o76J32O02q46m55N24M36p71J273j212J89O27
5592C58n61j28K46K57j555K378j557l71l54J815j464J268N16j141J057J09j138
5609b65l99P43O89j657L52R20j026K25k42R83j05L1m50R6Nq36J153M33j214K67
5629b97J192j414L73R10p41J69M38n95j8Q60P5o02r81O03j84m6J463j458Q58n08
5649I7p49Q97l09P45k028J406p73P96m05p01J142M12L20j905J692n7k76l6o6J72
5669C74n90J119j514k69L06j01J140p02O68J14q59J236j661M46K08L02j985J462
$$ plain form
5687 -306 -446 958 -175 -409 -90 -467 1024 275 -1626 340 741 318 -194 338 335 -288 -586 -1801 -893
5706 -893 612 147 -159 -120 -336 -443 -310 144 -837 -643 -500 -339 1134 -763 -374 -307 -750 252 -193
5725 -193 184 -306 197 -656 390 296 -1134 -269 -1457 1677 178 616 -743 -911 744 -783 163 -48
5743 -48 981 -156 155 1106 -2088 717 -1281 873 -653 -991 338 -588 893 -394 1537 299
5759 299 505 261 -861 1104 -544 -101 -1348 -635 1616 -1060 540 -855 644 302 155 843 -495
5776 -495 270 -815 -507 161 1133 -1070 834 1298 -793 -253 -802 716 -479 -615 -73 -120 1187 -163
5794 -163 -177 -46 360 -572 -29 289 -109 46 5 727 -846 392 252 759 -600 -406 -156 -486 51 -701
5814 -701 -1 -828 -623 -735 104 -433 -652 996 -579 4 -149 -351 299 -97 663 -1171 -461 -76 -622
$$ packed form
5687c06j40J404j133k34L19l77J491p49j901J966M01m23n12N32lo23k98j215R08
5706h93J505m65l06L9k16j07J33M54r81J94J43J61J473j897L89O7m43J002m45
5725a93L77m90N03q53J046r4j430Q65j188L134j499M38j359j68J655j527R46k11
5743d8J029j137L11R51l194K805j998K154j526l38J329r26J481j287J931j238
5759B99K06k44j122J965j648M43j247P13K251k676J600j395J499l42j47O88j338
5776d95P65j085L08O68R72k203J904M64k091N40n49J518j195j36N42m7J307j350
5794a63j4J31M06r32N43L18l98J55m1P22j573J238j40N07j359J94K50l30N37p52
5814g01P00q27K05j12Q39n37k19J648j575N83j53k02O50l96P60j834P10L85n46
$$ plain form
5833 -622 -404 -405 92 -345 48 -434 -469 -542 852 -447 -660 726 -638 557 342 -72 1204 -446 1041
5852 1041 -1082 213 -1072 -498 59 -1047 293 146 496 -63 -568 588 -627 766 -330 -277 1121
5869 1121 807 164 -480 -346 -744 -70 -282 882 349 -852 -43 -87 -401 -492 -668 692 -43 341 -660
5888 -660 110 -1262 -285 2 -594 -43 1044 -247 586 1171 -523 628 387 -177 -1017 302 660 -163
5906 -163 1203 -455 378 -1156 186 99 277 -140 -117 -392 -1204 61 -1120 -172 226 -1650 -414 -1224
5924 -1224 -534 -1445 -948 443 523 1974 -965 640 -598 -753 396 257 36 87 770 -617 -633 -154
5942 -154 -1210 1283 -126 943 637 235 -1163 -793 -186 -305 660 -406 -152 -87 -341 -711 -935 353
5960 353 96 -487 34 -60 -234 622 -360 -264 851 -274 225 -176 1107 -15 -466 -344 341 -482 -790
$$ packed form
5833f22K18jM97m37L93m82l5p3J394j299k13J386j364J195k15m14J276j650J487
5852A041k123J295j285N74N57j106J340j47L50n59n05J156j215J393j096N3J398
5869A121l14o43o44J34l98O74k12J164n33j201Q09m4l14r1j76J360p35L84j001
5888f60P70j372R77K87n96N51J087j291Q33N85j694J151k41n64q40J319L58q23
5906a63J366j658Q33j534J342q7J78m17K3k75q12J265j181R48L98j876J236q10
5924a224O90r11M97J391Q0J451k939J605j238j55J149j39k21N1O83j387j6M79
5942a54j056K493j409J069l06m02j398L70O07j19R65j066K54O5k54l70k24J288
5960C53k57n83N21r4j74Q56r82R6J115j125M99m01J283j122m51J22O85q23l08
$$ plain form
5979 -790 -1 -227 390 820 268 902 -31 -576 -142 50 -258 -259 -445 -550 526 1032 693 128 -639 446
5999 446 -159 -224 254 93 -862 -486 302 -79 619 -721 578 -122 -53 307 -473 -301 234 -333 -1292 94
6019 94 -331 -1146 -175 95 1281 369 296 -598 -475 -908 -961 -455 -1164 1803 -1079 180 -559 540 -392
6038 -392 241 1052 -1707 946 -1786 10 286 -516 890 -888 1191 -137 435 302 -1061 966 -191
6055 -191 206 499 493 384 -268 -103 254 801 -376 562 -52 -543 -222 -435 1084 -782 -1015 -820 -778 372
6075 372 411 32 -764 241 -349 906 -351 440 -537 -49 -9 -571 65 -302 -823 77 -260 -1733 -79
6094 -79 -619 219 -395 31 -25 -170 -477 -678 -1394 988 -520 851 481 1485 241 109 545 -406 302
6113 302 -1409 1401 -83 195 1311 -673 858 -1114 -581 -1097 547 477 -1069 228 -770 -169 148
$$ packed form
5979g90P89k26O17M30n52O34r33n45M34J92l08jj86j05J076N06l39n65p67J085
5999D46o05o5M78j61r55L76P88l81O98j340J299p00O9L60p80J72N35n67r59J386
6019I4m25q15R71K70J186r12p3q94J23m33n3N06p09K967k882J259p39J099r32
6038c92O33Q11k759K653k732J796K76q02J406j778K079j328N72j33j363K027j157
6055a91L97K93oj09o52J65L57N47j177R38o14m91L21k13J519j866k33J95M2J150
6075C72L9l79p96J005n90J255j257P91r77M88M0n62O36l67n21R00l37j473J654
6094g9n40Q38o14M26n6j45l07k01p16K382j508J371l70J004j244j32M36r51P08
6113C02j711K810j484K78J116j984J531j972N33n16J644p0j546J297r98O01L17
$$ plain form
6130 148 -784 -470 -169 721 -1249 250 -771 214 1053 171 269 1058 863 -113 731 -736 -343 1212 -314
6149 -314 547 -1144 69 103 -178 -515 -527 -109 -426 519 142 426 229 602 -84 -438 926 -525 -740
6168 -740 -532 -21 810 -85 -146 -45 177 -27 825 -536 563 -1308 -829 655 -690 799 -662 435
6186 435 284 856 592 617 135 -1108 556 -1114 517 73 -477 -150 165 1418 -1448 17 -113 -744
6204 -744 576 -1111 285 -287 -434 -1300 -579 -390 -8 502 -220 437 448 964 397 -659 1239 -795
6222 -795 -103 -798 5 -9 -486 1497 -968 205 99 -1 -10 -363 -88 431 -86 53 1388 -805 371
6241 371 -922 361 -455 -113 1274 673 1207 -363 -173 466 516 -238 -244 330 -185 -14 -67 128 -274 -63
6261 -63 766 395 423 -377 344 -956 -1460 -225 -731 632 -104 1997 839 591 810 -336 -71 -952 141
$$ packed form
6130A48r32L14L01Q90j970J499j021R85Q39q82R8P89j95r76Q44j467L93J555j526
6149c14Q61j691J213L4k81l37j2M18l17R45l77K84j97L73o86l54J364j451k15
6168g40K08N11Q31q95o1J01K22k04Q52j361J099j871M79J484j345J489j461J097
6186D35j51N72k64K5m82j243J664j670J631m44n50L27L15J253k866J465j30o31
6204g44J320j687J396n72j47q66P21J89L82N10p22O57J1N16n67j056J898k034
6222g95O92o95Q03j4m77J983k465J173j06j00rl53K75N19n17J39J335k193J176
6241C71j293J283q16L42J387o01N34j570J90O39N0p54oN74n15J71n3J95m02K11
6261f3Q29l71K8q00P21j300n04J235n06J363p36K101j158k48K19j146K65q81J093
$$ plain form
6280 141 -360 48 60 -763 -24 565 -389 -372 -162 -754 193 238 -622 467 494 280 -277 -365 -230 -130 510
6301 510 132 -355 -427 -33 -350 -738 149 -620 -592 -1180 239 542 1004 1220 -498 41 275 919 121 426
6321 426 314 29 631 -1212 -559 -420 1127 -807 -413 555 -829 -535 90 -919 -492 243 674 0
6339 0 126 -1542 -249 -131 1844 288 36 -1453 -539 -30 -229 -337 -726 68 -707 -257 2 -135 302
6358 302 25 449 -817 -149 209 -746 580 30 700 -437 1174 -37 200 63 -1529 1869 881 -318
6376 -318 -229 -637 494 -1234 520 333 209 782 703 587 399 365 -1074 574 -452 -520 165 -744 296
6395 296 -835 949 -164 192 -921 103 820 -164 1228 -502 977 -129 184 302 376 1191 -286
6412 -286 -41 -368 -663 342 -500 -190 -339 476 -119 10 908 413 28 1200 84 92 1380 -433 93
$$ packed form
6280A41n01M08J2q23P39N89r54J7K10n92R47M5q60J089K7k14n57q8J35J00O40
6301E10l78m87p2L94l17l88Q87p69K8n88J419L03M62K16j718N39K34O44p98L05
6321D26j12k85O02j843O53J39J547j934L94R68j384K94O25j009M27P35M31o74
6339@J26j668J293J18J975j556k52j489R14N09j99j08l89P94p75M50K59j37M37
6358C02k77M24j266O68L58r55J326n50O70j137J611j211K37j37j592L398r88j199
6376c18Q9m08J131j728J754j87j24N73p9j16j88l4j439J648j026o8O85r09J040
6395B96j131J784j113L56j113J024P17r84J392j730J479j106L13J18P4Q15j477
6412b86K45l27k95J005q42L10j49Q15n95J29Q98m95l85J172j116QJ288j813N26
$$ plain form
6431 93 -412 -859 -36 -1575 771 -1198 -1140 -473 124 -867 -513 183 -668 582 -603 564 -510 95
6449 95 -445 -1552 544 -933 -229 -481 174 270 508 283 -334 744 -485 -173 -185 -301 203 18 374
6468 374 -506 -108 -570 -527 114 -686 1396 466 671 -956 73 -244 -681 572 -1131 832 -67 405
6486 405 145 80 -194 -1337 -21 -985 -6 -346 76 -1265 536 1701 299 213 693 628 56 -1312 1497
6505 1497 -237 -795 -372 186 -324 626 -505 -517 344 -1460 -38 -16 321 572 588 -371 -457 324 794 -661
6525 -661 -699 67 -349 -619 336 136 -180 -1145 47 -988 354 661 -1122 1146 108 -829 -1364 429
6543 429 -407 -43 1014 266 745 -304 -1070 273 836 -31 -1411 158 -568 -246 -340 432 352 -171 58
6562 58 -859 749 -566 -29 429 -195 684 -391 301 -725 459 227 35 1182 -270 575 -176 278
$$ packed form
6431I3n05m47Q23j539K346j969N8O67N97r91L54O96q51J250j185J167j074O05
6449I5n40j107K096j477P04k52O55R6K38k25o17J078j229L12j2j16N04j85L56
6468C74q80L98m62M3O41q00K082r30K05j627J029l17m37J253j703J963q99M72
6486D05k60o5k74j143J316r64R79l40M22j341J801J165j402q6M80o5n72j368K809
6505A497j734n58M23N58n10R50j131j2Q61j804J422K2L37K51J6r59q6P81M70j455
6525f61l8P66m16k70R55k00l16r65J192j035J342L07j783K268j038r37n35J793
6543D29q36L64J057p48M79j049p66J343N63q67j380J569p26L22r4P72q0n23K29
6562E8r17J608j315N37M58o24Q79j075O92j026J184k32j92J147j452Q45p51M54
$$ plain form
6580 278 -1198 182 -177 -1016 219 -925 605 -66 269 -169 -402 -104 -1193 43 -110 756 -297
6597 -297 187 513 252 403 316 -423 -176 -60 442 -115 -691 152 -491 55 -351 -227 254 607 175 -630
6617 -630 -730 323 -579 -493 -342 996 -469 -760 127 -370 54 -1037 -348 -343 794 681 141 914 -244
6636 -244 -427 346 -232 -112 -860 288 -460 17 43 507 689 252 468 -452 532 -576 739 432 37
6655 37 1370 -1222 1101 -887 271 -439 -893 201 -713 -278 -604 -45 143 868 199 -1516 697 -565
6673 -565 1057 -1053 -200 1225 389 959 123 302 -512 -178 -657 -541 -584 -411 862 -719 -44 -481 -701
6692 -701 562 -128 491 369 766 43 377 -865 1242 444 453 188 -51 621 -133 -539 258 662 -401
6711 -401 1100 134 -372 932 -461 1064 -276 30 436 -76 -442 -120 604 224 -1241 -1807 482 245
$$ packed form
6580B78j476J380l59q39J235j144J530o71L35m38k33K98j089J236j53Q66j053
6597b97M84L26k61J51q7p39K47J16N02n57n76Q43o43N46m06J24M81L53m32q05
6617f30j00J053r02Q6J51J338j465k91Q87m97M24j091O89NJ137j13n40P73j158
6636b44j83P73n78J20p48J148p48M77K6M64J82m37K16r20R84j108J315l07l95
6655C7J333k592K323j988J158p10m54J094r14M35l26N59J88P25o69j715K213j262
6673e65J622k110Q53J425q36N70q36J79q14L34m79J16m3J73J273j581O75m37k20
6692g01J263o90O19j22L97p23L34j242K107p98Rk65k39O72p54m06P97M04j063
6711d01J501r66n06J304j393J525j340L06M06n12l66L22P24l80j465n66K289k37
$$ plain form
6729 245 -853 -687 271 -523 -316 -952 827 -1923 1477 -933 467 -171 38 816 -402 1478 -1161
6746 -1161 1172 -146 -1386 -201 -405 102 -68 712 -409 377 52 -855 455 -278 1950 -605 47
6763 47 368 -379 -30 -1149 365 -148 376 -619 380 638 -678 128 267 667 237 -570 23 -261 717
6782 717 -370 365 450 198 -1760 -962 255 -178 236 377 268 -233 496 370 -700 -1044 -605 680 -708
6801 -708 -23 108 -638 -539 -339 349 -1489 359 -603 395 -744 -750 239 -54 222 -52 -215 -732 472 -437
6821 -437 -354 589 -953 39 -40 687 -592 526 20 -520 578 -688 -159 -313 -77 744 -912 -91 -434
6840 -434 608 -712 -658 906 393 306 595 455 -256 254 -58 683 378 -400 -395 -949 -222 300 239 878 -727
6861 -727 805 -2157 759 386 373 -111 -92 -741 -1113 -465 423 184 -683 1 1018 -198 778 -817 -518
$$ packed form
6729B45j098J66R58p94K07o36J779k750L400k410J400o38K09P78j218J880k639
6746a161K333j318j240J185k04N07j70P80j121P86l25r07J310p33K228k555O52
6763D7L21p47L49j119J514n13N24r95R99K58j316Q06J39M00m30q07N93k84R78
6782G17j087P35Q5k52j958P98J217m33M14J41j09n01P29j26j070l44M39J285j388
6801g08O85J31p46R9K00O88j838J848r62R98j139oR89k93K76k74j63n17J204r09
6821d37Q3R43j542R92p9P27j279J118n06n40J098j266N29j54K36Q21j656Q21l43
6840d34J042j320N4J564n13q7K89j40p11N10l12P41l05p78Nn54P27N22o1O39j605
6861g27J532k962K916l73j3m84J9o49l72O48Q88k39q67O84J017j216R76j595K99
$$ plain form
6880 -518 617 -862 667 -24 -194 -645 504 256 586 -288 -113 -812 -351 419 90 499 3 -429 -106
6899 -106 -797 670 -882 -414 -1300 -231 -702 160 -887 -251 -319 -1501 -97 -500 654 -1154 -727 1319
6917 1319 -770 458 -521 674 -691 -1171 731 -283 201 -692 1177 144 287 -92 -536 579 -747
6934 -747 1107 -547 -421 455 -68 1262 -700 1496 -1625 283 -369 14 838 -783 1130 -120 581
6951 581 -615 -175 -129 -1389 -865 -667 140 -332 452 -607 -619 652 -794 -38 -894 1763 879 -60 -105
6970 -105 -320 -30 -689 1298 673 -144 -428 -280 -577 -990 -365 67 -193 -1132 322 -41 -220 1126 594
6989 594 1378 -952 137 -319 -271 -609 -852 -957 -891 -26 221 -43 -515 177 262 -989 339 313 1064 -1020
7009 -1020 914 1348 -993 127 670 1826 -890 522 -387 516 344 -1057 86 -303 43 1180 -913
$$ packed form
6880e18J135j479J529o91j70m51J149k48L30q74J75o99M61P70l29M09m96m32L23
6899a06o91J467j552M68q86J069m71Q62j047O36o8j182J404m03J154j808M27K046
6917A319k089J228r79J195j365m80J902j014M84q93J869j033J43l79m44J115j326
6934g47J854j654J26Q76n23J330j962K196l121J908o52L83Q24j621J913j250P01
6951E81j196M40M6j260N24J98Q07m72P84j059j2J271j446P56q56K657q84r39m5
6970a05k15K90o59J987o25q17k84J48k97m13O25M32k60r39J454l63j79J346n32
6989E94P84k330J089m56M8l38k43j05O6Q65K47k64m72O92Q5j251J328k6P51k084
7009a020J934M34k341J120N43J156k716J412r09R03j72j401J143l89L46J137k093
$$ plain form
7026 -913 -53 -209 201 -607 -609 -595 -390 -11 -896 748 -566 408 -430 -1269 675 -630 1551 -270 261
7045 261 330 -310 -683 38 965 -34 728 -1173 -508 -706 359 -208 -504 420 58 398 64 -15 145 746
7065 746 -249 -746 1017 -570 -166 -969 -230 -395 -1029 399 171 -275 -756 927 -439 710 -706 315
7083 315 229 615 1276 -108 897 -720 343 456 -236 -473 -1130 439 381 278 372 -189 656 -647 1565
7102 1565 817 113 95 -822 1168 -1587 939 -562 1114 -146 790 610 -1751 -261 -913 1494 -937
7119 -937 530 286 -599 1514 -975 227 -685 339 -897 -1326 275 -324 -588 713 290 506 -1297
7136 -1297 671 -931 620 -849 -302 257 -287 -329 -1110 609 -508 556 -348 -297 -1075 -313 1 88
7154 88 -527 -213 -877 -327 856 771 -36 198 175 784 -381 806 -94 -7 -662 126 748 50 -82 -292
$$ packed form
7026i13Q60j56M10q08kJ4K05L79q85J644j314R74q38q39J944j305K181j821N31
7045B61O9o40l73P21R27r99P62j901O65j98J065n67k96R24l62L40l34p9J60O01
7065G46r95m97J763j587M04q03P39j65o34J428k28m46m81J683j366J149j416J021
7083C15q6L86O61j384J005j617J063J13o92k37o57J569n8j03R4n61Q45j303K212
7102A565p48p04j8r17J990k755K526j501J676j260R36j80k361J490o52K407k431
7119i37J467k44q85K113k489J202r12J024j236m29J601n99k64J301m23K16j803
7136a297J968j602J551j469N47N59n44m2p81J719j117J064r04N1p78P62L14Q7
7154H8o15L14o64N50J183q5q07K34k3O09j165J187r00Q7o55P88O22o98j32k10
$$ plain form
7174 -292 864 -815 874 564 -185 674 -471 -149 -901 1483 -547 220 279 -143 5 87 638 335 1061
7193 1061 48 216 41 -108 19 -85 714 451 -304 443 -1033 484 -256 873 268 -1005 964 60
7211 60 643 -696 1183 1263 -136 17 -194 912 -128 1051 527 42 773 73 322 -558 262 -1108
7229 -1108 -59 237 -801 -1538 -1431 -18 -231 749 -851 -47 319 -563 12 -121 5 -1174 -48 -162
7247 -162 303 854 386 -38 -848 709 390 1554 -597 65 316 -1075 757 -531 1428 -279 304
7264 304 130 -473 1415 -522 749 38 1344 701 253 541 -811 355 -892 19 -503 -586 -322 390
7282 390 415 -915 306 560 -161 -225 -885 1510 -1780 -380 85 -370 -152 -880 890 -950 38 1026
7300 1026 1272 -1268 -15 1009 -535 1489 -1398 298 248 -142 1256 -269 804 -744 1133 -434
$$ packed form
7174b92J156j679J689l10p49Q59j145L22p52K384k030P67N9m22J48Q2N51l03P26
7193A061j013J68j75j49J27j04P99k63p55P47j476J517p40J129o05j273J969r04
7211F0N83j339J879Q0j399J53k11J106j040J179n24m85P31p00K49q80Q20j370
7229a108J049K96j038p37J07J413k13R80j600Q04L66q82N75j33J26j179J126j14
7247a62M65N51m68m24q10J557l19J164k151O62K51j391J832j288J959j707N83
7264C04j74o03J888j937J271p11J306o43m48K88j352J166j247R11n22q3K64P12
7282C90K5j330J221K54p21o4o60K395l290J400M65m55K18p28J770j840R88R88
7300A026K46k540J253J024j544K024k887J696n0l90J398j525J073j548J877j567
$$ plain form
7316 -434 -713 -539 -465 1793 -59 242 -324 -820 231 -103 -191 280 802 -531 -410 481 -241 402 -699
7335 -699 -518 -747 964 158 376 -358 300 21 -305 616 468 342 206 935 80 -164 1017 266 809
7354 809 -777 59 41 575 -144 -1698 -247 -111 -85 -369 374 551 -338 277 -204 1157 -143 536 19
7373 19 954 -46 -1204 707 -1060 919 -118 -435 362 -708 890 -1018 233 126 637 -1107 636
7390 636 1491 -503 458 -725 -919 -98 538 1060 -316 258 -477 1017 916 -26 -444 -787 705 -749
7408 -749 27 -320 143 -1257 15 535 -329 464 -600 89 112 -470 -241 213 813 -684 -527 -305 -17
7427 -17 154 -37 535 -702 365 -565 -173 503 235 6 109 231 -837 33 428 -248 96 834 1089
7446 1089 -500 395 -189 590 -152 171 239 -115 -153 -648 683 33 761 -549 -543 498 -752 776 -265
$$ packed form
7316d34k79J74P4K258j852L01n66m96J051l34q8M71N22j333J21Q91p22O43j101
7335f99J81k29J711q06K18p34O58k79l26R21j48j26j36P29q55k44J181p51N43
7354H09j586Q36j8N34p19j554J451J36K6k84P43J77q89O15m81J361j300O79n17
7373A9R35j000j158J911j767J979j037l17P97j070J598j908J251j07N11j744J743
7390F36Q55j994R61j183j94Q21O36N22j376N74p35J494j01r42m18l43J492j454
7408g49P76l47M63j400J272N20q64P93j064O89K3n82K29M54O00j497J57K22K88
7427a7J71j91N72j237J067r30L92O76k68k29J03J22j068Q70L95o76L44P38K55
7446A089j589Q95n84P79p42L23O8l54l8m95J331o50P28j310OJ041j250J528j041
$$ plain form
7465 -265 79 -158 142 404 -106 337 -404 980 -795 992 832 -1372 -190 -1242 603 -187 700 590
7483 590 -489 -140 -825 604 -1125 69 361 -777 439 -138 178 -402 40 -636 428 -381 -515 238
7501 238 -311 298 -411 515 -657 368 -395 -544 -647 -1316 719 898 647 402 -955 190 -407 28
7519 28 -1041 590 -53 -9 490 678 29 -385 366 -197 -194 425 -260 250 193 -220 -904 863 -939 -84
7539 -84 -556 4 30 -1453 162 -1883 -217 -1516 445 -227 -1462 1105 -853 250 -1061 345 256
7556 256 136 953 -548 7 -826 460 568 258 148 17 1149 -68 1098 -471 -493 651 -364 894
7574 894 -1536 449 -770 -104 -410 -199 -417 -734 605 -493 -459 1054 -671 497 12 1517 -1302
7591 -1302 -151 260 -474 737 -262 370 -1067 -148 -69 67 320 911 -956 -810 -679 -360 873 430
$$ packed form
7465b65L44k37L00K62n10M43p41J384j775J787j60k204J182j052J845p90Q87j10
7483E90j079L49o85J429j729J194K92j138J216n77L16n80M42o76J064q09j34P53
7501B38n49O09p09R26j172J025p63j49j03o69K035J79k51k45j357J145n97M35
7519B8j069J631o43M4M99J88o49m14P51n63LO19o85N10n7m13o84J767j802Q55
7539h4m72N60K6j483J615k045J666j299J961o72j235K567j958J103j311J406q9
7556B56j20Q17j501N55q33J286J08l10j10j31J132j217J166j569k2J144j015J258
7574H94k430J985j219O66l06K11k18l17J339j098L4J513j725J168m85J505k819
7591a302J151M11p34J211r99O32j437R19P9J36K53N91j867J46J31L19J233m43
$$ plain form
7609 430 -350 -147 -74 395 -680 -371 783 846 -754 -69 -444 102 270 450 179 -891 -136 38 -205
7628 -205 653 -664 525 -275 1983 219 -220 416 -622 1056 -638 1212 52 503 172 -978 1
7645 1 188 814 -629 1227 -67 -759 -17 -646 377 -181 -14 -973 -218 625 -7 63 -721 -48 -739 465
7665 465 -68 -551 -36 -1406 325 -245 654 -235 -630 -173 -288 1218 -427 -69 143 136 427 -634 519
7684 519 135 1620 888 993 -179 -139 -828 325 43 239 465 -126 -354 964 -883 -133 639 513 47
7703 47 602 -381 297 965 143 -127 181 327 149 773 -2 963 -582 -868 -5 -755 839 -1017 280
7722 280 -283 -333 428 -1149 405 -248 296 -72 -595 -683 -563 -266 -988 1106 27 -319 132 -769 1003
7741 1003 -1416 1111 -175 973 -104 -214 809 -117 -107 -436 -169 605 -394 515 -1280 1269 -1103
$$ packed form
7609D30p80K03P3M69j075L09J154O3j600O85l75N46J68J80k71j070P55J74k43
7628b05Q58j317J189q00K258j764m39O36j038J678j694J850j160M51l31j150R79
7645AJ87O26j443J856j294o92P42o29J023n58J67r59P55Q43o32P0p84O73o91J204
7665D65n33m83N15j370J731n70Q99q89l95M57j15J506j645L58K12pK91j061J153
7684E19l84J485p32J05j172M0o89J153k82J96K26n91k28J318j847P50P72j26m66
7703D7N55r83O78O68q22k70L08J46j78O24p75R65j545k86Q63p50J594j856J297
7722B80n63n0P61j577J554o53N44l68n23q8J20K97p22K094j079l46M51r01J772
7741A003k419K527j286J148j077j10J023r26J0l29K67P74r99R09j795K549k372
$$ plain form
7758 -1103 584 -34 -972 444 -853 588 44 1307 -315 1066 -1290 -728 137 521 -440 -100 -689
7775 -689 127 -10 767 -26 -989 134 184 -845 494 -1082 -732 337 -798 87 -255 -617 -309 -118
7793 -118 -92 702 1116 552 806 342 1141 -251 -1502 629 -585 1285 -793 374 -173 -22 -316 -335
7811 -335 789 660 1449 -1446 -141 1351 -825 908 -978 1133 -274 699 -486 -1003 518 -299
7827 -299 1468 -1521 1055 -547 -199 199 -1112 306 -183 1027 -284 -341 -114 1189 277 -727 2121
7844 2121 -1203 854 -575 -46 775 -364 857 -1049 -439 -235 752 -216 -209 293 -347 114 -491 -83
7862 -83 606 172 -328 -368 -83 -902 -178 955 -798 -196 248 1388 -105 -87 726 -1038 -74 -142 235 -649
7882 -649 84 66 1062 530 787 -299 -406 282 -974 205 114 753 -291 -1337 390 681 1078 -768
$$ packed form
7758a103J687o18r38J416j297J441n44J263j622J381k356N62Q65L84r61L40n89
7775f89Q16j37P77p93r63J123N0j029J339j576L50J069j135Q85l42l62L08J91
7793a18K6P94M14n64K54m64P99j392j251K131j214J870k078J167n47J51k94j9
7811c35J124j29P89k895J305J492k176J733j886K111j407R73j185n17J521q17
7827b99J767k989K576j602L48L98j311J418m89J210j311n7K27J303r12j004K848
7844B121l324K057j429N29Q21j139J221j906O10K04R87r68PN02o40M61o05M08
7862h3O89m34n00m0K85q19P24J133j753O02M44J140j493J8Q13j764R64o8L77q84
7882f49P33j8R96n32K57j086j07O88j256J179r1O39j044j046J727K91L97j846
$$ plain form
7900 -768 -134 -191 849 -818 -616 482 -343 662 -312 -85 844 -13 432 7 822 -1104 945 -699
7918 -699 -215 -132 -578 894 -1675 1450 -140 -1078 540 -170 877 -923 476 -367 231 314 -805 936
7936 936 -255 849 -1155 12 -956 323 -18 -210 486 147 689 -547 393 266 933 -327 -484 -811
7954 -811 -1185 -266 -186 1088 -19 1041 -6 -830 -22 -613 300 535 644 121 348 524 302 -191 -923
7973 -923 -1103 -368 406 1138 102 457 294 1553 -288 28 -205 -1013 -390 -313 -349 -1853 835 -495 541
7992 541 851 -480 416 -507 569 281 490 28 -1452 -64 -1194 -251 -179 578 -1169 -545 1370 -100
8010 -100 1217 -1164 336 -208 149 426 -693 512 -26 128 -871 37 240 -679 1241 513 1283 -431
8028 -431 -58 209 -1009 63 -536 -111 -968 451 0 -823 64 -783 500 -412 -230 735 -380 -1340
$$ packed form
7900g68O34n7J040j667K02J098q25J005r74K27R29q57M45m25Q15j926K049j644
7918f99M84Q3m46J472k569L125j590r38J618p10J047j800J399q43N98Q3j119J741
7936I36j191J104k004J167r68J279l41j92O96l39N42j236R40j27O67j260j57l27
7954h11l74R19Q0J274j107J060j047q24Q08n91R13K35J09n23K27J76k22m93p32
7973i23j80P35P74P32j036L55j63J259j841L16k33q08O23P7l6j504K688j330J036
7992E41L10j331Q96r23J076k88K09m62j480J388j130R43P2P57j747O24J915j470
8010a00J317k381J500n44L57K77j119J205n38J54r99R08K03r19J920p28P70j714
8028d31L73K67j218J072n99M25q57J419m51q23Q87q47J283r12J82R65j115r60
$$ plain form
8046 -1340 183 -785 -683 -49 -419 639 -24 528 -879 -410 118 -220 923 219 -87 1024 -202 -160
8064 -160 29 531 -244 365 -306 1305 30 230 -637 -1552 688 -669 930 -280 587 296 -1798 -61
8082 -61 -520 -148 -444 -789 570 -1460 256 -210 446 379 -481 864 81 814 -497 432 -412 662 -268
8101 -268 249 714 -1144 1296 607 -459 -851 -324 -458 -887 354 -400 693 -188 -84 950 361 1555
8119 1555 -1237 157 -425 658 1239 -273 985 -375 1117 -1068 -736 348 1435 432 -94 453
8135 453 -925 270 -209 -97 217 -96 -145 -121 343 138 -36 303 -457 607 -532 -1170 -5 -138 259
8154 259 -29 678 322 403 1119 198 -332 57 436 -454 -140 -991 861 222 1500 -601 -1311 -240 307
8173 307 -501 561 1022 -512 414 94 1135 152 -769 149 99 965 -896 1301 -676 -761 180 -280 453
$$ packed form
8046a340J523r68J02O34l70J058o63N52j407M69N28l38J143p04l06J111j226M2
8064a60J89N02p75O09o71J611j275K00q67r15K240j357J599j210Q67k91k094J737
8082f1m59L72k96l45J359k030J716m66O56o7q60J345p83P33j311R29q44J074r30
8101b68N17M65j858K440o89j066l92N27j34m29J241p54J093q81J04J034n89J194
8119A555k792J394n82J083N81j512J258j360J492k185L32J084J087j003n26N47
8135D53j378J195m79J12L14l13m9K4M64k05j74L39p60J064j139o38J165j33L97
8154B59k88P07l56Q1P16r21n30L89L79q90L14q51J852o39J278k101p10J071N47
8173C07q08J062M61j534R26l20J041r83r21R18n0Q66j861K197j977q5R41m60P33
$$ plain form
8192 453 -225 1372 1158 235 542 -964 -421 -178 -581 -850 396 509 -301 1226 -1188 -397 -394 191 -981
8211 -981 507 319 -1723 23 -497 977 -114 297 511 309 -316 -974 96 611 -528 993 -434
8228 -434 -180 551 -1305 700 -229 312 947 -695 -213 180 -490 -93 418 291 -222 -1151 182 159 656
8247 656 -418 369 666 640 272 453 464 -701 123 -139 1073 591 -18 188 484 345 -1006 426 -6
8266 -6 1139 -349 -821 1596 253 389 -251 296 -6 398 -101 111 127 -1087 775 17 -1074 -20
8284 -20 -182 -206 -63 151 -963 -1242 -179 -685 514 -1200 -214 -571 108 40 345 1425 -34 560 288
8303 288 339 456 106 731 -546 330 -464 -466 140 392 793 -1132 179 -1125 19 -894 -163 1013 -130
8322 -130 244 -472 356 -63 272 225 284 -207 -295 -369 -822 -42 -300 -367 815 -496 603 -696 154 -923
$$ packed form
8192D53o78J597k14r23L07j506N43K43m03k69J246J13q10J527k414P91LN85j172
8211i81J488j88k042J746n20J474j091M11K14k02o25o58J070N15j139J521j427
8228d34K54P31j856K005r29N41O35j642M82L93o70L97N11j27n13r29J333k3M97
8247F56j074P87K97k6l68J81J1j165Q24k62J212m82o09K06K96j39j351J432m32
8266fJ145j488m72K417j343J36o40N47l02M04m99K12J6j214J862p58j091J054
8284b0j62k4J43K14j114k79J063n06J199j714R86l57O79o8L05J080j459N94k72
8303B88N1J17l50O25j277Q76p94kO06K52M01j925J311j304J144r13P31J176j143
8322a30L74p16Q28m19L35m7N9m91q8p4m53P80k58o7J182j311J099j299Q50j077
$$ plain form
8342 -923 962 -422 494 -405 -1333 1434 -1297 1392 -404 1474 -74 134 -390 729 496 -988 1371
8359 1371 918 38 821 -608 924 -264 933 -826 225 -512 250 -250 -703 1489 -312 788 -373
8376 -373 -150 371 562 1081 -247 1313 -748 334 186 -180 597 -137 782 -528 398 -99 -380 925
8394 925 -411 273 -950 816 -342 -307 -150 -1295 517 -351 825 -515 -664 47 331 -1 -297 948
8412 948 60 369 -1184 -258 956 528 729 -178 -193 -192 -950 -1576 424 418 121 617 -519 648 -149 1271
8432 1271 -813 46 668 -805 271 -33 151 -874 469 -890 1468 969 -106 603 -21 417 -419
8449 -419 -762 -164 138 388 -42 832 -1094 210 532 -851 394 -59 706 -419 826 -391 -864 1265
8467 1265 -1149 -210 -307 -829 720 -943 328 -689 1069 691 212 285 1412 1051 -310 267 -1352
$$ packed form
8342i23J885j384R16q99r28K767k731K689j796J878j548K08n24J119k33j484K359
8359A371m53q80P83j429J532j188J197j759J051p37P62n00m53K192j801J100j161
8376c73K23N21J91N19j328J560k061J082j48l66P77p34R19j310R26m97k81J305
8394I25j336O84j223J766j158L5J57j145J812q68J176j340j49P11K84l32k96J245
8412I48q88L09j553R26J214m28K01r07j5Jp58o26K000ok97M96j136J167p97J420
8432A271k084Q59O22j473J076l04J84j025J343j359K358m99j075P09o24M38q36
8449d19l43N98L02K50m30Q74j926J304L22j383J245m53P65j125J245j217m73K129
8467A265k414R39r7n22J549j663J271j017J758l78m79P3J127l61j361N77j619
$$ plain form
8484 -1352 -545 -657 249 653 -546 420 147 1378 167 784 235 -602 -955 -1477 -135 -1033 1075 -845
8502 -845 -656 1340 214 656 -907 633 119 -869 -662 110 -499 492 269 -872 145 -581 -585 180 855
8521 855 -1040 -700 -132 174 92 -819 417 -349 -383 -206 -1307 -569 -636 1039 228 -286 -61 -851 396
8540 396 299 606 -499 358 -68 -255 765 -968 1455 -846 107 75 401 -543 280 261 -772 -192 -169
8559 -169 -458 857 -510 -788 -1027 754 -588 205 -500 207 864 -615 745 -847 716 -743 320
8576 320 764 -681 318 -1449 -584 -1051 -1068 1239 -301 842 -559 223 -214 -1130 330 1025 348 286
8594 286 645 -529 -266 -148 169 499 -423 146 -716 159 -195 45 446 305 -413 -309 61 134 -84 312
8614 312 197 -201 111 431 -635 1132 -262 537 -252 611 468 -754 979 -771 920 189 -503 125
$$ packed form
8484a352Q07j12R06M04j199R66k73J231j211O17n49q37l53n22J342q98K108j920
8502h45J89J996j126M42j563J540n14r88K07P72o09R91k23j141J017p26mP65O75
8521H55j895L40N68L06q2r11J236p66l4J77j101P38o7J675q11n14K25p90J247
8540C96r7L07j105Q57m26j87J020j733K423k301R53l2L26r44Q23j9j033N80K3
8559a69k89J315j367k78k39J781j342P93p05P07O57j479J360j592J563j459J063
8576C20M44j445R99j767Q65m67j7K307j540J143j401P82m37r16J460O95o77o2
8594B86L59j174K63J18L17L30r22N69q62Q75l54K40M01j41p18J04L70P3k18L96
8614C12j15l98L12L20j066J767j394P99p89Q63j43j222J733j750J691p31o92O28
$$ plain form
8632 125 104 520 -1598 815 234 893 1364 56 883 -381 2028 407 -164 -345 46 797 -291 509
8650 509 -1299 159 184 355 -255 -300 661 -806 352 -481 829 -278 93 723 -594 -153 903 525
8668 525 1150 612 101 -1551 204 966 -18 -301 -6 -51 -892 492 26 487 -494 -235 -133 -522 143
8687 143 -712 -191 -497 -1743 -359 -135 85 -105 901 -1379 -66 -1360 737 344 987 -447 506
8704 506 -36 -954 1149 269 1453 283 -578 173 562 415 -625 44 20 117 482 -369 509 -947 906
8723 906 -185 969 -44 204 766 -1542 -637 -1123 280 -515 -404 -504 438 2112 -382 605 -1161
8740 -1161 389 -632 -679 520 -549 1487 1016 -451 1371 241 342 -61 -2 -1 -760 19 -343 -46
8758 -46 -788 508 -283 -650 -279 578 -854 -514 -298 -238 -61 -288 11 102 986 1259 -317 -315 -906 954
$$ packed form
8632A25k1M16k118K413n81O59M71j308Q27j264K409j621n71j81L91P51j088Q00
8650E09j808J458K5J71o10m5R61j467J158q33J310j107L71O30j317M41J056l78
8668E25O25n38n11j652J755P62r84k83K95m5q41J384m66M61r81K59J02l89O65
8687A43q55N21l06j246J384K24K20j90J006k280J313j294K097l93O43j434R53
8704E06n42r18K103q80J184j170q61P51L89j47j040O69k4R7L65q51Q78j456J853
8723I06j091J154j013K48N62k308R05m86J403p95J11j00R42J674k494R87j766
8740a161J550j021m7J199j069K036m71j467J822j130J01m03N9Jp59P79l62K97
8758d6p42J296p91l67L71Q57j432L40K16O0J77k27K99R1Q84K73j576Kn91J860
$$ plain form
8778 954 64 -40 -630 -585 -760 101 198 56 582 -455 191 87 1096 73 -1570 891 557 -323 135
8797 135 -201 900 -132 648 161 -189 274 -399 -26 -1113 399 437 -69 -109 510 -396 -1047 387 -237
8816 -237 989 -117 79 179 -798 -720 -658 578 -33 428 351 30 -294 -1697 237 -837 965 51 1115
8835 1115 -462 -1561 452 -896 -639 -813 -528 -294 99 -140 -1030 387 -917 1403 -302 580 310
8852 310 -740 -236 -1936 595 490 1052 -468 129 611 291 273 1032 1927 7 476 337 260 208 -718
8871 -718 126 679 -363 5 -816 887 617 -84 823 300 653 448 25 -1141 954 33 938 -293
8889 -293 740 101 401 200 316 -486 344 666 320 102 -308 -129 939 27 1070 -482 842 28
8907 28 171 587 -652 624 -631 924 972 341 179 -1317 -264 -127 287 -613 28 482 -56 1351
$$ packed form
8778I54q90j04n90M5j75Q61R7j42N26j037O46j04J009j023j643K461l34q80M58
8797A35l36J101j032P80m87l50M63o73L73j087J512L8n06m0O19r06o51J434o24
8816b37J226j106J96J00r77P8O2J236o11M61p7l21l24j403J934j074J802r14J064
8835A115j577j099K013j348K57j74K85K34L93k39q90J417j304K320j705Q82k70
8852C10j050N04j700K531j05N62j520N97M82l20j8P59Q95j920M69j39p7n2r26
8871g18Q44N53j042L68q21J703k70p01R07n23L53k05m23j166K095r21R05j231
8889b93J033o39L00k01J16q02Q30L22l46k18m10J79J068r12J043j552J324q14
8907B8J43M16j239J276j255J555M8o31j62j496J053J37M14r00O41M54n38J407
$$ plain form
8925 1351 -24 1366 -309 369 184 1152 331 -161 272 -1374 858 -74 114 -87 -887 -431 -61 -414
8943 -414 -31 -75 -744 176 167 -551 607 -574 218 644 -204 -671 -1348 780 -578 405 -983 140 -205
8962 -205 381 -255 301 -5 -328 95 -725 -1030 -626 -881 1232 -376 293 -268 348 203 750 -1117 95
8981 95 -150 -905 487 -1409 412 271 -640 714 -499 965 -613 -840 -846 605 297 -217 8 -583
8999 -583 150 -129 422 183 -476 976 546 -516 -818 523 -228 -155 107 -1140 664 -425 364 -342
9017 -342 -11 401 -530 97 -1101 391 -70 260 -23 -367 509 -855 387 -445 331 342 251 622 792
9036 792 1384 -216 294 -857 -228 -693 -105 331 -63 658 -61 87 -642 878 -164 -212 202 -542 293
9055 293 -377 785 437 -494 450 163 201 -313 -26 -1001 320 -50 -435 135 -966 144 -5 934 131
$$ packed form
8925A351j375J390j675O78j85R68q21m92M33j646K232r32J88k01q00M56L70l53
8943d14L83m4o69R20rp18J158j181P92M26q48m67o77K128j358R83j388J123l45
8962b05N86o36N56l06l23M23q20l05M04k55K113j608O69n61O16j45N47j867J212
8981I5k45p55J392j896J821j41r11J354j213J464j578k27oJ451l08n14K25n91
8999e83P33k79N51k39o59J452m30j062l02J341p51P3K62j247J804j089P89p06
9017c42L31M12r31O27j198J492m61L30k83l44Q76j364J242q32P76J1r1L71J70
9036G92N92j600N10j151O29m65N88M36l94P21p19J48p29J520j042m8M14p44Q35
9055B93o70J162l48r31R44k87L8n14K87r75J321l70l85N70j101J110j49R39q03
$$ plain form
9074 131 -1185 -1099 -576 569 -183 320 -844 -51 50 -1141 557 -638 1473 547 930 -127 -963 782
9092 782 -501 830 -1299 -726 -1068 -642 674 -1483 541 203 619 255 -436 310 -561 -257 97 391
9110 391 555 488 -769 102 -642 -650 596 -164 667 507 544 490 -411 1708 30 949 223 -552 730 167
9130 167 1208 -1406 2 -676 248 -523 -789 272 -800 -344 -725 -829 229 250 -973 -368 -836 132
9148 132 -228 152 -79 -120 -505 -109 -86 68 -260 1105 -560 385 -199 -1813 113 557 216 -500 43
9167 43 288 177 -16 -126 149 310 912 -307 400 -401 -354 1052 -273 1001 -823 361 38 -393 -515
9186 -515 -415 374 -752 1135 -721 636 -982 136 1909 -538 451 -1468 21 395 163 -170 297
9203 297 261 -518 -121 441 -90 342 -368 -125 -685 -663 -444 136 363 -167 303 300 893 521 407 -280 -67
$$ packed form
9074A31j316Q6N23J145p52N03j164P93J01j191J698j195K111r26L83j057q36J745
9092G82j283J331k129N73l42M26J316k157K024l38M16l64o91P46q71L04L54K94
9110C91J64o7j257Q71p44qJ246p60Q31j60L7n4r01K119j678R19p26p75J282n63
9130A67J041k614J408o78R24p71k66J061j072M56l81j04J058K1j223O05m68R68
9148A32l60L80k31m1l85L96K3J54l28J365j665R45n84j614J926M44l41p16N43
9167D3K45j11j93j10K75J61O02j219P07q01M7J406j325J274j824J184l23m31j22
9186e15J00P89j126J887j856J357j618J118J773k447R89j919J489L74k32l33M67
9203B97l6p79L97N62n31M32p10K43n60K2K19N80K27n30M70lN93l72j14o87K13
$$ plain form
9224 -67 594 1360 -408 817 221 395 586 -986 -215 253 -212 562 -658 1353 781 716 917 -202 339
9243 339 -283 -171 -206 211 172 -222 1094 -324 496 37 408 -586 -1411 53 -686 372 -870 495 73
9262 73 759 555 -594 575 -1228 827 -936 136 265 -454 443 -1700 603 558 -437 15 -659 -132
9280 -132 -1140 1037 -1002 747 -1102 891 1117 -496 318 -1542 1139 -1003 -276 -1336 -719 -332
9296 -332 -545 665 -966 -217 698 138 875 9 -242 -1178 483 581 517 225 -1235 330 -1146 1031
9314 1031 592 670 -139 832 1297 133 1339 216 -191 -605 930 159 -280 -379 -109 466 -850 -783 -2058
9333 -2058 620 827 -401 233 -978 261 505 -226 -160 483 368 -880 -70 -716 656 -22 -641 943
9351 943 363 -436 -314 385 -571 781 12 -34 491 -452 871 -118 -345 473 -1 697 -337 673 -639
$$ packed form
9224f7O61P66j768J225n96J74J91j572P71M68m65P74j220K011n72o5K01j119N41
9243C39o22J12l5M17l9l94J316j418Q20m59L71r94q25J464p39J058j242J365m22
9262G3O86k04j149J169j803K055j763J072J29p19Q97k143K303m5r95M52o74N27
9280a32j008K177k039J749j849J993K26j613Q14j860K681k142P27j060O17L87
9296c32k13J210j631P49R15n60P37q66k51r36J661R8o4k92j460J565j476K177
9314A031m39P8q09R71M65j164J206j123m07m14J535p71m39r9K70N75j316O7j275
9333b058K678K07j228O34j211J239K44p31O6O43j15j248Q10o46J372o78o19J584
9351I43n80p99J22O99r56J352p69m6N25r43J323r89k27Q18m74O98j034J010j312
$$ plain form
9370 -639 -339 342 228 -964 -31 1313 -638 -108 -1910 -250 -178 -146 1415 -172 624 -682 -104 -275
9388 -275 640 357 -703 -827 -1465 651 751 -205 869 229 639 -834 338 140 828 153 87 444 -629
9407 -629 704 465 125 -1139 782 135 216 -464 -46 142 -680 -4 348 -282 230 615 -632 -446 -22
9426 -22 -7 401 -664 899 1315 -344 1172 -526 705 265 158 488 57 322 -255 1447 -40 519
9444 519 -930 -92 -166 -249 -564 -1010 -497 -1275 513 -232 102 709 176 837 328 690 1035 72 1342 -1152
9464 -1152 32 -802 806 -752 -48 651 -22 596 -479 546 -560 163 1047 1091 665 599 1403 -235
9482 -235 -326 -415 -349 671 -969 -6 -898 -741 -457 436 456 -120 83 -19 677 -491 506 -524 -115 152
9502 152 -225 -400 -404 438 424 783 -679 -190 -242 226 -373 -510 395 -884 -336 114 149 -1111 -308 1296
$$ packed form
9370f39L00O81j14j192R33J344j951N30j802J660P2L2J561j587P96j306N78j71
9388b75R15k83j060j24o38K116J00r56J074o40M10j473J172j98O88o75o6L57j073
9407f29J333k39l40j264J921o47Q1o80M18J88q22O76L52o30N12L85j247J86M24
9426b2J5M08j065J563M16j659J516j698J231m40j07L30m31K65n77J702j487N59
9444E19j449Q38p4q3l15m46N13p78J788p45L34O07n33O61n09L62L45r63J270k494
9464a152J184q34J608j558P04O99o73O18j075J025j106P23Q84M4m26o6Q04j638
9482b35r1q9O6J020j640R63q92J57K84Q93K0n76K03j02O96j168R97j030M09K67
9502A52l77j75mQ42j4L59j462M89n2M68n99j37R05j279N48M50L5j260Q03J604
$$ plain form
9522 1296 -564 -223 605 -500 -1079 -113 678 -349 572 22 -947 563 478 576 -322 404 366 -206 -100
9541 -100 -777 1242 -1154 202 183 44 -300 -599 277 -780 410 293 1533 -894 -88 -527 -864 319
9559 319 -201 152 -667 -258 -1484 55 293 -177 615 -835 -321 262 -808 538 32 169 -999 517
9577 517 -357 429 984 201 -100 -605 1319 -54 -134 311 -868 471 -89 176 -359 -220 621 570 313
9596 313 723 -119 -635 601 23 226 -299 225 -58 -50 -528 -661 241 -127 -272 808 -254 -492 -1362 93
9616 93 -1160 -1065 55 -1052 121 -425 834 -481 998 -1392 307 -235 -1455 544 -958 453
9632 453 367 652 298 -280 710 -981 -104 -662 173 23 332 -775 -871 441 491 471 -417 -117 381 -1563
9652 -1563 168 -601 119 -944 -256 573 -448 270 -827 893 -65 693 -30 100 39 -184 382 -260
$$ packed form
9522A296j860L41Q28j105n79R66P91j027R21n50r69J510q5R8q98P26l8n72J06
9541a00o77K019k396J356j9j39l44k99Q76j057J190j17J240k427Q06m39l37J183
9559C19n20L53q19M09j226J539K38m70P92j450N14N83j070J346n06J37j168J516
9577E17q74P86N55p83l01n05J924j373q0M45j179J339n60K65n35J39Q41n1k57
9596C13M10q42n16J236n78K03n25N24k83Qm78j33R02l68j45J080j062k38q70J455
9616I3j253R5J120j107J173n46J259j315J479k390J699n42j220J999j502J411
9632D53q6K85l54n78R90j691Q77n58Q35j50L09j107r6J312N0k0q88L00M98j944
9652a563J731p69P20j063O88Q29j021P18j097J720r58P58p23J30o1k23N66o42
$$ plain form
9670 -260 1329 -246 392 -256 -502 -886 -1276 -13 272 -1322 301 -375 557 -121 -230 28 -136 -346
9688 -346 351 657 150 -166 428 565 -664 404 -628 -537 138 -847 -413 -246 605 -547 1282 403 276
9707 276 -130 -727 225 -329 1113 -1119 317 112 1199 78 -215 720 -751 252 -77 -540 1151
9724 1151 -1256 1377 -972 161 553 -518 366 -472 1832 -1154 436 -521 59 572 -250 1246 -1447
9741 -1447 862 -879 -57 263 511 1137 -376 466 -582 -454 123 -562 -339 485 -565 -446 -42 -588
9759 -588 -197 -223 -329 596 -115 198 -736 -371 359 -930 968 217 365 -643 -445 1089 973 295 -599
9778 -599 -404 -450 409 47 -70 -1344 -298 -270 -20 519 -47 1049 -526 1148 -803 550 -661 -23
9796 -23 938 -1125 -211 -190 209 692 541 18 -113 1614 -348 -731 282 939 164 -1550 419 -336 201
$$ packed form
9670b60J589j575O38o48k46l84l90J263K85j594J623o76R32o78j09K58j64k10
9688c46O97L06n07l16N94J37j229J068j032R1O75r85M34J67Q51j152J829q79j27
9707B76m06n97R52n54J442k232J436k05J087j121k93R35j471J003l29m63J691
9724A151k407K633k349J133L92j071Q84q38K304k986J590r57N80N13q22J496k693
9741a447K309j741Q22L20K48O26j513Q42j048J28N77o85K23Q24j050J19M04n46
9759e88L91k6j06R25p11L13r34L65P30j289J898p51J48j008J98J534j16o78q94
9778e99J95m6Q59l62j17j274J046K8K50N39n66J096j575J674j951J353j211O38
9796b3R61k063R14K1L99M83j51n23j31J727j962l83J013O57p75j714J969p55N37
$$ plain form
9815 201 -753 205 1453 -319 1491 -169 297 -1380 208 433 -986 916 -1429 243 239 -44 -331
9832 -331 -253 -103 -260 859 -1244 -125 -285 -59 -20 -451 362 -553 165 -194 -359 409 86 988 -474
9851 -474 -76 82 -609 -95 686 -279 648 25 393 -6 641 687 -519 -1098 29 1322 303 437 11
9870 11 -747 111 81 -366 193 -1083 1336 -441 -1137 135 -23 80 -203 782 456 1118 49 -379 368
9889 368 140 407 -403 991 -720 -113 732 -131 -677 30 1201 -205 323 -567 1190 359 -786 -211
9907 -211 -486 251 -304 449 -296 -275 882 215 -16 -750 -195 8 424 578 613 942 -1040 468 -10 392
9927 392 891 -775 354 -169 433 -1147 568 -88 -159 1797 -820 66 -570 297 916 -325 492 -822
9945 -822 98 -90 -602 82 -242 867 -134 -678 -521 -438 376 611 -695 1221 569 -1 361 294 603
$$ packed form
9815B01r54R58J248j772J810j660M66j677J588K25j419J902k345J672mk83k87
9832c31P8J50j57J119k103J119j60K26L9m31Q13r15P18l59j65P68l23R02j462
9851d74L98J58o91N14P81r65R27o23L68l99O47M6j206n79J127J293j019J34m26
9870A1p58Q58l0m47N59j276K419j777o96J272j58J03k83R85l26O62j069m28P47
9889C68k28K67q10J394j711O07Q45q63n46P07J171j406N28q90J757q31j145N75
9907b11k75P37n55P53p45K1J157o67k31p34N55K03M16J54L5L29j982J508m78M02
9927C92M99j666J129n23O02j580J715o56p1J956k617Q86o36Q67O19j241Q17j314
9945h22R20j88n12O84l24J109j001n44J57Q3Q14K35j306J916o52n70L62o7L09
$$ plain form
9964 603 -646 -714 -605 -76 541 128 -235 -426 1412 -1304 22 415 620 -611 -559 413 -646 806
9982 806 9 -592 231 -83 1276 -806 1669 -684 386 860 -346 469 -313 -534 -62 939 -785
9999 -785 142 440 -85 1099 -621 -827 -290 -448 1906 -1042 -328 -695 307 -192 404 223 704 804
10017 804 -769 275 -724 -431 332 -918 410 -668 59 -1254 -149 706 -339 482 -360 26 -516
10034 -516 565 -517 -779 -16 -747 175 -204 211 -1596 631 -1273 150 361 -450 419 -534 -215 -904
10052 -904 109 -986 -601 1284 -9 822 1256 -656 390 389 -377 -715 -107 -1063 1401 501 177 -18
10070 -18 762 32 -1135 252 -267 702 -113 -417 849 -349 266 -171 -267 -3 525 182 -317 -234 -510
10089 -510 652 -1308 218 -188 -3 424 -623 879 -514 449 224 -22 960 -1028 -299 -319 215 -276
$$ packed form
9964F03j249o8J09N29O17m13l63j91J838k716J326L93K05j231N2R72j059J452
9982H06p97o01Q23l14J359k082K475k353J070M74j206Q15p82k21M72J001j724
9999g85R27K98n25J184j720k06N37j58K354k948P14l67J002m99N96j81M81J00
10017H04j573J044r99K93P63j250J328j078P27j313J105Q55j045Q21q42L86n42
10034e16J081j082k62P63p31R22l79M15j807K227j904J423K11q11Q69r53L19o89
10052i04J013j095L85J885j293Q31M34j912J046jp66l38O08r56K464r00l24j95
10070a8P80p30j167J387n19R69q15l04J266j198O15m37r6K64N28l43m99Q3k76
10089e10J162j960J526m06J85M27j047J502j393R63k25k46R82j988P29k0N34m91
$$ plain form
10107 -276 182 -148 92 447 258 490 619 -335 -242 -293 571 -96 481 -134 -77 -1676 -456 -229 -350 411
10127 411 -890 308 580 38 -97 -68 -507 666 359 82 413 413 380 609 47 -204 -182 208 857 -223
10147 -223 338 394 -653 277 712 -103 -81 802 -228 -712 65 985 -107 864 -927 436 308 117 110
10166 110 391 234 -827 507 -1294 796 -228 -379 627 -294 -555 -1333 875 474 397 234 -963
10183 -963 369 -1432 198 271 -764 -255 -616 1021 -1847 746 -757 533 307 -188 353 -82 885
10200 885 -1246 188 562 -60 136 -100 495 -930 -342 415 684 4 401 -141 -640 1580 649 -158
10218 -158 748 -722 -1240 641 -393 110 -703 476 559 -194 -382 41 -270 438 301 544 811 -402
10236 -402 585 -810 210 -820 -107 -714 364 -771 350 -351 -720 755 -888 715 393 -356 -459
$$ packed form
10107b76M58l30K40L55j89K32J29r54R3n1Q64o67N77o15N7j599J220K27j21P61
10127D11j301J198K72n42j35K9m39J173l07k77L31%l3K29n62k51K2L90O49j080
10147b23N61N6j047R30M35q15K2Q83j030m84P77R20j092R71j791J363j28j91p
10166A10K81j57j061J334j801K090j024j51J006r21k61p78K208m01p7j63j197
10183i63J332j801J630P3j035N09l61J637k868K593j503J290k26m95N41m35R67
10200H85k131J434L74o22J96k36N95j425N88P57K69o80L97n42m99K220r31q07
10218a58R06j470n18J881j034N03q13J179Q3p53j88M23l11P08j37K43K67j213
10236d02R87j395J020j030P13o07J078j135J121p01l69J475j643J603l22p49j03
$$ plain form
10253 -459 273 317 -889 511 -579 35 738 1133 -87 -1416 943 65 1566 -9 11 789 -1238
10270 -1238 835 -923 707 -653 170 730 -973 -116 -1210 1007 -1152 -2 -373 190 1297 -294
10286 -294 279 -162 -111 -2047 -796 120 -387 339 -1317 563 -333 1039 -733 72 273 -184 87 -558
10304 -558 152 48 -1256 759 376 -203 -247 -94 306 -96 -18 -1348 50 -163 972 -1105 927 -776
10322 -776 724 -851 -1293 486 -933 492 -45 449 -16 855 805 -493 456 -1260 -163 431 -891
10339 -891 -786 -1073 -342 -637 2258 -1494 541 -499 -187 1048 -411 1565 134 564 103 117 937
10356 937 29 559 -130 -26 63 -1490 -288 868 1663 -1356 109 -490 718 -1270 -672 113 -735 704
10374 704 95 417 1085 583 1184 -901 -506 -73 -59 -991 -64 -539 -137 -69 -34 195 259 965 -435 -987
$$ packed form
10253d59P32M4j206J400j090O14P03L95j220j329K359q78J501j575K0P78k027
10270a238K073j758J630j360Q23N60j703Q57j094K217k159J150l71N63J107j591
10286b94N73m41N1j936J251R16n07P26j656J880q96J372j772Q05K01m57K71o45
10304e58P10j04j304K015l83n79m4J53M00m02P8j330J398k13J135k077K032j703
10322g76J500j575m42J779j419J425n37M94m65Q71n0j298R49j716J097N94j322
10339h91J05k87P31k95K895l752K035j040L12J235j459J976j431M30m61J4Q20
10356I37r08N30o89J04Q9j553J202J156P95l019J465n99J208j988N98P85q48J439
10374G04o09L22O68n02O01k085L95M33J4r32R27m75M02O8L5K29O4P06j400n52
$$ plain form
10394 -987 476 520 851 -339 -253 796 -459 77 -955 231 -590 829 -231 576 1158 927 -825
10411 -825 -966 -277 15 -137 -361 -716 440 -254 -509 -727 399 -341 -97 -386 -559 644 -839 -1041
10429 -1041 -484 -417 -343 913 -618 340 177 -528 -267 -284 422 -712 -800 -73 15 929 -35 114 -226 129
10449 129 1205 -1315 718 -910 -90 -449 -18 216 -1356 979 -1302 902 -986 1291 -586 457
10465 457 210 -594 412 -686 1284 -1150 1137 63 75 444 -1044 1206 293 -68 777 -346 396
10482 396 1443 1304 -648 373 532 -75 -433 -365 -157 -661 -623 80 999 233 -464 36 172 1424 -366
10501 -366 1204 -1077 -474 -342 290 429 -1316 128 333 750 -440 468 -1971 -85 -302 -572 216
$$ packed form
10394i87J463M4L31j190Q6J049j255N36j032J186q21J419j060Q07N82k31j752
10411h25j41O89K92j52k24l55J156o94k55k18J126p40K44k89j73J203j483k02
10429a041N57O7P4J256j531R58j63p05K61j7P06j134q8P27Q8R14r64J49l40L55
10449A29J076k520K033j628Q20l59M31K34j572K335k281K204j888K277j877J043
10465D57k47q04J006j098J970k434K287j074J2L69j488K250r13l61Q45j123P42
10482C96J047j39j952J021J59o07l58O8K08n04L8P03R19p66o97N00J36J252j790
10501c66J570k281O03J32O32J39j745J444K05M17j190R08k439J886k17k70P88
$$ [...]
16383e55
##END NTUPLES=NMR FID
##END=
