##TITLE=1H_DE-80H_X3
 200.13MHz, d2o
 8 sc
 
 19ns.26.2.2025
##JCAMPDX= 6.0         $$ Bruker NMR JCAMP-DX V2.0
##DATA TYPE= NMR SPECTRUM
##DATA CLASS= NTUPLES
##ORIGIN= UXNMR, Bruker Analytische Messtechnik GmbH
##OWNER= pz
$$ XWIN-NMR		Version 3.5
$$ Tue Jun 17 14:16:11 2025 Russian Standard Time (UT+4h)  Yarkov@DPX200
##.OBSERVE FREQUENCY= 200.1313
##.OBSERVE NUCLEUS= ^1H
##.ACQUISITION MODE= SIMULTANEOUS
##.ACQUISITION SCHEME= undefined
##.AVERAGES= 8
##.DIGITISER RES= 18
##SPECTROMETER/DATA SYSTEM= spect
##.PULSE SEQUENCE= zg30
##.SOLVENT NAME= CDCl3
##.SHIFT REFERENCE= (INTERNAL, CDCl3, 0, 15.5045)
##AUDIT TRAIL= $$ (NUMBER, WHEN, WHO, WHERE, WHAT)
$$ ##TITLE= Audit trail, XWIN-NMR		Version 3.5
$$ ##JCAMPDX= 5.01
$$ ##ORIGIN= Bruker BioSpin GmbH
$$ ##OWNER= Yarkov
$$ C:/Bruker/XWIN-NMR/data/yarkov2/nmr/H-C/1/pdata/1/auditp.txt
$$ ##AUDIT TRAIL=  $$ (NUMBER, WHEN, WHO, WHERE, WHAT)
(   1,<2025-06-17 14:14:58.32 +0400>,<Yarkov>,<DPX200>,
      <created by zg, POWCHK disabled, PULCHK disabled
       configuration hash MD5:
       00 E9 B6 7A A2 85 ED C7 34 08 36 98 17 FE 4E 26
       data hash MD5: 16K
       E4 0F CF 6D B2 36 FE F6 5D 38 78 7D 8F DF B5 A1>)
(   2,<2025-06-17 14:15:07.09 +0400>,<Yarkov>,<DPX200>,
      <Start of raw data processing
       efp BC_mod = 2 LB = 0.25 FT_mod = 6 PKNL = 1 PHC0 = -1706.073 PHC1 = -3.233438 SI = 16K 
       data hash MD5: 16K
       BC DD E0 57 9F 9A F1 D1 90 17 4C 06 7D D5 4F AD>)
(   3,<2025-06-17 14:15:24.90 +0400>,<Yarkov>,<DPX200>,
      <pk PHC0 = -4.888746 PHC1 = 10.2 
       data hash MD5: 16K
       0D D4 BD DA 9D 6A 39 3D E8 71 9E 52 F6 12 3F E3>)
(   4,<2025-06-17 14:15:28.28 +0400>,<Yarkov>,<DPX200>,
      <abs ABSG = 5 
       data hash MD5: 16K
       85 66 71 37 90 11 AA B4 1B 36 F0 92 38 A5 A1 41>)
$$ ##END=
$$ 
$$ hash MD5
$$ 9B 7D 4D 97 F9 DD 7C A6 85 E9 40 CF 17 01 10 3F
##$RELAX= 
##$RELAX= 
##$RELAX= 
##$RELAX= 
##$RELAX= 
##$RELAX= 
$$ Bruker specific parameters
$$ --------------------------
##$DU= <C:/Bruker/XWIN-NMR>
##$EXPNO= 1
##$NAME= <H-C>
##$PROCNO= 1
##$TYPE= <nmr>
##$USER= <yarkov2>
##$AMP= (0..31)
100 100 100 100 100 100 100 100 100 100 100 100 100 100 100 100 100 100 
100 100 100 100 100 100 100 100 100 100 100 100 100 100 
##$AQSEQ= 0
##$AQ_mod= 1
##$AUNM= <au_zg>
##$AUTOPOS= <>
##$BF1= 200.13
##$BF2= 200.13
##$BF3= 200.13
##$BF4= 200.13
##$BF5= 200.13
##$BF6= 200.13
##$BF7= 200.13
##$BF8= 200.13
##$BYTORDA= 1
##$CFDGTYP= 0
##$CFRGTYP= 5
##$CHEMSTR= <none>
##$CNST= (0..31)
1 1 145 1 1 1 1 1 1 1 1 1 1 1 1 1 1 1 1 1 1 1 1 1 1 1 1 1 1 1 1 1 
##$CPDPRG= <>
##$CPDPRG1= <>
##$CPDPRG2= <>
##$CPDPRG3= <>
##$CPDPRG4= <mlev>
##$CPDPRG5= <mlev>
##$CPDPRG6= <mlev>
##$CPDPRG7= <mlev>
##$CPDPRG8= <mlev>
##$CPDPRGB= <>
##$CPDPRGT= <>
##$D= (0..31)
0 0.7 0 0 0 0 0 0 0 0 0 0.03 0 0 0 0 0 0 0 0 0 0 0 0 0 0 0 0 0 0 0 0 
##$DATE= 1750155297
##$DBL= (0..7)
120 120 120 120 120 120 120 120 
##$DBP= (0..7)
150 150 150 150 150 150 150 150 
##$DBP07= 0
##$DBPNAM0= <>
##$DBPNAM1= <>
$$ [...]
##$SUBNAM3= <"">
##$SUBNAM4= <"">
##$SUBNAM5= <"">
##$SUBNAM6= <"">
##$SUBNAM7= <"">
##$SUBNAM8= <"">
##$SUBNAM9= <"">
##$SW= 18.0517328524113
##$SWIBOX= (0..15)
0 0 2 0 0 0 0 0 0 0 0 0 0 0 0 0 
##$SW_h= 3612.71676300578
##$TD= 16384
##$TD0= 1
##$TE= 0
##$TE2= 300
##$TE3= 300
##$TEG= 300
##$TL= (0..7)
0 120 120 120 120 120 120 120 
##$TP= (0..7)
150 150 150 150 150 150 150 150 
##$TP07= 0
##$TPNAME0= <>
##$TPNAME1= <>
##$TPNAME2= <>
##$TPNAME3= <>
##$TPNAME4= <>
##$TPNAME5= <>
##$TPNAME6= <>
##$TPNAME7= <>
##$TPOAL= (0..7)
0.5 0.5 0.5 0.5 0.5 0.5 0.5 0.5 
##$TPOFFS= (0..7)
0 0 0 0 0 0 0 0 
##$TUNHIN= 0
##$TUNHOUT= 0
##$TUNXOUT= 0
##$USERA1= <user>
##$USERA2= <user>
##$USERA3= <user>
##$USERA4= <user>
##$USERA5= <user>
##$V9= 5
##$VALIST= <valist>
##$VCLIST= <CCCCCCCCCCCCCCC>
##$VD= 0
##$VDLIST= <DDDDDDDDDDDDDDD>
##$VPLIST= <PPPPPPPPPPPPPPP>
##$VTLIST= <TTTTTTTTTTTTTTT>
##$WBST= 1024
##$WBSW= 4
##$XGAIN= (0..3)
0 0 0 0 
##$XL= 0
##$YL= 0
##$YMAX_a= 159232
##$YMIN_a= -159530
##$ZGOPTNS= <>
##$ZL1= 120
##$ZL2= 120
##$ZL3= 120
##$ZL4= 120
##$ABSF1= 15.48356
##$ABSF2= -2.56829
##$ABSG= 5
##$ABSL= 3
##$ALPHA= 0
##$AQORDER= 0
##$ASSFAC= 0
##$ASSFACI= 0
##$ASSFACX= 0
##$ASSWID= 0
##$AUNMP= <proc_1d>
##$AZFE= 0.1
##$AZFW= 0.1
##$BCFW= 0
##$BC_mod= 2
##$BYTORDP= 0
##$COROFFS= 0
##$CY= -3
##$DATMOD= 1
##$DC= 0
##$DFILT= <>
##$DTYPP= 0
##$F1P= 0
##$F2P= 0
##$FCOR= 1
##$FTSIZE= 16384
##$FT_mod= 6
##$GAMMA= 0
##$GB= 0
##$INTBC= 1
##$INTSCL= 3.241238e-09
##$ISEN= 128
##$LB= 0.25
##$LEV0= 0
##$LPBIN= 0
##$MAXI= 10000
##$MC2= 0
##$MEAN= 0
##$ME_mod= 0
##$MI= 1.114404
##$NCOEF= 0
##$NC_proc= -7
##$NLEV= 6
##$NOISF1= 3.799351
##$NOISF2= 2.8
##$NSP= 0
##$NTH_PI= 0
##$NZP= 0
##$OFFSET= 15.50449
##$PC= 1
##$PHC0= -1710.962
##$PHC1= 6.966562
##$PH_mod= 1
##$PKNL= yes
##$PPARMOD= 0
##$PSCAL= 0
##$PSIGN= 0
##$REVERSE= no
##$SF= 200.130003444345
##$SI= 16384
##$SIGF1= 3
##$SIGF2= 2
##$SINO= 0.751879
##$SIOLD= 32768
##$SREGLST= <19F.Aceton>
##$SSB= 0
##$STSI= 16384
##$STSR= 0
##$SW_p= 3612.71676300578
##$SYMM= 0
##$S_DEV= 0
##$TDeff= 16384
##$TDoff= 0
##$TI= <>
##$TILT= no
##$TM1= 0
##$TM2= 0
##$TOPLEV= 0
##$USERP1= <user>
##$USERP2= <user>
##$USERP3= <user>
##$USERP4= <user>
##$USERP5= <user>
##$WDW= 1
##$XDIM= 16384
##$YMAX_p= 367008484
##$YMIN_p= -468983
$$ End of Bruker specific parameters
$$ ---------------------------------
##NTUPLES= NMR SPECTRUM
##VAR_NAME=  FREQUENCY,     SPECTRUM/REAL,   SPECTRUM/IMAG
##SYMBOL=    X,             R,               I
##VAR_TYPE=  INDEPENDENT,   DEPENDENT,       DEPENDENT
##VAR_FORM=  AFFN,          ASDF,            ASDF
##VAR_DIM=   16384,         16384,           16384
##UNITS=     HZ,            ARBITRARY UNITS, ARBITRARY UNITS
##FACTOR=    0.220516191357247, 1,           1
##FIRST=     3102.91361682597, 0,            0
##LAST=      -509.803146179811, 0,           0
##MIN=       -509.803146179811, -468983,     0
##MAX=       3102.91361682597, 367008484,    0
$$ Real data points
##PAGE= N=1
##DATA TABLE= (X++(R..R)), XYDATA
$$ [...]
6142F45283O1311l4046n989o1315o3204K47q941N8130K4009L7168K0060J0644
6130F83357k508P2438O9976P3438Q9338k4013Q4156P0571R0412L5585Q104J1324
6118A262178n4467K8421m4607J7116L5713n1277K5840q938P6163M0269K4790N2979
6106A404180M7567J34229J18332J29373J65787J48959J36536P0063P5248J16654
6096B546928O4746Q2354K4079o1793r3952j53030m2223J475p8608K1081Q0690
6085B391747j4481q510o892q3510l3618N0748M6253J09584R4578J38589J21645
6074B806133P6652J47195O2258M6677j23486k48000j90356j30974j72131j59783
6064B114185j62124j62312n6967J2537o2243j17820j2823l9499j0355J5922L3507
$$ y = [645283, 706594, 672548, 666559, 605244, 542040, 542287, 533346, 591476, 615485, 652653, 672713, 683357, 680849, 753287, 823263, 896701, 986039, 962026, 1046182, 1116753, 1207165, 1242750, 1250854, 1262178, 1207711, 1236132, 1191525, 1208641, 1244354, 1193077, 1218917, 1209979, 1286142, 1326411, 1351201, 1404180, 1451747, 1585976, 1704308, 1833681, 1999468, 2148427, 2284963, 2355026, 2430274, 2546928, 2611674, 2694028, 2718107, 2656314, 2562362, 2409332, 2367109, 2368584, 2289976, 2311057, 2391747, 2377266, 2368756, 2361864, 2278354, 2244736, 2295484, 2341737, 2451321, 2545899, 2684488, 2806133, 2882785, 3029980, 3092238, 3138915, 3015429, 2767429, 2577073, 2446099, 2273968, 2114185, 1952061, 1789749, 1732782, 1745319, 1683076, 1565256, 1552433, 1512934, 1502579, 1518501, 1552008]
6053A552008K8530n9494o967l6613o8982l5935N7011o9244l588Q9032Q5329l9872
6041A491215o5202q7180q1580q2535j62157p6049K0295n0941j36248j4969m7220
6030G07429n636N701l8499J8401R4136j0573o8414N562P4821j19714p8731k184
6018E82299J9773q4113l8697N6655K198m4647P5986M094m4016M6758o2377j0776
6006E03137o0128N171j8271j2142l4187k3418K3320O8702N90n6886n4006P4722
5994D16604L4855k0268k1876l5214N3414P1833j8768n5707J811P9486p6213M9529
5982D79486Q1499q1062m4978j6511n489p0317N3576M7331j01498m8921R1437O8709
5970D53262m5506K2650L4610l0854n5875J1632P6212J2873l6396L9719M4394o952
$$ y = [1552008, 1580538, 1521044, 1514077, 1477464, 1408482, 1372547, 1429558, 1360314, 1356726, 1445758, 1531087, 1491215, 1426013, 1338833, 1257253, 1174718, 1012561, 936512, 956807, 905866, 769618, 754649, 707429, 701793, 707494, 668995, 687396, 781532, 770959, 702545, 708107, 782928, 663214, 584483, 582299, 602072, 517959, 479262, 535917, 538115, 493468, 569454, 573548, 529532, 576290, 513913, 503137, 443009, 448180, 429909, 417767, 383580, 360162, 383482, 452184, 452774, 395888, 341882, 416604, 451459, 431191, 409315, 374101, 427515, 499348, 480580, 424873, 426684, 506170, 429957, 479486, 560985, 479923, 434945, 418434, 412945, 342628, 396204, 443535, 342037, 293116, 384553, 453262, 407756, 430406, 465016, 434162, 378287, 389919, 466131, 479004, 442608, 482327, 526721, 519769]
5958E19769j9096j7848j4800N979J5609n282n4273n4191N662j8328J0757M469
5946C78427J3463m98L2612k0671J1624r6377k1130N2868K5115L8055J0344L4903
5934D58735K0312r119l8451O1255K1450j5032L31m6200p5444l7202k2893N044
5922C22786M6657L4010k7718o5914M921O9237k8021k9280n346m6881L8564O806
5910C19821J5168k9458L2861m737l3784q5764O3778m4363m7964j01L1105M0117
5898B56679n1015L4224k9693K1604m8895j4103k7951J0967J6186n4055L6664o135
5886A44477n9683k3831N9106J9607k8686j7579M8207J769m6788K686K3083K7371
5874A49739o8763J4844R3665k5907J598o082q2700L2036J3961J1408L7737M2594
$$ y = [519769, 500673, 482825, 468025, 474004, 489613, 484331, 430058, 375867, 381529, 363201, 373958, 378427, 391890, 391392, 424004, 403333, 414957, 318580, 297450, 350318, 375433, 413488, 423832, 458735, 479047, 469928, 431477, 492732, 514182, 499150, 499481, 453281, 377837, 340635, 317742, 322786, 369443, 403453, 375735, 309821, 314742, 383979, 355958, 326678, 321332, 274451, 313015, 319821, 334989, 305531, 338392, 333655, 299871, 214107, 277885, 233522, 185558, 185457, 216562, 256679, 205664, 239888, 210195, 231799, 182904, 168801, 140850, 151817, 168003, 113948, 150612, 144477, 84794, 60963, 120069, 139676, 110990, 93411, 141618, 143387, 96599, 99285, 122368, 149739, 80976, 95820, 189485, 163578, 165176, 159094, 76394, 108430, 122391, 133799, 171536, 214130]
5862B14130q8750m4421L1475m0490N213K4012r600n4750L911K2463j3968N0285
5850I9510o3925N109Q1627L1415N259J6936l9421l3252j3677n7237m1130O7358
5838E8572L1331o183K9986o571J1532L7054K0932m4227j6808k2044m2245j3138
5826C8191k6696L1548R2948k0292p3060k6997O0810N993M8748n4773k429K3475
5814I7466j8462N1682R919o4K516k2484n3817r658Q3466R531q9775M990K8488
5801I3798j7502J6560L8416o6638O2241k0290N248l7698p382J9485N6694k2091
5789A20841j835J176j9881L3887l9123n4296M4564L4965J1617J0234l984J3493
5777A51658K3663L6103l3890N1095k4725o0629l6647K8719k0271N0924N270J7386
$$ y = [214130, 125380, 80959, 112434, 71944, 77157, 101169, 91569, 36819, 40730, 63193, 49225, 99510, 35585, 40694, 122321, 153736, 158995, 175931, 136510, 103258, 89581, 32344, -8786, 58572, 89903, 83720, 113706, 107135, 118667, 155721, 176653, 132426, 115618, 93574, 51329, 38191, 11495, 43043, 135991, 115699, 42639, 15642, 76452, 82445, 131193, 76420, 73991, 97466, 79004, 130686, 140605, 140541, 143057, 120573, 66756, 57098, 140564, 150095, 60320, 65310, 93798, 76296, 92856, 131272, 64634, 126875, 106585, 111833, 74135, 66753, 86238, 142932, 120841, 119006, 120182, 100301, 134188, 95065, 40769, 85333, 120298, 131915, 142149, 138165, 151658, 175321, 211424, 177534, 228629, 203904, 143275, 106628, 135347, 115076, 166000, 171270, 188656]
5765A88656m6717l3282K0782M6540q141J5470o4192K7520O7637n2169m380K6789
5753A84513K6804l3296K2470r930k3446j6934n835L771k1129N9777k2897k5902
5741A37966N4651m7600J0324K6173k0473J3446k8723k2348L4684j4015N0848M7785
5729B42718M0108l8877p1189R4210R9096k7208j4723O854P8311N2333n291J08534
5717E64876K06667Q5959O0764J41657K49668J5758k9172k29493k79012m5811r1621
5706F50240o3343k8299K3913j15703j3173l1806l8132j3501j7296L8753K4317
5695D15970m7111m6822n21m552r798Q992l3022L4920l6333L1763j6198k3077P8208
5682C52419N3666Q8462L8825K644l2577o6266n5398k119k9524o8995K4136l4697
$$ y = [188656, 141939, 108657, 129439, 175979, 167838, 183308, 119116, 146636, 214273, 162104, 157724, 184513, 211317, 178021, 200491, 190561, 167115, 150181, 144346, 148117, 126988, 186765, 163868, 137966, 192617, 145017, 155341, 181514, 161041, 174487, 145764, 123416, 158100, 144085, 194933, 242718, 282826, 243949, 172760, 266970, 366066, 338858, 324135, 330989, 409300, 461633, 456342, 564876, 771543, 857502, 918266, 1059923, 1309591, 1325349, 1296177, 1066684, 787672, 741861, 650240, 586897, 558598, 582511, 466808, 453635, 421829, 383697, 370196, 352900, 391653, 415970, 368859, 322037, 321516, 316964, 307166, 316158, 283136, 318056, 281723, 313486, 297288, 274211, 352419, 406085, 494547, 533372, 536016, 503439, 437173, 381775, 379656, 350132, 281137, 305273, 270576]
5670B70576o3328M3561Q543J73l4959N6079j2977j6881J6659L9463M9339q766
5658C47482K8602K8766m1281K1837J3120J3798R5460L5192J7340m9217Q0251O7358
5646F58708r4199m8994k8949k5898l4393m7990j6739N603K1793K3953N28o387
5634D07036O1271M1099l1130m3940q56K7427J48545J5026m8503l9390p3857J03927
5622E66655N059K4595k3413k048L0289O9532L0384J2809M5150j2986p0772K7251
5610G02505N8758M604K427P1121k4603N1849M8099N5693L600k5691J00554m6185
5598A002731k151K3999M7912r934p835k2149m3437Q0003N3891Q2538O9965l7830
5586A237703O5280J03716N4930Q4942M7098j2254P2122j179m849r4859o472j54249
$$ y = [270576, 207248, 250809, 259352, 259525, 224566, 280645, 267668, 250787, 267446, 306909, 356248, 347482, 376084, 404850, 363569, 385406, 398526, 412324, 507784, 542976, 560316, 511099, 591350, 658708, 564509, 515515, 486566, 460668, 426275, 378285, 361546, 367149, 388942, 412895, 413423, 407036, 468307, 509406, 478276, 434336, 433480, 460907, 609452, 624478, 575975, 536585, 462728, 566655, 571714, 596309, 572896, 570848, 601137, 670669, 701053, 713862, 759012, 746026, 675254, 702505, 761263, 765867, 768294, 839415, 814812, 866661, 914760, 970453, 974053, 948362, 1048916, 1002731, 1000580, 1024579, 1072491, 1062557, 1054722, 1032573, 989136, 1069139, 1123030, 1205568, 1275533, 1237703, 1302983, 1406699, 1461629, 1546571, 1593669, 1581415, 1653537, 1652358, 1647509, 1552650, 1546178, 1391929]
5574A391929j4711P842k7781O4713o12L8762q491P694m2915j9781q258M3148M451
5561A435990M2577P8975J37277J30489J17275K589n5069n2775j38265j48866j16084
5550A434113q3177q5932j37709k4263L1066l0852m3599m8036m7007n585K8380
5539I87399K8146Q0246j7094K9543N8398M183J31706R4002L4598M9837M9603O2947
5527A593514Q0380p2645k24398j68276p8790j25673j2981p0417j06263N2653K2052
5516H89156p0677p073p212o3092j0524m8114N0337k6068Q6944R6986N369K963
5504H98995k7788P0471P7748N7219R3410J8414p3964j06353r8307q3739q9314
5493G36792j12513m0495L6801J6173j3777M4354l6674O4379J5132o937n7676k8486
$$ y = [1391929, 1377218, 1385060, 1357279, 1421992, 1421380, 1460142, 1451651, 1459345, 1416430, 1396649, 1388391, 1431539, 1435990, 1478567, 1557542, 1694819, 1825308, 1942583, 1945172, 1890103, 1837328, 1699063, 1550197, 1434113, 1350936, 1265004, 1127295, 1103032, 1134098, 1103246, 1059647, 1011611, 964604, 959019, 987399, 1015545, 1095791, 1078697, 1108240, 1166638, 1170821, 1302527, 1396529, 1431127, 1480964, 1530567, 1593514, 1673894, 1601249, 1376851, 1208575, 1129785, 1004112, 991131, 920714, 814451, 867104, 889156, 818479, 811406, 804194, 741102, 730578, 682464, 732801, 706733, 793677, 890663, 896032, 898995, 871207, 941678, 1019426, 1076645, 1170055, 1188469, 1114505, 1008152, 909845, 826106, 736792, 624279, 583784, 620585, 636758, 622981, 667335, 630661, 695040, 710172, 703235, 645559, 617073]
5481F17073K9952o5123L2864M8344L3000Q4447K029l4496O4389J3314M0695l9677
5469H26811p0298K1431P748R767K1866m2993L796L0385O8417P0491M8108k714
5457I92815l933N5543M6504J23723J20054N9668J45016J16777q112j40380p9742
5446A427933l4841q2498r0923m139K3168J9430m529N3673J7298K6939J3181L4179
5434A398871J14431Q5106J12384P6260P4944L1884k0033P9057L3143P4793J49314
5423B210154K35546J42782L4361j14619k01924j02427o2401j58086r8234l2698
5413A852454j0544n8578p5522l562j0050K1253J9658O9331J11103P6972J5532
5402B008047O0179J0329R360j16896m7755p3691n0407q478m6506j47594q9445
$$ y = [617073, 647025, 581902, 614766, 663110, 696110, 780557, 782586, 748090, 812479, 825793, 866488, 826811, 756513, 777944, 785692, 795459, 817325, 774332, 778128, 808513, 876930, 947421, 995529, 992815, 988882, 1044425, 1090929, 1214652, 1334706, 1394374, 1539390, 1656167, 1648055, 1507675, 1427933, 1393092, 1310594, 1219671, 1215532, 1238700, 1258130, 1253601, 1307274, 1324572, 1351511, 1364692, 1398871, 1513302, 1598408, 1710792, 1787052, 1861996, 1893880, 1873847, 1952904, 1986047, 2060840, 2210154, 2445700, 2588482, 2622843, 2508224, 2306300, 2203873, 2141472, 1983386, 1885152, 1852454, 1841910, 1783332, 1707810, 1704248, 1694198, 1715451, 1735109, 1804440, 1915543, 1992515, 2008047, 2068226, 2078555, 2087915, 1971019, 1923264, 1849573, 1799166, 1790688, 1744182, 1596588, 1507143]
5391A507143j00561j02662j21111l5439p5247j9316K5763j25738l0088L0428j2966
5380I40206k4381N743j4158k8992m3042J3415K9923O7098l7517P748m0561q7566
5368G87916n9579j8963k5457p4699o8690o6530K893J5084R1550n7116n9626m1475
5356D25308M6437N1232r5671m8317j8221k0896j6381M26L9237L249J8424N0241
5344D35068j5252k5220m0699K7982K3048l9105K5178p0408p0503K4391m3248N5973
5332B87205R862L2658j9793k0817p363m2140K1363J0994p5702m1825N2594M1338
5320B48374Q1677L4713m8725P073j8583K1472l1893k3893N200j4770m341j4218
5308B42086M6544m6563K4018M3131l8608m8350j0038p291P269p363n4199P5499
$$ y = [1507143, 1406582, 1303920, 1182809, 1147370, 1072123, 1052807, 1078570, 952832, 922744, 953172, 940206, 915825, 921568, 907410, 878418, 835376, 848791, 878714, 945812, 908295, 916043, 875482, 787916, 728337, 709374, 683917, 609218, 540528, 473998, 476891, 491975, 583525, 526409, 466783, 425308, 471745, 522977, 427306, 378989, 360768, 339872, 323491, 323917, 363154, 366403, 384827, 435068, 419816, 394596, 353897, 381879, 404927, 365822, 391000, 320592, 250089, 274480, 231232, 287205, 297067, 329725, 309932, 289115, 281752, 239612, 260975, 271969, 196267, 154442, 207036, 248374, 330051, 364764, 316039, 323112, 304529, 326001, 294108, 270215, 275415, 260645, 256304, 242086, 288630, 242067, 266085, 309216, 270608, 222258, 212220, 204929, 212198, 204835, 150636, 226135]
5296B26135R105m4607L0326k2893K7645K0424k8344k6584k0155j4007J1621j3822
5284A54844l7490M2798Q253l2985Q723L9094L7766L8978n4127n5761L751N6667
5272B10511p7044R997O5756n722k451l6M5326L5810l5318o712O822l6027j6549
5259A94363k5081k7517M6889P1727n3934J1718m45l312l5276M8623j3481m6531
5247A67743l1510N8381K683m3759l0784M3639N8080o325J0022k0708k7861K436
5235A82037O6150k9761L1271m2355j8902k5687l2898j7079r981P1126m368K8866
5223A98419L6266m4487n0055N9305M5374m1469r6000l0199Q195K1076P1473M557
5211A82455j2624m4055N0045k389J281K5006o0388l333j2519K2697J4470L2057
$$ y = [226135, 235240, 190633, 220959, 198066, 225711, 246135, 217791, 191207, 171052, 157045, 168666, 154844, 117354, 160152, 168405, 135420, 144143, 183237, 221003, 259981, 205854, 150093, 153844, 210511, 133467, 143464, 209220, 203498, 201047, 201011, 246337, 282147, 246829, 240117, 246939, 210912, 194363, 169282, 141765, 188654, 260381, 206447, 218165, 217720, 214408, 179132, 227755, 214274, 167743, 136233, 194614, 197297, 153538, 122754, 166393, 224473, 218148, 228170, 207462, 179601, 182037, 248187, 218426, 249697, 207342, 188440, 162753, 129855, 112776, 102795, 173921, 169553, 198419, 234685, 190198, 140143, 199448, 244822, 203353, 107353, 77154, 85349, 106425, 177898, 182455, 169831, 125776, 175821, 173432, 174713, 199719, 139331, 135998, 123479, 146176, 160646, 192703]
5199A92703m0568j2173N7587J6131J3008J5347m2133n959K0878r487j3357M5365
5187B37342j9748k008K6227l4278M624O647l1660K645j7427k6549J8995R514R082
5174A83406k2171j960L3726j0272K1881K1164o1530l259p2333M8206J02130k302
5162B36686J3655M197j10860k8804K9734M7524R934p278k9348P2623N5515j5004
5150B78574l3218l9026J12190J9326k0643l5836L0418l3490n3874M2582P451O433
5138B80887J5545K9300m3395j4915L3006p883n6243M9924L3390j0163j3855M7988
5126C43586M22K138l9769m9617K9984K8357m4386M4852N8452L4076J4939m1724
5114C81310K6759j0188L1369O0626L4673j4653m0944l9732P6107m0378M4896J7275
$$ y = [192703, 152135, 139962, 197549, 213680, 226688, 242035, 199902, 193943, 214821, 205334, 191977, 237342, 217594, 215586, 241813, 207535, 212159, 218806, 187146, 189791, 172364, 145815, 164810, 174324, 183406, 161235, 159275, 193001, 182729, 204610, 225774, 164244, 160985, 88652, 136858, 238988, 236686, 250341, 254538, 143678, 114874, 144608, 192132, 202066, 194788, 165440, 238063, 293578, 278574, 245356, 206330, 318520, 337846, 317203, 281367, 311785, 278295, 224421, 267003, 274454, 280887, 296432, 325732, 282337, 267422, 300428, 292545, 236302, 286226, 319616, 309453, 295598, 343586, 344008, 346146, 306377, 256760, 286744, 315101, 270715, 315567, 374019, 408095, 423034, 381310, 408069, 397881, 429250, 489876, 524549, 509896, 468952, 429220, 505327, 464949, 509845, 527120]
5102E27120k1273O1736k8275L324Q8868N9147N3061O7279K4819M8431L9162l0666
5090H92733O6364J26331P9780Q9989R2266L4547J52162J49107J04043J32150J43979
5079B063451K10780J58918K94068L06137K34572L91893M70695N03977P57038R49302
5069F340831J132699J313833J180192L21615o86614m89997k1750J91202K4995
5060I307006n27055k87506J99881M18771O10352K3710j064066j393910j075475
5051F211708q46695o07378m26675l63995l13061k42464k72941k68675k04451j83581
5041B481792j07683j03926j19470j78118l7498j10667j13113p2899j11857o7973
5031A458588m4502p1147o1228n3496q131L0159m4224l7124J9409l2154j23574
$$ y = [527120, 505847, 567583, 539308, 542632, 631500, 690647, 743708, 810987, 835806, 884237, 923399, 892733, 959097, 1085428, 1165208, 1255197, 1347463, 1382010, 1534172, 1683279, 1787322, 1919472, 2063451, 2274231, 2433149, 2727217, 3033354, 3267926, 3659819, 4130514, 4634491, 5391529, 6340831, 7473530, 8787363, 9967555, 10289170, 9602556, 9112559, 9090809, 9282011, 9307006, 8779951, 8492445, 8692326, 9111097, 9721449, 9745159, 8681093, 7287183, 6211708, 5365013, 4757635, 4330960, 3966965, 3653904, 3411440, 3138499, 2869824, 2665373, 2481792, 2374109, 2270183, 2150713, 1972595, 1935097, 1824430, 1711317, 1638418, 1526561, 1458588, 1414086, 1342939, 1281711, 1228215, 1220084, 1250243, 1206019, 1168895, 1188304, 1156150, 1032576]
5020A032576l8859n3609N6448l9974m6245m4589k4422k0371r1655K0749P4541
5009H24590m4760J1784l0665K882L6412O897L1236K5966J501p0127k4411N477
4997G76782l2405j2646p3245m9930J6049r404N6141l858l4179m210k0966j5514
4985E92615O0461J2608m3776m8652J0851m6269m6226J2929L818O5982j6569M3714
4973F01486K7248m3050n3029l4212N3393K3473m3340j1744O5549R949M7657m914
4961F38466k8101N4653L7242J3804R0529P8558J9903m2192K4763k7416R0508L7982
4949I88699k7132P3695L1610o9881l8958K010J3580m4631K7250Q4042M9712j43419
4937I46577n1683J6821K4972K6484p7031L7023k7382k4119n7952l3461L0513m3791
$$ y = [1032576, 993717, 940108, 996556, 956582, 910337, 865748, 841326, 820955, 729300, 750049, 824590, 779830, 791614, 760949, 763831, 800243, 807140, 838376, 864342, 865843, 795716, 771305, 776782, 744377, 731731, 658486, 608556, 624605, 615201, 671342, 667484, 633305, 629095, 608129, 592615, 653076, 665684, 621908, 573256, 584107, 537838, 491612, 504541, 508359, 574341, 557772, 601486, 628734, 585684, 532655, 498443, 551836, 575309, 531969, 520225, 585774, 595723, 643380, 638466, 610365, 665018, 702260, 716064, 806593, 885151, 905054, 862862, 887625, 860209, 950717, 988699, 961567, 1035262, 1066872, 996991, 958033, 960043, 973623, 928992, 956242, 1040284, 1089996, 946577, 894894, 911715, 936687, 963171, 886140, 923163, 895781, 871662, 813710, 780249, 810762, 766971]
4925G66971k5002l3513o2238N894Q4954L409J3287L4031j6539J4528P1307P4640
4913I31729o010K8068K8767l1078p722p5129q3662j7050p3936n2946L1691L5121
4901G07843k4322j7677k5943L3056J9647j3719N884J1459L2950J9474l3886k618
4889G12148M5578J07584K3261o97q1652n5322N4789k3806K945N5782j2518J1826
4877H39918M1328l4173p4635K0366j8542N409Q974n117O5614J5888l3573l6690
4865G94767N7074M2417M743n683p416J7274J9241j1981J7507R0113j2835N28J0542
4852A016291M5560l3671L8897l576M3110M9548M5373R3379k9121o2848J11869
4841A314811O0985K3636O9328P9524J9648l6799M3571P0582j7494O4002Q349O0824
$$ y = [766971, 741969, 708456, 646218, 652112, 737066, 740475, 753762, 787793, 771254, 785782, 857089, 931729, 925719, 953787, 982554, 951476, 943754, 868625, 784963, 767913, 693977, 641031, 672722, 707843, 683521, 665844, 639901, 672957, 692604, 678885, 684769, 696228, 729178, 748652, 714766, 712148, 757726, 865310, 888571, 887874, 806222, 750900, 805689, 781883, 784828, 840610, 828092, 839918, 881246, 847073, 772438, 792804, 774262, 779671, 788645, 783528, 849142, 865030, 831457, 794767, 851841, 894258, 899001, 893318, 885902, 903176, 922417, 910436, 927943, 1018056, 1005221, 1005749, 1016291, 1061851, 1028180, 1067077, 1063501, 1106611, 1156159, 1201532, 1294911, 1265790, 1202942, 1314811, 1375796, 1399432, 1468760, 1548284, 1567932, 1531133, 1574704, 1645286, 1627792, 1691794, 1700143, 1760967]
4829A760967R329n7021M7933n6237M6410M494J1141M7429J38646J26708J9122
4818B098921L173J57706O5124j6675O8822J01026P7433J24566J43286J25841P9109
4807C028332K20065J47344J60429J57526J61823K06944J80639K04259K38381K60574
4797D966316K75988L07259L81902L91527L16553L24845M10900M09856M29041N52457
4787H766644N48680O00001O58998O51625O50023O81831Q18257J074126J286192
4778A5736377J582934J780019J850286J441220R60790M94404L01474M25712M69590
4769B5042806L58513K73375K01213K54152N79891O38994P46192P21047Q41100
4760B9657283R63362J090072J241696J312971J112082R25598Q87216R77148J030771
$$ y = [1760967, 1770296, 1713275, 1761208, 1704971, 1751381, 1755875, 1767016, 1814445, 1953091, 2079799, 2098921, 2102094, 2259800, 2324924, 2308249, 2377071, 2478097, 2555530, 2680096, 2823382, 2949223, 3028332, 3248397, 3395741, 3556170, 3713696, 3875519, 4082463, 4263102, 4467361, 4705742, 4966316, 5242304, 5549563, 5931465, 6322992, 6639545, 6964390, 7375290, 7785146, 8214187, 8766644, 9315324, 9915325, 10574323, 11225948, 11875971, 12557802, 13376059, 14450185, 15736377, 17319311, 19099330, 20949616, 22390836, 23351626, 23846030, 24147504, 24573216, 25042806, 25401319, 25674694, 25875907, 26130059, 26709950, 27348944, 28095136, 28816183, 29657283, 30620645, 31710717, 32952413, 34265384, 35377466, 36303064, 37190280, 38167428, 39198199]
4751C9198199J226716J478364J694941K032699K176808K200458J954027R29428
4743E2891640m81646j563694j897706j714641j566224j384393j226415j032361
4735D2024560q81469q24373r15872j217537j336148j328503j218341j006744q14398
4726C2481175p35590n31770o19737o18395l34493j35493q513o9646j49825k86645
4716B8991068k74205l01441m31410j037686j790617k181829j996318j590520j321528
4707A8065514j037826q54159p12362o48895o74413p02737n92205m91291n91200
4698A1760426m98111n08037l88499l65851m36328m07942m12192l66149l56284
4689H021033l61831k13775k29458k14929j53338k69113k34437j92368k02291j98868
$$ y = [39198199, 40424915, 41903279, 43598220, 45630919, 47807727, 50008185, 51962212, 52891640, 52409994, 50846300, 48948594, 47233953, 45667729, 44283336, 43056921, 42024560, 41143091, 40318718, 39402846, 38185309, 36849161, 35520658, 34302317, 33295573, 32481175, 31745585, 31213815, 30594078, 29975683, 29641190, 29505697, 29497184, 29427538, 29277713, 28991068, 28716863, 28415422, 27984012, 26946326, 25155709, 22973880, 20977562, 19387042, 18065514, 17027688, 16173529, 15461167, 14812272, 14137859, 13435122, 12842917, 12351626, 11760426, 11262315, 10754278, 10365779, 9999928, 9563600, 9155658, 8743466, 8377317, 8021033, 7659202, 7445427, 7215969, 7001040, 6847702, 6578589, 6344152, 6151784, 5949493, 5750625]
4679E750625k43402j21328j16928j59793o2688m8316j58069o8207p3683l8694
4669D659517p8732j10300l8067k5249j09807l8773m4334j09548Q979o980k126
4658D104580o8362m7919q6677M7826o3927j45315J5859k21121j70840p0775k5479
4647C267850p3420j68103n2650o8090r7461j00636K4582j3671j39715r9678n3302
4636B425706M4257J1432l0031k6992j32003o064j5682R038K2808p4208m3076J1280
4624B196465o4163l847j4180l6917o3197p8153l2727o1100n6637r4919m0704k4286
4612A625635k5769p8253o7963l8490n6457k533k2112M0783q5722k570L731j33057
4600A157223m2540P2247q4396j612L1787k1127o024k4216j2575j4649j163J0611
$$ y = [5750625, 5507223, 5385895, 5268967, 5109174, 5046486, 4998170, 4840101, 4771894, 4698211, 4659517, 4580785, 4470485, 4432418, 4407169, 4297362, 4258589, 4214255, 4104707, 4113686, 4106706, 4104580, 4036218, 3988299, 3901622, 3949448, 3885521, 3740206, 3756065, 3534944, 3364104, 3293329, 3267850, 3194430, 3026327, 2973677, 2905587, 2808126, 2707490, 2732072, 2718401, 2578686, 2479008, 2425706, 2469963, 2481395, 2451364, 2424372, 2292369, 2286305, 2270623, 2279661, 2302469, 2228261, 2185185, 2196465, 2132302, 2128455, 2114275, 2077358, 2014161, 1936008, 1903281, 1842181, 1785544, 1690625, 1649921, 1625635, 1599866, 1521613, 1453650, 1415160, 1358703, 1356170, 1334058, 1374841, 1289119, 1286549, 1290280, 1157223, 1114683, 1186930, 1102534, 1100922, 1132709, 1111582, 1105558, 1081342, 1068767, 1054118, 1052955, 1063566]
4588A063566k0870o8834K1319o824J4328N3057K4992n0853r9525j0901J6001L2373
4576I67829J1883m5575r619j3411k9124o0317k1331K9496J2069K2800m2496l6663
4564G85541N8289q5812R2822P0572n692p0316J3173L0126k0617N235q521m7352
4552H17448j3620L3325j1164J6462m58o642j7419l6178o222k3279J4748K7806
4540G94807j8524l4774k9469M9125k338k4669k168Q087M522M5629k5225M503P4656
4527H44162l8871K0279k9320n8167j28440J972o539N5894P5034j7590L3413m8743
4515G03084P096n1418Q8745n1719r2182L3219J9162K8249l4543J5026j7540l0909
4503F16270K1764p068K476M7857m6416J8221j8021m0835j000k6317l35N5838j1385
$$ y = [1063566, 1042696, 973862, 995181, 988357, 1002685, 1055742, 1080734, 1029881, 930356, 919455, 935456, 967829, 979712, 934137, 924518, 911107, 881983, 821666, 800335, 829831, 841900, 864700, 822204, 785541, 843830, 758018, 850840, 921412, 915720, 845404, 858577, 888703, 868086, 873321, 864800, 817448, 803828, 837153, 825989, 842451, 841993, 835351, 817932, 781754, 775532, 752253, 767001, 794807, 776283, 741509, 712040, 761165, 758827, 734158, 731990, 740077, 744599, 790228, 765003, 769506, 844162, 805291, 825570, 796250, 738083, 609643, 611615, 605076, 660970, 736004, 718414, 751827, 703084, 710180, 658762, 747507, 695788, 603606, 636825, 655987, 684236, 649693, 664719, 647179, 616270, 638034, 630966, 633442, 681299, 634883, 653104, 635083, 594248, 593248, 566931, 566596, 622434, 611049]
4490F11049l4668M1655Q894P062l5591q48l7708J1436n357k2684n4718Q1424K3789
4477E93735l4089Q3302K1868l7881K6076m7306K7285J3639m4481l1038J0358K609
4465E84077K0728k0445l9143P2911N6391L9177k4525j2733q113J4056k3657k8213
4453F30511N9193k0694J151l2920N3236M7815l0180r925j1267O213k4000M9538
4441G18671q24l389K2115M2117l1804L7467J3464L83j3629L0788N427m8784K5964
4428G97966K5844M3245k4938p5921k598L5474m9728O6096K0740n5145N459l8921
4416G47573n1888J0093K6260m526L7125J0728k2180m0557N6017L6166k1344J7391
4404H00858o1398m8891L2594O4851l1068m0318m7793k6394m1259J7317M4779j4361
$$ y = [611049, 576381, 618036, 626930, 633992, 598401, 597553, 559845, 571281, 565924, 543240, 488522, 569946, 593735, 559646, 642948, 664816, 626935, 653011, 605705, 632990, 646629, 602148, 571110, 581468, 584077, 604805, 584360, 545217, 618128, 674519, 713696, 689171, 676438, 668325, 682381, 658724, 630511, 689704, 669010, 670161, 637241, 690477, 738292, 708112, 698187, 686920, 693133, 669133, 718671, 717847, 714458, 736573, 778690, 746886, 784353, 797817, 798200, 784571, 815359, 820786, 772002, 797966, 823810, 867055, 842117, 766196, 763598, 799072, 749344, 815440, 836180, 781035, 786494, 747573, 695685, 705778, 732038, 727512, 764637, 775365, 753185, 712628, 768645, 804811, 783467, 800858, 739460, 690569, 723163, 788014, 756946, 716628, 668835, 642441, 601182, 618499, 663278, 648917]
4392F48917J3008p3532L5537P2510l3895L9782L1482o1650K8371N3266k5435n2892
4380F75469L8444L6286k4455J1476L6147m6850O2454L7376j6449m580l9294N2022
4368H18046O7970n9316k6101j2957n8449j1373O6604j7195j1013J1024o5096M3522
4356G45666M1864k9969J4045K2808R66m0799K3206k8866j4963M7328K2398k0517
4344G83167J03120P30j4723K35l8064L5598p909j9813J1154r347K0198R3289o843
4331I50792j0159M8491l7726m2286J3852J02735Q8704l7837n2112J1959J8642
4320A055055J9895J21038L6063N2077m534m1624L9606J10373O1885j3527J6370
4309A452677P4648J07535Q7747K8360q453J29829J40541J03158P5840Q8543R0569
$$ y = [648917, 661925, 588393, 623930, 696440, 662545, 702327, 733809, 672159, 700530, 753796, 728361, 675469, 713913, 750199, 725744, 737220, 773367, 726517, 788971, 826347, 809898, 805318, 766024, 818046, 886016, 826700, 800599, 787642, 729193, 717820, 784424, 767229, 756216, 767240, 702144, 745666, 787530, 757561, 771606, 794414, 795380, 754581, 777787, 748921, 733958, 781286, 803684, 783167, 886287, 887017, 872294, 872529, 834465, 870063, 862154, 842341, 853495, 844148, 864346, 957635, 950792, 940633, 989124, 951398, 909112, 922964, 1025699, 1114403, 1076566, 1024454, 1036413, 1055055, 1074950, 1195988, 1232051, 1284128, 1279594, 1237970, 1277576, 1387949, 1449834, 1436307, 1452677, 1527325, 1634860, 1722607, 1750967, 1742514, 1872343, 2012884, 2116042, 2191882, 2280425, 2370994]
4298B370994J38321J53679J87310J58878J40825K04831J34639J48436J90041L03500
4288D131454K35905K98136K47015L73324M37736M34190M28093M28560L70461L09723
4278G694597K12602K86336K22711K60958L96797N33917N60012O71156P61535Q37512
4268A2438133Q54304Q45477P17793N52612L58229K63332K28961K16254J78665
4259A6653760K05767M00347N19285P33056Q85165R78394R21309Q48466Q02997
4250B2948546M62939K47757J20130p1448k73639m21887l24550k45367k6783Q3892
4240B2499590K86397M34110M47407M30329L60790K24328N3635j96288n96172q44544
4230B3099582q98039r28149r09261p53841m94631k61456k13068j26664M5903K2841
$$ y = [2370994, 2509315, 2662994, 2850304, 3009182, 3150007, 3354838, 3489477, 3637913, 3827954, 4131454, 4367359, 4665495, 4912510, 5285834, 5723570, 6157760, 6585853, 7014413, 7384874, 7694597, 7907199, 8193535, 8416246, 8677204, 9074001, 9607918, 10167930, 10839086, 11600621, 12438133, 13292437, 14137914, 14855707, 15408319, 15766548, 16029880, 16258841, 16475095, 16653760, 16859527, 17259874, 17779159, 18512215, 19397380, 20375774, 21297083, 22145549, 22948546, 23411485, 23659242, 23779372, 23707924, 23434285, 23012398, 22687848, 22442481, 22415698, 22499590, 22785987, 23220097, 23667504, 24097833, 24458623, 24682951, 24736586, 24540298, 23944126, 23099582, 22201543, 21273394, 20364133, 19610292, 19115661, 18854205, 18641137, 18514473, 18560376, 18583217]
4220A8583217j4264j68593m55158p71708r60094j085709r48682r27292q44087
4211A2407630o49150m78947m11696k61343j54085p7842j36607l36116m15166m68510
4201I018168o32434o37756n68294m84517m69503k94869k55633k06535j45385j70416
4191E152826k84156j28742q2786r4665k47664j19340j25726k03936j95238j53203
4181C517370j12073j09349q2742j05303q9511j45984J2758q7500k5841j31127
4171B640698o1124K5245n5087j38253p4210k3967k7945m9809J9252q7676m7037
4160B120087L3943q8359o9208m1549m793O0310j6321m4645N0228n5888n5146N9850
4148A948509J257p5852m4636k0613O792m799k4160m8276k6371M6296l5530L6957
$$ y = [18583217, 18568953, 18400360, 17945202, 17173494, 16213400, 15127691, 14179009, 13251717, 12407630, 11758480, 11279533, 10867837, 10606494, 10452409, 10374567, 10237960, 9901844, 9486678, 9018168, 8385734, 7747978, 7179684, 6695167, 6225664, 5930795, 5675162, 5468627, 5323242, 5152826, 4868670, 4739928, 4657142, 4562477, 4314813, 4195473, 4069747, 3865811, 3670573, 3517370, 3405297, 3295948, 3213206, 3107903, 3018392, 2872408, 2885166, 2797666, 2771825, 2640698, 2579574, 2604819, 2549732, 2411479, 2337269, 2313302, 2285357, 2235548, 2254800, 2167124, 2120087, 2154030, 2065671, 1996463, 1954914, 1950121, 2010431, 1994110, 1949465, 1999693, 1943805, 1888659, 1948509, 1949766, 1873914, 1829278, 1808665, 1815457, 1810658, 1786498, 1738222, 1711851, 1758147, 1722617, 1759574]
4136A759574J3242j04717L791L2772l3094r825n6860l222k6463l609J2666P0370
4124A654625m9667l0044R7210m175l5331O4526P1606j5949j0018J7669j9253p6404
4112A664795k0909M2945J6404M2940q098m3606N3109J7717M7283L0939M7368P1233
4100A962120O5202n0730O6905R2064J44138M9376k2127J7131L8007J0602q430
4089B364258M4528J14368J56300J09892O9812P0692J55722J10530R3549N0736
4079C340387p3794j2964N6467R8051N5355J5930L2952J25816J89954R9362J82254
4068D109770Q1087K7892j10288j28804q3423o6191M6772J1917L4660R6742L9627
4057D059761R1825N4749Q0876J20600l3862j53936j43566j41169q7015j18976
$$ y = [1759574, 1772816, 1668099, 1671890, 1704662, 1671568, 1661743, 1604883, 1601661, 1575198, 1571589, 1584255, 1654625, 1604958, 1574914, 1672124, 1667949, 1632618, 1697144, 1768750, 1752801, 1742783, 1760452, 1741199, 1664795, 1643886, 1686831, 1703235, 1746175, 1738077, 1694471, 1747580, 1765297, 1812580, 1843519, 1890887, 1962120, 2027322, 1976592, 2043497, 2135561, 2279699, 2329075, 2306948, 2324079, 2362086, 2372688, 2364258, 2408786, 2523154, 2679454, 2789346, 2859158, 2929850, 3085572, 3196102, 3289651, 3340387, 3266593, 3253629, 3310096, 3408147, 3463502, 3479432, 3512384, 3638200, 3828154, 3927516, 4109770, 4190857, 4218749, 4108461, 3979657, 3896234, 3830043, 3876815, 3888732, 3923392, 4020134, 4059761, 4151586, 4206335, 4287211, 4407811, 4373949, 4220013, 4076447, 3935278, 3848263, 3729287]
4047C729287m5025m2704l448l7171N0579L7697K6941N3322o2608j29826m9004
4036C528040n4189R053m3226n5322L186L6721m3671n5640P8824k0567p490L79
4024C376098L2810l2694k5213M8105L2140M2620L5892j674L6443K2836J7774N6422
4012C641559N2410m303K4938J2473M5840N5440P8237L0989R384N9079K6942l2658
4000D000330L6674Q6860J0607J6750j5176J352J08346N2500O0738K3257J05361
3989D487599J1674l6233O6490R1287J3952J579k6599M0864N7803O112R583J14483
3977D838594P3078P6814P3704k813M8389P786m101R2494M3504m6013m8065K7082
3965E180453j2752M2450K2657J341P0884L4379J66434J36255N0846J23087J44425
$$ y = [3729287, 3684262, 3641558, 3638110, 3600939, 3651518, 3689215, 3716156, 3769478, 3706870, 3577044, 3528040, 3473851, 3482904, 3439678, 3384356, 3387542, 3424263, 3380592, 3324952, 3403776, 3383209, 3375719, 3376098, 3408908, 3376214, 3351001, 3399106, 3431246, 3473866, 3509758, 3508084, 3544527, 3567363, 3585137, 3641559, 3693969, 3689666, 3714604, 3727077, 3772917, 3828357, 3906594, 3937583, 3946967, 4006046, 4032988, 4000330, 4037004, 4123864, 4134471, 4151221, 4136045, 4137397, 4245743, 4298243, 4358981, 4382238, 4487599, 4499273, 4463040, 4529530, 4620817, 4634769, 4636348, 4609749, 4650613, 4708416, 4714528, 4724111, 4838594, 4911672, 4988486, 5062190, 5059377, 5107766, 5115552, 5111451, 5203945, 5247449, 5201436, 5153371, 5180453, 5167701, 5210151, 5232808, 5234149, 5305033, 5339412, 5505846, 5642101, 5692947, 5816034, 5960459]
3954E960459K33152K79560K63278K01304P9468R8289J7863m0837m676N2198Q8422
3943G228480R9052J37199J46634K30729K61217K90260K87635L49015L82714M78120
3933I891055N43155N45303N96612O76841P93699Q08898P40327O82133P83427Q60922
3923A6922372J238012J489020J725739J965612J996797J762378J068154L24918
3915B8493002m3710j949J62024K23792L41208N49209Q15000J127855J491207J700449
3905C4858087J620612J373343J007466N35032L09648J45158J35737K53053K94552
3896D0532688M69234Q60177J189951J663173K112233K612760K899337K973056
3888E5312609K662253J374423q72520k834155l605864l467274k819165k056707
$$ y = [5960459, 6193611, 6473171, 6736449, 6937753, 7017221, 7115510, 7133373, 7092536, 7087860, 7140058, 7228480, 7327532, 7464731, 7611365, 7842094, 8103311, 8393571, 8681206, 9030221, 9412935, 9891055, 10434210, 10979513, 11576125, 12252966, 13046665, 13855563, 14595890, 15278023, 16061450, 16922372, 18160384, 19649404, 21375143, 23340755, 25337552, 27099930, 28168084, 28493002, 28449292, 28447343, 28609367, 28833159, 29174367, 29723576, 30538576, 31666431, 33157638, 34858087, 36478699, 37852042, 38859508, 39394540, 39704188, 39849346, 39985083, 40238136, 40532688, 41001922, 41862099, 43052050, 44715223, 46827456, 49440216, 52339553, 55312609, 57974862, 59349285, 58476765, 55642610, 52036746, 48569472, 45750307, 43693600]
3880D3693600j423526j116117q52491o30073k80807j12139m8971K628p2853l88592
3870C8770659q49809j410678j794531j841330j675673j286102q37849n17502k81536
3861B8275649j94817j42606j36851k4074k05671q70550j531311j815021j765786
3852B1588962j549309j228012j006151q31925o42743o24191n48204o41344p02468
3843A3814615o48045n66535m83454m52567l09861l20589k36432k01781j96286
3834A0399065j96468j03143o3140p7385j15692j48419l930N0241n7540j00480
3824I583109j77140r6087k15049l00708k81900k18318j51322j70705j23151r8556
3814G750173j43679n5822l1998n4671l8369L8514M4350k7837k2295p7498n4680
$$ y = [43693600, 42270074, 41153957, 40301466, 39671393, 39390586, 39278447, 39229476, 39232104, 39159251, 38770659, 37920850, 36510172, 34715641, 32874311, 31198638, 29912536, 29074687, 28557185, 28275649, 28080832, 27938226, 27801375, 27777301, 27571630, 26701080, 25169769, 23354748, 21588962, 20039653, 18811641, 17805490, 16973565, 16330822, 15706631, 15158427, 14517083, 13814615, 13166570, 12600035, 12116581, 11664014, 11354153, 11033564, 10797132, 10595351, 10399065, 10202597, 10099454, 10036314, 9958929, 9843237, 9694818, 9690888, 9741129, 9683589, 9583109, 9405969, 9309882, 9094833, 8794125, 8512225, 8293907, 8142585, 7971880, 7848729, 7750173, 7606494, 7550672, 7518674, 7464003, 7425634, 7464148, 7508498, 7480661, 7458366, 7380868, 7326188]
3803G326188m8299j7111o5963n1115L4922k2285m2095n3879l8583j1864l4644
3792F975272j8301N1041n1308p9218j3884Q7724k7373m7343M6589P1828J06748
3781G101775J26336J35738N2722J06982R5926N6237P8940P6412J23128J70613
3771H124809K75463J65641J99071K72912K71349L02298L14839M10172M22438N24788
3761A1283780M77198N75179O74894P04966Q00422R07393R71917J151495J228559
3752A8775803J469542J562900J837150K120545K296660K363888K434174K286008
3744C5146670J947178J610900J192335P51999K60381q2330m74613n82333n42825
3735C9227362m33551j69244P7057L45153M56082L85862L12075k0409m56152q30756
$$ y = [7326188, 7277889, 7260778, 7194815, 7143700, 7178622, 7156337, 7114242, 7060363, 7021780, 7009916, 6975272, 6956971, 7008012, 6956704, 6877486, 6863602, 6951326, 6923953, 6876610, 6923199, 6995027, 7101775, 7228111, 7363849, 7416571, 7523553, 7619479, 7675716, 7754656, 7831068, 7954196, 8124809, 8400272, 8565913, 8764984, 9037896, 9309245, 9611543, 9926382, 10336554, 10758992, 11283780, 11760978, 12336157, 13011051, 13716017, 14516439, 15423832, 16395749, 17547244, 18775803, 20245345, 21808245, 23645395, 25765940, 28062600, 30426488, 32860662, 35146670, 37093848, 38704748, 39897083, 40649082, 40909463, 40827133, 40352520, 39770187, 39227362, 38793811, 38624567, 38701624, 39046777, 39502859, 39888721, 40200796, 40180387, 39724235, 38893479]
3725C8893479j236867j573265j965655k161406k301338k248159k061980j905114
3717B3439695j713594j521193j372530j119005r19072q47909q25525o88720n90681
3708A3841466m80906n19604n37605l99777l69235l32556l75604k93347k12820
3699A0320012k22183k00766j79183j46960j52996j06666j27633j20106j11427
3690H952092o0937l0831j07158j45255j22543n7364k8054l1598r1527j00370j05349
3679H071106q6099l6050n9987j27244j1877R0433r18p849m0374j29918R219O7136
3667G737578M4238L7017L7875k7201O7451k4032N3610J12045R1716R4413J09886
3656H334596J17368K4774R36L9034Q6239J71150Q6154J19617R5084J08455P3214
$$ y = [38893479, 37656612, 36083347, 34117692, 31956286, 29654948, 27406789, 25344809, 23439695, 21726101, 20204908, 18832378, 17713373, 16794301, 15946392, 15120867, 14432147, 13841466, 13360560, 12840956, 12303351, 11903574, 11534339, 11201783, 10826179, 10532832, 10320012, 10097829, 9897063, 9717880, 9570920, 9417924, 9311258, 9183625, 9063519, 8952092, 8891155, 8860324, 8753166, 8607911, 8485368, 8428004, 8399950, 8368352, 8276825, 8176455, 8071106, 7985007, 7948957, 7888970, 7761726, 7749849, 7840282, 7839364, 7831515, 7791141, 7661223, 7670442, 7737578, 7781816, 7818833, 7856708, 7829507, 7896958, 7872926, 7926536, 8038581, 8130297, 8224710, 8334596, 8451964, 8476738, 8477674, 8516708, 8602947, 8774097, 8860251, 8979868, 9074952, 9183407, 9256621]
3645I256621J13037K16227J32601J57107J39967J37591J04573J07140J37405J74751
3635A0677020K20248R7276J44139K47245K73134K69828L04052K74284K78137L53624
3625A3138987M16566L86034M69163O55247O82610O39830P51411R59752R81219
3616A9080819J128528J428454J566850J808089K108973K392445K578608K779538
3608C4872304K860444K660078K398608K032580J563045J219220P82250L21635
3600D8710164k2396j56359r5849j83706P4879K80180M14409L91341K78367M7196
3590D9738226l24993p41267j121798j496691j904345k170354k443078k483444
3582C7052256k313231k232605j974901j674925j452330j291390r18599p47941
$$ y = [9256621, 9369658, 9585885, 9718486, 9875593, 10015560, 10153151, 10257724, 10364864, 10502269, 10677020, 10897268, 10994544, 11138683, 11385928, 11659062, 11928890, 12232942, 12507226, 12785363, 13138987, 13555553, 13941587, 14410750, 15065997, 15748607, 16388437, 17139848, 18099600, 19080819, 20209347, 21637801, 23204651, 25012740, 27121713, 29514158, 32092766, 34872304, 37732748, 40392826, 42791434, 44824014, 46387059, 47606279, 48388529, 48710164, 48687768, 48531409, 48435560, 48251854, 48326733, 48606913, 49021322, 49412663, 49691030, 49738226, 49413233, 48671966, 47550168, 46053477, 44149132, 41978778, 39535700, 37052256, 34739025, 32506420, 30531519, 28856594, 27404264, 26112874, 25194275, 24446334]
3574B4446334o71384n93707m01770k35269k31575p2532M9352J36476J96970K92403
3564B2915298M53679N94943O51673P68440R36083J152550J295363J455657J666034
3555C1889720J974330K138536K387905K805176L154868L300612L598081L729627
3547E4978855L620426L464067L247410L177830K990513K833871K665631K364958
3539G9343561J837769J354602Q74901M38804l7007m18026o83825r03513j307591
3530H0499675j424984j511497j798655k040821k207833k239360k397732k511551
3522F4367242k406194k357691k299673k082766j835447j577313j262972r08695
3514D9636491n00207N4059N15250J021111J356975J245192O98140M62698J138935
$$ y = [24446334, 23774950, 23181243, 22779473, 22544204, 22312629, 22240097, 22289449, 22425925, 22622895, 22915298, 23368977, 23963920, 24615593, 25384033, 26320116, 27472666, 28768029, 30223686, 31889720, 33864050, 36002586, 38390491, 41195667, 44350535, 47651147, 51249228, 54978855, 58599281, 62063348, 65310758, 68488588, 71479101, 74312972, 76978603, 79343561, 81181330, 82535932, 83410833, 83849637, 83812630, 83394604, 82710779, 81807266, 80499675, 79074691, 77563194, 75764539, 73723718, 71515885, 69276525, 66878793, 64367242, 61961048, 59603357, 57303684, 55220918, 53385471, 51808158, 50545186, 49636491, 49136284, 49190343, 49705593, 50726704, 52083679, 53328871, 54027011, 54489709, 55628644]
3505E5628644J737527K160534K296534J972204J640036K180465K945066L517487
3497G4078497M206259M347794M385488M257256L968104L766806L351519K826878
3489A05188601K553467K285276K343568K704850L190836L992089M767369N532553
3481A32558609N939897N428979M876524M753250M440469L419610J881983k57533
3473A63041788k643713m328773n170631n559701n614438n315440m828577l930477
3465A25650038l124397k493754j975202j681241j652263j714935k048545k460131
3457A08499570l013819l775587m457901m819226n090062n108948m891547m622496
3449G2719984m263252l909948l455277l080873k669223k312942j869742j528361
$$ y = [55628644, 57366171, 59526705, 61823239, 63795443, 65435479, 67615944, 70561010, 74078497, 78284756, 82632550, 87018038, 91275294, 95243398, 99010204, 102361723, 105188601, 107742068, 110027344, 112370912, 115075762, 118266598, 122258687, 127026056, 132558609, 138498506, 143927485, 148804009, 153557259, 157997728, 161417338, 163299321, 163041788, 160398075, 156069302, 150898671, 145338970, 139724532, 134409092, 129580515, 125650038, 122525641, 120031887, 118056685, 116375444, 114723181, 113008246, 110959701, 108499570, 105485751, 101710164, 97252263, 92433037, 87342975, 82234027, 77342480, 72719984, 68456732, 64546784, 61091507, 58010634, 55341411, 53028469, 51158727, 49630366]
3441D9630366j238023r34107o35162m43168j90810N276K52313M96957P85860J108112
3431D8837614J564724J912197K354153K592389K827943L038798K995287K802089
3423F8925194K561339K511020K348080K219236J984172J286776M70617j64992
3415H2141442n96407r49498j118669j202881j150684j116876j080123r39391p75265
3406G3211648o89989p66871p82841r24678j059428j420771j651131k017891k353509
3397F1544539k527547k814777k921182k839488k741382k452785k300345k259238
3389D0687795k320715k069658j776603j583063j311467j205477r59884p64885
3381B8696043o52049o35052n03205m42926k42997k61974j87966q5964M5661K55967
$$ y = [49630366, 48392343, 47458236, 46823074, 46379906, 46189096, 46194372, 46446685, 46943642, 47729502, 48837614, 50402338, 52314535, 54668688, 57261077, 60089020, 63127818, 66123105, 68925194, 71486533, 73997553, 76345633, 78564869, 80549041, 81835817, 82306434, 82141442, 81545035, 80595537, 79476868, 78273987, 77123303, 76006427, 74926304, 73986913, 73211648, 72521659, 71754788, 70971947, 70047269, 68987841, 67567070, 65915939, 63898048, 61544539, 59016992, 56202215, 53281033, 50441545, 47700163, 45247378, 42947033, 40687795, 38367080, 36297422, 34520819, 32937756, 31626289, 30420812, 29460928, 28696043, 28043994, 27408942, 26905737, 26462811, 26219814, 25957840, 25769874, 25683910, 25729571, 25985538]
3371B5985538M07923O91465Q25631R95183J022223P77464K72213j86537p12853
3362C0078250j265619r96011n34337l05041j31447j47132M4019J35174J17925
3353B6995781K22421L60988L15202J70637M2904O8775J8822M7050J89581L38766
3343B8770927M87152O55047R61377J047597J039229J047726O38517K80564j24999
3334C4803137m30204J66790O64720J070469J545213J870010K042480K136237K193962
3325D6062814K194799K316737K435984K426986K375294K234287J964161J699857
3317F3710919J444354J280982J322775J323321J274622J161638Q81302N07726
3309G2907639K12849k4232k33848m6225l0889l25640q56472j231935j656082j912924
$$ y = [25985538, 26393461, 27084926, 27910557, 28905740, 29927963, 30705427, 30977640, 30791103, 30078250, 28812631, 27816620, 27282283, 26977242, 26845795, 26698663, 26742682, 26877856, 26995781, 27218202, 27579190, 27894392, 28065029, 28107933, 28176708, 28195530, 28242580, 28432161, 28770927, 29258079, 29913126, 30874503, 31922100, 32961329, 34009055, 34647572, 34928136, 34803137, 34372933, 34539723, 35204443, 36274912, 37820125, 39690135, 41732615, 43868852, 46062814, 48257613, 50574350, 53010334, 55437320, 57812614, 60046901, 62011062, 63710919, 65155273, 66436255, 67759030, 69082351, 70356973, 71518611, 72399913, 72907639, 73120488, 73096256, 72862408, 72816183, 72785294, 72459654, 71603182, 70371247, 68715165, 66802241]
3299F6802241k062178k271928k574181k772630k951265l184301l256584l183063
3291D4546111l186914l058371k856636k713311k463539k118423j861796j765717
3283B4521404j456508j291137j083051r60820r73770p97589o54369p68625n88152
3274A5947383n51294m56559m20968l67375l46171l03363k38465k44376k32112
3265A2786700j49486j41367j27826n8468l1305n8971K1442m1501j61367j38435
3255A1899416j72574j10529k34131j97692j69078k40448j94050j22101j74555
3246A0284258j43647j13318j86703j30854j12775j69772r4598j66044k14765k41651
3236H710131j52307k10114j88327j50364j28996j54676j69377j20990k30440j33156
$$ y = [66802241, 64740063, 62468135, 59893954, 57121324, 54170059, 50985758, 47729174, 44546111, 41359197, 38300826, 35444190, 32730879, 30267340, 28148917, 26287121, 24521404, 23064896, 21773759, 20690708, 19729888, 18756118, 17958529, 17304160, 16535535, 15947383, 15396089, 14939530, 14518562, 14151187, 13805016, 13501653, 13263188, 13018812, 12786700, 12637214, 12495847, 12368021, 12309553, 12278248, 12219277, 12240719, 12199218, 12037851, 11899416, 11726842, 11616313, 11382182, 11184490, 11015412, 10774964, 10580914, 10458813, 10284258, 10140611, 10027293, 9840590, 9709736, 9596961, 9427189, 9332591, 9166547, 8951782, 8710131, 8557824, 8347710, 8159383, 8009019, 7880023, 7725347, 7555970, 7434980, 7204540, 7071384]
3226G071384o9674q3645o4515l7311j31403m5602k4609j68719m1842k0609o7824
3215F315631l6999J3440K7539o0060m3671k3115k5488j30129O043O772p3651j1605
3203E964707l5175R613k1804J7075k193K9884k4131l730J0986N2603l1L2230N7469
3190F087503L966p0474j6209L5042L0909p68m3936p1703q0814k2664M7623n3521
3178E844954o2382k460j417k3810r5811k4164k1795j8660J3071m1959l7738N9390
3166E587219K1868K3741L9617M3640k7247j9763j1759P1479M8843j9300N6300
3155E814638P7017J12778J06133r529L1852J09103J22516J10904Q3212P5085J51050
3144F784759K00495J50356J09459J77127Q0928Q8749J55406K43001J81915K04161
$$ y = [7071384, 7001710, 6918065, 6853550, 6816239, 6684836, 6639234, 6614625, 6445906, 6404064, 6383455, 6315631, 6278632, 6292072, 6319611, 6259551, 6215880, 6192765, 6167277, 6037148, 6043191, 6049963, 5976312, 5964707, 5929532, 5939145, 5917341, 5934416, 5932223, 5962107, 5937976, 5934246, 5945232, 5997835, 5997804, 6030034, 6087503, 6091469, 6020995, 6004786, 6039828, 6070737, 6069969, 6026033, 5954330, 5873516, 5850852, 5898475, 5844954, 5782572, 5780112, 5778695, 5754885, 5659074, 5634910, 5613115, 5594455, 5607526, 5565567, 5527829, 5587219, 5609087, 5632828, 5672445, 5716085, 5688838, 5669075, 5657316, 5728795, 5777638, 5758338, 5814638, 5891655, 6004433, 6110566, 6101037, 6132889, 6241992, 6364508, 6475412, 6558624, 6633709, 6784759, 6985254, 7135610, 7245069, 7422196, 7503124, 7591873, 7747279, 7990280, 8172195, 8376356]
3134H376356K20586J69389K20936K41198J34513K81745L04611L59342L42946K49439
3124A0901061L09639L50722L81573M03175M26444N02934M99090N90092N69912
3115A4934642O31063O47930P82503R11339Q60553R80812J059754J222377J215568
3106B3246541J288353J360320J484778J570918J626822J896456K071550K345121
3098C6890859K605966K866085L271850L639192M261984N006749N769550O584942
3090G0897177P327854Q102652R017064R957149J1234822J2760342J4815882J7999449
3082A62112391K1872164K6279115L0850176L4585970L5029515K7448927J1663934
3075C49842192k005378l129348M985410J1524468N791140j5126823l7891774m6028816
$$ y = [8376356, 8596942, 8766331, 8987267, 9228465, 9362978, 9644723, 9949334, 10308676, 10651622, 10901061, 11210700, 11561422, 11942995, 12346170, 12772614, 13275548, 13774638, 14364730, 14934642, 15565705, 16213635, 16996138, 17907477, 18768030, 19748842, 20808596, 22030973, 23246541, 24534894, 25895214, 27379992, 28950910, 30577732, 32474188, 34545738, 36890859, 39496825, 42362910, 45634760, 49273952, 53535936, 58542685, 64312235, 70897177, 78225031, 86327683, 95344747, 105301896, 116536718, 129297060, 144112942, 162112391, 183984555, 210263670, 241113846, 275699816, 310729331, 338178258, 349842192, 347836814, 344707466, 349692876, 361217344, 367008484, 351881661, 313989887, 267961071]
3067B67961071m0614461l1994573k4857246j9489371j5435795j2401451j0162964
3060A13005210q798645q229272p510430o648811n864892n262529m795462m365820
3052F1529349l994870l585136l254831k954949k669144k510788k252539k143641
3044C8163451j879875j681722j473170j422157j279105j185639j227222j097555
3036B6917006r74259q58053q22212r70545r62296r23485q52108p60422p46191
3027A9047435p05479o23361n89094n87532m81593m45658l60712l55286l87650
3018A4511070m19373k82613k86879l66983l38154l33110l26413k42951k84491
3009A1630103k90760k69021k38669l00051k57346k43868j71559j85463j85741
$$ y = [267961071, 227346610, 195352037, 170494791, 151005420, 135569625, 123168174, 113005210, 104206565, 95977293, 88466863, 81818052, 75953160, 70690631, 65895169, 61529349, 57534479, 53949343, 50694512, 47739563, 45070419, 42559631, 40307092, 38163451, 36283576, 34601854, 33128684, 31706527, 30427422, 29241783, 28014561, 26917006, 25942747, 25084694, 24262482, 23291937, 22329641, 21406156, 20554048, 19793626, 19047435, 18341956, 17718595, 17129501, 16541969, 16060376, 15614718, 15254006, 14898720, 14511070, 14091697, 13809084, 13522205, 13155222, 12817068, 12483958, 12157545, 11914594, 11630103, 11339343, 11070322, 10831653, 10531602, 10274256, 10030388, 9858829, 9673366, 9487625]
3000I487625j86951k60359k49436j29506j36771j60367q3136j54444j34079j71854
2990G820722j32640j19708j35730k06157j81537j00709j22749q0741j57853j25615
2980F457283P961n1625j00735r5664j11298j03689j50591n7155m0253j00047j63823
2969E490364j54858n7079j06203j19499m6211j07623r7715r0777k9270q7264m394
2958D589471m518j10885r7444j22075n6673p4840l0399l406p1689j01249o3070
2947C853223N666o6215j41177q7709N291r0356n9169L3937k0833k0595k8686j00296
2935C283081m0958o2078j02977j5287o0683n1569j2086k1529q1045L675J6445
2924B854989L8561n6402j36510j11354J5299k6130p0665j3893n5107N2042j0908
$$ y = [9487625, 9300674, 9040315, 8790879, 8661373, 8524602, 8364235, 8281099, 8126655, 7992576, 7820722, 7688082, 7568374, 7432644, 7226487, 7044950, 6944241, 6821492, 6740751, 6582898, 6457283, 6465244, 6413619, 6312884, 6217220, 6105922, 6002233, 5851642, 5794487, 5754234, 5654187, 5490364, 5335506, 5278427, 5172224, 5052725, 5006514, 4898891, 4801176, 4710399, 4681129, 4593865, 4589471, 4584953, 4474068, 4376624, 4254549, 4197876, 4123036, 4092637, 4089231, 4017542, 3916293, 3853223, 3858889, 3792674, 3651497, 3563788, 3569079, 3478723, 3419554, 3453491, 3432658, 3412063, 3383377, 3283081, 3242123, 3180045, 3077068, 3061781, 3001098, 2949529, 2937443, 2915914, 2834869, 2838544, 2854989, 2893550, 2837148, 2700638, 2589284, 2604583, 2578453, 2507788, 2493895, 2438788, 2490830, 2479922]
2913B479922Q039n6809K9500Q717k1434n0867J5098K7762o820p4007j17906L1142
2901B272337o9065j43729n7298n2228o4830j4776l2019o3496K5185L2896n3643
2890A779334n0050M5925n190j8741k8707L209R775n5298o0462L540O013M8174
2878A677522N2971l5859p3725o1242L2775j8903l434o3699m4514J0993L5133J4124
2866A522142P386m0096K5693O589P969K3285m1755q605j841l4079j6455l7956
2854A412277N6500j1796n3930Q895l8289l0551K5704K981j3394j088R516n832
2842A360993J5440L5524j600l9880k7559L5074k3368l7026K298k616l926n1208
2830A262146q9046j3515L3971o6644O4100P4016m0168j1835j3880l6100o3K9523
$$ y = [2479922, 2487961, 2431152, 2460652, 2469369, 2447935, 2397068, 2412166, 2439928, 2433108, 2359101, 2241195, 2272337, 2203272, 2059543, 2002245, 1950017, 1885187, 1870411, 1838392, 1774896, 1800081, 1832977, 1779334, 1729284, 1775209, 1770019, 1751278, 1722571, 1725780, 1735555, 1680257, 1619795, 1623335, 1629348, 1677522, 1730493, 1694634, 1620909, 1559667, 1592442, 1573539, 1570105, 1506406, 1461892, 1472885, 1508018, 1522142, 1529528, 1489432, 1515125, 1521714, 1529683, 1552968, 1511213, 1502608, 1500767, 1466688, 1450233, 1412277, 1468777, 1456981, 1403051, 1411946, 1373657, 1343106, 1368810, 1371791, 1358397, 1357309, 1366825, 1360993, 1376433, 1411957, 1410357, 1370477, 1342918, 1377992, 1354624, 1317598, 1319896, 1317280, 1313354, 1262146, 1173100, 1159585, 1193556, 1126912, 1191012, 1265028, 1224860, 1213025, 1199145, 1163045, 1162982, 1192505]
2818A192505K5764Q8313o0787p3483K344J2980q251p764l941j7985N0521P4609
2806A274825J37513k6076J244N1180J42761O0413J2234Q4612J43077J69891J53390
2795B205064J64637J03527J9334J01540M3853q829M1855j4359m9864j67574k23676
2784B215508k24122j64608j41692p3125p5913j33242m5781p3718r6732o8854j1108
2773A106613n1781k8142q2930r1197P144J5465p4766P876N5786K7382k1146n1311
2761H18993K4793p0398m164j3572K1920l3816P8736l050n701L665l0435l5288
2749G51683q845K986k9143r7669J7959J5851N4417j3424P6620J0302l3888q5157
2737F61692j00619M4375M748k5640P40M8159L9015l2052j3591k9590p9622K9739
$$ y = [1192505, 1218269, 1306582, 1245795, 1172312, 1174656, 1187636, 1179385, 1171621, 1167680, 1149695, 1200216, 1274825, 1412338, 1386262, 1387506, 1438686, 1581447, 1641860, 1654094, 1738706, 1881783, 2051674, 2205064, 2369701, 2473228, 2492562, 2594102, 2637955, 2629126, 2670981, 2656622, 2606758, 2439184, 2215508, 1991386, 1826778, 1685086, 1611961, 1536048, 1402806, 1357025, 1283307, 1186575, 1117721, 1106613, 1054832, 1026690, 943760, 852563, 859707, 875172, 800406, 808282, 864068, 891450, 870304, 818993, 843786, 773388, 769224, 755652, 777572, 743756, 822492, 819442, 813741, 817406, 786971, 751683, 742838, 745824, 716681, 619012, 636971, 652822, 707239, 693815, 770435, 780737, 746849, 661692, 561073, 605448, 610196, 584556, 585296, 633455, 672470, 640418, 626827, 597237, 517615, 547354]
2725E47354m0855R0529j5171k0685k1141k3807j1341R449k4507K2496j1307m4112
2713D56902J4508m8851o1876J2876N4464q566N038o964J6868J579o777M9818M1135
2700E20154j3634n2440j6933k9099P0893L7181q4918L8538k5023p2101J6326N5533
2688D44477L735l9325l0139K0786k1961K870R339n874M9143q8178o7817Q2235
2676C59291M6984k2656j7069J4150O880k4404k0087P3152K2359L5386o3079P289
2664D18196N6481O502p2291K1045L5355o2171p9127j5239J0323L6537M3013O5757
2652D64381q4952l0056K6683l1091k3755J7674N1655m6092k8059m6053M5191M5214
2640C60740k8880n5732K9517K2026J2052L0453K6020L1884J5385k9966M066m3319
$$ y = [547354, 506499, 597028, 581857, 561172, 540031, 516224, 504883, 514332, 489825, 512321, 501014, 456902, 471410, 422559, 360683, 373559, 428023, 419457, 424495, 417531, 434399, 435978, 429201, 479019, 520154, 506520, 454080, 437147, 408048, 478941, 516122, 431204, 469742, 444719, 372618, 388944, 444477, 448212, 408887, 378748, 399534, 377573, 380443, 389782, 383908, 433051, 344873, 277056, 359291, 406275, 383619, 366550, 380700, 387580, 363176, 343089, 416241, 438600, 473986, 410907, 418196, 474677, 481179, 408888, 429933, 465288, 403117, 323990, 308751, 319074, 355611, 398624, 464381, 379429, 349373, 376056, 344965, 321210, 338884, 390539, 344447, 316388, 270335, 315526, 360740, 331860, 276128, 305645, 327671, 339723, 370176, 396196, 428080, 443465, 413499, 417565, 374246]
2628C74246p7177n3819k2910k9051L7152M414K7079R75j1315j547P8869K543Q011
2615C37470k6609N4999j1498n2340p5068N7952O3738l3324K4013n6172N413L5831
2603C24405J8587l089R53l1605o818j0955j5647k9551j2489K7446K2874j1015
2591B73096J8940K8356J0529J7147k2004M6024K9894o9834j2921L7645L9518J8079
2579D14469O240J0370j6600P408l0629k2224r6137r4232L7558J14228n1047J859
2567B81263n8781L0628O0124j03453N844l292K7641N425n7739l3767J3602J9957
2555A87452j9176M7968O0486k5304n8690M6991K0203j2947j9192q616k6114l6533
2543A56528O7233k4196m3144O930N7365j740m1200k8331k1175k3588l098r080
$$ y = [374246, 297069, 243250, 220340, 191289, 228441, 232855, 259934, 260909, 249594, 248047, 326916, 329459, 337470, 310861, 365860, 354362, 302022, 226954, 284906, 348644, 315320, 339333, 283161, 288574, 324405, 342992, 339903, 340856, 309251, 302433, 291478, 275831, 246280, 233791, 261237, 284111, 273096, 292036, 320392, 330921, 348068, 326064, 372088, 401982, 332148, 319227, 356872, 396390, 414469, 420709, 431079, 414479, 421887, 391258, 369034, 272897, 178665, 216223, 330451, 279404, 281263, 222482, 253110, 313234, 209781, 215625, 212333, 239974, 245399, 187660, 153893, 167495, 187452, 168276, 216244, 276730, 251426, 192736, 239727, 259930, 246983, 227791, 219175, 193061, 156528, 223761, 199565, 156421, 163351, 220716, 218976, 177776, 149445, 128270, 104682, 101584, 92504]
2531I2504J32327J5038r7266P7178M8084k8409L1439j6694k0362K5225o2377r6755
2519I9932O359J6947P9937J7325l5822K9440J0637k7827q712l8209K4650J4569
2507A89226P0583K3598k1297N1190j04656l8573N6809J3813M7442j2145M238j15974
2495A64254l3902J00018k8506m4872q475M0509J0376m972L0189P201K4243j6708
2483B39355J9800k006j5373n6336J6103l4627N2261J3517n522J9816n1869P2461
2471B67580r7916p6891J1921N5686N4287m6975K4017J5453k1686J5233q241M3414
2459B35882K9026j5690p020n242o00l9812Q431K8926o2287P2879N9337k4345j5895
2446B63590l8685l6872m4269N6770l4259J0891J06416l0315j9646L6226q0536
$$ y = [92504, 224831, 239869, 142603, 219781, 267865, 239456, 270895, 254201, 233839, 259064, 196687, 99932, 106291, 123238, 203175, 220500, 184678, 214118, 224755, 196928, 188216, 150007, 174657, 189226, 259809, 283407, 262110, 313300, 208644, 170071, 226880, 240693, 288135, 275990, 280228, 164254, 130352, 230370, 201864, 156992, 148517, 189026, 199402, 194430, 224619, 231820, 256063, 239355, 259155, 257149, 241776, 185440, 201543, 166916, 219177, 232694, 227172, 246988, 195119, 267580, 169664, 92773, 104694, 160380, 214667, 167692, 191709, 207162, 185476, 200709, 192468, 235882, 264908, 249218, 242198, 236956, 236356, 196544, 204975, 233901, 171614, 244493, 303830, 279485, 263590, 224905, 188033, 143764, 200534, 166275, 177166, 283582, 253267, 233621, 269847, 189311]
2435A89311k8840N1288O4630p5172p5485K0188Q3582K3910m8549r3176k9424k5471
2423E6792L8811Q1976j6016J7577L3703j0592J642Q8978L9735p3813k8820r322
2411B20651N941M4059l8949Q015N1303j9568L5416O0453q7163q574J5210m3720
2399B43074n0920J2227N0868N6021K3873R369p9151k3930J8455L3199m2611L0220
2387B80694l7098P8383P6931m306n6416l1448L5558M7984M1426m8525l3542k4858
2375C24783Q8093K9614K1055n4287o836O8612j646J5626o1452P5226J8449L0550
2363E47787j4941N323L7630N7847L7008R9859o8143L3341J5676L2275P6813N4101
2351I14576p697L5873O1756O9122M3559R1583J22205J12486P7947J35680P3543
$$ y = [189311, 160471, 211759, 276389, 201217, 125732, 145920, 229502, 253412, 204863, 111687, 82263, 56792, 95603, 177579, 161563, 179140, 212843, 202251, 203893, 292871, 332606, 258793, 229973, 220651, 226592, 270651, 231702, 239717, 291020, 271452, 306868, 367321, 280158, 271584, 286794, 243074, 192154, 204381, 255249, 311270, 335143, 344512, 265361, 241431, 259886, 293085, 250474, 280694, 243596, 321979, 398910, 394604, 338188, 306740, 342298, 390282, 431708, 383183, 349641, 324783, 412876, 442490, 463545, 409258, 402422, 471034, 469388, 485014, 423562, 498788, 517237, 547787, 532846, 538169, 575799, 633646, 670654, 770513, 702370, 735711, 751387, 783662, 860475, 914576, 906879, 942752, 1004508, 1073630, 1117189, 1208772, 1330977, 1443463, 1521410, 1657090, 1730633]
2340A730633P2453Q3841M9724J30445J21171J49782J92427K23294K94241L18753
2330C366764L03970M79067O19021M53126N41680M43788M57540N39280O21929Q23954
2320H650119R84520J061428J530632K048917K797266L432546M179475N489025
2312C0173928M892406R3035o884367o402218m108088k955198k185913j745509
2304A0878076j280994j064810p34100o32640m57998l69832l10098j99367k85306
2295E542931n84183m36032l78163k68396k64293k76156k44602k28544j62192q9192
2285B611178j31220k16841j29772q3358p9460o2442j14356q1670m8694m4624n6277
2274A562464j2413q4679q4684l6379r3825m2592O172O544j2559j39594l4516j4435
$$ y = [1730633, 1803086, 1886927, 1936651, 2067096, 2188267, 2338049, 2530476, 2753770, 3048011, 3366764, 3670734, 4149801, 4768822, 5221948, 5763628, 6207416, 6664956, 7204236, 7826165, 8650119, 9634639, 10696067, 12226699, 14275616, 17072882, 20505428, 24684903, 30173928, 35066334, 35159369, 28275002, 21872784, 17764696, 14809498, 12623585, 10878076, 9597082, 8532272, 7798172, 7165532, 6707534, 6337702, 6027604, 5828237, 5542931, 4958748, 4522716, 4144553, 3876157, 3611864, 3335708, 3091106, 2862562, 2700370, 2611178, 2479958, 2263117, 2133345, 2049987, 1970527, 1908085, 1793729, 1712059, 1663365, 1618741, 1562464, 1550051, 1465372, 1380688, 1344309, 1250484, 1207892, 1214064, 1220608, 1208049, 1068455, 1033939, 1019504]
2262A019504n2711j2864n0742J0459n5495R711L0246l6384o6472k0195O654k6783
2250G54928j2578o6608k3892j515l641k5379O06J3095l2830j0793n3491o1357
2238D76545L64k7154K2531j1641k9919n2728O0447L9985K13m4334J0009r4411
2226C49907j3642K3723L5963l6748K0538N8045p7081J5451L912J6273l5430m2775
2214C18136n4088K7627L5915N1743K807r418o1065m8056L5542L3295J0121n760
2202C36799k831k177N6678k7590m4973n0072K8722j2745n5741L8760Q0551k7848
2190C17533p1694r3781L8657K3431L2106m4445m0279k3885l778k7736K5551M8916
2178A80596k0464Q901K8923j0524k49L225J4421m0901R897M0191J4701l5949l6457
$$ y = [1019504, 966793, 953929, 903187, 913646, 858151, 867862, 898108, 861724, 795252, 775057, 781711, 754928, 742350, 675742, 651850, 650335, 646694, 621315, 621921, 635016, 602186, 591393, 537902, 476545, 476909, 449755, 472286, 460645, 430726, 377998, 438445, 478430, 478643, 434309, 444318, 349907, 336265, 359988, 395951, 359203, 379741, 437786, 360705, 376156, 380068, 396341, 360911, 318136, 264048, 291675, 327590, 379333, 382140, 372722, 311657, 263601, 299143, 332438, 342559, 336799, 333968, 331791, 388469, 360879, 315906, 265834, 294556, 281811, 226070, 264830, 345381, 317533, 245839, 152058, 190715, 214146, 246252, 201807, 161528, 137643, 133865, 106129, 131680, 180596, 160132, 169033, 197956, 187432, 187183, 190408, 204829, 163928, 173825, 214016, 228717, 192768, 156311]
2165A56311N3553n0734L117m6072m2975M5962N8736K6082m554N3499N6651q8896
2153B20680n5342j6974K9158l2981k6224m2909R7599M1864p4135o2075m0125R7880
2141A36416k1991q391l7713l3140l2247P6372K7571k0146J6400o476M5803k5293
2129A17165k0713L9232r3633n9885L8689Q1201l2999r244R616J8804L8087K7071
2117A53391j3775l7928J6407N9864o9755p1461L6185k6421L0255k688K8849n162
2105I7761J355L786k2219o501O8444n7439p4285N4923j5537K7622L5955L0729
2093A44594l3361K817J29k1811Q832k8932J2093j9786Q9397m2659l099j2948l9144
2080E6122K1597k796l1672k5826L0416j9777K422N0511j3776k26K3396M7788l4863
$$ y = [156311, 209864, 159130, 162247, 116175, 73200, 119162, 177898, 203980, 199426, 252925, 309576, 220680, 165338, 148364, 177522, 144541, 118317, 75408, 173007, 214871, 140736, 78661, 38536, 136416, 114425, 106034, 68321, 35181, 2934, 79306, 106877, 86731, 103131, 96655, 142458, 117165, 96452, 135684, 42051, -17834, 20855, 102056, 69057, 59813, 69429, 88233, 126320, 153391, 139616, 101688, 118095, 177959, 108204, 36743, 72928, 46507, 76762, 74074, 102923, 97761, 99116, 102902, 80683, 74182, 142626, 85187, 10902, 65825, 50288, 77910, 113865, 144594, 111233, 114050, 114179, 92368, 101200, 72268, 84361, 64575, 153972, 111313, 108214, 95266, 56122, 77719, 74923, 43251, 17425, 47841, 28064, 30486, 80997, 67221, 66995, 90391, 138179, 103316]
2067A03316n0657J6301m3323J0457L9944P670L6069j8315l9590m0802P5948K0393
2055A17411m827k3758L3273n1053J3979L0708m560j0818K9969m8972M2721O0598
2043A84671L2681L95r933m6638J5738k4782k5083P273o6717j804j4209k1796J5861
2030D5657L7171k0360m6008J1089N0455p2768m2262o181M3932K7344k4719j0556
2018g206L7191j1532l29j0047l041L441p379J4317m3913K673P5648K140m4992
2005F971j07267j8348N5949J0276J00117k1165j4138M7289l2441q142J55L4304
1993E3560K1830j0828k9937l3029P5135M4086p8768J1552l5937N6147j989J3200
1981H5022n1414L38l1678k5007j2461j7840k3423P5624K6193N3536o5614o0064
$$ y = [103316, 52659, 68960, 25637, 36094, 76038, 83708, 119777, 101462, 61872, 21070, 97018, 117411, 112584, 88826, 122099, 71046, 85025, 115733, 111173, 100355, 130324, 81352, 124073, 184671, 217352, 217747, 207814, 161176, 176914, 152132, 127049, 134322, 67605, 65801, 51592, 29796, 45657, 82828, 62468, 16460, 27549, 78004, 5236, -37026, -43207, 725, 28069, 3350, -7206, 29985, 18453, 18124, 8077, 5036, 8477, 1098, 15415, -28498, -25825, 49823, 51963, 6971, -100296, -118644, -62695, -52419, 47698, 26533, 12395, 59684, 27243, 19101, 19256, 53560, 75390, 64562, 34625, 1596, 76731, 120817, 42049, 53601, 17664, 73811, 71822, 85022, 33608, 33946, 2268, -22739, -35200, -53040, -76463, -839, 25354, 78890, 13276, -46788]
1969d6788K2224K8557M7306J7564p2428n296K30p512l8435K8471l2412o835o5366
1956a30720M8334P5885m0647j604L7801K3619k4907j2070q3617R1702j2529n979
1944c4732K0285m906L5288J6060r95m3619K859m2489L349P307P75M7593p156J4946
1930A4565j4419j4090K6742L3857k4782K2098r392n469p4272J7368K7731L2079
1918C2016M6272j076p1243K3072N062j8307K3796j9350K549N7811N589K0175Q0
1905A06446P323J6901q3437k3259P2602l4204l6570L5984j4679l8204j5113J5304
1893I094J8963J7770J9996K9231l0187O040K1274n2429L568k1409P1359p4358
1881A8912k3979j9348l8971j8384L0469N6439p0656m4987N7133l7850P2961j7167
$$ y = [-46788, -24564, 3993, 51299, 68863, -3565, -8861, -8631, -16143, -54578, -26107, -58519, -65354, -130720, -82386, -6501, -47148, -48752, -10951, 12668, -12239, -24309, -107926, -16224, -28753, -34732, -14447, -19353, 15935, 31995, 31000, -12619, -9760, -52249, -48900, -41593, -40818, 6775, -381, 14565, 146, -13944, 12798, 46655, 21873, 43971, 34579, 29110, -45162, -27794, -63, 32016, 78288, 77212, 5969, 29041, 34103, 15796, 39592, 20242, 22791, 80602, 86191, 106366, 106446, 113769, 130670, 47233, 23974, 96576, 62372, 25802, 61786, 47107, 8903, -6210, 9094, 28057, 45827, 65823, 95054, 64867, 70907, 92181, 39752, 43320, 21911, 93270, 18912, -5067, -24415, -63386, -81770, -51301, 5138, -65518, -110505, -53372, -91222, -18261, -35428]
1869c5428K4190M2610l6013P2393k9383q3850k1104N0197J3540m616Q587J4110
1857A5233J0970m3477l4410K7599K6369N341l4352R4070q0107m8036P8156k2687
1845e331K742N5123l8838l9131j0353K969J948J1473j6168K7251K772N083q022
1832h482M9498m8610L8012K0579j4918k8680q240L4884l3931l3528N1654J3364
1820C1602p5187k0417R2756j280r1621N4363j2512J8137O3910l3681n2567j9551
1808d6048k643R6279J2979L3002k2091j2289J5678n6650k4835j0568m5963k318
1796f5467M4587J23307o6801n6294n066l6027J9353k176N2981K3906o759P050
1784C2594k6811r324K3089M618m6533J0497o2709K8847J23792n1215j4748j6239
$$ y = [-35428, -11238, 31372, -4641, 67752, 38369, -45481, -66585, -16388, -2848, -7464, 1123, 15233, 26203, -17274, -51684, -24085, 2284, 7625, -26727, 67343, -12764, -60800, 17356, -5331, -2589, 52534, 13696, -25435, -35788, -32819, -30871, -19398, -35566, -8315, -5543, -460, -8482, 41016, -7594, 30418, 50997, 36079, 7399, -841, 34043, 112, -33416, 18238, 31602, -43585, -64002, 28754, 27474, -64147, -9784, -22296, -4159, 59751, 26070, -26497, -46048, -48691, 47588, 60567, 93569, 71478, 59189, 74867, 18217, -6618, -17186, -63149, -65467, -20880, 102427, 35626, -20668, -25734, -61761, -42408, -44584, 8397, 32303, 25544, 32594, 5783, -3541, 19548, 24166, -22367, -11870, -74579, -45732, 78060, 26845, 12097, -4142]
1772d142K0653R895n2183k6446P1447M4069m4929m0351n6524J1437O5414j8341
1760b0001l5K4707m434N9463M5894j6457J1380l1551n1716j8166n9353k1241l1616
1747a13126N3458O9740L3404k4770n9901N4443j8861o229P1602l075p9784j0851
1735c3950j3254K9758K1416j0674k2661m620n4770O710P5818K6702N03J7336m9863
1722a1549N8523j3648k989R6613O961o6380k9662N3917r1819l3058K6936p120
1710a3275L3279o6116J1865j4858Q261J5169k5962j5127K8947K982q273l806J2379
1697c4535l8143J1118O7286J5654k4319J010K1070k8943L6294J2500K6323l1011
1685C4304l3474n601j3221m2423M7585o9983K003P1085M0273o8803q4668j004
$$ y = [-4142, 16511, 26406, -25777, -52223, 19224, 63293, 18364, -21987, -78511, -67074, -1660, -20001, -20036, 4671, 237, 59700, 105594, 89137, 100517, 68966, 17250, -916, -60269, -81510, -113126, -59668, 10072, 43476, 18706, -41195, 13248, -5613, -11842, 59760, 56685, -23099, -33950, -47204, -17446, 3970, -6704, -29365, -33985, -88755, -82045, -6227, 20475, 20978, 38314, -11549, 46974, 33326, 30337, 126950, 133911, 67531, 37869, 91786, -33, -33091, -6155, -13275, 20004, -46112, -34247, -49105, -40844, -25675, -51637, -66764, -37817, -34835, -43108, -46914, -34535, -72678, -61560, 5726, 21380, -2939, -1929, 19141, -9802, 26492, 38992, 65315, 34304, 830, -4771, -17992, -60415, -12830, -82813, -80810, -9725, 30548, -38255, -122923, -123927]
1673a23927K9145N1688O7772m3960R113k8336j3387Q7725l2949j3007L960N1742
1661D5579j3833o4368l6121J11888K6848j6447p4562K962K3843q3080r164J6642
1649f9813j0621k3624N9852O2052K1320k7960m2647N839N7055p3811q695L3125
1637a7928j3778N964M5540l7495K191O856K254J9354k5911j4630L5102K1417k207
1624B6729k2256l5042j262J6676j4676J84L0897n226K1282J0671l3086j7561O7107
1611D4437N823l873q970k1453M4624l4935j7565O1581o8273o3025M9670P188K0223
1598A5452J2335J6551P39N855q0667N1087Q5729m5844l3330j8583K1905l0009
1586A220k3039N168n3788L4089j0107j2784k3838M7962N2412K286n2916n6869
$$ y = [-123927, -94782, -43094, 24678, -19282, -10169, -38505, -51892, 35833, 2884, -10123, -6163, 45579, 31746, -32622, -68743, 43145, 69993, 53546, -21016, -18054, 5789, -77291, -86455, -69813, -80434, -104058, -44206, 17846, 39166, 11206, -31441, -25602, 31453, -42358, -51053, -17928, -31706, -25742, 19798, -17697, -15506, -8650, -6396, 12958, -12953, -27583, 7519, 28936, 26729, 4473, -30569, -31831, -15155, -29831, -29647, 1250, -3976, 17306, 27977, -5109, -22670, 44437, 50260, 46387, 37417, 15964, 60588, 25653, 8088, 69669, 1396, -61629, -11959, -4771, 15452, 27787, 44338, 45077, 50932, -29735, 21352, 107081, 61237, 27907, 9324, 31229, 1220, -21819, -16651, -70439, -36350, -46457, -59241, -83079, -35117, 17295, 19581, -33335, -90204]
1574i0204Q4637K7265K9965J0373k0897n1983n8833J7576J1349K7615K6024m2686
1562b9799j9107q190K753o0306J9824K3150R296l316L8780N0262r445k4995L2901
1549B1808q8598r11K2864m6571O0749N3448J1206j3671j4538N2696p6740n2915
1537g1173O1482J1514m8064J1576K9190j8649m5419N0307J475M9147K1734j46439
1525i3319k4138P1538m0094R996J3820J049j889L4617j3210q397R97m3696J45584
1512E2858m1469k5440N5002l889O119n5040r158J1122j1542J835N7697r1017P0541
1499A7619P4075j090n307r9170k5836j243Q0209r445L7491l8053j8516m3546Q218
1486b4594L5945k6389k0043K1601j7063J2722J5554j0172L093N6754q0863j9526
$$ y = [-90204, -5567, 21698, 51663, 62036, 41139, -10844, -69677, -52101, -40752, -13137, 12887, -29799, -48906, -57096, -54343, -114649, -94825, -71675, -62379, -65695, -26915, 23347, 13902, -11093, 21808, -66790, -67701, -44837, -91408, -30659, 22789, 33995, 20324, 5786, 58482, -18258, -71173, -9691, 1823, -46241, -34665, -5475, -24124, -69543, -19236, -17761, 31386, 53120, -93319, -117457, -45919, -86013, -76017, -62197, -61148, -63037, -28420, -41630, -50027, -49030, -92726, 52858, 11389, -14051, 40951, 37062, 43181, -11859, -21017, -9895, -21437, -19602, 38095, -52922, 17619, 91694, 90604, 85297, -13873, -39709, -40952, 39257, 29812, 67303, 29250, 10734, -32812, -24594, 11351, -15038, -35081, -13480, -30543, -17821, -2267, -12439, -9346, 47408, -33455, -52981]
1474e2981L6386l7521N9661K86m1863N1610j2919L6621l8969j2231N1665l474
1462C6271k5081M6188m7131q1109J0475P023o5397J0330P2861J5400M7191j6385
1450A0636k6297O6838k4599m17o913j1105J8677j6386M9840m1248q8127K0813
1438d8288J08541r0828K4770J2655k1588j3501r091M6856m2241J1873R059k9174
1426d0957k0355K418L0762L3630J8339p3304M9679J6284J4856p2652K4445L0294
1414A3439P0127k5035q4544k3394P9805J7542J2333l4822j0068J5494k2258L7557
1402D6176k3021j9546j337o6971o217L1881p627l949K0597P4846j2133K9787n457
1389E7029k4772J1229K560R597M50j0210k6295k2899p890R766j8046J4415N816
$$ y = [-52981, -16595, -54116, 5545, 5831, -36032, 15578, 2659, 39280, 311, -11920, 39745, 36271, 11190, 57378, 10247, -70862, -60387, -53364, -118761, -108431, -35570, -20170, 27021, 10636, -15661, 51177, 26578, 26161, 19248, 8143, 26820, 10434, 60274, 19026, -69101, -48288, 60253, -30575, -5805, 6850, -14738, -28239, -37330, 9526, -32715, -20842, -11783, -40957, -61312, -58894, -28132, 5498, 23837, -49467, 212, 16496, 31352, -41300, -16855, 13439, 83566, 58531, -26013, -49407, 30398, 47940, 60273, 25451, 15383, 30877, 8619, 46176, 23155, 3609, 2272, -64699, -70916, -39035, -46662, -50611, -30014, 44832, 32699, 62486, 57029, 32257, 43486, 46046, 55643, 56093, 45883, 19588, -3311, -11201, -1435, -19481, -5066, 750]
1376G50m8906q58K6098M8688R294r506M1136j1329o7967j0752k839O0470O344
1363D0623j07992r2521N2057Q4551K9350n0354K4724R184N4021o3514j4516l8158
1351g2545m7808N3246M9107N4367K5004j9636L6334j569n4972p4873k8289R61
1339h0673K5722N5273o5585j188M1915j8694K1954k1058M0442n5954j4871P3269
1327E52L4354l8969j977j0549K2308M7710k7764P621K8671j4897m6233L56o3820
1314f2637n8037j8650Q9050P4565p0672K5725N7129N3690m1127k6986L1573m002
1302D9621n7169n233K553o7372O3960j5346l939J1376K0012j7928L9923J1253
1290C1711j12048j6797R9621o455m7566M1946k7782J3878N6841L3342k3453P408
$$ y = [750, -48156, -49014, -22916, 25772, 35066, 25560, 66696, 55367, -12600, -23352, -26191, 34279, 40623, -67369, -159890, -107833, -23282, 6068, -44286, -19562, -10378, 43643, -19871, -34387, -72545, -120353, -67107, -18000, 36367, 61371, 41735, 78069, 76500, 21528, -53345, -81634, -80673, -54951, 322, -65263, -66451, -24536, -43230, -21276, -42334, -1892, -57846, -72717, 552, 34906, -4063, -6040, -16589, 5719, 53429, 25665, 33286, 61957, 47060, 827, 1183, -62637, -120674, -139324, -50274, 24291, -46381, -20656, 36473, 90163, 49036, 22050, 53623, 49621, -7548, -12781, -10228, -77600, -13640, -28986, -32925, -21549, -1537, -19465, 20458, 31711, -80337, -97134, 2487, -3968, -51534, -9588, -37370, -23492, 33349, 66691, 43238, 50646]
1278E0646n8296k7479L2259R450K9389j4995p939K7246m0891r8551R5872J0406
1266G117n449o7864l2972L2744M5206L2254K1173k9387K5042j9617l0473p9103
1254a01329K245N8503l5563p87O2550J2175J0820o0858j0586M8505L096q3081
1242i4310j7917M1692l5572L1815P2818m0247J9130N3371J421j0186K6439m2442
1230F012o713l1828L9656j7833k7355K127J1581k2151j621L4043k0104M2371K001
1217A0186l7787j2097L1557M2297l7755l7608J00236l5500m1094l1215N8659m6738
1205c6859k911j979L0129M7662N147K7987k1085j422Q3605l0810r0176k4833j622
1192a7167j9303O2773k9579l3417N2907J9275l0204Q78n5970k3978N5782N6703
$$ y = [50646, -7650, -35129, -2870, 6580, 35969, 20974, 13035, 40281, -610, -99161, -3289, 7117, 1668, -66196, -99168, -66424, -21218, 11036, 32209, 2822, 27864, 8247, -22226, -101329, -99084, -40581, -76144, -76931, -14381, -2206, 8614, -52244, -62830, -14325, -11229, -94310, -112227, -70535, -106107, -74292, -1474, -41721, -22591, 30780, 32201, 22015, 48454, 6012, -701, -32529, 7127, -10706, -38061, -35934, -24353, -46504, -48125, -14082, -34186, 8185, 10186, -27601, -39698, -8141, 34156, -3599, -41207, 59029, 23529, -17565, -48780, 9879, -36859, -39770, -41749, -11620, 36042, 41189, 69176, 48091, 46669, 130274, 99464, 9288, -15545, -17167, -36470, 26303, -3276, -36693, 16214, 35489, 5285, 6163, -49807, -73785, -18003, 38700]
1180C8700k0540K0796n660K6585k2343j02944L2739L6060R288Q791J3875J4405
1168D9752l3387n9145L2106J2986k7515L4202N88m3207m1016P2488j4027o0287
1156g6462M1492j8288n6974P2479R9349m9966J283k8659k7103N4136m587J3199
1144A9899l4741l4002N0328j0098M408k623J0838J2947k0314N887l445L3378l1900
1131E62q805o7248K5560M1755m0444r76K8962N3026M1087J5476k497n4362q043
1118B4053j7662j9420l1787m5800J2495K8618m147J5729O263m814J1755l4641
1106e9358N0245L2488l5542j1914j8741K356L4473l0322P1054M9145q397m4722
1094C0765r9462k030M6675j7860N7069o4562m1782N071P3392k1183M5387R524
$$ y = [38700, 18160, 38956, 33296, 59881, 37538, -65406, -32667, 3393, 12681, 21472, 35347, 49752, 16365, -42780, -10674, 2312, -25203, 8999, 9587, -33620, -74636, -2148, -16175, -76462, -34970, -53258, -110232, -37753, 61596, 11630, 12913, -15746, -42849, 11287, 6700, 19899, -14842, -48844, 1484, -8614, -4206, -6829, 4009, 16956, -3358, 2529, -916, 32462, 562, -8243, -75491, -49931, -8176, -48620, -49596, -20634, 32392, 73479, 88955, 86458, 32096, 24053, 6391, -13029, -44816, -90616, -78121, -49503, -53650, -37921, -31658, -36472, -24717, -59358, -9113, 23375, -12167, -24081, -42822, -40466, -5993, -36315, 34739, 83884, 75487, 30765, -68697, -70727, -24052, -41912, 15157, -49405, -91187, -86116, -12724, -33907, 11480, 21004]
1082B1004m6155j4201k3552L5369j3010l2326K0090M3542L368R140k387L041j1047
1069g124L4211m026J1262J3018n1621L505L4283j7689k6665J4762M4385m6744
1057A557o1907K9254M1885M9952m5503j2978L1475L5978j5992r2209l3363O040
1045f5811R0797l0524j5394R287J3698r292L273J4032J2543M4496J1102o153o4601
1032G453L6538J6512l795n0294L050o0778M6662M1566j075q7868P2325L584j8210
1019E670J5175P361J8673p5761L3114J5725M7284l9609o949K3215n7042l2272
1007d5416K6182j7919M1814J2900J4115Q067l5205L5016K0314k9364J7360k7997
995A9867p1079O8033J8707j2152Q370L549k7716J6142m3639o8837J7453j7117
$$ y = [21004, -25151, -39352, -62904, -27535, -40545, -72871, -52781, -9239, -5871, 3269, 882, 3923, -7124, 27087, 23061, 34323, 47341, -4280, -775, 33508, 15819, -10846, 3916, 48301, 1557, -60350, -31096, 10789, 60741, 15238, 2260, 33735, 69713, 53721, -38488, -71851, -65811, 24986, -5538, -20932, -11645, 2053, -7239, -3966, 10066, 22609, 67105, 78207, 72054, 7453, 43991, 60503, 56708, 6414, 9464, -51314, -4652, 36914, 35839, -52029, 20296, 23880, 5670, 20845, 28206, 46879, -28882, 4232, 19957, 67241, 27632, 20683, 43898, -13144, -45416, -19234, -37153, 4661, 17561, 31676, 39743, 4538, 39554, 59868, 30504, 47864, 19867, -51212, 16821, 35528, 23376, 31746, 35295, 7579, 23721, -19918, -88755, -71302, -88419]
983h8419L9951J4970K0609k0245m500J0274m7214O597M0437n0287l9613K3112
971i4328J1770O8746Q645L7230L647l4493n8173n4436M050K6884Q4087k9304K9929
958D254p1482k1276L2045O3658m8081M1789L3121k8412k517K033k8985L4431j31233
945a20655J1995M4591M7265J534k2287j8137J1290N190J8416K487q091L1863n0361
932d4900M3019K4413J4954m1992J4470j0886n6398k936J1447N5771L780k9738
920a8996J8042m3097M2506Q351l1135q602O599k0256M9982l3579K5191O8588n471
907E8123R514q7179m0158L3501j5150j1969n436R0963l0532O72N713R234n0776
894c3480j1758M8878o3384J1816K8062J9032M2016n2983l8635K6073L4823k8591
$$ y = [-88419, -48468, -33498, -12889, -33134, -37634, -27360, -74574, -67977, -27540, -77827, -117440, -94328, -82558, -13812, -5167, 32063, 35710, 1217, -56956, -111392, -107342, -80458, 3629, -25675, 4254, -67228, -88504, -56459, 7199, -40882, 907, 34028, 5616, 3099, 5132, -23853, 10578, -120655, -108660, -64069, -16804, -15270, -37557, -55694, -44404, -39214, -20798, -18311, -26402, 5461, -44900, -1881, 22532, 37486, -4506, 9964, -922, -57320, -60256, -48809, 6962, 10742, -18996, -954, -44051, -1545, 6806, -24329, -32931, -26332, -46588, 3394, -30185, -4994, 63594, 58123, 67637, -19542, -59700, -26199, -41349, -53318, -58754, 32209, 1677, 2349, 8062, 17296, -33480, -45238, 3640, -59744, -47928, -19866, -834, 41182, -11801, -50436, -24363, 10460, -18131]
882a8131o393N3710o3308l7620l2904O2943N1627m4190K4332L3491l8910l311
870a8664L6555j7211K629j7452Q551J9697J641N4016Q0905o7963j36238L2999
858b0535K4435k4986J7809M9983j0226J0023j5412m0473j3437M4463N017k4674
846A987R2R459l2848J4553L8687l0170L5266l6183l5515j7675M9816k5999L9212
833A0682N60J9247j05650K9422O9787R1191j0766j9776M7686n5924m3177j1171
821B2111j3734k2013M2999K8597m8918k854N7858l3372L811J8344n5216L8952
809C6565J3763n5616r163L2289k8408P8001O7563o1666m213k3788j474m1052K4901
796B7702o307n32l7652j9024r860n3223L3266k56K4020K9153l3938L1974O0089
$$ y = [-18131, -24524, 29186, -34122, -71742, -104646, -41703, 9924, -34266, -9934, 23557, -15353, -18664, 17891, 680, 3309, -14143, -5592, 14105, 15746, 69762, 150667, 82704, -53534, -20535, 3900, -21086, -3277, 46706, 36480, 46503, 31091, -9382, -22819, 21644, 26661, 1987, 2079, 11538, -21310, -6757, 31930, 1760, 37026, 843, -34672, -52347, -2531, -28530, 10682, 11242, 30489, -75161, -45739, 24048, 115239, 104473, 84697, 132383, 76459, 33282, 22111, 8377, -13636, 29363, 57960, 9042, 6188, 64046, 30674, 34485, 52829, -2387, 36565, 50328, -5288, -14451, 17838, -10570, 67431, 134994, 73328, 69115, 45327, 43853, 2801, 27702, 21395, 20863, -16789, -35813, -45673, -98896, -65630, -65886, -41866, -12713, -46651, -14677, 45412]
783D5412K4193N186L5725p737m1996l9714K4228m287J2080m1926l6201P4621m7130
770B454o4817R3910M741J6618l9443L7193j3405j7522K782l0405K058K6748n8944
757c8032l744m2392O6241R3411J8187q9548o4344L9488m4804L6636Q4441l0324
745B5216J1494J5638R695p4920k2734m9400L6750Q8067R373l1088k7803j5447
733b5159R2825N100p4252K283M348l4864J7844N0095l6148J890n3466O8774O375
720B5645k5173J2119l4757L7844J0761k8851O3316n0344k0292J304N2283m5670
708a815p6983Q454O2703q536l5866M8772J1072M5455l9581q7081P6665J7994Q3824
695A05077J1398j7276q9436k5173J8342J6892j5998L9689m7118l613M2865m441
$$ y = [45412, 69605, 74791, 110516, 102779, 60783, 21069, 45297, 41010, 53090, 11164, -25037, 49584, 2454, -62363, 31547, 36288, 52906, 13463, 50656, 37251, 19729, 22511, -7894, -5836, 20912, -38032, -41776, -84168, -17927, 75484, 93671, 4123, -60221, -20733, -65537, -28901, 55540, 25216, 36710, 52348, 62043, -12877, -35611, -85011, -48261, 39806, 49179, 18091, -9712, -25159, 67666, 72766, -1486, 797, 5145, -29719, -11875, 38220, 2072, 3962, -49504, 19270, 25645, 472, 12591, -22166, 15678, 26439, -2412, 60904, 10560, -9732, -8428, 43855, -1815, -78798, -70344, -7641, -16177, -52043, -3271, 7801, 53256, 13675, -73406, 3259, 21253, 105077, 116475, 99199, 9763, -15410, 2932, 19824, 3826, 43515, -3603, -7216, 35649, 31208]
683C1208M0443j9158m3556P414r5079Q4718K2350q0235J9872m4348o9454M7015
671i8810J05249j1903k5083K7010M5785o4039n6687O0062L4177l7942l351L4333
659H801p95j8114l605N0180R939o1816k2707k5347J07728p114o7489L0589J6298
646A6548L4305o6338L2163N2350m2554J3822n855L1238r39k4922l7787N3861o883
633D9009l0889J7918M8743q4051n5447J6305K8257L2759k5873j948k6379q006
621c9602N6417N0715j68r5404n4436O4708J9288l2626k5894L2023Q6356m4457
609A6920o538L1065l6282n9356k678M7612m9855l2684K0170J9615n7338K9321
597h0028M5618O3710M8970j23504L4535K0982L0486l748R099n5670j5755J7131
$$ y = [31208, 71651, 52493, 8937, 16351, -78728, 5990, 28340, -51895, -32023, -76371, -145825, -98810, 6439, -5464, -30547, -3537, 42248, -21791, -78478, -18416, 15761, -22181, -25532, 8801, 8006, -10108, -13713, 36467, 46406, -15410, -38117, -63464, 44264, 37150, -30339, 250, 16548, 50853, -15485, 16678, 69028, 26474, 40296, 34441, 65679, 64740, 39818, 2031, 55892, 49009, 18120, 36038, 84781, 730, -54717, -38412, -10155, 22604, -3269, -5217, -31596, -39602, 16815, 67530, 67362, -28042, -82478, -17770, 1518, -31108, -57002, -24979, 61377, 16920, 10382, 41447, 5165, -54191, -56869, -9257, -59112, -91796, -71626, -52011, -109349, -80028, -34410, 29300, 78270, -45234, -10699, 10283, 40769, 37021, 46120, -9550, -25305, -8174]
585h174L0816n2933J9729Q196M6493o0818k5091N1904q163l611l5421N8712j0367
572A1272k2592m7548R8506K2639m4959p120p114K2826K2274l8052o810m0697M3061
559E686J0571q800k2511L5419K2210j3243L7136m3079m0447k338M1214K1395R351
546E2564o118j9826J373k9456Q456j865j05O1419m2997k1222O2040m7354P1877
533H8786j7826j0293m263q6621K9421m1395j9764Q2521m7460M1315K5742K1007
521F1170J1009k9784k3989l8030n483k188R9496m4197r5417j3115L9821l071J4775
508b9003N4076k9814Q5500J9850j6113j6999j6409n3366k9211l9714K9377N8605
496A6779o5163r242M0520M8670j7710r153k7585k5305K4721k728J5997Q051J7763
$$ y = [-8174, 22642, -30291, -10562, -2366, 44127, -16691, -41782, 10122, 1959, -1652, -37073, 21639, 11272, -11320, -58868, 39638, 62277, 17318, 10198, 3084, 25910, 48184, 10132, 3322, -37375, 5686, 16257, 7457, -15054, 20365, 42575, 29332, 66468, 23389, -17058, -19396, 21818, 43213, 52564, 46446, 26620, 27993, -1463, 6993, 5128, 5023, 66442, 23445, 2223, 64263, 16909, 88786, 70960, 60667, 56404, -30217, -796, -42191, -61955, 20566, -26894, 14421, 40163, 61170, 72179, 42395, 18406, -19624, -25107, -27295, 72201, 28004, -67413, -80528, -40707, -43778, -29003, 25073, -4741, 80759, 100609, 84496, 67497, 51088, -2278, -31489, -71203, -41826, 16779, -48384, -57626, -17106, 31564, 13854, 4701, -22884, -48189, -23468, -26196, -10199, -2148, 15615]
483A5615K089m0610J8166l3910O5276k4227n3820j2022n5440P2171M3840K7521
471B4649M8142k9907L084p776J0108L9776n8218n6525K5571Q391Q756P451P6671
458A00173k7337j3350r654l8404J5069n0965j5282K4616l410L1998K5996m1739
446b289P148k0710n5836P2476r13K1943q0343M181M4258R880m2409L5779M2916
433C6081m7525J3179M9411J0199j1316n1893k9216K5306R716K5321O076O2344
421I7683n7493K2357k8775l7222j9536K5652L1494n8182K2386J5760m2585j9206
409d7667j7644O0256j9115l0174k7844J03515J1054n2539k9953l0135P1123O764
397b359J8005o3042q4492L3220O8763k0901p053l222O7689N431n9447M3656j3322
$$ y = [15615, 17704, -22906, -4740, -38650, 26626, 2399, -51421, -63443, -118883, -46712, -2872, 24649, 72791, 42884, 45968, 38192, 48300, 88076, 29858, -26667, -1096, 7295, 16051, 23502, 100173, 72836, 59486, 49832, 11428, 26497, -24468, -39750, -15134, -18544, 13454, 39450, -2289, 4859, -15851, -71687, 789, -124, 21819, -58524, -54343, -10085, -205, -42614, -6835, 36081, -11444, 1735, 51146, 61345, 50029, -1864, -31080, -5774, 3942, 29263, 35339, 97683, 40190, 62547, 33772, -3450, -22986, 2666, 34160, -24022, -1636, 14124, -28461, -47667, -65311, -5055, -24170, -54344, -82188, 21327, 32381, -20158, -50111, -80246, -9123, -2359, 15646, -47396, -131888, -98668, -29905, -50806, -57859, -61081, 6608, 12039, -47408, -3752, -17074]
384a7074k6075n3498R9927m0387K1011J8029J1294N458l0087N5124n9330M1409
372B5801J7618L3201p2615J1074l4057j4050O4614k3425k5632K447R3108o7304
360A0780q6624l838L0582k67J2533M010j3654J4130p3546O998M5828N8966j8069
347a2171n026O7464n7588J9976M8539n2125m8392m9018O848J9265K7334n5355
335i0249M6921L2933J4034k8004k2731R651k2770L7601M5780J9451p2808J503
323b8688l521P035O378J1000p6737l2291L2306N2519P2128J8027n398J0532r1293
310b8003k0558M8217P399M1232l0592k1053p69r01k421o5800M0157N015M6564
297A8487o3147o2276J06135k585q1998J3560L7464j3504P094l7833m741J6790
$$ y = [-17074, -43149, -96647, 3280, -37107, -16096, 1933, 13227, 18685, -11402, 43722, -15608, 25801, 43419, 76620, 4005, 15079, -18978, -33028, 31586, 8161, -17471, -15024, 78084, 10780, -75844, -79682, -49100, -49367, -36834, -32824, -46478, -32348, -105894, -98896, -53068, 5898, -12171, -17197, 50267, -7321, 12655, 61194, 9069, -39323, -88341, -81493, -62228, -34894, -90249, -43328, -10395, 3639, -24365, -47096, -37445, -60215, -22614, 23166, 42617, -30191, -28688, -32209, -25174, -18796, -7796, -84533, -116824, -84518, -31999, 40129, 58156, 52758, 63290, -28003, -48561, -344, 7055, 48287, 17695, -3358, -4127, -5028, -7449, -73249, -33092, -28077, 18487, -44660, -106936, -801, -3386, -85384, -71824, -34360, -47864, -40770, -78603, -83344, -66554]
285f6554N7338j1201m1167m2941M3077L0394O061M854J7223j095k9214M2302m3358
272c4281o6455J24809K0342p0482J1647m7751l0737M8585O5462j4877n5982q9001
260a38721Q0188N1928o7590n555k4390O9287O741M9741p5379K1653K5932k931
248i096j5j0724k5038K0055j3747J0509q810o4822J9745j9588J3574J6264L044
235f8649L7186K8996k7337j0897j1491Q4964k8871l7221k9609p172Q4532l1081
223a6650K1104P6391j5586p5131m66L1865l1940K934l72J5924J4066J7320l13
210C9146m7423J7678j7642n5656K6032Q286J9089J3743M0516m6684k7224R457
198b0682L8000j3375j1908J6747m7329J378J0859J3721m588r721P132j6170n0011
$$ y = [-66554, -9216, -20417, -61584, -104525, -61448, -31054, -24993, -20139, -2916, -4011, -33225, 9077, -34281, -100736, 24073, 44415, -26067, -14420, -62171, -92908, -44323, 21139, 6262, -49720, -138721, -58533, -6605, -74195, -79750, -104140, -34853, -28112, 21629, -53750, -32097, -6165, -9096, -9111, -19835, -44873, -24818, -38565, -28056, -36866, -101688, -81943, -101531, -87957, -71693, -68649, -31463, -2467, -29804, -40701, -52192, 32772, 3901, -33320, -62929, -70101, 14431, -16650, 4454, 80845, 65259, -9872, -10338, 21527, -10413, -7479, -7851, 8073, 22139, 39459, 39146, -8277, 9401, -8241, -63897, -37865, -29579, -10490, 3253, 43769, -2915, -30139, -20682, 17318, 3943, -7965, 8782, -38547, -37169, -26310, -12589, -17177, -26898, -19766, -35936, -85947]
185h5947m8466O6011Q6375Q2268l3353J6527o5339m523n6862P415m9245j186M9817
172c6508l3762M6931o045N951k1995l8329m279J9458l6474O1405p748J7585J6084
159a7726j4301J9179J7605m9754N5787l3324K1845j8880k6490k0326l950M9311
147b1024k4871k476k4745J6812K8923K0267L0298K5165p2051L0519K25q4102L7049
134d0011l9013j9641M7116L9165J0636m738J7175k8314K3912K5453j8668j1593
122A479j23k0254M589r399k4302j2104J4537m3907O5280O1612m5190O6361M2936
109A01515p8568m6146k4806k7315p194k3751L0366N51L2510m3138L5305k254l3360
96h6285M8651q335j6834J835k604L8693K3238K1715J8024J0429n7863J5608j8430
$$ y = [-85947, -134413, -68402, 17973, 100241, 66888, 83415, 18076, 13553, -43309, -35894, -85139, -86325, -36508, -70270, -23339, -29384, -23433, -45428, -83757, -88036, -68578, -105052, -43647, -51395, -33810, -17726, -32027, -12848, 4757, -44997, 10790, -22534, -689, -19569, -46059, -66385, -70335, -21024, -45895, -48371, -73116, -56304, -27381, -7114, 23184, 48349, -23702, 6817, 7042, -77060, -40011, -79024, -98665, -51549, -12384, -1748, -6486, 10689, -17625, 6287, 31740, 13072, 1479, 1356, -18898, -14309, -23708, -48010, -60114, -45577, -89484, -24204, 37408, -7782, 58579, 101515, 22947, -23199, -48005, -75320, -82514, -106265, -75899, -75348, -42838, -85976, -50671, -52925, -86285, -37634, -45969, -62803, -60968, -63572, -24879, -1641, 20074, 38098, 48527, -9336, 6272, -12158]
83a2158j3005j0943l0564O863j9175M1918K4305K8983q932J3033j0683j9121j8094
70b7573m435M14n416J1668l8433R134L2151j7018l4938J4384L2177m2026K983
57f6928k868K6555K8850L1405j2147l0349o366J2891r897n9216L2553J4140K208
44c9169M5114k6030k4798Q736L4069l3281P005K6492q473J5767Q752j5389n563
31f768j4661l937j6956j9640k640M1528K274k844m502K4248j3594k4662J7713
18b4441k2039j0134J6251p542j6972N722Q690J8386j6557J7469J6437M8167m8357
5a4920l6102K1750J1350R96R607
0g319
$$ y = [-12158, -25163, -36106, -66670, -59807, -78982, -37064, -12759, 16224, 7292, 20325, 9642, -9479, -27573, -32008, -31594, -37010, -25342, -63775, -54641, -22490, -39508, -74446, -60062, -27885, -69911, -66928, -69796, -43241, -14391, 17014, 4867, -25482, -31848, -18957, -28854, -88070, -55517, -41377, -39169, 5945, -20085, -44883, -36147, -2078, -35359, -28354, -1862, -10335, 5432, 14184, -1205, -6768, -21429, -25366, -42322, -61962, -64602, -23074, -20800, -23644, -28146, -3898, -17492, -42154, -24441, -46480, -56614, -40363, -47905, -64877, -59155, -50465, -32079, -48636, -31167, -14730, 33437, -14920, -51022, -29272, -17922, -16926, -7319]
$$ Imaginary data points
##PAGE= N=2
##DATA TABLE= (X++(I..I)), XYDATA
16383a381553o2800M8073J6348l268M1021K6237l7283k781Q4769m1060J1545O9158
16371a231594J2791L3377M401j821J4426N1739M5948r898l595N2688L0260r306
16359a010584r733q223K4351L4894j2100J6959K3187R557K2954N4546Q178O3779
16347g82235m1272j1481L2796j1780M6187n392M2061N2194N664n0035L4098n314
16335f94509M7047N4451J2875m560R275j1801J173K9306N3988J0215K8684M5379
16323d18477K4523N346L709J5032J6284K2138M9184J044k9268k1027O4898K6706
16311b39908l9919N4399J4405M0314j8812m2807N7335M0691j9219J1084J3244
16300a29193k599K0805O2150J6461l5552M0515m3347O5621O9691m5268R523l2128
$$ y = [-1381553, -1444353, -1396280, -1379932, -1383200, -1342179, -1315942, -1353225, -1356006, -1271237, -1312297, -1300752, -1231594, -1218803, -1185426, -1181025, -1182846, -1168420, -1116681, -1070733, -1080631, -1084226, -1031538, -1001278, -1010584, -1020317, -1028540, -1004189, -969295, -981395, -964436, -941249, -931692, -908738, -854192, -846014, -782235, -823507, -834988, -802192, -813972, -767785, -773177, -731116, -678922, -673258, -723293, -689195, -694509, -647462, -593011, -580136, -584696, -575421, -587222, -586049, -556743, -502755, -492540, -463856, -418477, -393954, -388608, -384899, -369867, -353583, -331445, -282261, -281217, -310485, -331512, -266614, -239908, -279827, -225428, -211023, -170709, -189521, -232328, -174993, -134302, -153521, -142437, -129193, -131792, -110987, -48837, -32376, -67928, -27413, -70760, -5139, 64552, 19284, 28807, -3321]
16288c321J7634j3086O1831m299L992O1471K899k7042L4460j4724k1756O5259
16276A63318N8671K9133M4j7654j3576J6871J3397p8137M8379N5151K6252K9055
16264C30904M5638L2106l2556l2089J1130Q2856m3211j765L6497n365m887Q2498
16252E01756l189o6709K2170M4940K7291q174k7093L616J4568K4618J9485K5159
16240E78438j5441Q158j8212M0972P5967j1949K8622L2265m6214k1535j8707K3986
16228F56350M5717j7390j7215j6687L2801Q9305M6876k6228l2189n3794J2817
16217G20363j0206q143J866J3643K0998n2763K2045N7223J0299L9586N1110q4508
16205G81513j4048L9667m9550J8043M6460M6595m4300J6723L498N564K86O4991
$$ y = [-3321, 14313, 1227, 63058, 58759, 62751, 124222, 127121, 100079, 134539, 119815, 98059, 163318, 221989, 251122, 251166, 233512, 219936, 236807, 250204, 172067, 220446, 275597, 301849, 330904, 376542, 408648, 376092, 344003, 355133, 437989, 394778, 393013, 429510, 424145, 419258, 501756, 498567, 431858, 454028, 498968, 526259, 518085, 490992, 494608, 509176, 533794, 553279, 578438, 562997, 571155, 552943, 593915, 669882, 657933, 686555, 718820, 672606, 651071, 632364, 656350, 702067, 684677, 667462, 650775, 683576, 772881, 819757, 793529, 761340, 707546, 720363, 710157, 702014, 703880, 717523, 738521, 685758, 707803, 765026, 775325, 814911, 866021, 781513, 767465, 807132, 757582, 775625, 822085, 868680, 824380, 841103, 844601, 850165, 850451, 915442]
16193I15442J2745L4874J3130l0236j1963L2908K7692o5196N2956p80K8925o834
16181A003663n4271q072N382Q3905l097q0933n565r993k8744J6979L6812O9598
16169A025664J8783J9508k7527J4254q180j9929J9124K321j8175m3172L9044m6384
16157I75331L3655k1430L7535M1622r401q66P013J949l3507J1273M2149N0000
16145A135323Q1678p1862K425l5872J3179K020n117L1084m1696j2760j7150O623
16133A087875m864L7274l68j8275n4182O771P6761O6768j987k4279N8620p2985
16121A157129m4757P3546L0211m3597j7174M2581J557K0521O1430o2369q8534
16110A130544o245J9256q239L2263J2571m7659j4073M6804K3810n4838K8884K8395
$$ y = [915442, 928187, 963061, 976191, 945955, 933992, 966900, 994592, 929396, 982352, 981572, 1010497, 1003663, 949392, 941320, 946702, 1030607, 1027510, 946577, 941012, 931019, 902275, 919254, 956066, 1025664, 1044447, 1063955, 1036428, 1050682, 1042502, 1022573, 1041697, 1044018, 1025843, 982671, 1021715, 975331, 1008986, 987556, 1025091, 1066713, 1057312, 1056446, 1063459, 1065408, 1031901, 1043174, 1085323, 1135323, 1217001, 1145139, 1147564, 1111692, 1124871, 1126891, 1121774, 1152858, 1111162, 1098402, 1081252, 1087875, 1083011, 1120285, 1119917, 1101642, 1047460, 1054231, 1130992, 1197760, 1195773, 1171494, 1230114, 1157129, 1112372, 1185918, 1216129, 1172532, 1155358, 1197939, 1199496, 1220017, 1281447, 1219078, 1130544, 1124299, 1143555, 1135316, 1167579, 1180150, 1132491, 1118418, 1165222, 1189032, 1134194, 1163078, 1191473]
16098A191473K6776j8314m6998q75N3907J043l8106l1417N7092K2460n0732L4306
16086A200615O0168m2357l8103l8527L1661J6069K12M6519J8968M1669L8503j17679
16074A217718K7470L2704j16375k7262n332K2904Q4563M3475l4044q3780p82J9310
16062A180569J1845O4415m6379p7747M5218K426J8498n7553K4526L1491K1247
16051A218556m8938k9346l741O4938O258l0343K1329j5866j2267r077P7334M1184
$$ y = [1191473, 1218249, 1199935, 1152937, 1152062, 1205969, 1207012, 1168906, 1137489, 1194581, 1217041, 1166309, 1200615, 1260783, 1218426, 1180323, 1141796, 1173457, 1189526, 1189738, 1236257, 1255225, 1296894, 1335397, 1217718, 1245188, 1277892, 1161517, 1134255, 1128923, 1151827, 1236390, 1279865, 1245821, 1162041, 1161259, 1180569, 1192414, 1256829, 1210450, 1132703, 1177921, 1180347, 1198845, 1141292, 1165818, 1197309, 1218556, 1169618, 1140272, 1136531, 1201469, 1207727, 1177384, 1198713, 1182847, 1170580, 1161503, 1238837, 1280021]
$$ [...]
##END NTUPLES=NMR SPECTRUM
##END=
