##TITLE=1H_DE-80H_X3
 200.13MHz, d2o
 8 sc
 
 19ns.26.2.2025
##JCAMPDX= 6.0         $$ Bruker NMR JCAMP-DX V2.0
##DATA TYPE= NMR SPECTRUM
##DATA CLASS= NTUPLES
##ORIGIN= UXNMR, Bruker Analytische Messtechnik GmbH
##OWNER= pz
$$ XWIN-NMR		Version 3.5
$$ Thu Jul  2 10:34:20 2026 Russian Standard Time (UT+4h)  Yarkov@DPX200
##.OBSERVE FREQUENCY= 200.1313
##.OBSERVE NUCLEUS= ^1H
##.ACQUISITION MODE= SIMULTANEOUS
##.ACQUISITION SCHEME= undefined
##.AVERAGES= 8
##.DIGITISER RES= 18
##SPECTROMETER/DATA SYSTEM= spect
##.PULSE SEQUENCE= zg30
##.SOLVENT NAME= CDCl3
##.SHIFT REFERENCE= (INTERNAL, CDCl3, 0, 15.5519)
##AUDIT TRAIL= $$ (NUMBER, WHEN, WHO, WHERE, WHAT)
$$ ##TITLE= Audit trail, XWIN-NMR		Version 3.5
$$ ##JCAMPDX= 5.01
$$ ##ORIGIN= Bruker BioSpin GmbH
$$ ##OWNER= Yarkov
$$ C:/Bruker/XWIN-NMR/data/yarkov2/nmr/H-C/1/pdata/1/auditp.txt
$$ ##AUDIT TRAIL=  $$ (NUMBER, WHEN, WHO, WHERE, WHAT)
(   1,<2026-07-02 10:33:27.64 +0400>,<Yarkov>,<DPX200>,
      <created by zg, POWCHK disabled, PULCHK disabled
       configuration hash MD5:
       00 E9 B6 7A A2 85 ED C7 34 08 36 98 17 FE 4E 26
       data hash MD5: 16K
       F4 B6 B0 3D 1B 15 45 AB 58 08 0E 71 AD 4C 46 6C>)
(   2,<2026-07-02 10:33:38.90 +0400>,<Yarkov>,<DPX200>,
      <Start of raw data processing
       efp BC_mod = 2 LB = 0.25 FT_mod = 6 PKNL = 1 PHC0 = -6894.148 PHC1 = 6.42196 SI = 16K 
       data hash MD5: 16K
       75 DC 24 5E 37 27 88 DD 66 23 10 8C DB 00 F8 CA>)
$$ ##END=
$$ 
$$ hash MD5
$$ 32 3A E2 B7 00 C0 2B 93 1B BB E5 43 69 47 65 AB
##$RELAX= 
##$RELAX= 
##$RELAX= 
##$RELAX= 
##$RELAX= 
##$RELAX= 
$$ Bruker specific parameters
$$ --------------------------
##$DU= <C:/Bruker/XWIN-NMR>
##$EXPNO= 1
##$NAME= <H-C>
##$PROCNO= 1
##$TYPE= <nmr>
##$USER= <yarkov2>
##$AMP= (0..31)
100 100 100 100 100 100 100 100 100 100 100 100 100 100 100 100 100 100 
100 100 100 100 100 100 100 100 100 100 100 100 100 100 
##$AQSEQ= 0
##$AQ_mod= 1
##$AUNM= <au_zg>
##$AUTOPOS= <>
##$BF1= 200.13
##$BF2= 200.13
##$BF3= 200.13
##$BF4= 200.13
##$BF5= 200.13
##$BF6= 200.13
##$BF7= 200.13
##$BF8= 200.13
##$BYTORDA= 1
##$CFDGTYP= 0
##$CFRGTYP= 5
##$CHEMSTR= <none>
##$CNST= (0..31)
1 1 145 1 1 1 1 1 1 1 1 1 1 1 1 1 1 1 1 1 1 1 1 1 1 1 1 1 1 1 1 1 
##$CPDPRG= <>
##$CPDPRG1= <>
##$CPDPRG2= <>
##$CPDPRG3= <>
##$CPDPRG4= <mlev>
##$CPDPRG5= <mlev>
##$CPDPRG6= <mlev>
##$CPDPRG7= <mlev>
##$CPDPRG8= <mlev>
##$CPDPRGB= <>
##$CPDPRGT= <>
##$D= (0..31)
0 0.7 0 0 0 0 0 0 0 0 0 0.03 0 0 0 0 0 0 0 0 0 0 0 0 0 0 0 0 0 0 0 0 
##$DATE= 1782974007
##$DBL= (0..7)
120 120 120 120 120 120 120 120 
##$DBP= (0..7)
150 150 150 150 150 150 150 150 
##$DBP07= 0
##$DBPNAM0= <>
##$DBPNAM1= <>
##$DBPNAM2= <>
##$DBPNAM3= <>
##$DBPNAM4= <>
##$DBPNAM5= <>
##$DBPNAM6= <>
##$DBPNAM7= <>
##$DBPOAL= (0..7)
0.5 0.5 0.5 0.5 0.5 0.5 0.5 0.5 
##$DBPOFFS= (0..7)
0 0 0 0 0 0 0 0 
##$DE= 6
##$DECBNUC= <off>
##$DECIM= 32
##$DECNUC= <off>
##$DECSTAT= 4
##$DIGMOD= 1
##$DIGTYP= 9
##$DL= (0..7)
0 120 120 120 120 120 120 120 
##$DP= (0..7)
$$ [...]
##$SUBNAM2= <"">
##$SUBNAM3= <"">
##$SUBNAM4= <"">
##$SUBNAM5= <"">
##$SUBNAM6= <"">
##$SUBNAM7= <"">
##$SUBNAM8= <"">
##$SUBNAM9= <"">
##$SW= 18.0517328524113
##$SWIBOX= (0..15)
0 0 2 0 0 0 0 0 0 0 0 0 0 0 0 0 
##$SW_h= 3612.71676300578
##$TD= 16384
##$TD0= 1
##$TE= 0
##$TE2= 300
##$TE3= 300
##$TEG= 300
##$TL= (0..7)
0 120 120 120 120 120 120 120 
##$TP= (0..7)
150 150 150 150 150 150 150 150 
##$TP07= 0
##$TPNAME0= <>
##$TPNAME1= <>
##$TPNAME2= <>
##$TPNAME3= <>
##$TPNAME4= <>
##$TPNAME5= <>
##$TPNAME6= <>
##$TPNAME7= <>
##$TPOAL= (0..7)
0.5 0.5 0.5 0.5 0.5 0.5 0.5 0.5 
##$TPOFFS= (0..7)
0 0 0 0 0 0 0 0 
##$TUNHIN= 0
##$TUNHOUT= 0
##$TUNXOUT= 0
##$USERA1= <user>
##$USERA2= <user>
##$USERA3= <user>
##$USERA4= <user>
##$USERA5= <user>
##$V9= 5
##$VALIST= <valist>
##$VCLIST= <CCCCCCCCCCCCCCC>
##$VD= 0
##$VDLIST= <DDDDDDDDDDDDDDD>
##$VPLIST= <PPPPPPPPPPPPPPP>
##$VTLIST= <TTTTTTTTTTTTTTT>
##$WBST= 1024
##$WBSW= 4
##$XGAIN= (0..3)
0 0 0 0 
##$XL= 0
##$YL= 0
##$YMAX_a= 195120
##$YMIN_a= -185659
##$ZGOPTNS= <>
##$ZL1= 120
##$ZL2= 120
##$ZL3= 120
##$ZL4= 120
##$ABSF1= 0
##$ABSF2= 0
##$ABSG= 0
##$ABSL= 0
##$ALPHA= 0
##$AQORDER= 0
##$ASSFAC= 0
##$ASSFACI= 0
##$ASSFACX= 0
##$ASSWID= 0
##$AUNMP= <proc_1d>
##$AZFE= 0.1
##$AZFW= 0.1
##$BCFW= 0
##$BC_mod= 2
##$BYTORDP= 0
##$COROFFS= 0
##$CY= -3
##$DATMOD= 1
##$DC= 0
##$DFILT= <>
##$DTYPP= 0
##$F1P= 0
##$F2P= 0
##$FCOR= 1
##$FTSIZE= 16384
##$FT_mod= 6
##$GAMMA= 0
##$GB= 0
##$INTBC= 1
##$INTSCL= 3.241238e-09
##$ISEN= 128
##$LB= 0.25
##$LEV0= 0
##$LPBIN= 0
##$MAXI= 10000
##$MC2= 0
##$MEAN= 0
##$ME_mod= 0
##$MI= 1.114404
##$NCOEF= 0
##$NC_proc= -6
##$NLEV= 6
##$NOISF1= 3.799351
##$NOISF2= 2.8
##$NSP= 0
##$NTH_PI= 0
##$NZP= 0
##$OFFSET= 15.55187
##$PC= 1
##$PHC0= -6894.148
##$PHC1= 6.42196
##$PH_mod= 1
##$PKNL= yes
##$PPARMOD= 0
##$PSCAL= 0
##$PSIGN= 0
##$REVERSE= no
##$SF= 200.129993962367
##$SI= 16384
##$SIGF1= 3
##$SIGF2= 2
##$SINO= 0.751879
##$SIOLD= 32768
##$SREGLST= <19F.Aceton>
##$SSB= 0
##$STSI= 16384
##$STSR= 0
##$SW_p= 3612.71676300578
##$SYMM= 0
##$S_DEV= 0
##$TDeff= 16384
##$TDoff= 0
##$TI= <>
##$TILT= no
##$TM1= 0
##$TM2= 0
##$TOPLEV= 0
##$USERP1= <user>
##$USERP2= <user>
##$USERP3= <user>
##$USERP4= <user>
##$USERP5= <user>
##$WDW= 1
##$XDIM= 16384
##$YMAX_p= 310128804
##$YMIN_p= -487259
$$ End of Bruker specific parameters
$$ ---------------------------------
##NTUPLES= NMR SPECTRUM
##VAR_NAME=  FREQUENCY,     SPECTRUM/REAL,   SPECTRUM/IMAG
##SYMBOL=    X,             R,               I
##VAR_TYPE=  INDEPENDENT,   DEPENDENT,       DEPENDENT
##VAR_FORM=  AFFN,          ASDF,            ASDF
##VAR_DIM=   16384,         16384,           16384
##UNITS=     HZ,            ARBITRARY UNITS, ARBITRARY UNITS
##FACTOR=    0.220516191357247, 1,           1
##FIRST=     3112.39571846237, 0,            0
##LAST=      -500.32104454341, 0,            0
##MIN=       -500.32104454341, -487259,      0
##MAX=       3112.39571846237, 310128804,    0
$$ Real data points
##PAGE= N=1
##DATA TABLE= (X++(R..R)), XYDATA
$$ [...]
7148c0741k689K9939K4846j0304j5355J0360j8334r7L044J2643K8977r114K8823
7135E1998J3937j7822k3728L445M574j1257J8091k2595j6997L428L5649M786k7587
7122A5922J2390j2398j2721M2766j0148J3610P397K765L9813J8433J66j996J2623
7109A28622j1759J1247K8042r873L9046r981q588K4988L6228Q0999O3181Q3852
7097D56004N7975J16772J62958K30939L52303O68105R56501Q20909R49466O39952
7087E411884J11386O2977m33553q57673r78647p95645o05093m95393l85726k51309
7077G83208j42592j31629r2243k3694l6862n3744m9323m3658J8649k3773k9169
7066A75170j3702J137p730J136k8913j1242j570j6838k3406J4842N128k1064m568
$$ plain form
7148 -30741 -33430 -3491 21355 11051 -4304 6056 -12278 -12375 -9331 3312 32289 23175 51998
7135 51998 65935 48113 24385 27830 32404 21147 39238 16643 -354 3074 38723 43509 15922
7122 15922 28312 15914 3193 45959 35811 49421 56818 59583 99396 117829 117995 115999 128622
7109 128622 116863 128110 156152 146279 185325 175344 166756 191744 227972 308971 372152 456004
7097 456004 513979 630751 793709 1024648 1376951 2045056 3001557 3822466 4771932 5411884
7087 5411884 5523270 5586247 5152694 4295021 3316374 2520729 1915636 1420243 1034517 783208
7077 783208 640616 508987 416744 393050 356188 302444 253121 209463 228112 204339 175170
7066 175170 161468 162605 154875 156011 127098 115856 114286 97448 74042 88884 94012 72948 68380
7053F8380r335K8894p645m1502j4325j3096n788Q309J3387m366l6300l93K2329
7040H549O085L444l356k4404m634K5372K3677j3363j9623k7181M236N1386j0331
7027A9857O496n626n902k0449k6946K3123M770J6758k8800P308k3971K9972L0522
7014B7112r41J6324p785j9594j1608l5693k4929J2976N43L6934o186k0324J7646
7001a5525o955k0354Q122n433J0927l554J1248J8591k1717r279K91R170J9271
6988e197J5044j3523k0982N225j9159K0650N972j3492O450J3457n870k3223k5911
6975f0559l185K1756j554n132J2448K4413P405Q96j4722k4779P75l5742k2215
6962a00195L2021K9042m31P598k1966o990j941m5392J2630K2749L8418k5542j722
$$ plain form
7053 68380 59045 87939 80294 38792 24467 11371 5583 13892 27279 22913 -13387 -13780 8549
7040 8549 14634 18078 14722 -9682 -14316 11056 34733 21370 1747 -25434 -21198 30188 19857
7027 19857 26353 20727 14825 -5624 -32570 -9447 -4677 12081 -16719 -9411 -33382 -3410 27112
7014 27112 26171 42495 34710 15116 3508 -32185 -57114 -44138 -43595 -6661 -12847 -33171 -15525
7001 -15525 -22480 -42834 -34712 -40145 -29218 -32772 -21524 -2933 -24650 -33929 -33638 -24468 -5197
6988 -5197 9847 -3676 -24658 -19433 -38592 -17942 -11970 -25462 -19012 -5555 -11425 -34648 -60559
6975 -60559 -63744 -41988 -43542 -48674 -36226 -11813 -4408 -3512 -18234 -43013 -42238 -77980 -100195
6962 -100195 -68174 -39132 -39563 -31965 -53931 -60921 -62862 -108254 -95624 -72875 -34457 -59999 -61721
6949f1721j1074J8227l0030K2415L4533k4812n363J7414P158L8849l8225L829
6937b8800k4258l1518M0325j3226J483J5148l1937N132k9435l129L1908q408R684
6924f7031q445M5568k8679J2248q736Q970p058J2681l5965O134l640M2446q551
6911d0058r019J1897K9342k0347j220N216Q785o7337l865l207L4681L9781l1160
6898d6511O749j4154k8057Q912K5951j1250J0375J833N096N258L376j0486r37
6885d3845P807j7273J540r755J4061K5245k2799J7955k8311n066K4937l8811j6689
6872i1004M0636O11j3829m110J8864N481K8645M322j2484l0775J9043o322j2874
6859e3796Q108J6101o139p799N240k36l3590L372L7338p314l1538M5356J1953
$$ plain form
6949 -61721 -72795 -54568 -84598 -62183 -27650 -52462 -57825 -40411 -33253 5596 -32629 -28800
6937 -28800 -53058 -84576 -44251 -57477 -55994 -40846 -72783 -67651 -97086 -100215 -68307 -76715 -67031
6924 -67031 -75476 -29908 -58587 -46339 -55075 -46105 -53163 -40482 -76447 -70313 -73953 -31507 -40058
6911 -40058 -49077 -37180 -7838 -28185 -29405 -24189 -15404 -82741 -86606 -89813 -55132 -15351 -46511
6898 -46511 -39762 -53916 -81973 -73061 -47110 -58360 -47985 -46152 -41056 -35798 -32422 -42908 -43845
6885 -43845 -36038 -53311 -51771 -61526 -47465 -22220 -45019 -27064 -55375 -60441 -35504 -74315 -91004
6872 -91004 -50368 -49757 -63586 -67696 -48832 -43351 -14706 -10384 -22868 -53643 -34600 -40922 -53796
6859 -53796 -45688 -29587 -35726 -43525 -38285 -38521 -72111 -68739 -31401 -38715 -70253 -24897 -12944
6846a2944l1076j6020q020K0700K3434J4506J8728l0062j4874j2493j6027m540
6834f8688K9327J3978k482j7305J936J1140p740p634j5901L038O523P823k4968
6821g0953k8006M4013J9884l1635j2190J1287j055j0432J2663J2115O448J1432
6809c6429j3412j4762j3559j346K9612j8670l4037J3326n611j5177K4746J0384
6797g4935Q461N709N2909j8982o3093L7123O286n175l864l6150j6598M6245q724
6784g0788j630N294K1077k194j6867J9198j8098J3619K0303J0080l0602m80J0354
6771d0734k5492J7618M5998P663k0942k968J319R795j0528m5283M306l7473J1740
6758h4981K4626Q606k0272J5056J0026j4789k761L0934J2234j5147O676O000j55
$$ plain form
6846 -12944 -44020 -60040 -68060 -47360 -23926 -9420 9308 -20754 -35628 -48121 -64148 -68688
6834 -68688 -39361 -25383 -27865 -45170 -43234 -32094 -39834 -47468 -63369 -60331 -53808 -45985 -70953
6821 -70953 -98959 -54946 -35062 -66697 -78887 -67600 -68655 -79087 -66424 -54309 -47861 -36429
6809 -36429 -49841 -64603 -78162 -79508 -49896 -68566 -102603 -89277 -94888 -110065 -85319 -74935
6797 -74935 -66474 -60765 -7856 -26838 -89931 -52808 -46522 -51697 -55561 -91711 -108309 -62064 -70788
6784 -70788 -72418 -67124 -46047 -48241 -65108 -45910 -64008 -50389 -30086 -20006 -50608 -51088 -40734
6771 -40734 -66226 -48608 -2610 5053 -15889 -18857 -17538 -7743 -18271 -63554 -59248 -96721 -84981
6758 -84981 -60355 -51749 -72021 -56965 -46939 -61728 -64489 -33555 -21321 -36468 -29792 -23792 -23947
6745b3947l5204J2348J0721j6888L928J8860o373p234k6738l0131N652N7598J4319
6732b3089p032K413k5954K1462k7873K5711K2362q961m0937J5122l0807J4295
6720f3288J0258P575L2803k4793Q455M352q761k7305J9449j3500q112q876O83
6707g1060K2931q323O708K0977k1892m87k853J6450M451o753j5897K6212Q474
6694b1062m4551j0917L3851m152N6203K7997j4962j9426k2006M9320k1773k6233
6682a7711j5749K2537k869k1313k8575l215J9502L4395P826j4541j9879J8256
6670b1336k5846j4188J2208r930J5388P556J1740j4791m69R229l156p607J4696
6657b6506k107Q378J8820L344j1289j7510j7331L824q210K2883k4065j0038j5098
$$ plain form
6745 -23947 -59151 -46803 -36082 -52970 -49042 -30182 -36555 -43789 -70527 -100658 -95006 -37408 -23089
6732 -23089 -30121 -27708 -53662 -32200 -60073 -34362 -12000 -20961 -61898 -46776 -77583 -63288
6720 -63288 -53030 -45455 -12652 -37445 -28990 -24638 -33399 -60704 -41255 -54755 -62867 -71743 -71060
6707 -71060 -48129 -56452 -49744 -28767 -50659 -51146 -53999 -37549 -33098 -39851 -55748 -29536 -21062
6694 -21062 -65613 -76530 -42679 -46831 9372 37369 22407 2981 -19025 30295 8522 -17711
6682 -17711 -33460 -10923 -13792 -35105 -63680 -66895 -47393 -12998 -5172 -19713 -39592 -21336
6670 -21336 -47182 -61370 -49162 -59092 -43704 -36148 -24408 -39199 -39668 -30439 -33595 -41202 -26506
6657 -26506 -28613 -20235 -1415 1929 -9360 -26870 -44201 -40377 -48587 -25704 -49769 -59807 -74905
6644g4905l701J9991K0637L102j0454J2700q294q647l3480n586J6660J091J0405
6631f0481K5759m941m1837L7742J8601k0043J0517m344j1496J5J9054J0943l392
6618b3903l5353m095L8282J3652k7195k2894K3494p623J3339M241j1425m523k599
6605d6602K2846K6048J909k8268p011k2399j9883R22j4590j0790K4072J2166P495
6592e4085Q766j173O432K0682N731l501k2962l2950K5274j0173o783M243k7004
6579h7503k429r61L3182M0811j2247l6431m373J9637J9579O882j6366k7496O134
6566f1581J6171K886L1129k530j2341k824n322J3712o224j4215O20p977L4463
6553a4033k1086k3460K206k5824J2002J4570M861K3198J0295l2823k339k328L2401
$$ plain form
6644 -74905 -78606 -58615 -37978 -34876 -45330 -32630 -40924 -49571 -83051 -88637 -71977 -70886 -60481
6631 -60481 -34722 -39663 -81500 -43758 -25157 -45200 -34683 -39027 -50523 -50508 -31454 -20511 -23903
6618 -23903 -59256 -63351 -25069 -11417 -38612 -61506 -38012 -45635 -32296 -28055 -39480 -44003 -46602
6605 -46602 -23756 2292 4201 -24067 -31078 -53477 -73360 -72438 -87028 -97818 -73746 -61580 -54085
6592 -54085 -45319 -46492 -40060 -19378 -13647 -17148 -40110 -73060 -47786 -57959 -64742 -60499 -87503
6579 -87503 -89932 -90893 -57711 -16900 -29147 -65578 -69951 -50314 -30735 -23853 -40219 -67715 -61581
6566 -61581 -45410 -42524 -11395 -13925 -26266 -29090 -34412 -20700 -26924 -41139 -40519 -48496 -14033
6553 -14033 -35119 -58579 -56373 -82197 -70195 -55625 -50764 -27566 -17271 -50094 -52433 -54761 -22360
6540b2360k214R938p169j6530J1046j8517K0924M0288j4686k7497l6052Q346L942
6527e0541l845j170n781L8289r261l4276K1737J3687q646j3971O657K1320P178
6514a8623o871q961J1676q424J6273k7244j4802K9833j6266m892j7308Q157K065
6501e5387J829n911O058J2233N27O610J3173L998j3529P16l0454J2629K81P157
6487d0070J2900q188M042J4546j9271K7397M594q253p633j2811J629K1022j1209
6474b1305l2156K5064K3373j8686k6555R710j799l2839K9326J5301m5068J4434
6462f1200K991n696K0757Q826J2678m7996L6240J3046j2619M8516k5504l1374
6450d1335j6519K2557J9131k985K796l596k1111n851o101J3417L840l564j9041
$$ plain form
6540 -22360 -24574 -14636 -21805 -38335 -27289 -45806 -24882 15406 720 -26777 -62829 -54483 -50541
6527 -50541 -54386 -55556 -61337 -23048 -32309 -66585 -44848 -31161 -39807 -53778 -47121 -25801 -18623
6514 -18623 -25494 -34455 -22779 -31203 -14930 -42174 -56976 -27143 -43409 -48301 -65609 -57452 -55387
6501 -55387 -53558 -59469 -53411 -41178 -40651 -34041 -20868 -16870 -30399 -29683 -60137 -47508 -47227 -40070
6487 -40070 -27170 -35358 -31316 -16770 -36041 -8644 -4050 -12303 -19936 -32747 -31118 -10096 -21305
6474 -21305 -53461 -28397 -5024 -23710 -50265 -40555 -42354 -75193 -45867 -30566 -75634 -61200
6462 -61200 -58209 -63905 -43148 -34322 -21644 -69640 -33400 -20354 -32973 15543 -9961 -41335
6450 -41335 -57854 -35297 -16166 -19151 -16355 -19951 -41062 -46913 -53014 -39597 -35757 -39321 -58362
6437e8362L9774k9821l3648M634K960K5678K1649Q283n144k7573K2033K790k9300
6424e6047J1235J2920k0181k2135K2499N3830k5596k5690J6584L2873R484k2005
6412a2229k1369n8437J9169O614k9525j407O5567J2909j0513N055K5903o645l3889
6399c8797M1888L0713m0406j0400m973j6354k814K7136j6887k3040J7873r853
6387d5914q961N806K8520l9643J7184J6407j1448L9409L2344l9601K723k5532
6375b8706m0170J9634j0703j552p17m588O443J0582o414L1176q420K3264m053
6362a4224k7522K8950j4136o163O668P090l3569r901L5605L847o843j7495K8035
6349a9658J8768m838l9690L730K8371K0996q429j6720o8075J9298R631k0784M7526
$$ plain form
6437 -58362 -18588 -48409 -82057 -77423 -74463 -48785 -27136 -18853 -23997 -51570 -29537 -26747 -56047
6424 -56047 -44812 -31892 -52073 -74208 -51709 2121 -23475 -49165 -32581 292 9776 -12229
6412 -12229 -33598 -92035 -72866 -66252 -95777 -97184 -31617 -18708 -29221 -24166 1737 -4908 -38797
6399 -38797 3091 33804 -6602 -17002 -21975 -38329 -41143 -14007 -30894 -53934 -36061 -45914
6387 -45914 -54875 -49069 -20549 -60192 -43008 -26601 -38049 1360 33704 -5897 -3174 -28706
6375 -28706 -68876 -49242 -59945 -61497 -62214 -66802 -60359 -49777 -56191 -25015 -33435 -10171 -14224
6362 -14224 -41746 -12796 -26932 -33095 -26427 -19337 -52906 -62807 -27202 -23355 -30198 -47693 -19658
6349 -19658 -890 -5728 -45418 -41688 -13317 7679 -750 -17470 -85545 -66247 -56616 -77400 -29874
6336b9874j3075r016K8697N338j3549J197j241K7446q814K4343m926j5119m470
6323a3063m6958L8329J066M606j0038m472m3028j4547N6312N32k1986m096K5291
6310c2052j5578R850k1894M0099l2084J2711J8925k4248J851l0936M894L6870
6298c1592R204j591J5319m2350Q734r736n37N2999l565k2362j412K1616J6722
6285A1449k4893n59P194m1509n807n536o132K6647K6333L462j4262j1046j4623
6272d9282k248j6141j965J8820K5923l332j8447n201P420J0789Q714l358R271
6259a9037J4821k5675q910n318K8075m397k4600n06K3484k0836o29L3319l60n73
6245a1142l5987K801q501m246N3353o804j0148L2775m0471o189L4541q059o964
$$ plain form
6336 -29874 -42949 -51965 -23268 -17930 -31479 -30282 -31523 -4077 -12891 11452 6526 -8593 -13063
6323 -13063 -60021 -21692 -20626 -16020 -26058 -30530 -73558 -88105 -31793 -31261 -53247 -57343 -32052
6310 -32052 -47630 -37780 -59674 -19575 -51659 -38948 -20023 -44271 -42420 -73356 -68462 -31592
6298 -31592 -22388 -23979 -8660 -51010 -42276 -52012 -52549 450 -3115 -25477 -26889 -5273 11449
6285 11449 -13444 -14003 -6809 -48318 -54125 -59661 -65793 -39146 -12813 -9351 -23613 -34659 -49282
6272 -49282 -51530 -67671 -69636 -50816 -24893 -28225 -46672 -51873 -44453 -33664 -24950 -28308 -19037
6259 -19037 -4216 -29891 -38801 -44119 -16044 -20441 -45041 -45547 -22063 -42899 -43528 -10209 -10569 -11142
6245 -11142 -47129 -44328 -52829 -57075 -3722 -10526 -20674 12101 -28370 -34559 -18 -8077 -15041
6232a5041m6717q007J6186K125J50k010M6266K7117L410j5929j1147r155K1340
6219H588n3055j8229O689K5992J3112o987K7813L260P540M55j0015j7641K0124
6206G646rP172j8072k6510m531N064j0968m75J3898L5451l2065r794L338J1197
6192a8658n660j0547J2900J2291p646Q888j5638J6664Q346m271k872j5698L9892
6179A7991J661m264J8332M2481l8437k1997l535m5377J1526j2923q382J0177k0564
6166e3311O703K5601k3139K6886K9149k5230J9669n257k7145K5607n56J4247K568
6153A5792l2293j3766k1891K9270L8505L3692k6786N82K6841l4345l2543K5457
6141H515m6191K9779R734m126J674j1160k0478J9080r836p693j4199O209L3507
$$ plain form
6232 -15041 -61758 -69765 -53579 -51454 -51304 -53314 -7048 20069 23479 7550 -3597 -12752 8588
6219 8588 -44467 -62696 -56007 -30015 -16903 -23890 3923 7183 14723 15178 5163 -12478 7646
6206 7646 7637 14809 -3263 -29773 -34304 -29240 -40208 -40683 -26785 8666 -23399 -33193 -29855 -18658
6192 -18658 -24318 -34865 -21965 -9674 -17320 -8432 -24070 -7406 940 -3331 -6203 -21901 17991
6179 17991 19652 15388 33720 76201 37764 15767 12232 -33145 -21619 -34542 -42924 -32747 -53311
6166 -53311 -46608 -21007 -44146 -17260 11889 -13341 6328 1071 -26074 -467 -1023 13224 15792
6153 15792 -16501 -30267 -52158 -22888 15617 49309 22523 23105 49946 15601 -16942 8515
6141 8515 -37676 -7897 1837 -2289 -615 -11775 -32253 -13173 -23009 -30702 -44901 -38692 -5185
6128e185m2345J524j0176K8930R364j6954N000K3380q613o075j1450j4584L2325
6115a4859L001k0518j0029J6065R539L0335j3n403O458k0514j123m1853P630N1046
6101I762j4045K5329L971k7099j4240q642O626o875K9360j0029m846P990N298
6088B560K3914k3198p485o180j6574M563p755L2503Q409j1955O960R182o298p576
6074A070k6495J444M19K0539m206N466j0205J5833r121j6607K0240r892J3965
6061B450K6288j1576j1812Q889m556o461m471r341j8691R455k0745J132M3411
6048C972N708n8997J6958p651N849L3160m1816m883K1173k074m730K624J5662
6035a5045j0713K8515m699m1566J843m156r816K9499K2667n246k4336K7860n95
$$ plain form
6128 -5185 -47530 -46006 -56182 -27252 -17888 -34842 -29842 -6462 -15075 -21150 -32600 -47184 -14859
6115 -14859 -11858 -32376 -42405 -26340 -16801 13534 13521 8118 14576 -5938 -7061 -48914 -41284 9762
6101 9762 -4283 21046 25017 -2082 -16322 -24964 -18338 -25213 4147 -5882 -10728 -2738 2560
6088 2560 26474 3276 -4209 -10389 -26963 -22400 -30155 2348 10757 -1198 5762 14944 8646 1070
6074 1070 -25425 -23981 -23562 -3023 -7229 -1763 -11968 3865 -5256 -21863 -1623 -11515 2450
6061 2450 28738 17162 5350 14239 9683 3222 -1249 -10590 -29281 -19826 -40571 -39439 3972
6048 3972 9680 -49317 -32359 -40010 -34161 -1001 -42817 -47700 -26527 -28601 -33331 -30707 -15045
6035 -15045 -25758 2757 -1942 -43508 -41665 -45821 -55637 -26138 -3471 -8717 -33053 -5193 -5788
6022e788j7666K3009q895j3028j5555N784q190j5276M6190P087r398K1650J1652
6009B1576j1359P499m491j2972P13k6567J8571j664J94J3650O554n3146R526K7458
5995d458J5119l8474j6928R37L2328L5679j3934J6665J89p516n236J322k2406
5982f713l8724O152K5859j9849j4644L9968K4426m5148m2030J5430K6176L2089
5970B992Q0M144m4424J9007L4623k689M785m496P317m4753J2542J3323j173m863
5956c585K7693K812j7893O015K0960l0516j5831p135j557M3367j8095j2732K851
5943c646N679L8260k2375J9805J2202l920j1135l1682K1332L762j2037K6713P008
5930D9966j7384j0606l151J7020j1257K9073O710l5864o907K3608O206j3800K1664
$$ plain form
6022 -5788 -23454 -445 -9340 -22368 -37923 -32139 -40329 -55605 -9415 -2328 -11726 9924 21576
6009 21576 10217 17716 13225 253 966 -25601 -7030 -8694 -8500 5150 11704 -41442 -31916 -4458
5995 -4458 10661 -27813 -44741 -43804 -11476 24203 10269 26934 27123 19607 14371 15693 -6713
5982 -6713 -45437 -39285 -13426 -33275 -47919 -7951 16475 -28673 -70703 -55273 -29097 2992
5970 2992 3072 7216 -37208 -18201 16422 13733 18518 14022 21339 -23414 -10872 2451 1278 -3585
5956 -3585 24108 26920 9027 15042 36002 5486 -10345 -17480 -19037 24330 6235 -6497 -3646
5943 -3646 2033 40293 17918 37723 49925 46005 34870 3188 24520 28282 16245 42958 49966
5930 49966 32582 21976 18825 35845 24588 53661 60371 24507 17600 41208 47414 33614 55278
5917E5278j9307k678K1831n1629j2301M44m121K830J9712R438Q48N497j609J5291
5903C9524l4004J6228q917J1733K1095k8673r32O284K0463k3648L0588K8678M134
5890H2553k1047k4622J1465k0799n192O926j6907N00J3543j6679j9684K1285L3594
5877D4936k0457l6259R359j0142k0116m738j9892N1873l04J6211K0663l1649K1934
5864B1419K2126Q772J6323k9698j9297j851k0410n969j6464K9367L1770k8957
5852G131n273O907L0220j2149j6291K3759n607m160j4761q199j5560J9106k8715
5839b3592j858L2429J2976J0240l1885o83K2596J3083P303q355m1121j6001R486
5826a5382l3606J633J2165P0616K0160j1144k977j1347L2850j7318J292l128O882
$$ plain form
5917 55278 35971 33293 55124 3495 -8806 -8362 -12483 -9653 10059 19497 20345 25842 24233 39524
5903 39524 5520 21748 12831 24564 45659 16986 16054 22338 42801 19153 49741 78419 82553
5890 82553 61506 36884 48349 27550 22358 29284 12377 12877 26420 9741 -9943 11342 44936
5877 44936 24479 -11780 -2421 -12563 -32679 -37417 -57309 -5436 -5740 10471 31134 -515 21419
5864 21419 43545 52317 68640 38942 19645 17794 -2616 -8585 -25049 4318 36088 7131
5852 7131 1858 8765 38985 26836 10545 34304 28697 24537 9776 1577 -13983 5123 -23592
5839 -23592 -25450 6979 19955 30195 -1690 -2373 20223 33306 40609 32254 -8867 -24868 -15382
5826 -15382 -48988 -47355 -35190 35426 55586 44442 41465 30118 62968 45650 46942 43814 50696
5813E0696j1501l5542Q876J7025j2885J0807j0752J6327K6896j3947j9019L1991
5801E8972K0204M672j814l8201m2122m415N0992J9923k2901l4186K1565P178K5806
5788F5673L5014k1687j6402l54Q394j1269j1744J6240k1377j8046L4845j0951
5776D8336k9054O190K7499l0763j2144J1479K4358Q112j3626R18j9507l3816Q33
5763a1185M2318J0070J2865J1376j9204o226p60n420K4657k2239k693j64J0400
5750D3795j129j4464K2229P16k1120j3184M083M3148k3366K5577K4468j1898j6259
5737F2596O137n913J5519N416j7637k4034R37N509q867J7773m0703K5052J3670
5724E5455l9860l493P272J900P323J0506j6640j46K4075J5603M720J4789K071
$$ plain form
5813 50696 39195 3653 12529 29554 16669 27476 16724 33051 59947 46000 26981 58972
5801 58972 79176 83848 82034 43833 1711 -2704 48288 68211 45310 11124 32689 39867 65673
5788 65673 100687 79000 62598 62244 70638 59369 47625 63865 42488 24442 59287 48336
5776 48336 19282 25472 52971 22208 10064 21543 45901 54013 40387 41305 21798 -12018 -11185
5763 -11185 31133 41203 54068 65444 46240 40014 39254 33834 58491 36252 33559 33395 43795
5750 43795 42666 28202 50431 51147 30027 16843 20926 64074 40708 66285 90753 78855 62596
5737 62596 68733 62820 78339 83755 66118 42084 43021 48530 39663 57436 16733 41785 55455
5724 55455 15595 12102 19374 21274 28597 39103 22463 22317 46392 61995 66715 81504 83575
5711H3575j9103o975k0424J58K5200K8949O993r335L515r683J0174K9011o584
5698A15471m4409J480M5033m1175K5236j2863N746J4186m240l907r916K2132L4590
5685A47364j7161j8398OK0381n89l687J9512M9780j0692k7659K5380K8366M403
5672B17006k1924j0279o043N241J0379K773k015M825J3783M7892l366K2042k2527
5659B57787j0479j3099j1035J1994L2555M4970J7321M791J2362P7395M8927O8056
5647E41545M7870O9142J61729J97148K55170K97735K60226K23678J96077J28577
5637B378897J38059P0408r8558k84574l42040l26528k36315k15114j81398r2428
5627H10409k7291J73k8421L126k1854j0564O9003P5340P2678O2289J18527J15062
$$ plain form
5711 83575 64472 57497 37073 37231 62431 91380 98373 89038 92553 82870 93044 122055 115471
5698 115471 71062 72542 117575 76400 101636 88773 94519 108705 104465 100558 90642 112774 147364
5685 147364 130203 111805 111811 132192 131603 127916 147428 197208 186516 158857 184237 212603 217006
5672 217006 195082 184803 178760 184001 194380 197153 195138 199963 213746 261638 258272 280314 257787
5659 257787 247308 234209 223174 235168 267723 312693 330014 334805 347167 424562 473489 541545
5647 541545 589415 658557 820286 1017434 1272604 1570339 1830565 2054243 2250320 2378897
5637 2378897 2516956 2587364 2488806 2204232 1862192 1535664 1299349 1084235 902837 810409
5627 810409 783118 783291 754870 757996 736142 725578 794581 869921 942599 1004888 1123415 1238477
5615A238477K05283K48503L44342N35251Q43399R96223Q60139O94211M86182M41756
5605F893766L55411J70107m04896r41982j145284r83741p53218o69434n03170
5596B017559l43044k15052j48995j16883m4619l2335O749o213L7047R2361N3526
5585A300101R6735J13328J65941K30790L72942N90217R33229J000763Q28319N94935
5575F227300M53858N12509K99323P9989n52579j052878j195340j014846p36639
5566C020697o74918n33845l38517k33265j21871r2743j06818m1154o8104l2109
5556G77353m4159K084M0713J2527J9325M1764O4583J20581K22972L16238L32226
5545A906207K65084J75991J41613J47443J07810J0843k25423m19893l95824l57687
$$ plain form
5615 1238477 1443760 1692263 2036605 2571856 3415255 4411478 5271617 5965828 6452010 6893766
5605 6893766 7249177 7419284 7014388 6072406 4927122 3943381 3190163 2520729 2017559
5596 2017559 1674515 1459463 1310468 1193585 1148966 1116631 1123380 1117167 1154214 1246575 1300101
5585 1300101 1396836 1510164 1676105 1906895 2279837 2870054 3803283 4804046 5632365 6227300
5575 6227300 6681158 7193667 7492990 7572979 7020400 5967522 4772182 3757336 3020697
5566 3020697 2345779 1811934 1473417 1240152 1118281 1025538 918720 877566 809462 777353
5556 777353 733194 735278 775991 788518 807843 849607 914190 1034771 1257743 1573981 1906207
5545 1906207 2171291 2347282 2488895 2636338 2744148 2754991 2529568 2109675 1713851 1356164
5535A356164k57473k17853j85565p8274j05024o8727N854n8845k5205l2859m7996
5524B84197q306M2j9929r829j1957o261j7584J3314L387j7942k1328m765k3200
5511A59839k4538K5246r369j6320K8451l0341j493J8148O156Q010q423j5l6206
5498A19145j1248L3772p459p398j5001r616N857j3455j7829L8083L67m080K034
5485A13172L16J5116j0286l0612k0633k2511k791P477R95L3462K2720j7112N13
5472H9826r67k3118L8192O125J4387m4708L290j5567m584K0590QK0472k3135k0715
5458F0096o914L9533j6892k8161J523j2277k2915M5095J1719l0582J9896J1186
5446G1307J1635p260q84m1628K2920l974J5257j3029k0582N2352m204j4204l075
$$ plain form
5535 1356164 1098691 880838 695273 616999 511975 443248 449102 390257 365052 332193 284197
5524 284197 275891 275933 256004 246175 234218 227957 210373 223687 227074 209132 187804 183039 159839
5511 159839 135301 160547 151178 134858 163309 132968 131475 149623 155779 163789 155366 155351 119145
5498 119145 107897 141669 134210 126812 111811 102195 108052 94597 76768 114851 115218 111138 113172
5485 113172 113488 128604 118318 87706 67073 44562 41771 49248 50243 83705 106425 89313 89826
5472 89826 88859 65741 103933 110058 124445 79737 83027 67460 62876 83466 83474 103946 80811 60096
5458 60096 53182 92715 75823 47662 49185 36908 13993 59088 70807 40225 60121 71307
5446 71307 82942 75682 74798 33170 56090 52116 67373 54344 33762 86114 81910 67706 64631
5433F4631j3321J7500j1942j9716L4260L0916l1146J046J4919k2879J2792k4700
5421E2360J4356R784l0516M591M454J5668K4747j4387l2099j5925k296p108p064
5408A6565j2718j7810J1203N3821K1180j9961p037k0620J1921n720k8366J5985
5396A8443J110l9001L2779K8906j5148K8513k089j1512j4970r990J8076j6754
5384A8363j2154J4966K6590m8241K2144L241k8483K4661L917p027N6837l6017
5372C8797j4274J9122j3943J6325j8177n459k9683r007j82n183Q746K3359O867
5359A7308j601n966m917J6184K4538L368r138J3170j6462k8900j769k722J5853
5346A8946o797R088l1239M7540r335L416L611K3167J9380l7313k6627R114K3270
$$ plain form
5433 64631 51310 68810 56868 37152 71412 102328 71182 72228 87147 64268 77060 52360
5421 52360 66716 76500 45984 50575 55029 70697 95444 81057 48958 33033 30737 23629 16565
5408 16565 3847 -13963 -2760 51061 72241 52280 45243 24623 36544 30824 2458 18443
5396 18443 19553 -19448 13331 42237 27089 55602 53513 42001 27031 17041 35117 18363
5384 18363 6209 21175 47765 -476 21668 24909 -3574 21087 25004 17977 74814 38797
5372 38797 24523 43645 29702 46027 27850 22391 -7292 -16299 -16481 -21664 -12918 10441 17308
5359 17308 15707 9741 4824 21008 45546 48914 39776 52946 36484 7584 5815 3093 18946
5346 18946 12149 21237 -10002 37538 28203 31619 35230 58397 77777 40464 13837 22951 46221
5333D6221k142j0693R155k1203k2140K485J3333N1483m2170j7378R335L8615J0260
5320F5161N815l5616K8235j7453k0791L6947j1961j2329k237k028k5466K0633
5308B8910n032K1692n7716O64K4746J5437k0965J719J5494M760J5387K0321k1377
5295D4040J1982O884j9828O447K0297m597q226J0260o17R248p489j2176l0855
5282B5370l8601K193L3849J0784J4332o418Q503k1994j8319j6059L2343P314m790
5269B8507J612j543J8736P697l5838Q543L217J1191J4119j3713j0822K8599J6535
5256G6840K2603Q271k5947q744J7637n1501N073r569m0296l100J1122L2919k0018
5243A5290L4604K1658k4186j9726l445j543K283k9374J5105j884k9201K2128L1361
$$ plain form
5333 46221 44079 33386 42541 21338 -802 1683 15016 66499 24329 6951 16286 54901 65161
5320 65161 70976 35360 63595 46142 25351 62298 50337 38008 35771 33743 8277 28910
5308 28910 23878 45570 -12146 -11482 13264 28701 7736 9455 24949 29709 45096 65417 44040
5295 44040 56022 62906 43078 49525 69822 65225 56999 67259 66642 75890 68401 56225 25370
5282 25370 -13231 -11038 22811 33595 47927 41509 50012 28018 9699 -6360 25983 33297 28507
5269 28507 30119 28576 47312 55009 19171 27714 30931 42122 56241 42528 31706 60305 76840
5256 76840 99443 107714 81767 73023 90660 39159 44232 34663 -5633 -8733 2389 35308 15290
5243 15290 49894 71552 47366 27640 24195 22652 24935 -4439 10666 8782 -20419 1709 33070
5230C3070k7247K578p05K733L0293m804n7631N764N1690J8376M510k7774k1077
5217I776K8686j1346l630J0731L4616n081m3411l289o491j058j3456Q649M4332
5204D9028P328l0873M881j5494L9228l7889J4243J7781k1388k8727K463K036n783
5191c166J8314l3178P277J277N084o631m440K4694J4903j1122l479j3350P421
5178C604J6234L6214K0660l3662l5339j8040J2935K2429m6381p685L2477j7961
5166a4515k4140M1771L2569l723J2738M325k7411j2829J5282M962k534k0908J3414
5153A9001N397q019k9075P238l771l019n294L8650J0538M740j5988L1306J3058
5140F4762k4248m349q024K5316K4656k6028p504K1450j236K1385j0922J2547j968
$$ plain form
5230 33070 5823 8401 7696 10429 40722 35918 -21713 -15949 35741 54117 58627 30853 9776
5217 9776 38462 27116 23486 34217 68833 63752 20341 17052 10561 9503 -3953 4696 49028
5204 49028 56356 25483 30364 14870 54098 16209 30452 48233 26845 -1882 581 2617 -3166
5191 -3166 15148 -18030 -10753 -9476 -4392 -11023 -15463 9231 24134 13012 9533 -3817 3604
5178 3604 19838 56052 76712 43050 7711 -10329 2606 25035 -21346 -29031 3446 -14515
5166 -14515 -38655 3116 35685 31962 44700 49025 21614 8785 24067 29029 26495 5587 19001
5153 19001 24398 16379 -12696 -5458 -9229 -12248 -17542 21108 31646 36386 20398 51704 64762
5140 64762 40514 36165 28141 53457 78113 52085 44581 66031 64795 86180 75258 87805 85837
5127H5837K1747L3595R304R928P367J4404L5594k94J0796n6582l7897j1932l8512
5114H3355j6359O545j6299k9439j8688R167J6462j6630J4905n516k5668K4747
5102B6582j9771M354K9383K1031j9073j4906k0557L0524J362l1485N5928J2794
5090G6166J4566l3248r969J7061j2702l0072P890j660J4130p69Q677J0046k9909
5077C0207p437J0950o967J4061L9667j3798J0669j8924N784j1390n335k56R971
5064E7202O477j2621J32P5P265l4257J1888M161o845j8541k7999L4235K1321m628
5050C7865J9645K0313o443J703m1211J7092K851j7500j5092J5145J9286l7529
5038A6125m010j1322R357N1624o425j8020j421j6037R004q992J0471M080k193
$$ plain form
5127 85837 107584 141179 150483 160411 167778 182182 217776 217482 228278 171696 133799 121867 83355
5114 83355 66996 73541 57242 27803 9115 18282 34744 18114 33019 27503 1835 26582
5102 26582 6811 11165 40548 61579 42506 27600 7043 37567 38929 7444 63372 76166
5090 76166 90732 57484 47515 64576 51874 21802 29692 28032 42162 41393 50070 60116 30207
5077 30207 22770 33720 26753 40814 80481 66683 77352 58428 64212 52822 47487 47231 57202
5064 57202 63679 51058 51190 51265 58530 24273 36161 40322 33477 14936 -13063 21172 42493 37865
5050 37865 57510 77823 71380 73083 31872 48964 51815 34315 19223 34368 53654 16125
5038 16125 12115 793 10150 61774 55349 37329 35908 19871 28875 19883 30354 34434 32241
5025C2241r887J2684J0183j5144K9055j6366j0970m150j0567J170L8404j0380
5013D6273n6142L7147J2024Q829k7345N640n203J7145k449R005j4147j0481J7286
5000C7582j295J4959n620Q152k757J2744j2194k320k9734J3366J5573m02L3434
4987H1488k7552k9430Q852K2161p100J9463j6220j0403j071L8613j2182m6686
4975A9933L08l177J2234K8138P22l1204K5749R968n387j0369r885R203K1450j5522
4961E2161l1621M914j0094k05m339k1053L8906j2418j7145K0812j2149L28L6958
4948D5055Q007m003j6627j5013Q924K1051q90j2194k1210l2934K0424M2260k4669
4935A8181l108P264K1482L1742l480l1611l2865j4742K2997l455L985J6215J5306
$$ plain form
5025 32241 22354 35038 45221 30077 59132 42766 31796 27646 17079 18249 56653 46273
5013 46273 -9869 27278 39302 48131 20786 26426 21223 38368 35919 44924 30777 20296 37582
5000 37582 36287 51246 45626 53778 51021 63765 51571 49251 19517 32883 48456 48054 81488
4987 81488 53936 24506 33358 55519 48419 67882 51662 41259 40188 78801 66619 19933
4975 19933 20241 17064 29298 57436 58158 26954 52703 62671 57284 46915 37030 46233 67683 52161
4961 52161 20540 25454 15360 15155 10816 -10237 28669 16251 -894 19918 7769 8097 45055
4948 45055 53062 49059 32432 17419 26343 47394 46504 34310 13100 -19834 590 42850 18181
4935 18181 15073 22337 43819 75561 72081 40470 7605 -7137 15860 12405 16390 32605 47911
4922D7911k6558L104K729L3335J9903k1911j2060k6955L3376o926K7011J3359
4910H6318M172j8652j5598p663L5738n341Q124l0760k8269j4729J1732n45J0377
4897C4904L464J1881Q527k3840k6022J4653K2344m6430o665J5983k4418J9225
4885C606M7274q926j3795P553L4879K569j7128n501j905O480j3589j4361M37P768
4871C5361L7543k8663J7817j390l206Q368K253k316L670j3691L1790l91k7582
4858E9563r622r212q059R941J9601K9361M161m4175J0780l3739K501J2729M742
4845D8572J2521j3875m7399N061K963K9745K016k2143m350K1638n780o105J0308
4832C3172J2388J3282j7730K184j0013K1217p423J743k0034M1675r152j0453J75
$$ plain form
4922 47911 21353 24457 27186 60521 80424 58513 46453 19498 52874 45948 72959 86318
4910 86318 90490 71838 56240 48577 84315 78974 87098 56338 28069 13340 25072 24527 34904
4897 34904 38368 50249 58776 34936 8914 23567 45911 -519 -7184 8799 -15619 3606
4885 3606 50880 41954 28159 35712 70591 73160 56032 50531 48626 55106 41517 27156 27593 35361
4871 35361 72904 44241 62058 60668 57462 65830 68083 65767 69437 55746 87536 87145 59563
4858 59563 49941 40729 32670 42611 62212 91573 95734 51559 62339 28600 31101 43830 48572
4845 48572 61093 47218 -181 4880 7843 37588 39604 17461 13111 34749 28969 22864 33172
4832 33172 45560 58842 41112 43296 33283 54500 47077 48820 28786 70461 61309 50856 51031
4819E1031j3786K0309K7402p595n827j9460J4817L3519k6003k3842o30K2229J1439
4806H3603k6985j4094J7747J1Q535R237L2548k282j9526L031k2442q427n569O099
4792F1486j8201K8548j7113j3417N0793m404O999J2857l455k9092l1368k404J2265
4779E3494K8612J675n096j9844q600P346K748M4740q524j7406P198j7856j113
4766F7374j803J4157J8199k9016K3698j3298k5869K7877J854j713p736j0936k1480
4753D1308L933m140R467n873J6433R17j9254K0357L677L0487j3927K5539p589
4740A01335J182k2833J2687n067K5490L9325k8159M949K783k3658Q676l5018l0755
4727E0937L021Q544J3333J9732p792O619R969j2315J2340J1162K5607j5789l5639
$$ plain form
4819 51031 37245 57554 84956 77361 71534 52074 66891 100410 74407 50565 49935 72164 83603
4806 83603 56618 42524 60271 60282 68817 78054 110602 108320 88794 91825 69383 60956 55387 61486
4792 61486 43285 71833 54720 41303 92096 87692 94691 107548 104093 75001 43633 41229 53494
4779 53494 82106 83781 78685 58841 50241 57587 60335 105075 96551 79145 86343 68487 67374
4766 67374 65571 79728 97927 68911 92609 79311 53442 81319 83173 81460 73724 62788 41308
4753 41308 45241 41101 50568 44695 61128 62045 42791 63148 66825 97312 83385 108924 101335
4740 101335 102517 79684 92371 87304 112794 152119 123960 128909 131692 108034 116710 81692 50937
4727 50937 53958 62502 75835 95567 87775 94394 104363 92048 104388 115550 141157 125368 89729
4714H9729p376L1387j8005l895J4448J8663R070k1563M560r972L102p150j0903
4701I2095J4013L753J1849J5702j3206j289K3708k6004k9524j8021k541J474M7810
4688A19819k0283M918M1681k7771j5430J751j306j5679k4130O815J8447N216L821
4675I7869j864J977k161n28j2120K5068J9799j5334J1309J4688r962J3118m0659
4662A01200N766j2739K0815M0270J085l4168k0142K5485o830r271J1508k260l013
4649A17706j9873j0097J9024J0036k0488O148K1480k8600l7607k413J7585J6928
4637H9829J4711K771k2419J9252k4189K5293K1741k2941J0468k3693L7357o993
4625A21187J7958j8289j9651m53L5766l221k8508o821j7944K547K2171P335m41
$$ plain form
4714 89729 82353 113740 95735 91840 106288 124951 134021 112458 117018 107046 110148 102998 92095
4701 92095 106108 109861 121710 137412 124206 122917 146625 120621 91097 73076 70535 72009 119819
4688 119819 99536 104454 146135 118364 102934 104685 103379 87700 63570 70385 88832 94048 97869
4675 97869 96005 97982 95821 95293 83173 108241 128040 112706 124015 138703 128741 141859 101200
4662 101200 106966 94227 115042 155312 156397 122229 102087 127572 120742 111471 122979 120719 117706
4649 117706 97833 87736 106760 116796 96308 102456 123936 95336 57729 55316 72901 89829
4637 89829 104540 107311 84892 104144 79955 105248 126989 104048 114516 90823 128180 121187
4625 121187 139145 120856 101205 100752 136518 133297 104789 97968 80024 82571 104742 112077 111636
4612A11636o055J3086j2813J2664k4054J157m766O155j091K3264r986l45K626
4599A11478j9087l5702q02L0413J3433j8951L413k519J3065N656j7269L554Q057
4586I4739O984J1416q208r096L0686O579J5407j6026J1635R486k5416l2961O524
4573A01749Q631m3089o872N5601l64O886L0373Q52k2646j0998j2012O403o584
4560A07930p698l169J0144M002R589k439J0583j3398k3282K6454L4590j264J2132
4547A64174k371k1228O108L812k5254p33K0025r083j9928J326k180R698L0920
4534A55286k2092J093J1640j5481P762K9813k1120K108j051l380J2543j5554k804
4521A38763k4309P880J8689P694j1648j3700p590R175p125K4435J0288J8457K0460
$$ plain form
4612 111636 105581 118667 105854 118518 94464 95621 90855 97010 95919 119183 109197 108852 111478
4599 111478 92391 56689 55887 86300 99733 80782 84195 81676 94741 100397 83128 86682 94739
4586 94739 101723 113139 104931 95835 126521 133100 148507 132481 144116 153602 128186 95225 101749
4573 101749 110380 67291 60419 116020 115656 122542 152915 153767 131121 120123 108111 114514 107930
4560 107930 100232 97063 107207 111209 120798 118359 128942 115544 92262 118716 153306 152042 164174
4547 164174 161803 140575 146683 150495 125241 124508 144533 135450 115522 116848 114668 124366 155286
4534 155286 133194 134287 145927 130446 138208 168021 146901 149009 147958 144578 157121 141567 138763
4521 138763 114454 122334 141023 148717 137069 123369 115779 124954 117829 142264 152552 171009 191469
4508A91469l3219J789J4477l4221K2500K6460m6067l5662N7996J4385N496k0409
4496A64994N440J2788j632j6455j2336o56N300q185R199J6812K6952O357K6076
4483B34654j578k9835K5648j6573P190J7198q630N725k317J3271L2l6697L364
4470B11452N840K630L865K9849j0001K8340J1445K914K8536L9130J892J2505p256
4457C61141k0423J8077K3627R784K9059L98J8350J4347M10L3518q435m189L7552
4444E13216L2754K031R942K0183L665j3930K9286k615K547M6578Q602J5430L4601
4431G02290l088J2254k750J540k0803k2528L1423L5571l973l6077J4681L382P41
4418G12663j3907j037L0996j6768l3060K4205J4668k1399m7394k4285k8355j0241
$$ plain form
4508 191469 158250 160039 174516 140295 162795 189255 143188 107526 165522 179907 185403 164994
4496 164994 170434 183222 181590 165135 152799 152143 157443 149258 158457 175269 202221 208578 234654
4483 234654 233076 203241 228889 212316 219506 236704 228074 233799 231482 244753 244785 208088 211452
4470 211452 217292 219922 223787 253636 243635 271975 283420 286334 314870 354000 355892 368397 361141
4457 361141 340718 358795 382422 392206 421265 421663 440013 454360 454770 488288 479853 475664 513216
4444 513216 545970 548001 557943 578126 581791 567861 597147 594532 597079 643657 652259 667689 702290
4431 702290 699202 711456 708706 710246 689443 666915 698338 733909 729936 693859 708540 711922 712663
4418 712663 698756 697719 728715 711947 678887 703092 717760 696361 648967 624682 596327 586086
4406E86086l0947j8661k4851J3217J0912K0331j8843m058M1430k4938n7974j277
4394D90427M195j7894Q79P720R502O071M774L9195M657q520M063o3762J7863M9854
4380E49024m0442n6421l392M917j3641j8240Q290J2879j54L090n6543L2656N163
4367D27186l8411J5136L5457J6291j5695O740K3117k285n2616K329M023J019M2976
4354D65267Q061j9679K4447P543J5062K2904j0228m0698J3082o541J0974M8240
4342E38434R529m905Q528J2231J61j5821j025J6730r244l9176J1275Q689J7678
4329E53084J9561r331K3788L4424p316j3846l356k07j1840L658J283N7978K4266
4316F72146m9681m446j9043K5117j5603k1615K0483K8408J7636P1J7393k3400
$$ plain form
4406 586086 555139 536478 511627 524844 535756 556087 537244 533186 574616 549678 491704 490427
4394 490427 494622 476728 477607 485327 494829 500900 505674 544869 549526 541006 545069 481307 499170 549024
4380 549024 508582 452161 448769 453686 440045 421805 430095 442974 442820 445910 389367 422023 427186
4367 427186 388775 403911 439368 455659 439964 446704 469821 467536 414920 417249 421272 422291 465267
4354 465267 473328 453649 478096 485639 500701 523605 513377 472679 485761 479220 490194 538434
4342 538434 547963 543058 551586 563817 563978 548157 547132 563862 554618 515442 526717 535406 553084
4329 553084 572645 563314 587102 621526 614210 600364 597008 596801 584961 588619 589902 647880 672146
4316 672146 622465 618019 598976 624093 608490 586875 607358 635766 653402 653473 670866 647466
4304F47466k708J8977j4347J1402N4218j294J6525P507K165J7196J5669k6600
4292G46176K2408P5329K601k1858J4997L1307J4729j889L7679j2192Q166p375
4280I10078J8945j694K1379L778K0364L6400k5174J786J6595L026K3959K8550
4268A057992n719J5481O199L4446O432j0454L207N526L0716N6080j4784j2280
4256A172842l09J9529J7936M8074j92P58P529L4132M3558O435J5224L3367K3779
4243A422662r942l895L8433o35L5186j2649K0672K8751O52M2403L7264N0991K734
4230A652627q489K8415O3509J8894J1728N4929O6814k2610K3653O4798J1331L3900
4218A999499L7610K3829N9413L6115J1995R0487O8807K0556M9841N1017O6312
$$ plain form
4304 647466 644758 663735 649388 660790 715008 713714 730239 737746 739911 757107 772776 746176
4292 746176 768584 843913 846514 824656 839653 870960 885689 883800 921479 909287 917453 910078
4280 910078 929023 927329 948708 952486 972850 1009250 984076 985862 1002457 1005483 1029442 1057992
4268 1057992 1052273 1067754 1073953 1108399 1114831 1104377 1107584 1113110 1143826 1199906 1185122 1172842
4256 1172842 1172533 1192062 1209998 1258072 1257880 1258638 1266167 1300299 1343857 1350292 1365516 1398883 1422662
4243 1422662 1412720 1408825 1447258 1446623 1481809 1469160 1489832 1518583 1519235 1561638 1598902 1649893 1652627
4230 1652627 1644138 1672553 1736062 1754956 1766684 1821613 1888427 1865817 1889470 1954268 1965599 1999499
4218 1999499 2037109 2060938 2120351 2156466 2168461 2258948 2327755 2348311 2398152 2449169 2515481
4207B515481M5539L2776O0041O5985R8804Q0757L5832N9903R3520R5731N2570
4196C236939J02051J49982N0218J09201J33894R9407J09225J25814J60047J71385
4186D448163J73222K06951K39577K15202K94123L24288K90072L71275L99960M25472
4176G388305M37310N13654N68154O11549O44260P25260P95954Q50735R58604J048401
4166A4542186J137488J201014J323191J409554J521865J563796J608507J699389
4158B6006990J764069J794287J829329J941137J985203K083086K177118K248282
4150D1829501K335623K436622K487351K471836K462737K360200K270763K163865
4142F0818498K076389J903239J727870J680779J594802J614870J614562J563431
$$ plain form
4207 2515481 2561020 2593796 2653837 2719822 2818626 2899383 2935215 2995118 3088638 3184369 3236939
4196 3236939 3338990 3488972 3539190 3648391 3782285 3881692 3990917 4116731 4276778 4448163
4186 4448163 4621385 4828336 5067913 5283115 5577238 5901526 6191598 6562873 6962833 7388305
4176 7388305 7825615 8339269 8907423 9518972 10163232 10888492 11684446 12535181 13493785 14542186
4166 14542186 15679674 16880688 18203879 19613433 21135298 22699094 24307601 26006990
4158 26006990 27771059 29565346 31394675 33335812 35321015 37404101 39581219 41829501
4150 41829501 44165124 46601746 49089097 51560933 54023670 56383870 58654633 60818498
4142 60818498 62894887 64798126 66525996 68206775 69801577 71416447 73031009 74594440
4134G4594440J463893J356113J258767R67230P21360L71744M6781k29823n00816
4125H0049689p34385r01729r60060r82577j068635j104664j140508j245585j342489
4116G0569057j602307j828068j983696k247152k401638k493456k550574k541566
4108E2920600k501299k403971k319939k179090k102517k081625k057578k015634
4100C5258947k000261k013943j959159j910120j888648j846288j747087j649796
4092B0243645j528934j394214j256294j147662j040943r51924r23549q42526p88008
4083A0369591p05247o81730n99243n66629n12286m68242m43303l82514l50717
4074E659680l06424k49472k00449k50427j85466j61592j47107j27189j48439r1371
$$ plain form
4134 74594440 76058333 77414446 78673213 79640443 80361803 80733547 80780328 80550505 80049689
4125 80049689 79315304 78413575 77453515 76470938 75402303 74297639 73157131 71911546 70569057
4116 70569057 68966750 67138682 65154986 62907834 60506196 58012740 55462166 52920600
4108 52920600 50419301 48015330 45695391 43516301 41413784 39332159 37274581 35258947
4100 35258947 33258686 31244743 29285584 27375464 25486816 23640528 21893441 20243645
4092 20243645 18714711 17320497 16064203 14916541 13875598 12923674 12000125 11157599 10369591
4083 10369591 9664344 8982614 8383371 7816742 7304456 6836214 6392911 6010397 5659680
4074 5659680 5353256 5103784 4903335 4652908 4467442 4305850 4158743 4031554 3883115 3791744
4064C791744j19195r4685p5317p6391o2131j06651o7800j5840k9467m4592j5167
4053C084508l7369n4621j2143k305j0869q42J0161j6564m3578l4246k2763K3329
4041B882698l40k3570r21K4449j4099J3434j195j4847K951r244k4043k4217n2051
4028B759005m2358n0088j7223j2362k8582k5864k1497m1624k7156Q604l3487l6302
4016B431066p210m0528J2972l1618J1022K4488n4791j3712k1797K554M782N606
4004B322834m329M575L2445P1399M8020P6248Q6533P0436M8913Q5997N8894N9655
3992B961620O9690M5872J9620L024k1115l0265o5164k6604l5869n0391j3044k2778
3980B834596r914j3324n4408l1682n0642l3479n9329o2203p9133p5163q7253o8305
$$ plain form
4064 3791744 3672549 3577864 3502547 3426156 3364025 3257374 3189574 3173734 3144267 3099675 3084508
4053 3084508 3047139 2992518 2980375 2978070 2967201 2966359 2976520 2959956 2916378 2882132 2859369 2882698
4041 2882698 2882358 2858788 2857867 2882316 2868217 2881651 2880456 2865609 2868560 2859316 2835273 2811056 2759005
4028 2759005 2716647 2666559 2649336 2636974 2608392 2582528 2561031 2519407 2492251 2500855 2467368 2431066
4016 2431066 2423856 2383328 2396300 2364682 2375704 2400192 2345401 2331689 2309892 2312446 2317228 2322834
4004 2322834 2318505 2323080 2355525 2426924 2474944 2551192 2637725 2708161 2757074 2843071 2901965 2961620
3992 2961620 3031310 3077182 3096802 3099826 3078711 3048446 2983282 2956678 2920809 2870418 2857374 2834596
3980 2834596 2824682 2811358 2756950 2725268 2674626 2641147 2581818 2519615 2440482 2365319 2278066 2209761
3968B209761m9500m1713l1601m5434o6621l8995O064k5241l6666P30k072r616
3956A869096K8920q140o319J1836M371K3086J2186j3546k0201K4189K2750m9670
3944A898558K1752m622p385k3354L3297L0566L0784j3259j3715K1312K0588M890
3932A999412l3372J9700j1667J7896J1104R179p12j5924K7279J375N3702K3273
3920B101245m4498k1211N500N3503K6737j5811P18K9556L0815K9489L1899M2021
3908B269963J5908J170N0312L6433M7035L5142M9802L2083k6087L2957N4076N1024
3896B649818O0797M7423K8849L4481L6948L0247J5081K6188N0142J2349J2313
3885C004636O3607K0864K0967N1820M5649J4125K9255N4309J9649N5201N1825
$$ plain form
3968 2209761 2160261 2118548 2086947 2041513 1974892 1935897 1941961 1916720 1880054 1880784 1878712 1869096
3956 1869096 1898016 1889876 1883557 1895393 1899764 1922850 1935036 1921490 1901289 1925478 1948228 1898558
3944 1898558 1920310 1915688 1908303 1884949 1918246 1948812 1979596 1966337 1952622 1973934 1994522 1999412
3932 1999412 1966040 1985740 1974073 1991969 2003073 2012252 2011540 1995616 2022895 2024270 2077972 2101245
3920 2101245 2056747 2035536 2041036 2094539 2121276 2105465 2106183 2135739 2166554 2196043 2227942 2269963
3908 2269963 2285871 2287041 2337353 2373786 2420821 2455963 2505765 2537848 2511761 2544718 2598794 2649818
3896 2649818 2710615 2758038 2786887 2821368 2858316 2888563 2903644 2929832 2979974 2992323 3004636
3885 3004636 3068243 3089107 3110074 3161894 3207543 3221668 3250923 3305232 3324881 3380082 3431907
3874C431907L9561L5093N6038P7499L4127J3818N6567P3523N6944P7833J07815
3863D060725L4485N2573J01532P3162N3791R2975P4172P6991O0531J07873J15640
3852D904450Q0814J24232P4492R4786J55647R9585J29103J29363J15396J53126
3842F060994J37494J87828J47215J75803J68928K04334K02666K39754K68953K91353
3832H085322L36217L62487M11492L87285M68395N47634N95498O87786P41281Q28118
3822A3451515Q43905Q64214Q77485Q44101P78535P72815O94199O46598N80903
3813B0354270N80398N65133N25069O41786O27994O62336O57353N53788N04148
3804B5672275L91354J99721K9290j27598k72329l50962m11824m55169m08469l51404
$$ plain form
3874 3431907 3471468 3506561 3562599 3640098 3674225 3688043 3744610 3818133 3875077 3952910 4060725
3863 4060725 4095210 4147783 4249315 4322477 4376268 4469243 4543415 4620406 4680937 4788810 4904450
3852 4904450 4985264 5109496 5183988 5278774 5434421 5534006 5663109 5792472 5907868 6060994
3842 6060994 6198488 6386316 6533531 6709334 6878262 7082596 7285262 7525016 7793969 8085322
3832 8085322 8421539 8784026 9195518 9582803 10051198 10598832 11194330 11882116 12623397 13451515
3822 13451515 14295420 15159634 16037119 16881220 17659755 18432570 19126769 19773367 20354270
3813 20354270 20934668 21499801 22024870 22666656 23294650 23956986 24614339 25168127 25672275
3804 25672275 26063629 26263350 26292640 26165042 25892713 25541751 25129927 24674758 24266289 23914885
3794B3914885l17069k36991j84632j88473j64392j55543j81967k15648j61144
3785B2109026j37113r8869k8488O5805K48632L83394N56176P69884R43416J184708
3775B5996571J474940J790970K085331K392904K787714L077292L421212L704811
3767D6731745L878401L971086M001615M040354M000875M002827L931704M088300
3759G8646907M189939M383660M637504M904790N153009N342223N446801N418019
3751A18122852N329350N086385M751912M386021L969120L513739L122120K810270
3743A51091769K498855K147452J798514J593598J298687J078472R63975Q38540
3735A63309862P11741N47009M75039L30662J36735j17316l67787o31887q15196
$$ plain form
3794 23914885 23597816 23360825 23176193 22987720 22823328 22667785 22485818 22270170 22109026
3785 22109026 21971913 21873044 21844556 21910361 22158993 22542387 23098563 23868447 24811863 25996571
3775 25996571 27471511 29262481 31347812 33740716 36528430 39605722 43026934 46731745
3767 46731745 50610146 54581232 58582847 62623201 66624076 70626903 74558607 78646907
3759 78646907 82836846 87220506 91858010 96762800 101915809 107258032 112704833 118122852
3751 118122852 123452202 128538587 133290499 137676520 141645640 145159379 148281499 151091769
3743 151091769 153590624 155738076 157536590 159130188 160428875 161507347 162471322 163309862
3735 163309862 164021603 164568612 165043651 165374313 165511048 165393732 165025945 164394058 163578862
3726A63578862r38375r87364r58867q02177n99684k25259M14834J333600K595185
3717A63410755M370057O628146R251469J1999698J4632921J6688178J7910142
3710B44891366J7917218J6348695J3631306R923129N797285J619805k125596m860451
3702C03142757o374305o617940n718970l954438j987753m57158L51490l6008j552776
3693B76794899m036903p422938j1150083j4792659j7699199j9629084k0564336
3686A81499697k0237652j9072928j7375862j5227304j2840422j0645863q699327
3679G7400339p009659n673663m573780l650580k906275k390715j981282j701218
3671D7513167j476314j358155j359246j393238j366680j462943j453863j374757
$$ plain form
3726 163578862 162640487 161653123 160694256 159892079 159292395 159067136 159481970 160815570 163410755
3717 163410755 167780812 174408958 183660427 195660125 210293046 226981224 244891366
3710 244891366 262808584 279157279 292788585 302711714 308508999 310128804 308003208 303142757
3702 303142757 296768452 290150512 284431542 280477104 278489351 278032193 278383683 278347675 276794899
3693 276794899 272757996 265335058 254184975 239392316 221693117 202064033 181499697
3686 181499697 161262045 142189117 124813255 109585951 96745529 86099666 77400339
3679 77400339 70390680 64717017 60143237 56492657 53586382 51195667 49214385 47513167
3671 47513167 46036853 44678698 43319452 41926214 40559534 39096591 37642728 36267971
3663C6267971j388351j337885j226517j091193r28967r07218q39438q09519q08987
3654B6929896q65841q95400r08206r69486r88128r98638r68327p99390q07923
3645A8728557p89706p21913o50121o02682n08512m60206m24716l81727l41701
3636A3847273k68832k73045k53070k21757j96104k07208j87456j43049j28456
3627A1968296j57934j25442j33579p4187q9249j16738n0139p3996q4405p3161
3617A0989466n1221k0784l9906l3642l9485m4031k9644K545l7573J5898K063J2525
3605A0726211K7290K2154J4326L7482O1828O8897O1205M1712M5310P8256J20837
3594A1305508N5318J6448O5718P9204Q8515J02826J07747N7511M6391N3447J05591
$$ plain form
3663 36267971 34879620 33541735 32315218 31224025 30295058 29387840 28548402 27738883 26929896
3654 26929896 26064055 25168655 24260449 23290963 22302835 21304197 20335870 19536480 18728557
3645 18728557 17938851 17216938 16566817 15964135 15455623 14995417 14570701 14188974 13847273
3636 13847273 13578441 13305396 13052326 12830569 12634465 12427257 12239801 12096752 11968296
3627 11968296 11810362 11684920 11551341 11477154 11387905 11271167 11221028 11147032 11062627 10989466
3617 10989466 10938245 10917461 10877555 10843913 10804428 10760397 10730753 10733298 10695725 10711623 10713686 10726211
3605 10726211 10753501 10775655 10789981 10827463 10889291 10958188 11019393 11061105 11106415 11184671 11305508
3594 11305508 11360826 11377274 11442992 11522196 11610711 11713537 11821284 11878795 11925186 11978633 12084224
3583A2084224J29400J11889J11329R5261J60178J84299J02318J52233J41849J56249
3573A3429229J55093J87049J46604J93732J82677J85994J61753J88328K13801
3564A5044260J79925K15765J83893K17891K03375K20154K56982K22208J89445
3555A6933898K17014K05340K65584K06715K02392K10660K05460K24030K19437
3546A8890530J95451K35734J98889J92291J83463J60296K24347J14345J59850
3537B0555196J70454J32900J21138J20059J25543Q1691R3838J07835N2772L8328
3527B1599754L071J9470J0373l3097n661l8311j04190j09769q4817r4848p0723
3516B1091252j53120j41049j38683j41520j56061j89761j89635j83261k35044
$$ plain form
3583 12084224 12213624 12325513 12436842 12532103 12692281 12876580 12978898 13131131 13272980 13429229
3573 13429229 13584322 13771371 13917975 14111707 14294384 14480378 14642131 14830459 15044260
3564 15044260 15224185 15439950 15623843 15841734 16045109 16265263 16522245 16744453 16933898
3555 16933898 17150912 17356252 17621836 17828551 18030943 18241603 18447063 18671093 18890530
3546 18890530 19085981 19321715 19520604 19712895 19896358 20056654 20281001 20395346 20555196
3537 20555196 20725650 20858550 20979688 21099747 21225290 21306981 21400819 21508654 21561426 21599754
3527 21599754 21602825 21622295 21632668 21599571 21593910 21555599 21451409 21341640 21256823 21161975 21091252
3516 21091252 20938132 20797083 20658400 20516880 20360819 20171058 19981423 19798162 19563118
3507A9563118k24417j75189k20090k27088k05794k45512k55649k29526k09025
3498A7570828k47111k48729j95686k32898k44180k04451k43631k54367k16076
3489A5483699k19601k08265k64714k69254j57071j71270k33840k33197j88889
3480A3537598j92470j85659k18307j68331j45462j45333j97645j95949j61286
3471A1927156j75843j98098j76653j57431j29134j35659j49904j17331j06789
3462A0580314j48825j21290j01803j34133j46120j49410j35562r9812j27670j12179
3452I303510j34920j49682j27251j11622j04223r7927j19407j03663n6339j24541
3442H173935j16295j02479j05842p6385q9839j14531q1240n6515q1682n2636j162
$$ plain form
3507 19563118 19338701 19163512 18943422 18716334 18510540 18265028 18009379 17779853 17570828
3498 17570828 17323717 17074988 16879302 16646404 16402224 16197773 15954142 15699775 15483699
3489 15483699 15264098 15055833 14791119 14521865 14364794 14193524 13959684 13726487 13537598
3480 13537598 13345128 13159469 12941162 12772831 12627369 12482036 12284391 12088442 11927156
3471 11927156 11751313 11553215 11376562 11219131 11089997 10954338 10804434 10687103 10580314
3462 10580314 10431489 10310199 10208396 10074263 9928143 9778733 9643171 9543359 9415689 9303510
3452 9303510 9168590 9018908 8891657 8780035 8675812 8577885 8458478 8354815 8298476 8173935
3442 8173935 8057640 7955161 7849319 7772934 7683095 7568564 7487324 7430809 7349127 7296491 7295329
3431G295329k9584o1620j7273j6825K0932N3491K7775N3291N0835Q3538L3653
3420G493542P6122M6300Q8124J09622N4485M7162J16546J10378J65288K14767
3410H522336K79969M86134Q47662J049066R76688Q82756O75902L32975J43416
3401A4196904j56170p67370j270293j416504j245463r63514q12957o89167m95546
3392F379920l56782k28888j92053j30269j37025o4959R652Q084L3758R3450J39550
3381E554438J90843K73117L57742O28404R82501J787472K162400J876893J842242
3372A5656052J366359O24481M97631k10522j521080k374346k472882j936334j536944
3363H092415j346460r09057o02361m40413l02539k36203j70223j55682q9245o0906
$$ plain form
3431 7295329 7265745 7204125 7186852 7170027 7190959 7244450 7272225 7325516 7376351 7459889 7493542
3420 7493542 7569664 7615964 7704088 7813710 7868195 7915357 8031903 8142281 8307569 8522336
3410 8522336 8802305 9288439 10136101 11185167 12161855 13044611 13720513 14053488 14196904
3401 14196904 14040734 13273364 12003071 10586567 9341104 8377590 7564633 6875466 6379920
3392 6379920 6023138 5794250 5602197 5471928 5334903 5269944 5279596 5287680 5321438 5414888 5554438
3381 5554438 5745281 6018398 6376140 7004544 7987045 9774517 11936917 13813810 15656052
3372 15656052 17022411 17646892 18144523 17934001 16412921 14038575 11565693 9629359 8092415
3363 8092415 6745955 5836898 5234537 4794124 4491585 4255382 4085159 3929477 3840232 3779326
3353C779326n5702j0936J2372L875R390R7706J86470L06535N22915R00375J016633
3342F768959Q66745Q37790N71772K90971J42591k14468q10795j176969j201160
3333F075436q97982p06469o34424m69435l02428j93230j64375j22919j09270j19071
3323B355833m7813l0681o5880j00269n7804k8761q1177o0685k514K0745n1587
3312A849407o5454m5756l1934J3253j5730l4290j8561m1024m0222k2129l2793
3301A514767q003L227j063p504k4222l8018J7310k7651N257l1351p7148K9269
3289A354870j6572n7185n557j6760k5602k1148j6056K8881J57j1731J286l9339
3277A175244J655l6863p436l887L356j5257j4110K615k5461k6427k7108N053j9672
$$ plain form
3353 3779326 3723624 3712688 3725060 3728935 3738325 3836031 4022501 4329036 4851951 5752326 6768959
3342 6768959 7635704 8473494 9045266 9336237 9478828 9264360 8453565 7276596 6075436
3333 6075436 5177454 4470985 3836561 3367126 3064698 2871468 2707093 2584174 2474904 2355833
3323 2355833 2308020 2277339 2211459 2111190 2053386 2024625 1943448 1882763 1880249 1900994 1849407
3312 1849407 1783953 1738197 1706263 1719516 1703786 1669496 1650935 1609911 1569689 1547560 1514767
3301 1514767 1506764 1509991 1508928 1501424 1477202 1439184 1456494 1428843 1434100 1402749 1325601 1354870
3289 1354870 1338298 1281113 1275556 1258796 1233194 1212046 1195990 1224871 1225028 1213297 1214583 1175244
3277 1175244 1176899 1140036 1132600 1128713 1132069 1116812 1102702 1105317 1079856 1053429 1026321 1031374 1011702
3264A011702k4011j6922J6500J2831j2143o487m2183q266j5563m3213L0097j7360
3252H84982m6410k1564J1027J2747J7620q003J4308m6536L592K7764m9419k1388
3240G78720o691L6790O5m2368k1949R451k3175o264k5344k941m942K7673j7394
3227G01631k2081L685K0994M083k4982j0814l4131M2528L987l428j2734j8041
3215F50697k2390K0212q04k5762j017K6903j7245k3050k9545p460J1919J8378
3203F00836j3771P635Q335n212m408l9576o899R091O065J398j7371j1930J2752
3190E46945j6560k8713M525L2078n455l4125k1371L406k0993J4283O3471k4830
3178E12661J3405j9221l1402J9481L524K2394L007J0807o627k2424n742k721n733
$$ plain form
3264 1011702 987691 970769 987269 1000100 987957 981470 939287 931021 915458 872245 902342 884982
3252 884982 838572 817008 828035 840782 858402 850399 864707 818171 821763 849527 800108 778720
3240 778720 772029 808819 808884 766516 744567 754018 730843 724579 699235 696294 691352 719025 701631
3227 701631 679550 683235 704229 708312 683330 672516 638385 680913 684900 681472 668738 650697
3215 650697 628307 648519 647715 621953 620936 647839 630594 607544 577999 570539 582458 600836
3203 600836 587065 594700 603035 597823 593415 553839 546940 556031 562096 563494 546123 534193 546945
3190 546945 530385 501672 506197 538275 532820 498695 477324 480730 459737 474020 537491 512661
3178 512661 526066 506845 475443 494924 498448 520842 523849 534656 528029 505605 499863 497142 491409
3165D91409l6226J5366o689k0152J3575J0357k0780j6993j473K1776P296k297
3153D55169j2793k0233j4522k425N8655l560J3032K4829J1083L5498J5828k9895
3141E30666K2720q330l3777j2056k471m5070r78J8393k4019k4125L650N245J8243
3128D48091R630k3512p195J2357k4391Q748J2616N262O257n269p171M7075j0638
3115D71860p486R541k7385J5496K9830J5139o133l2317m1984K1557J6505M8151
3103E12774j5105k4577n0021M0280N1255p259J2957j7598k7456L1478J9887j2102
3091E14513j318K987J4325P911K3689l915M365L8953J9082k8150j6191K0237l9295
3078E57193j0146J2936L7840m029J3731O6233J442J9651j0433j7675k6560J4780
$$ plain form
3165 491409 455183 470549 463860 443708 457283 467640 446860 429867 428394 450170 457466 455169
3153 455169 442376 422143 407621 405196 463851 460291 473323 498152 509235 544733 560561 530666
3141 530666 553386 545056 511279 499223 496752 451682 450704 469097 445078 420953 424603 429848 448091
3128 448091 457721 434209 427014 439371 414980 423728 436344 441606 447863 442594 435423 482498 471860
3115 471860 464374 473915 446530 462026 491856 506995 500862 468545 426561 448118 464623 512774
3103 512774 497669 473092 423071 463351 514606 507347 520304 502706 475250 506728 526615 514513
3091 514513 513195 516182 530507 538418 562107 558192 562557 601510 620592 592442 576251 596488 557193
3078 557193 547047 559983 597823 593794 607525 673758 675200 694851 684418 666743 640183 654963
3066F54963R154o216J0660m4372k4020l0746j0225k3281l409P665m783N4863N233
3053E95486j199p707j5345J1763j4915k0050L62L7031j8585m534L1979k5791Q639
3040E77134r025Q481j5304O959l5156m2660P638J4872n0054n521j0196k7002N908
3027D26074m9050L280K5609L0959j4721p091k9956k141J6248l0037L104K1715
3015C93993j4784j5662j2892k1080p526j6981L3057r350j161k4255k4349j1382
3003B67628L3078J0117l315j6405k4039j5703r658K4352l0263j8070O345J0457
2991B34524k0756K5095j3234M7442l3865m3420J3568o674k7378j7009L2984P632
2979A98909q971R99J1548r072l1590j3164K4825K2439K1280l6882k9263K2204
$$ plain form
3066 654963 664117 657901 668561 624189 600169 569423 559198 535917 532508 540173 535390 590253 595486
3053 595486 594287 586580 571235 582998 568083 548033 548395 585426 566841 562307 594286 568495 577134
3040 577134 568109 576590 561286 568245 533089 490429 498067 512939 462885 457364 447168 420166 426074
3027 426074 377024 380304 405913 436872 422151 415060 385104 382963 399211 369174 372278 393993
3015 393993 379209 363547 350655 329575 322049 305068 338125 328775 327614 303359 279010 267628
3003 267628 300706 310823 307508 291103 267064 251361 241703 266055 235792 217722 224067 234524
2991 234524 213768 238863 225629 273071 239206 195786 209354 202680 175302 158293 191277 198909
2979 198909 189938 190937 202485 193413 161823 148659 173484 195923 217203 180321 151058 173262
2967A73262J7247L096O837o97k9601j2139J3083j3934k0835K346j4555K3048K7663
2954A74821m6001K1169J7518l3515M86K9468j6851J241P957l6334J4576J9001
2942A53536n507n014N175j1746Q260j1359J2821l6743K0013l150P24O67k571J6369
2928A41475J8789j206l8885J0278P2J873J937N003J4429m095l2198L697N450l131
2914A23488l9863k8452L1548j2490l577K3207k2162j3501l1706M1715J8324n984
2902H0547j3613P954r846j8359L257J775j3956p203L8917j2540k6945Q392J1032
2889D9412j5401O19J0833J948Q322l187j840P622l671n254J0773j0252K27J0862
2875F1013l1122Q669J0727j0858J6864M524j3519Q948m522J101k041j4793r078
$$ plain form
2967 173262 190509 193605 200442 199745 170144 158005 171088 157154 136319 138665 124110 147158 174821
2954 174821 128820 149989 167507 133992 134478 163946 147095 148336 156293 119959 134535 153536
2942 153536 148029 143015 148190 136444 144704 133345 146166 109423 129436 126286 127010 127677 125106 141475
2928 141475 160264 159058 120173 130451 130523 132396 134333 139336 153765 149670 117472 121169 126619 123488
2914 123488 83625 55173 86721 74231 70654 93861 71699 58198 26492 68207 86531 80547
2902 80547 66934 74888 65042 46683 49940 51715 37759 30556 69473 56933 29988 38380 49412
2889 49412 34011 34630 45463 47411 55733 52546 50706 58328 54657 49403 60176 49924 50151 61013
2875 61013 29891 38560 49287 38429 55293 59817 46298 55246 50724 51825 49784 34991 25913
2862B5913r731M7272r951j9497J0294K6752k1724L461l7375o917L0995j1547J6310
2849D4255m381k4961O710K2222k06K3843j7357l1101M374J4466J0K7662j9874
2836D5662j1542r332L3760j086k9322J8945R9k012k9786o701l13J6614J3641O726
2822D5353K9924Q90k3264k2284O124j6535J7185J2305l65k0214k6357o718J5900
2809A1944M6456l574l248K0571M0296m5185l77J0537k0477j1358L341j3780Q59
2796C6005R646J6600p639j0912k0305L188L1622m1269J2692J9965j2170j6946
2784B0477J7721K893j7028j52K1408j4963l5714O802J8137j6045j3685J0339L3057
2771C3247m252J604k5794L1541J4431l3011L1695n315k5402n657N693k0188J3422
$$ plain form
2862 25913 16182 63454 53503 34006 44300 71052 49328 52789 15414 8497 39492 27945 44255
2849 44255 39874 14913 21623 43845 43639 67482 50125 19024 23398 37864 37874 65536 45662
2836 45662 34120 24788 58548 57462 28140 47085 47184 45172 15386 8685 8372 24986 38627 45353
2822 45353 75277 76167 52903 30619 36743 20208 37393 49698 49333 29119 2762 -3956 11944
2809 11944 58400 54826 51578 72149 112445 67260 66883 77420 56943 45585 48926 35146 36005
2796 36005 45651 62251 54612 43700 23395 26583 58205 16936 29628 49593 37423 20477
2784 20477 38198 41091 24063 23911 45319 30356 -5358 1444 19581 3536 -10149 190 33247
2771 33247 28995 30599 4805 36346 50777 17766 49461 44146 18744 13087 18780 -1408 12014
2758A2014o55l5511K9587l459j5248O234J0947k0073q424l735L2458L0730M190
2745C9055n1054k443J5770j3168Q568O051K1772j2428j3378N313O204j4370K6545
2732B2437j551m0115j450N103j5906k746L0035k0007q455o063N203J9967K3732
2719A0184K3972m0252q613J7055j7073P395M671m2033L684L0385j98q436M457
2706a4802J2659j0374K6437j362m7160L9928l873k1020n0403J7715K7282J2406
2694a2567K7197J4118m4954K482K6574L293M324k8026K563j0714J901N603q747
2681a6953p558j1473J4129J3138K334K0894r592m6357K4773O707L009j1837P674
2668a1112M6957n522j4381m3063J781M7095m234L909k8443j3218j5068J2392j8205
$$ plain form
2758 12014 11359 -24152 5435 1976 -13272 -7038 3909 -16164 -24588 -28323 4135 34865 39055
2745 39055 -11999 -14442 1328 -11840 -3272 2779 24551 12123 -1255 4058 10262 -4108 22437
2732 22437 20886 -19229 -20679 -15576 -31482 -34228 -4193 -24200 -32655 -38718 -33515 -13548 10184
2719 10184 34156 -6096 -14709 2346 -14727 -7332 -2661 -44694 -41010 -10625 -10823 -19259 -14802
2706 -14802 -2143 -12517 13920 12558 -34602 5326 1453 -19567 -69970 -52255 -24973 -12567
2694 -12567 14630 28748 -16206 -13724 12850 16143 20467 -7559 -4996 -15710 -13809 -8206 -16953
2681 -16953 -24511 -35984 -21855 -8717 -6383 14511 4919 -41438 -16665 -9958 -6949 -18786 -11112
2668 -11112 35845 30323 15942 -27121 -25340 21755 17521 21430 -7013 -20231 -35299 -22907 -41112
2655d1112l2528k5791K4383M6710L5466R30k0847L2584N589j2353J3229j1499
2643A4761j7301o583j4602J0475r853R793J6997m0543q816J9594k0999K3211J219
2630b2647J2182K2287J6102l5099m1468r95L4552j834o323K7630K3571k5156j1811
2617i009L0019j3995L510K9783l9510J5042k6525K9049p54J2034j1711k1342N642
2604B233k2400K2051k3879J9821J5842j6504K7751K3147k2329l6411k8710L3743
2592e645N641m805o489J5229j519k0128K6099J5329j0451J6800j2632j1775L7354
2579D3008k0090m986N14K6098l4970k1803j4606k319M958R857j3172p690L6535
2566A334J984J8817k0765J4469L217l3532n6866J5878N4335j792j1442o134Q691
$$ plain form
2655 -41112 -73640 -99431 -75048 -28338 7128 8058 -12789 19795 25384 13031 26260 14761
2643 14761 -2540 -9123 -23725 -13250 -23103 -13310 3687 -36856 -45672 -26078 -47077 -23866 -22647
2630 -22647 -10465 11822 27924 -7175 -48643 -49638 -15086 -16920 -23243 4387 27958 2802 -9009
2617 -9009 21010 7015 10525 40308 798 15840 -10685 18364 17610 29644 17933 -3409 2233
2604 2233 -20167 1884 -21995 -2174 13668 -2836 24915 48062 25733 -10678 -39388 -5645
2592 -5645 -4 -4809 -11298 3931 2412 -17716 8383 23712 13261 30061 17429 5654 43008
2579 43008 22918 17932 18446 44544 9574 -12229 -26835 -29154 -24196 -14339 -27511 -35201 1334
2566 1334 3318 22135 1370 15839 19056 -14476 -71342 -55464 -1129 -2921 -14363 -20497 -11806
2553a1806K89K6366j0989j5728K8938j9954j9596O758j6419J3722k1295N867L5376
2540A529K2950k0315J8972M1867l3297R887j55j7157p060q292K7374l0451J1002
2527A6854j9965j3134j4868j9741L5499j6996J798J8939J7392j0795O801N56L7070
2514C9410j3550J5388K354k2508k9591K8492k9440J0321J8865n6674K1665M5926
2502C0658q592J6472J6402m2862m6704j2369R838K02j0698Q767L977r405L280
2489d1034L4998j8996J6015q211j5032J4074J8750r727j1500J3575j13l4029J6110
2476b5120K2429p65J1077l1884Q186k9990j1950L5661n152P177K408o996Q809
2463a6110J0427K4452K6338k3538n118j4482n0j2233J7908o258j7337L1737j9961
$$ plain form
2553 -11806 -11517 14849 3860 -11868 17070 -2884 -22480 -15722 -32141 -18419 -39714 -33847 1529
2540 1529 24479 4164 23136 65003 31706 41593 41438 24281 17221 8929 36303 5852 16854
2527 16854 -3111 -16245 -31113 -50854 -15355 -32351 -30553 -11614 5778 -5017 1784 2340 39410
2514 39410 25860 41248 43602 21094 -8497 19995 -9445 876 19741 -36933 -15268 30658
2502 30658 22066 38538 54940 12078 -34626 -46995 -37157 -36955 -47653 -38886 -34909 -44314 -41034
2489 -41034 -6036 -25032 -9017 -17228 -32260 -18186 564 -9163 -20663 -7088 -7201 -41230 -25120
2476 -25120 -2691 -3456 7621 -24263 -16077 -46067 -58017 -22356 -27508 -20331 -17923 -24919 -16110
2463 -16110 -5683 18769 45107 21569 16451 1969 1919 -10314 7594 1336 -16001 15736 -4225
2450d225K4908j2174Q210J1906m062k3485j3061j7596K3461j5230K2668K3676
2438B4996R959l5724K330K0827L339j5781j3234P515k3449J8089j5961K1964r571
2425d701N425Q092m192k626k0961R956O606J2669k2188l0295L319M4975Q261j5630
2411a290k764J4079k132O699n318K024J2372k6879J1661J4631j2679q36M541K1416
2397C5525J1319j0336k9592J2639k4923J9407J5324o075j7083j8310J7944J0205
2385A6044M997n134J325J984k0030K3387j4774j6150q59K9708l5836k1916N3492
2372A6238M384J3848J7013l914j9050j3685M236J3584j464l1114j967L1194K4955
2359E4258q499j0836J3770K30J1743o215l9205o305K3701M6852J4955l2121L81
$$ plain form
2450 -4225 20683 8509 16719 28625 24563 1078 -11983 -29579 -6118 -21348 1320 24996
2438 24996 34955 -769 1561 22388 25727 9946 -3288 4227 -19222 -1133 -17094 4870 -4701
2425 -4701 724 8816 4624 1998 -18963 -9007 -2401 10268 -11920 -42215 -38896 6079 14340 -1290
2411 -1290 -4054 10025 7893 14592 9274 11298 23670 -3209 8452 23083 10404 9568 14109 35525
2397 35525 46844 36508 6916 19555 -5368 14039 29363 23288 6205 -12105 5839 16044
2385 16044 21041 15907 17232 19216 -814 22573 7799 -8351 -9210 20498 -15338 -37254 16238
2372 16238 20622 34470 51483 47569 28519 14834 19070 32654 31190 76 -1891 29303 54258
2359 54258 45759 34923 48693 48923 60666 54451 15246 8941 32642 79494 94449 62328 62709
2346F2709J6597k7495j6865M9156J429j4800N163K4394J8717N534l2523K1253
2334A13269j4668L4107j1378J2519R33j1723K370k7901j4426M2885j5625J2295
2322A22657J5630p071K1901l0414N2875M1274j7330j5807k0940M871K940L0665
2310B01251R069k385J644K6402r8O22L1464j0016Q837L297K4432O798O299M7675
2296C55291N2538J7836L5685K8115M1938K3451L9975P4673Q7729R1572J14087
2285I62890J19423J32994J50274J15442R6572J49771K41212K99538M43821O92437
2275C404374J211788K109022K314167K047793K198620Q78720J68956q8330j433212
2266A2811898k221957k368366j833833j333629j244209r45154n36586l66695k24895
$$ plain form
2346 62709 79306 51811 34946 84102 85531 70731 75894 100288 119005 124539 92016 113269
2334 113269 98601 132708 121330 133849 134782 123059 125429 97528 83102 125987 110362 122657
2322 122657 138287 131216 153117 122703 175578 216852 199522 183715 162775 167646 170586 201251
2310 201251 210320 207935 209579 235981 235883 236505 267969 257953 266790 270087 294519 301317 307616 355291
2296 355291 407829 425665 461350 489465 531403 554854 594829 669502 757231 848803 962890
2285 962890 1082313 1215307 1365581 1481023 1577595 1727366 1968578 2268116 2711937 3404374
2275 3404374 4616162 6725184 9039351 11087144 13285764 14164484 14333440 14245110 12811898
2266 12811898 10589941 8221575 6387742 5054113 3809904 2864750 2328164 1961469 1736574
2257A736574j74137j18624r2246r7023p7017j09199j09820q5552p0748j15206
2247F87002r3629m0461l9772m0537n7091Q667n5019l306k2573m0581j7994q128
2235B76578l2880m3892k314P907l5368k4626L4174J1030J76j8581l0090L8708
2223A80822j9568j5416J1628j4093l825m606o697L314P447m4954m3963J9434j5108
2210E4415j0675L0158j0986k0413K7287J5365j4523n924N124k013l9017M4754
2198G3552M4847j9743k1059j6623j2544j5126K2045l1312l983J3853j2104J6971
2186C8774k2246k652K2506j8210m975o824l478j2152l3562K0577M5598j9J6198
2173C9535J4103K831l5131J1722p280k9777j585L2153o704O17N223j0581r933
$$ plain form
2257 1736574 1562437 1443813 1351567 1254544 1177527 1068328 958508 872956 802208 687002
2247 687002 593373 552912 513140 472603 415512 424179 369160 365854 343281 302700 284706 276578
2235 276578 243698 199806 197492 205399 170031 145405 179579 190609 190785 172204 142114 180822
2223 180822 161254 145838 157466 143373 139548 134942 128245 131559 139006 94052 50089 69523 54415
2210 54415 43740 73898 62912 42499 69786 85151 70628 64704 69828 67815 28798 73552
2198 73552 118399 98656 77597 60974 48430 33304 55349 24037 20054 33907 21803 38774
2186 38774 16528 13876 36382 18172 13197 6373 2895 -9257 -42819 -22242 23356 23337 39535
2173 39535 53638 56469 21338 33060 25780 -3997 -5582 26571 19867 20484 25707 15126 5193
2160E193j9553j8315n26L1302Q290j2753j1819K1441m642J3281j0698q752k5040
2147c2591O028l6798L935J6246K2443j3022j7093k3437K3572M9228j5233j3981
2135c0703R227K316j4298R317R9j3713N044j224j6993O449R415l418k0741p387
2121f6610N984J7327K3532o787k5398m3005j3819K4503K4780j8615K3995J3811
2109d0302j2958O96p946J5421J778j1125K4460M703k4281J1084n095k4353r39
2096f8857J0526j1361M704M3064N481k7060j8148j0893K7397L3210k2711j8729
2084e3377R877k0676k4074k909j096L9171O568l0958K0780o823J8775j068J3868
2071c1942j332q226l122O902O206l0232J6312K427q698J6188j505k8105l953J0722
$$ plain form
2160 5193 -14360 -32675 -33201 -1899 6391 -6362 -18181 3260 -1382 11899 1201 -7551 -32591
2147 -32591 -26563 -63361 -59426 -43180 -20737 -33759 -50852 -74289 -50717 -1489 -16722 -30703
2135 -30703 -21476 -19160 -33458 -24141 -24042 -37755 -32711 -33935 -50928 -44479 -35064 -38482 -59223 -66610
2121 -66610 -60626 -43299 -19767 -26554 -51952 -94957 -108776 -84273 -59493 -78108 -54113 -40302
2109 -40302 -53260 -52564 -60510 -45089 -43311 -54436 -29976 -25273 -49554 -38470 -43565 -67918 -68857
2096 -68857 -58331 -69692 -64988 -21924 -16443 -43503 -61651 -72544 -45147 -11937 -34648 -53377
2084 -53377 -43500 -64176 -88250 -91159 -92255 -53084 -46516 -77474 -56694 -63517 -44742 -45810 -31942
2071 -31942 -33274 -41500 -44622 -37720 -31514 -61746 -45434 -43007 -51705 -35517 -37022 -65127 -69080 -58358
2057e8358N65j7785Q823N362K7528R83r976J081n143J3429J3253l6029r196J3374
2043e2089l3883p426J0945j673J4629L613j4525K2477K1526p01j5422J1320p693
2030d8902k7783n524R197J6208J0942k7396j24k424j6385J3743M3763L746l696
2017c4635r343j8763j9701M5096K718l0956K5436N91j4830k065Q759J2893M7334
2004A2534k3240J7716k3691r877M5388M5093J711l7182k5300L218k1484j2201
1992b7315o707m3676K9178K0962j0029q333k98o531K2115j0874J6002j2405Q803
1979b9108m965n2602k3973j7995M0306L5329k3370L8192L717j0838J393J082k5278
1966f8110k3760j175J1979M8628q194N915j2054L72r258q163J431M256M770J604
$$ plain form
2057 -58358 -57793 -75578 -66755 -61393 -33865 -32882 -42858 -41777 -46920 -33491 -20238 -56267 -65463 -52089
2043 -52089 -85972 -93398 -82453 -84126 -69497 -65884 -80409 -57932 -36406 -37107 -52529 -41209 -48902
2030 -48902 -76685 -82209 -73012 -56804 -45862 -73258 -73382 -75806 -92191 -78448 -34685 -30939 -34635
2017 -34635 -43978 -62741 -82442 -37346 -34628 -65584 -40148 -39557 -54387 -56452 -47693 -34800 12534
2004 12534 -10706 7010 -16681 -26558 18830 63923 65634 28452 3152 6370 -15114 -27315
1992 -27315 -34022 -77698 -48520 -27558 -37587 -45920 -46218 -52749 -30634 -41508 -25506 -37911 -29108
1979 -29108 -34073 -86675 -110648 -128643 -88337 -53008 -76378 -38186 -34469 -45307 -43914 -42832 -68110
1966 -68110 -91870 -93045 -81066 -32438 -40632 -34717 -46771 -46399 -55657 -63820 -62389 -58133 -53363 -51759
1952e1759n071J4236k3874O11K2277O154j376k363j5409P288j0648K593j2989
1939g0330K641M3998p190j2708r627K3545m476k1525J744j698k111K515j1085
1926f6307J3976j4614L768j3027J3218R714j1219o2971J4864L9786J1413K513
1914e8886K7026J0872q53q009p768l5817O452J3592j290J325k5943M602K4327
1901e0370J5787M401k5032L020J0689j6307K6949Q799n874k7570J5015l9791l1904
1888a12188k330L9243J0410j4572K2425j33j4747J3950j7236K2501J7964l8375
1876g3088L631M5417m4911J6643J467J5458N5882l1301k0871m0393p230R023L609
1863f6664K1019j7112j4935j484K5489j4484k7343P688O386J3883m132J750k5068
$$ plain form
1952 -51759 -56830 -42594 -66468 -65857 -43580 -37426 -38802 -41165 -56574 -49286 -59934 -57341 -70330
1939 -70330 -67689 -23691 -30881 -43589 -53216 -29671 -34147 -55672 -53928 -55626 -57737 -55222 -66307
1926 -66307 -52331 -66945 -63177 -76204 -62986 -53272 -64491 -127462 -112598 -72812 -61399 -58886
1914 -58886 -31860 -20988 -21841 -29850 -37618 -73435 -66983 -53391 -54681 -53356 -79299 -74697 -50370
1901 -50370 -34583 -30182 -55214 -52194 -41505 -57812 -30863 -22064 -27938 -55508 -40493 -80284 -112188
1888 -112188 -114518 -75275 -64865 -79437 -57012 -57145 -71892 -57942 -75178 -52677 -34713 -73088
1876 -73088 -69457 -24040 -68951 -52308 -50841 -35383 20499 -10802 -31673 -72066 -79296 -70273 -66664
1863 -66664 -45645 -62757 -77692 -79176 -53687 -68171 -95514 -87826 -81440 -67557 -71689 -69939 -95007
1850i5007K7442J4774m1760O255k5554K8558K1368j8701J5135K2251l1569m78
1838g7286L9266j5913m951j767J347J0832j072L767N877k0167n3925N3482J3827
1825d6683l2927N1111j3717o106k2168J2241K2789k0133K3220N630k7873l2111
1813h6727L5290l2107J8573N696Q929n042j1751L0527J0002K5498l2177j9337
1801e2626J3717k0399k8909K3928k8766J1605P995M167J8026l1876k5087K7407
1789h0818j9822L2352O764j2673O697j2109J4220l0572J4662M625M6853J4976
1777a4845m7394K7194l2653l3889j8560O2153K1424l5539p031J1749k84M998k1445
1764h4122L8644L0557j1308k2311J2671k0056j5740M160L8638k687j8109M602
$$ plain form
1850 -95007 -67565 -52791 -94551 -88296 -113850 -85292 -63924 -82625 -67490 -45239 -76808 -77286
1838 -77286 -38020 -53933 -58884 -60651 -59304 -48472 -49544 -45777 -39900 -60067 -113992 -60510 -46683
1825 -46683 -79610 -28499 -42216 -48322 -70490 -58249 -35460 -55593 -32373 -26743 -54616 -86727
1813 -86727 -51437 -83544 -64971 -59275 -50346 -55388 -67139 -36612 -26610 -1112 -33289 -52626
1801 -52626 -38909 -59308 -88217 -64289 -93055 -81450 -73455 -69288 -51262 -83138 -108225 -80818
1789 -80818 -100640 -68288 -61524 -74197 -67500 -79609 -65389 -95961 -81299 -76674 -29821 -14845
1777 -14845 -62239 -35045 -67698 -101587 -120147 -57994 -36570 -72109 -79140 -67391 -67675 -62677 -84122
1764 -84122 -45478 -14921 -26229 -48540 -35869 -55925 -71665 -67505 -28867 -31554 -49663 -45061
1752d5061L0257j2569j864j359q278J976l6858J4699K4680O455k7292j6624j0648
1739h2486M1634j6417j9546j3549K2976j0321k5061k020L8904J6740j7466m371
1727g0983L805L4705J1985m1248j867Q823L623j8378J6004J7267P364j5335j6811
1714f1046k6738J0489M0076r71j3238k3228J4041j2775J1134k0027K495K4477
1702e5311l1935K9910q60L406o972J5287n315J145M3650j4119j3905r629l0037
1689g4685J5482n402m358L549k1072Q972q280l9465J0687M1480K1783m27L054
1676d8682P738p761n438L849k7587m350K7734R467K6687o0181J5141J9636o842
1663e0589r371M298m888O275K6098m3652l4507J7355K5707N555K294N447p39J3274
$$ plain form
1752 -45061 -14804 -27373 -29237 -30596 -38874 -36898 -73756 -59057 -34377 -27922 -55214 -71838 -82486
1739 -82486 -40852 -57269 -76815 -90364 -67388 -77709 -102770 -104790 -65886 -49146 -66612 -70983
1727 -70983 -67178 -32473 -20488 -61736 -63603 -54780 -51157 -69535 -53531 -36264 -28900 -44235 -61046
1714 -61046 -87784 -77295 -37219 -38190 -51428 -74656 -60615 -73390 -62256 -82283 -79788 -55311
1702 -55311 -87246 -57336 -58196 -54790 -61762 -46475 -51790 -50645 -6995 -21114 -35019 -44648 -74685
1689 -74685 -59203 -64605 -68963 -65414 -86486 -77514 -85794 -125259 -114572 -73092 -51309 -51736 -48682
1676 -48682 -40944 -48705 -54143 -50294 -77881 -82231 -54497 -45030 -18343 -78524 -63383 -43747 -50589
1663 -50589 -59960 -55662 -60550 -54275 -28177 -71829 -106336 -88981 -63274 -57719 -55425 -49978 -50717 -37443
1649c7443k6322j3340L956n468j6458J637L9955P556k2569J1248j6458N17K3697
1636d9492n4618L343L6601K4602k850L178j0856m753J3443k6610n641J7535R31
1623e5187j9191J2575K2064P549j1443k3344j6213J9403M98J689L0608K1033k0442
1610c0401n1687J4889j7325L55Q207M2381j1447k326L0320k8216j8513R61K9631
1597c3171k7759k2645r512l984J2794J1478P768j0828K9521j1236r297Q315l8385
1584i6941l9134O6696J488j9349J6429j3917K9167n2760J5691K5677J3746j2937
1572f6144l065l371k309K3954j4209L3429N501k1945n895J0590p264J6555j1734
1559d5907m112k2161R376J6188n7652K711K0273J9666J3262j3009k0567M2267
$$ plain form
1649 -37443 -63765 -77105 -73149 -78617 -95075 -93438 -53483 -45927 -68496 -57248 -73706 -73189 -49492
1636 -49492 -104110 -100767 -64166 -39564 -42414 -39236 -50092 -54845 -41402 -68012 -73653 -56118 -55187
1623 -55187 -74378 -61803 -39739 -32190 -43633 -66977 -83190 -63787 -63289 -61600 -30992 -9959 -30401
1610 -30401 -82088 -67199 -84524 -84169 -75962 -33581 -45028 -47354 -17034 -45250 -63763 -62802 -33171
1597 -33171 -60930 -83575 -93087 -97071 -84277 -72799 -65031 -75859 -46338 -57574 -66871 -58556 -96941
1584 -96941 -136075 -69379 -67891 -87240 -70811 -84728 -55561 -108321 -92630 -66953 -53207 -66144
1572 -66144 -69209 -72580 -74889 -50935 -65144 -31715 -26214 -48159 -54054 -43464 -50728 -34173 -45907
1559 -45907 -50019 -72180 -62804 -46616 -104268 -101557 -81284 -61618 -48356 -61365 -81932 -39665
1547c9665O481k0601p231m0229J3312J1710j2415J3811L1940L2801j8189m3359
1535g1634j7384j0143K1411M1081j3541P55k4287j7161K3556l0843K3659r686
1523h4217m4842J8071N7176l435l4850L1449J5834k736M0058k96l9709k5263N934
1510f6826K6251Q409k8800j6319K1178l760J2925k664o848j4231k1736k8416L9375
1497h1462L1725p12j6297j3518K3328J1423o952r71k0831J9961J8669q919m0638
1484h5194K0032P671j0371N573J9995J202l9603J280J0384l6358J3357J9040j8003
1471i0995J4937k4097L0188O465o993K1564l229j1945J6852l9653m175L0709K4140
1458c6232J8886k7299k3349L9795J6084k5084j7010K327q644j4780K9660J8870
$$ plain form
1547 -39665 -33184 -53785 -61016 -101245 -87933 -76223 -88638 -74827 -42887 -10086 -28275 -71634
1535 -71634 -89018 -99161 -77750 -36669 -50210 -49455 -73742 -90903 -67347 -98190 -74531 -84217
1523 -84217 -129059 -110988 -53812 -57247 -92097 -60648 -44814 -47550 -7492 -7788 -47497 -72760 -66826
1510 -66826 -40575 -32166 -60966 -77285 -56107 -59867 -46942 -49606 -56454 -70685 -92421 -120837 -81462
1497 -81462 -49737 -50449 -66746 -80264 -56936 -45513 -52465 -53436 -74267 -54306 -35637 -44556 -85194
1484 -85194 -65162 -57491 -67862 -62289 -42294 -41092 -80695 -79415 -69031 -105389 -92032 -72992 -90995
1471 -90995 -76058 -100155 -69967 -63502 -70495 -48931 -52160 -64105 -47253 -86906 -91081 -60372 -36232
1458 -36232 -17346 -44645 -67994 -28199 -12115 -37199 -54209 -51882 -60526 -75306 -45646 -26776
1446b6776L40q252l8488m313J378K0078r360l1590J5675R310K9892r224J3002
1433c8328k6477p422M3802Q80j1500J7617r939l3292k4604M1410J1500k540K1421
1420a7472l064M949j1666L725j2332l593o7m572l6952P747l739J1469j80k2440
1406h8187j0217L8456M1354j1998j2550j5822j5315J0562J1106j7561N570l075
1394f7677N847N087J4219L8589k9994l9559N108j5937N3150j8946j6668K4790
1382d1991j1384j3469p503K9903j684j4300P400Q1l0816j557J3260M6838p83k3061
1368d9066K0900K8476p614j2346k2255n726o877J2548l0451o77J1800k313J2891
1355e0710m0813k3355L8240j855r547K5087j6453L0151k1078J3319k152k0062
$$ plain form
1446 -26776 -26436 -34688 -73176 -77489 -76111 -56033 -65393 -96983 -81308 -71998 -42106 -51330 -38328
1433 -38328 -64805 -72227 -28425 -27545 -39045 -21428 -31367 -64659 -89263 -47853 -36353 -38893 -17472
1420 -17472 -20536 -15587 -27253 -23528 -35860 -39453 -39520 -44092 -81044 -73297 -77036 -65567 -65747 -88187
1406 -88187 -98404 -59948 -18594 -30592 -43142 -58964 -74279 -63717 -52611 -70172 -64602 -67677
1394 -67677 -61830 -56743 -42524 -3935 -33929 -73488 -68380 -84317 -31167 -50113 -66781 -41991
1382 -41991 -53375 -66844 -74347 -44444 -46128 -60428 -53028 -52947 -83763 -85320 -72060 -25222 -26005 -49066
1368 -49066 -28166 310 -7304 -19650 -41905 -47631 -54508 -41960 -72411 -73088 -61288 -63601 -50710
1355 -50710 -91523 -114878 -76638 -78493 -88040 -62953 -79406 -49255 -70333 -57014 -59166 -79228
1343g9228O3479n777j6612J0737J9630k4006R828l78l4167k1613l395K6576j2095
1330f7021j0132J7715r164k5612K6590K287n6354K1154K1558J6772J7459j2108
1318e6856k0042j457K3368k913J3656j6696K6433n356j9063K1334R160q005l0061
1305f6498j1519M154j866K539Q36m876k936m472K6931K1056k1471m473l5554J9329
1291g8820O847j3062L3797J9639j0953j0449l819o325J2178J5220K010j1372j5416
1278f0525L411N635J63N62m007k462K0828m3829n826J0429L482J5882K4185j8117
1264e0189K323N73o677K724k5826j5587l649J8355J2049r639J0333L0135l52j1071
1250d6498m979k2934K2783J5084k7346J0859j4579J3002J6845k9828J1118J9828
$$ plain form
1343 -79228 -15749 -21526 -38138 -27401 -7771 -31777 -21949 -22327 -56494 -78107 -81502 -54926 -67021
1330 -67021 -77153 -59438 -68602 -94214 -67624 -65337 -121691 -100537 -78979 -62207 -44748 -56856
1318 -56856 -76898 -78355 -54987 -57900 -44244 -60940 -34507 -39863 -58926 -37592 -28432 -36437 -66498
1305 -66498 -78017 -73863 -75729 -73190 -72354 -77230 -80166 -84638 -57707 -36651 -58122 -62595 -98149 -78820
1291 -78820 -71973 -85035 -51238 -31599 -42552 -53001 -56820 -63145 -50967 -35747 -33737 -45109 -60525
1278 -60525 -57114 -51479 -51316 -50754 -54761 -57223 -36395 -80224 -86050 -75621 -72139 -56257 -32072 -50189
1264 -50189 -47866 -47293 -53970 -51246 -77072 -92659 -96308 -77953 -65904 -75543 -65210 -35075 -35427 -46498
1250 -46498 -51477 -74411 -51628 -36544 -63890 -53031 -67610 -54608 -37763 -67591 -56473 -36645
1238c6645r138R005l4215L038J0542j3244O69k603q096j2067k1O714J9815l943
1224g0189m308K223P697L627p927Q10L239K6692m6259J023M858J8185j5440k136
1210g7905K803J9199N9601l368n0909m42Q39o391M7130j5784k6192J7102k2574
1197e6891j4959n129M329L3758l101j6625k917K1281J2182m283l9305K6093J8464
1184b7103k8282p059L631L782o571l244o118P699j3821P601L0664J5322k3931
1171d7430o508K2149j9690l3992m914J0866q509L089J7644L2865N493j1429N72
1158c9794j915l599j1405L771j3521j1529J9487j7823K350q251L3561J1999k4765
1145f1434J4677L687k7117j3939M408m6021J1369K4135j0616J6255K3356K813
$$ plain form
1238 -36645 -45783 -36778 -70993 -67955 -57413 -70657 -69988 -72591 -80687 -92754 -92775 -86061 -66246 -70189
1224 -70189 -74497 -72274 -64577 -60950 -68877 -68067 -64828 -38136 -84395 -83372 -78514 -60329 -75769 -77905
1210 -77905 -75102 -55903 3698 330 -50579 -51021 -50182 -56573 -9443 -25227 -51419 -34317 -56891
1197 -56891 -71850 -76979 -72650 -38892 -41993 -58618 -61535 -40254 -28072 -32355 -71660 -45567 -27103
1184 -27103 -55385 -62444 -58813 -55031 -61602 -64846 -70964 -63265 -77086 -69485 -38821 -23499 -47430
1171 -47430 -53938 -31789 -51479 -85471 -90385 -79519 -88028 -84939 -67295 -34430 -28937 -40366 -39794
1158 -39794 -41709 -45308 -56713 -52942 -66463 -77992 -58505 -76328 -73978 -82229 -48668 -36669 -61434
1145 -61434 -46757 -43070 -70187 -84126 -79718 -125739 -114370 -90235 -100851 -84596 -61240 -58427
1133e8427j7127n913k1861M3618P972p27K112k7018K6949q859l8358J1335L3850
1120e2454l1307Q097P32L4949K473l9933k007j031J8344O144j1407j5698n746
1107h8844N207J6505J047k4882J7521L2823J9991k2102k2799J3225K9248j6676
1095c9736k2372j2477K6250l2046J9800J1395j9053N152k5552K7844k729K1684
1083d1840p765m4014M3087M735l2446J5219N474N709o553J5381K4370P641j0548
1070b1550k8169l4142o712J3836J8646J1104L660k0488o654J4309J3154j2980
1058e5986j6246J4005k417j9649J4563J1740P338l5513k5236k162J0543L8886
1046f0134J8071m0828P203o247K7299n246j5817N1899l8474j8919K3440J2892
$$ plain form
1133 -58427 -75554 -81467 -103328 -59710 -51738 -52465 -50353 -77371 -50422 -59281 -97639 -86304 -52454
1120 -52454 -83761 -75664 -74932 -39983 -37510 -77443 -79450 -80481 -62137 -55993 -67400 -83098 -88844
1107 -88844 -83637 -67132 -66085 -90967 -73446 -40623 -20632 -42734 -65533 -52308 -23060 -39736
1095 -39736 -62108 -74585 -48335 -80381 -60581 -49186 -68239 -63087 -88639 -60795 -63524 -41840
1083 -41840 -49605 -93619 -50532 -45797 -78243 -63024 -57550 -51841 -58394 -43013 -18643 -11002 -21550
1070 -21550 -49719 -83861 -90573 -76737 -58091 -46987 -43327 -63815 -70469 -56160 -43006 -55986
1058 -55986 -72232 -58227 -60644 -80293 -65730 -53990 -46652 -82165 -107401 -109563 -99020 -60134
1046 -60134 -42063 -82891 -75688 -81935 -54636 -59882 -75699 -23800 -62274 -81193 -57753 -44861
1034d4861k983q268j229j158M466q820q055j1019K0217K3436O909j1977Q065j2242
1020d7519l356j8305N320P160O241n803J6566J057k6192k3653P693j2673K3930
1007f9534L275j5039J3782J128J465j0939M0651j9131j6018Q293L2814j3609m8054
994i0916L5K4486n998k17N91j3935O72K441J4764j9628l1929L0071K9728J7879
980d1956j6171j1437m557J9510n291J4138N359N85l2778L4015K8942n4113j2603
967g6357j4328J4833L3781k4922L7393j1413m6590K3307L2126m049j6603k381
955e5203J3700J5240k8834P876j1733J4968m2472r990M3236l4027k4554O100k030
942a07723K7530L9216j1521l6437j2635K9383L1228k0067m748K1438k4771K4942
$$ plain form
1034 -44861 -47844 -56112 -57341 -58499 -54033 -62853 -70908 -81927 -61710 -38274 -31365 -43342 -35277 -47519
1020 -47519 -50875 -69180 -63860 -56700 -50459 -56262 -39696 -38639 -64831 -88484 -80791 -93464 -69534
1007 -69534 -66259 -81298 -67516 -66388 -64923 -75862 -35211 -54342 -70360 -62067 -29253 -42862 -90916
994 -90916 -90881 -66395 -72393 -72610 -72019 -85954 -85282 -82841 -68077 -87705 -119634 -89563 -59835 -41956
980 -41956 -58127 -69564 -74121 -54611 -59902 -45764 -40405 -39820 -72598 -38583 -9641 -63754 -76357
967 -76357 -90685 -75852 -42071 -66993 -29600 -41013 -87603 -64296 -32170 -36219 -52822 -55203
955 -55203 -41503 -26263 -55097 -47221 -58954 -43986 -86458 -96448 -53212 -87239 -111793 -105693 -107723
942 -107723 -80193 -40977 -52498 -88935 -101570 -72187 -40959 -61026 -65774 -44336 -69107 -44165
930d4165k6810N904R653r412k6207J4934j1719M5241j9663m6067n124K6788o745
917i3392m250L8350k472J9153j9191J020o616j1365l7469L0273K5867o890l3940
904a00922K6317K9622O234j8199j1594o491J138J5166J8897k1091j0735R366o562
891f8854J6988p434q941J1836J7316K9640j3676l8551N267o304J1751j0682k2514
878h4158L455K3057N869q808N15J4021O6L233k6530j9205K1689K5112N980M570
864c1134j5161j1432k0938J324J3968J1856o289j3367K7947l066o150k1125j1484
851h5051Q386L385j3218J062L2384l888j8399K7771K788J1579j3888K213J6820
838b8056r008r127J994p781N981J3628M0270m3628j9594n576j1651j0044L343
$$ plain form
930 -44165 -70975 -65071 -55418 -64830 -91037 -76103 -87822 -42581 -62244 -108311 -113435 -86647 -93392
917 -93392 -97642 -59292 -61764 -42611 -61802 -60782 -67398 -78763 -116232 -85959 -60092 -66982 -100922
904 -100922 -74605 -44983 -38749 -56948 -68542 -75033 -73895 -58729 -39832 -60923 -71658 -62292 -68854
891 -68854 -51866 -59300 -68241 -56405 -39089 -9449 -23125 -61676 -56409 -62713 -50962 -61644 -84158
878 -84158 -80703 -57646 -51777 -60585 -60070 -46049 -45983 -42750 -69280 -88485 -66796 -41684 -35704 -31134
864 -31134 -46295 -57727 -78665 -77341 -63373 -51517 -57806 -71173 -43226 -46292 -52442 -73567 -85051
851 -85051 -76665 -73280 -86498 -85436 -53052 -56940 -75339 -47568 -44780 -33201 -47089 -44876 -28056
838 -28056 -37064 -46191 -44197 -51978 -45997 -32369 7901 -35727 -55321 -60897 -72548 -82592 -79249
825g9249j1078K7101m085o713Q487j0237Q534K1989J8815j3064L411p055j3115
812e6259l1014j2357M1213j743K9385o890j7646j3462M8525m54k3482j1528k6890
799h2602J8243j2943J9003J0679j5609q86p205J7451K9293J1590N428m3582n227
786e6367j6137j3504J3309J0911k1603k2661M3806Q26j7875N0584l174k291k9675
773f3851j6618q561M4144O861r394Q426Q988o212q738k0999J7411J3384k2477
760e7636M032N7M958J049k0489J4121j231m066M570L1059k9981J1348L606L648
746c4955j8438j8479J1740q858K696M008Q444l7154J126J5156J4694o418N32O325
732e9581j5704K0778p386J6702K6375J5597p874k5540r940j9932L259k9131J8061
$$ plain form
825 -79249 -90327 -63226 -67311 -74024 -65537 -75774 -67240 -45251 -26436 -39500 -36089 -43144 -56259
812 -56259 -87273 -99630 -58417 -60160 -30775 -37665 -55311 -68773 -20248 -20702 -44184 -55712 -82602
799 -82602 -64359 -77302 -58299 -47620 -63229 -64115 -71320 -53869 -24576 -12986 -7558 -51140 -56367
786 -56367 -72504 -86008 -72699 -61788 -83391 -106052 -62246 -61420 -79295 -28711 -31885 -34176 -63851
773 -63851 -80469 -89030 -44886 -38025 -47419 -38993 -30005 -36217 -44955 -65954 -48543 -35159 -57636
760 -57636 -53604 -53547 -48589 -47540 -68029 -53908 -55139 -59205 -54635 -23576 -53557 -42209 -38603 -34955
746 -34955 -53393 -71872 -60132 -68990 -66294 -62286 -53842 -90996 -89870 -74714 -60020 -66438 -65906 -59581
732 -59581 -75285 -54507 -61893 -45191 -18816 -3219 -11093 -36633 -46573 -66505 -63246 -92377 -74316
719g4316J0562J0643J331j2778n499q16P393K6331J529l8310R371J7139j706L412
705d5714r484j6636L8740K0100j5293l5672R398j9182k2933K3124j8876P578K1263
692f3587J1688m882j3969k1671J0563J1425J975J7097m020j4004j495j3164j8165
679a02209M4713r582m5704K5172J7043j0859L591L4020j9176n109J7290P495R382
666c3933j5668J3888J4015n4312j2888j0864j2474L7249K526k075K8126k374j7124
653f5908L050j0396j6872J2622L0714m163j9906n728R625N408O348m1025L172
640i3059K9491J507J8252r538K6172k3693l9944L226K7496J6063n95j2006r106
627f5734k7459M109o986J6993J0788J5403R48J5455M109k6574K131Q904p212J0896
$$ plain form
719 -74316 -63754 -53111 -51780 -64558 -70057 -70873 -63480 -37149 -35620 -73930 -64559 -47420 -49126 -45714
705 -45714 -55198 -71834 -33094 -12994 -28287 -63959 -54561 -73743 -96676 -73552 -92428 -84850 -63587
692 -63587 -51899 -56781 -70750 -92421 -81858 -70433 -68458 -51361 -55381 -69385 -70880 -84044 -102209
679 -102209 -57496 -67078 -112782 -87610 -70567 -81426 -77835 -43815 -62991 -68100 -50810 -43315 -33933
666 -33933 -49601 -35713 -21698 -76010 -88898 -99762 -112236 -74987 -72461 -74536 -46410 -48784 -65908
653 -65908 -62858 -73254 -90126 -77504 -46790 -50953 -70859 -76587 -66962 -61554 -55206 -96231 -93059
640 -93059 -63568 -62061 -43809 -53347 -27175 -50868 -90812 -87586 -60090 -44027 -44622 -56628 -65734
627 -65734 -93193 -89084 -96070 -79077 -68289 -52886 -51938 -36483 -32374 -58948 -56817 -47913 -55125 -44229
613d4229m542l0639j9346m80N378j1109l500J7127Q091K3937J8337j0150j5933
600f7058k5041K6856K3946Q583J9082L835j8242l1050J5657m94k9600K0254J4441
587c8831N403j2162m9845J6417L6402k6946o843J4587L857p311j8163j877M8013
574c7299Q490n1670k6573J5645L4213L262Q252K1023m8635j0415K8476k9204j6280
561a00715K2056M3834p303r959j2763l4633K5338J201k3805O540Q427K1790k1099
548h1091j0233K7391L664L126m5018N7735P579J0958j3201J3215J813k4055j1010
535e9127o327j7365J182K601J6525j2139j5787K8248L696J1891m421q008j7040
522g6071m6268K3657N5698P85J5103r111k7639O162K0694J4534l0886K6144l0798
$$ plain form
613 -44229 -48771 -79410 -98756 -99236 -93858 -104967 -108467 -91340 -83249 -59312 -40975 -51125 -67058
600 -67058 -92099 -65243 -41297 -32714 -13632 -9797 -28039 -59089 -43432 -43926 -73526 -53272 -38831
587 -38831 -33428 -45590 -95435 -79018 -42616 -69562 -76405 -61818 -57961 -65272 -83435 -85312 -37299
574 -37299 -28809 -80479 -107052 -91407 -57194 -53932 -45680 -24657 -73292 -83707 -55231 -84435 -100715
561 -100715 -78659 -34825 -42128 -52087 -64850 -99483 -74145 -72944 -96749 -90209 -81782 -59992 -81091
548 -81091 -91324 -63933 -60269 -57143 -102161 -44426 -36847 -25889 -39090 -25875 -24062 -48117 -59127
535 -59127 -65454 -82819 -81637 -79036 -62511 -74650 -90437 -62189 -58493 -46602 -51023 -59031 -76071
522 -76071 -122339 -98682 -42984 -42199 -27096 -36207 -63846 -57684 -36990 -22456 -53342 -27198 -57996
509e7996l5294Q902M0606L3701k6124p827k2954L4269n076n8530j1862K2260q934
496i4859J9792j0238K6222j5345m7307K9396K1467j1752J5590J5749n053l5059
484i1397J1275L734Q874n662N594m123j4661J5477K4437j5039J5954J8046j1521
471c9012O281J2894j9860j6174L3938K1958k7445k4393q471m1670K0595j9534
459a00893J4961K8335k437J5447L862l4667J5305p179J065K1136K258j1331n224
446e9362J4903j8860N029n773l2677k9884M2213o889l0907K7211J9323j1753Q810
433g8616M1641l927j9572L322J5151q251J6659j5060j590O63k3029R161m38O415
419e7471j9725J370K1191Q81j1742K3191J21j7101j9789l4737L1612O727N66p481
$$ plain form
509 -57996 -93290 -84388 -43782 -10081 -36205 -44032 -66986 -32717 -37793 -96323 -108185 -85925 -94859
496 -94859 -75067 -85305 -59083 -74428 -121735 -92339 -70872 -82624 -67034 -51285 -56338 -91397
484 -91397 -80122 -76388 -67514 -73176 -67582 -71705 -86366 -70889 -46452 -61491 -45537 -27491 -39012
471 -39012 -32731 -19837 -39697 -55871 -21933 25 -27420 -51813 -60284 -101954 -81359 -100893
459 -100893 -85932 -57597 -60034 -44587 -40725 -75392 -60087 -67266 -66201 -45065 -42807 -54138 -59362
446 -59362 -44459 -63319 -58290 -64063 -96740 -126624 -84411 -91300 -122207 -94996 -75673 -87426 -78616
433 -78616 -36975 -40902 -60474 -57152 -42001 -50252 -33593 -48653 -50243 -49580 -72609 -63448 -63886 -57471
419 -57471 -77196 -75826 -54635 -53754 -65496 -42305 -42184 -59285 -79074 -113811 -82199 -75472 -74906 -82387
405h2387L0303J8540r602K9062m0208J2633K6969k416l8571k9522J6626K5894
393d2679K644r740o478J3194q867M6396R182l2794m7582K2911K7836o623l6651
380f9251l646K3905j6218J7132P538l2332R331L2026l3289K340J1802J3357J5547
367b1758j7568j8202l9550K5230J2352k0518Q874J549J6309j3354J0333J2567
355d3736j5177j799J487K1787J3915n601j0433l3218J9253J8907r087l2226J8892
342e7036k138N5346j090m7370j5581J9428R400r15k5462N179j07j561l0367n824
328i8098L5439p907L579K45L2622L6174L767k1974j2256k5291j1225j0973j4020
315h9918M2762j6244J3788R945k3470j0955L1753K8942j4794l941k6145o184R985
$$ plain form
405 -82387 -52084 -33544 -43146 -14084 -54292 -41659 -14690 -17106 -55677 -85199 -68573 -42679
393 -42679 -40035 -49775 -56253 -43059 -51926 -5530 3652 -29142 -76724 -53813 -25977 -32600 -69251
380 -69251 -72897 -48992 -65210 -48078 -40540 -72872 -63541 -31515 -64804 -62464 -50662 -37305 -21758
367 -21758 -39326 -57528 -97078 -71848 -59496 -80014 -71140 -69591 -53282 -66636 -56303 -43736
355 -43736 -58913 -60712 -59225 -37438 -23523 -29124 -39557 -72775 -53522 -34615 -43702 -75928 -57036
342 -57036 -59174 -3828 -4918 -52288 -67869 -48441 -39041 -39956 -65418 -60239 -60346 -61907 -92274 -98098
328 -98098 -62659 -70566 -66987 -66742 -34120 2054 5821 -16153 -28409 -53700 -64925 -75898 -89918
315 -89918 -47156 -63400 -49612 -39667 -63137 -74092 -42339 -13397 -28191 -32132 -58277 -64461 -54476
302e4476K9351l3188o600P712n930L1888k1191j1083M982o73K3918l1898n054
289g2242L2647l0334k0372j682K2054K4125j3977k4199K2332j149p306N0154O647
276a3302k9165J304j2172j679r179k7562L8328K12K507L4877O612k2645q47q229
262d0940k4689k2796J0433K5448n09q391K9283k7836q370l6750J4513K0291o956
249g7269l218J1795Q979Q605j7375J4945K3043j9417k0363m450K4216r415J5185
236d4739j287K809j1471j245J3331r143n612J2089M644N376r198n185j6175j7215
222h3021m45J7265P13m4569L0322O1971l1645k4806O371J8616r840J7433j0976
$$ plain form
302 -54476 -25125 -58313 -64913 -57201 -63131 -31243 -52434 -63517 -58535 -59208 -35290 -67188 -72242
289 -72242 -39595 -69929 -90301 -91983 -69929 -45804 -59781 -83980 -61648 -62797 -70103 -19949 -13302
276 -13302 -42467 -41163 -53335 -55014 -64193 -91755 -53427 -53215 -50708 -15831 -9219 -31864 -32711 -40940
262 -40940 -65629 -88425 -77992 -52544 -53053 -61444 -32161 -59997 -68367 -105117 -90604 -70313 -77269
249 -77269 -80487 -68692 -59713 -51108 -68483 -53538 -30495 -49912 -70275 -74725 -50509 -59924 -44739
236 -44739 -46026 -43217 -54688 -55933 -42602 -51745 -57357 -45268 -40624 -35248 -44446 -49631 -65806 -83021
222 -83021 -83466 -66201 -65488 -110057 -79735 -17764 -49409 -74215 -67844 -49228 -59068 -41635 -52611
$$ [...]
##END NTUPLES=NMR SPECTRUM
##END=
