##TITLE=1H_DE-80H_X3
 200.13MHz, d2o
 8 sc
 
 19ns.26.2.2025
##JCAMPDX= 6.0         $$ Bruker NMR JCAMP-DX V2.0
##DATA TYPE= NMR SPECTRUM
##DATA CLASS= NTUPLES
##ORIGIN= UXNMR, Bruker Analytische Messtechnik GmbH
##OWNER= pz
$$ XWIN-NMR		Version 3.5
$$ Thu Jun  5 11:26:24 2025 Russian Standard Time (UT+4h)  Yarkov@DPX200
##.OBSERVE FREQUENCY= 200.1313
##.OBSERVE NUCLEUS= ^1H
##.ACQUISITION MODE= SIMULTANEOUS
##.ACQUISITION SCHEME= undefined
##.AVERAGES= 8
##.DIGITISER RES= 18
##SPECTROMETER/DATA SYSTEM= spect
##.PULSE SEQUENCE= zg30
##.SOLVENT NAME= CDCl3
##.SHIFT REFERENCE= (INTERNAL, CDCl3, 0, 15.5254)
##AUDIT TRAIL= $$ (NUMBER, WHEN, WHO, WHERE, WHAT)
$$ ##TITLE= Audit trail, XWIN-NMR		Version 3.5
$$ ##JCAMPDX= 5.01
$$ ##ORIGIN= Bruker BioSpin GmbH
$$ ##OWNER= Yarkov
$$ C:/Bruker/XWIN-NMR/data/yarkov2/nmr/H-C/1/pdata/1/auditp.txt
$$ ##AUDIT TRAIL=  $$ (NUMBER, WHEN, WHO, WHERE, WHAT)
(   1,<2025-06-05 11:25:23.62 +0400>,<Yarkov>,<DPX200>,
      <created by zg, POWCHK disabled, PULCHK disabled
       configuration hash MD5:
       00 E9 B6 7A A2 85 ED C7 34 08 36 98 17 FE 4E 26
       data hash MD5: 16K
       23 57 28 21 E7 A5 18 E5 25 A4 6F 8F 27 8D 40 AC>)
(   2,<2025-06-05 11:25:32.96 +0400>,<Yarkov>,<DPX200>,
      <Start of raw data processing
       efp BC_mod = 2 LB = 0.25 FT_mod = 6 PKNL = 1 PHC0 = -1710.501 PHC1 = 9.76656 SI = 16K 
       data hash MD5: 16K
       F2 B2 F3 EB 4C 67 D0 D7 DB A0 CD CD 53 A1 16 FE>)
(   3,<2025-06-05 11:25:36.90 +0400>,<Yarkov>,<DPX200>,
      <abs ABSG = 5 
       data hash MD5: 16K
       EC 63 B3 C6 8A 7C F3 8D 83 94 D2 3C FA 0B 17 4E>)
$$ ##END=
$$ 
$$ hash MD5
$$ 4E B1 7E B6 B5 E4 04 4E CD 36 37 A2 92 F2 C1 EC
##$RELAX= 
##$RELAX= 
##$RELAX= 
##$RELAX= 
##$RELAX= 
##$RELAX= 
$$ Bruker specific parameters
$$ --------------------------
##$DU= <C:/Bruker/XWIN-NMR>
##$EXPNO= 1
##$NAME= <H-C>
##$PROCNO= 1
##$TYPE= <nmr>
##$USER= <yarkov2>
##$AMP= (0..31)
100 100 100 100 100 100 100 100 100 100 100 100 100 100 100 100 100 100 
100 100 100 100 100 100 100 100 100 100 100 100 100 100 
##$AQSEQ= 0
##$AQ_mod= 1
##$AUNM= <au_zg>
##$AUTOPOS= <>
##$BF1= 200.13
##$BF2= 200.13
##$BF3= 200.13
##$BF4= 200.13
##$BF5= 200.13
##$BF6= 200.13
##$BF7= 200.13
##$BF8= 200.13
##$BYTORDA= 1
##$CFDGTYP= 0
##$CFRGTYP= 5
##$CHEMSTR= <none>
##$CNST= (0..31)
1 1 145 1 1 1 1 1 1 1 1 1 1 1 1 1 1 1 1 1 1 1 1 1 1 1 1 1 1 1 1 1 
##$CPDPRG= <>
##$CPDPRG1= <>
##$CPDPRG2= <>
##$CPDPRG3= <>
##$CPDPRG4= <mlev>
##$CPDPRG5= <mlev>
##$CPDPRG6= <mlev>
##$CPDPRG7= <mlev>
##$CPDPRG8= <mlev>
##$CPDPRGB= <>
##$CPDPRGT= <>
##$D= (0..31)
0 0.7 0 0 0 0 0 0 0 0 0 0.03 0 0 0 0 0 0 0 0 0 0 0 0 0 0 0 0 0 0 0 0 
##$DATE= 1749108323
##$DBL= (0..7)
120 120 120 120 120 120 120 120 
##$DBP= (0..7)
150 150 150 150 150 150 150 150 
##$DBP07= 0
##$DBPNAM0= <>
##$DBPNAM1= <>
##$DBPNAM2= <>
##$DBPNAM3= <>
##$DBPNAM4= <>
##$DBPNAM5= <>
##$DBPNAM6= <>
##$DBPNAM7= <>
##$DBPOAL= (0..7)
0.5 0.5 0.5 0.5 0.5 0.5 0.5 0.5 
##$DBPOFFS= (0..7)
0 0 0 0 0 0 0 0 
##$DE= 6
$$ [...]
##$SUBNAM3= <"">
##$SUBNAM4= <"">
##$SUBNAM5= <"">
##$SUBNAM6= <"">
##$SUBNAM7= <"">
##$SUBNAM8= <"">
##$SUBNAM9= <"">
##$SW= 18.0517328524113
##$SWIBOX= (0..15)
0 0 2 0 0 0 0 0 0 0 0 0 0 0 0 0 
##$SW_h= 3612.71676300578
##$TD= 16384
##$TD0= 1
##$TE= 0
##$TE2= 300
##$TE3= 300
##$TEG= 300
##$TL= (0..7)
0 120 120 120 120 120 120 120 
##$TP= (0..7)
150 150 150 150 150 150 150 150 
##$TP07= 0
##$TPNAME0= <>
##$TPNAME1= <>
##$TPNAME2= <>
##$TPNAME3= <>
##$TPNAME4= <>
##$TPNAME5= <>
##$TPNAME6= <>
##$TPNAME7= <>
##$TPOAL= (0..7)
0.5 0.5 0.5 0.5 0.5 0.5 0.5 0.5 
##$TPOFFS= (0..7)
0 0 0 0 0 0 0 0 
##$TUNHIN= 0
##$TUNHOUT= 0
##$TUNXOUT= 0
##$USERA1= <user>
##$USERA2= <user>
##$USERA3= <user>
##$USERA4= <user>
##$USERA5= <user>
##$V9= 5
##$VALIST= <valist>
##$VCLIST= <CCCCCCCCCCCCCCC>
##$VD= 0
##$VDLIST= <DDDDDDDDDDDDDDD>
##$VPLIST= <PPPPPPPPPPPPPPP>
##$VTLIST= <TTTTTTTTTTTTTTT>
##$WBST= 1024
##$WBSW= 4
##$XGAIN= (0..3)
0 0 0 0 
##$XL= 0
##$YL= 0
##$YMAX_a= 597496
##$YMIN_a= -606458
##$ZGOPTNS= <>
##$ZL1= 120
##$ZL2= 120
##$ZL3= 120
##$ZL4= 120
##$ABSF1= 15.5056
##$ABSF2= -2.546249
##$ABSG= 5
##$ABSL= 3
##$ALPHA= 0
##$AQORDER= 0
##$ASSFAC= 0
##$ASSFACI= 0
##$ASSFACX= 0
##$ASSWID= 0
##$AUNMP= <proc_1d>
##$AZFE= 0.1
##$AZFW= 0.1
##$BCFW= 0
##$BC_mod= 2
##$BYTORDP= 0
##$COROFFS= 0
##$CY= -3
##$DATMOD= 1
##$DC= 0
##$DFILT= <>
##$DTYPP= 0
##$F1P= 0
##$F2P= 0
##$FCOR= 1
##$FTSIZE= 16384
##$FT_mod= 6
##$GAMMA= 0
##$GB= 0
##$INTBC= 1
##$INTSCL= 3.241238e-09
##$ISEN= 128
##$LB= 0.25
##$LEV0= 0
##$LPBIN= 0
##$MAXI= 10000
##$MC2= 0
##$MEAN= 0
##$ME_mod= 0
##$MI= 1.114404
##$NCOEF= 0
##$NC_proc= -5
##$NLEV= 6
##$NOISF1= 3.799351
##$NOISF2= 2.8
##$NSP= 0
##$NTH_PI= 0
##$NZP= 0
##$OFFSET= 15.52543
##$PC= 1
##$PHC0= -1710.501
##$PHC1= 9.76656
##$PH_mod= 1
##$PKNL= yes
##$PPARMOD= 0
##$PSCAL= 0
##$PSIGN= 0
##$REVERSE= no
##$SF= 200.129999254363
##$SI= 16384
##$SIGF1= 3
##$SIGF2= 2
##$SINO= 0.751879
##$SIOLD= 32768
##$SREGLST= <19F.Aceton>
##$SSB= 0
##$STSI= 16384
##$STSR= 0
##$SW_p= 3612.71676300578
##$SYMM= 0
##$S_DEV= 0
##$TDeff= 16384
##$TDoff= 0
##$TI= <>
##$TILT= no
##$TM1= 0
##$TM2= 0
##$TOPLEV= 0
##$USERP1= <user>
##$USERP2= <user>
##$USERP3= <user>
##$USERP4= <user>
##$USERP5= <user>
##$WDW= 1
##$XDIM= 16384
##$YMAX_p= 331671823
##$YMIN_p= -208875
$$ End of Bruker specific parameters
$$ ---------------------------------
##NTUPLES= NMR SPECTRUM
##VAR_NAME=  FREQUENCY,     SPECTRUM/REAL,   SPECTRUM/IMAG
##SYMBOL=    X,             R,               I
##VAR_TYPE=  INDEPENDENT,   DEPENDENT,       DEPENDENT
##VAR_FORM=  AFFN,          ASDF,            ASDF
##VAR_DIM=   16384,         16384,           16384
##UNITS=     HZ,            ARBITRARY UNITS, ARBITRARY UNITS
##FACTOR=    0.220516191357247, 1,           1
##FIRST=     3107.10423941739, 0,            0
##LAST=      -505.612523588386, 0,           0
##MIN=       -505.612523588386, -208875,     0
##MAX=       3107.10423941739, 331671823,    0
$$ Real data points
##PAGE= N=1
##DATA TABLE= (X++(R..R)), XYDATA
$$ [...]
6159B245937j33052j18325j19172p0588k9178m0901p0710p7958k5473l5120n983
6148A519477J9046J6802L5788N8694K7678M8050J5288l0434j1953o4061j02451
6137A531924r5586j06115j04101j16127n8858o3310q1900m4871j6074n7077j3891
6126G74014K9413j8995j5706l0297j4807J3877j5997K6075K2433M1896K9732J0895
6114H52533J4566J9984N5562O9748M8950N9228N4645P8338Q4416Q6515Q7299O1741
6102A573525M8804R4497O4139K1860n463k1235l1802K304K5262K5044M237K0651
6090A821823M5862N8142N0008J08544J38177J12290J41358J71898J36395J54219
6080B938716J74444J41434J30423R9214Q1892K2219k1298o3588j28720r4324q1807
$$ plain form
6159 2245937 2112885 1994560 1875388 1804800 1775622 1734721 1664011 1586053 1560580 1525460 1519477
6148 1519477 1538523 1555325 1591113 1649807 1677485 1725535 1740823 1710389 1698436 1634375 1531924
6137 1531924 1436338 1330223 1226122 1109995 1051137 987827 905927 861056 844982 787905 774014
6126 774014 803427 784432 768726 738429 723622 737499 721502 747577 770010 811906 841638 852533
6114 852533 867099 887083 942645 1012393 1061343 1120571 1175216 1253554 1337970 1424485 1511784 1573525
6102 1573525 1622329 1716826 1780965 1802825 1797362 1776127 1744325 1746629 1771891 1796935 1801172 1821823
6090 1821823 1867685 1925827 1975835 2084379 2222556 2334846 2476204 2648102 2784497 2938716
6080 2938716 3113160 3254594 3385017 3484231 3566123 3588342 3567044 3503456 3374736 3280412 3198605
6069C198605j17590q2213p8668m7443n2223j5588J0315q614N2588O8345L2035
6058B959549R6428R8601J57372J67901J71733J01975P6107l8237j17135j69648
6048C504646k23340k67606k17402k48390j83117j63919k07099j68812j22208j37766
6038A564987n6552n0661k1373l8174J7071m3822l6406k577J1187M1098L4789N5670
6026A475237P1976P272M5563K7177l4181k2410j00722j30051j26250r1353r0708
6015A031550j34725j10093l1566m4547m8802p5552l3058k1034J3852l9134o4803
6004D42088k0424L7392j8327J0126m3635l7898m2336k3018J5679m0208J8396L515
5992C01350j4538q646j2589j0842J170Q550k9811k9272N8404L345l1534K997j1335
$$ plain form
6069 3198605 3081015 2998802 2920134 2872691 2820468 2804880 2815195 2806581 2859169 2927514 2959549
6058 2959549 3055977 3154578 3311950 3479851 3651584 3753559 3829666 3791429 3674294 3504646
6048 3504646 3281306 3013700 2796298 2547908 2364791 2200872 1993773 1824961 1702753 1564987
6038 1564987 1508435 1457774 1436401 1398227 1415298 1371476 1335070 1332493 1343680 1384778 1419567 1475237
6026 1475237 1547213 1554485 1600048 1627225 1593044 1570634 1469912 1339861 1213611 1122258 1031550
6015 1031550 896825 786732 755166 710619 661817 586265 553207 532173 546025 506891 442088
6004 442088 421664 459056 440729 450855 407220 369322 326986 303968 319647 279439 297835 301350
5992 301350 286812 278166 265577 254735 255905 264455 234644 205372 263776 267121 235587 238584 227249
5979B27249K9788k1454k4033j6039j1528n652o396p205q148p99J4635Q970J2600
5966A91988o473M0546k064k5893L066J1381P969K2409k0070J6111j0095J3471
5954B42346j9927K2307l543j4747j1054N39L908j0230J7386l3097J1761K770q923
5941A99496l7585K5327P074r051L6582L011m8023j0709L5807p797j4682J4378
5929A93828J8126k383k2067j6280K1955j7253L5L837k0326j9318o140J3088Q5
5916A47187p920J0569j6864l608L510j6495J696k0958L33J0632k4665P973J2838
5903A04228j1774J4481o427o325M2189q664k3197N682O152l1831k3714j0022j0806
5890C9972J5178K0373K7201k1544J8971k9613k7529j6455M541q623p456O169J0929
$$ plain form
5979 227249 257037 235583 211550 195511 183983 178331 171935 164730 156582 155783 170418 179388 191988
5966 191988 185515 226061 223997 198104 201170 212551 220520 242929 222859 238970 228875 242346
5954 242346 222419 244726 241183 226436 215382 215921 219829 209599 226985 193888 205649 208419 199496
5941 199496 161911 187238 194312 185261 221843 224854 176831 166122 201929 194132 179450 193828
5929 193828 211954 209571 187504 171224 193179 175926 175961 179798 159472 140154 134014 147102 147187
5916 147187 139267 149836 132972 129364 132874 116379 118075 97117 97450 108082 83417 91390 104228
5903 104228 92454 106935 100508 94183 136372 127708 104511 110193 116345 84514 60800 50778 39972
5890 39972 55150 75523 102724 81180 100151 70538 43009 26554 31095 22472 15016 21185 32114
5877C2114j8069J2008j4055k344K2576R706M305O745O576k1130l1835j0689o040
5864a0132J3090L6153k737j5625o316J2897l1341k631J3452J3417J523l2279r852
5851b0381M0429l54L489K3505r982j9475k7192M801l3774L2943J1172l0288j4594
5838c9701P365J4153k9074J5470K4567J8691j4300j4816L3309j8687J4142k7536
5826a6417N667j4187K0296j2110k1981L8725Q61M545l1905O703J2560k3059J5544
5813a4758r312k6568J0184J7548J1950K0122l1061j3500J4154l6445J2391K3330
5801b1965M93k2953J3289p218Q150M7373k2782k0674j5679k5610K6004L0414j1039
5788b2197k536K4448n7114q17j385q12k8964L1451M7633j2043j8841K363L3275
$$ plain form
5877 32114 14045 26053 11998 9654 32230 41936 46241 52986 59562 38432 6597 -4092 -10132
5864 -10132 2958 39111 36374 20749 14433 27330 -4011 -6642 6810 20227 21750 -10529 -20381
5851 -20381 20048 19694 23183 46688 36706 17231 -9961 -5160 -38934 -5991 5181 -25107 -39701
5838 -39701 -32336 -18183 -47257 -31787 -7220 11471 -2829 -17645 15664 -3023 11119 -16417
5826 -16417 -10750 -24937 -4641 -16751 -38732 -7 854 5399 -26506 -19803 -7243 -30302 -14758
5813 -14758 -24070 -50638 -40454 -22906 -10956 9166 -21895 -35395 -21241 -57686 -45295 -21965
5801 -21965 -21472 -44425 -31136 -38354 -30204 17169 -5613 -26287 -41966 -67576 -41572 -11158 -22197
5788 -22197 -24733 -285 -57399 -58216 -59601 -60413 -89377 -57926 -10293 -22336 -41177 -38814 -5539
5775e539j9281j7420K357J0103j48K606M2873M944l4126j0972M0J7531r927K508
5761a4451K306j1076o536J176L5419j8264R419l9940P754L819M498J0492M135
5748a1249M2212m9849K0317J6059k0376N866K0338q592J1127o683r831q904j8539
5735a8104L1770P872R407M806j1586q899k65j6362n056J5027J9945q088M456l620
5721B1303m540O565J4615L422n909j5737K4591l5146j6296J4968k4134K1620L3752
5708C9074n2224O558K9130q2R233k983J6436k7542j4405l6815J7229M403j576
5695a3564j0512J5948j3959l000Q521J2187k3126m721K7024j0525L390k7315J3486
5682b6166J0041K32K1755Q168O284j2134L7220K6913k5533j0626K902j4449l8787
$$ plain form
5775 -5539 -24820 -42240 -39883 -29780 -29928 -27322 15551 20495 -13631 -24603 -24563 -7032 -16959 -14451
5761 -14451 -12145 -23221 -29757 -28581 6838 -11426 -2007 -41947 -34193 -30374 -25876 -15384 -11249
5748 -11249 30963 -18886 1431 17490 -2886 2980 23318 14726 25853 19170 9339 435 -18104
5735 -18104 13666 21538 30945 35751 24165 15266 15001 -1361 -6417 8610 28555 20467 24923 21303
5721 21303 16763 23328 37943 41365 35456 19719 44310 9164 -7132 7836 -16298 5322 39074
5708 39074 -13150 -6592 22538 22456 31689 28706 45142 17600 3195 -33620 -16391 -11988 -13564
5695 -13564 -24076 -8128 -22087 -25087 -16566 -4379 -27505 -32226 -5202 -15727 -12337 -39652 -26166
5682 -26166 -16125 -15893 5862 14030 20314 8180 45400 72313 46780 36154 39056 24607 -14180
5669a4180P360J1730l83J4214P833L5851k4593K593K0581k5872m463K2979N258
5656E8908O374N375K5981P403j6297K212j4710J5518j4196K5304L9272J5208k3782
5643A32570J8325L9236m4406k8935j5373K0062L8552l051m758k6659p225J0397
5631A28735J3546J7054j11n1071J385O5104k533J828N151L8797j6974Q694K1328
5618B30933m701M4675J1630K3041L5692L1186J9254j8042L4579J4514K2436k5596
5606D19601k1885N3860j1226M4264J4141k4829J8524J1709J4300l578M6212N3796
5594F14889r477M3518L6531N6704K9415p739K8073P7827M2574M263N9414K4894
5582A000886N4476N2773N96n969J9653L9756N4792J9049J9633J2827M8417N1988
$$ plain form
5669 -14180 -6820 4910 4527 18741 26574 62425 37832 40425 61006 35134 30671 53650 58908
5656 58908 65282 70657 96638 104041 87744 89956 75246 90764 76568 101872 141144 156352 132570
5643 132570 150895 190131 145725 116790 101417 121479 160031 156980 152222 125563 118338 128735
5631 128735 142281 159335 159224 108153 109538 174642 172109 173937 179088 217885 200911 209605 230933
5618 230933 226232 270907 282537 305578 341270 372456 391710 373668 408247 422761 445197 419601
5606 419601 397716 451576 440350 484614 498755 473926 492450 504159 518459 514881 561093 614889
5594 614889 605412 648930 685461 742165 771580 763841 791914 869741 912315 916578 975992 1000886
5582 1000886 1055362 1108135 1108731 1102762 1122415 1162171 1216963 1236012 1255645 1268472 1316889 1368877
5570A368877K879L5718M243L4253L5969L448N3391L0767j405M0599K9552q023
5558A630268j7027n1621q240k6430O864m2037l6562Q711q795J407j4808L5081
5546A476811J0429r498J3058L8922n776o435P453Q0358O2050K2921J7511k7581
5534A680223p2297l9494n0194p1745j20392r1072q0112m1228m4388l0520l9448
5523I99333j5019l2941n196j3196j6864N8011R852M7720P0760O0800L5167L5002
5511A233429Q4154Q7697J9040K5501k8052l3629p2949p6802r9797j21831n9442
5500I57319o8856p1368o5386l557p508j3432l0123j8430m134o611J9953J7423
5488G05290M1842O6906L1373K7631O7952N5577M9702L9723j1327o2901M695l4519
$$ plain form
5570 1368877 1371756 1407474 1411717 1445970 1481939 1485387 1538778 1569545 1568140 1608739 1638291 1630268
5558 1630268 1613241 1561620 1553380 1526950 1533814 1491777 1455215 1463926 1455131 1456538 1441730 1476811
5546 1476811 1487240 1477742 1490800 1529722 1523946 1517511 1524964 1605322 1667372 1690293 1707804 1680223
5534 1680223 1607926 1568432 1518238 1446493 1326101 1235029 1154917 1113689 1069301 1038781 999333
5523 999333 984314 951373 946177 932981 916117 974128 983980 1031700 1102460 1163260 1198427 1233429
5511 1233429 1317583 1405280 1424320 1449821 1421769 1388140 1315191 1238389 1138592 1016761 957319
5500 957319 888463 817095 751709 748152 740644 727212 697089 678659 674525 667914 687867 705290
5488 705290 747132 814038 845411 873042 940994 996571 1046273 1085996 1074669 1011768 1016463 981944
5476I81944q1925p2866l2197m5644n0267l2707k9013l2861j5411o972o896L7180
5464F12365R991k5073K5131N7947M6346J6066J5078L8447P0940J8544O0113M9818
5452I95713L5063j658k768N4367K6868o330k3236J4430L747K3155L011K5217M4617
5439A192196L6836Q2316O2101P6091Q1184Q8336J16507J32714R3900P1305N7902
5428B091388k2013k1858n4035l6199m3673m6858l1808k5302j5913m4231J5850
5417A765348Q691J2373M2432M4305K1727K8648J02768J36444O3478J02369J26503
5406B455086J54832J79960J53649J34778P9971Q889p9541r6123j74857j89048
5396B627596j79753j45175j47919p3841j14930o3142p2009p1312l1934l4697K6516
$$ plain form
5476 981944 900019 827153 794956 749312 699045 666338 637325 604464 589053 582081 575185 612365
5464 612365 622356 597283 622414 680361 726707 742773 757851 796298 867238 885782 945895 995713
5452 995713 1030776 1029118 1026350 1080717 1107585 1101255 1078019 1092449 1096196 1119351 1122362 1147579 1192196
5439 1192196 1229032 1311348 1373449 1449540 1530724 1619060 1735567 1868281 1962181 2033486 2091388
5428 2091388 2069375 2047517 1993482 1957283 1913610 1866752 1834944 1809642 1793729 1749498 1765348
5417 1765348 1774039 1786412 1828844 1873149 1894876 1923524 2026292 2162736 2226214 2328583 2455086
5406 2455086 2609918 2789878 2943527 3078305 3158276 3167165 3087624 2991501 2816644 2627596
5396 2627596 2447843 2302668 2154749 2080908 1965978 1902836 1830827 1759515 1727581 1692884 1719400
5385A719400J8971N157L1587K1442M3354K5535q02k0509j8064r13k4881n4631
5373A745646p7934j28171j55372q4994p9577j24400j12997p4702q2640l3878p1025
5362G19956n1717k6057j1045J7157k7169m2953O631K2190j1143j612J1759m9211
5350E56786k6648n9338o4745k9218k0649j6406j8666m248k6604k2685l0930l667
5338B32982o2890l4224L1551k1380J3087r89l1121J5714j8963j2086J7238M121
5326A33040k8773l6044J4099r207J3166q384P593K972J8729J0628j7827J0714
5314A10706K1090k2606k1582K4512m078l5291Q062j2920r834j0080p573k6112
5302A4294M613K905Q1L069J94L798j6081j9279j1112J6487j9271L456J2662J2864
$$ plain form
5385 1719400 1738371 1743528 1775115 1796557 1839911 1865446 1864644 1844135 1826071 1825158 1800277 1745646
5373 1745646 1667712 1539541 1384169 1299175 1219598 1095198 982201 907499 824859 790981 719956
5362 719956 668239 642182 631137 648294 621125 578172 584803 606993 595850 594238 605997 556786
5350 556786 530138 470800 406055 376837 356188 339782 321116 316868 290264 267579 236649 232982
5338 232982 170092 135868 167419 146039 159126 158137 127016 142730 123767 111681 128919 133040
5326 133040 104267 68223 82322 73115 86281 77897 85490 88462 107191 117819 99992 110706
5314 110706 131796 109190 87608 112120 108042 72751 80813 67893 58059 47979 40406 14294
5302 14294 18907 21812 21893 24962 25156 28954 12873 -6406 -17518 -1031 -20302 -16846 -4184 8680
5288H680l812l853r760J5242L0239k5078k9475J9798R623k3816k515L3141M3644
5275F2058l2383l7819M417k0501j4875j829N733k6992J2967R630R696k4423J1435
5262d2886M247K110J3076j0527j6950L4052k096K0134l6989j9356J7614o320k3979
5249f7870L621L9881P152L79J5987r931J7560O620j9235j4911K3852O639k6307
5236a6563J0803j7751K8977J7975o9855k1950M4664j3361P958j7216N0211J1004
5224A4896j6515K8040k3726l0956L6453J7038j6447j5961P808J1082K5557k1108
5212A6161k4426o783L587k9932L236j005J4362K1517P481J0079k0493J7462J5169
5199B6415m421R653j1600m011P9l421j3106J4068k1045k8162O701L4260K0263
$$ plain form
5288 8680 4868 1015 -8745 6497 36736 11658 -17817 1981 11604 -12212 -14727 18414 62058
5275 62058 29675 -8144 -3727 -24228 -39103 -40932 -35199 -62191 -49224 -39594 -29898 -54321 -42886
5262 -42886 -38639 -36529 -23453 -33980 -50930 -16878 -18974 1160 -35829 -55185 -37571 -43891 -67870
5249 -67870 -64249 -24368 -17216 -16837 -850 -10781 6779 13399 -5836 -20747 3105 9744 -16563
5236 -16563 -5760 -23511 5466 23441 -46414 -68364 -23700 -37061 -29103 -46319 3892 14896
5224 14896 -1619 26421 2695 -28261 8192 25230 8783 -7178 630 11712 37269 16161
5212 16161 -8265 -15048 -11461 -41393 -38157 -39162 -24800 -3283 4198 14277 -6216 11246 26415
5199 26415 21994 31647 20047 16036 16115 12694 -412 13656 -7389 -35551 -28850 5410 25673
5186B5673P39k2632l281j7518p274J5467l374J7170j1189j5351j6317K3200q665
5173b3352n306L5280j5661j1790J4647K9504r68l4892K4814j1632j553Q266k9024
5160b1667J7517N0084J61p3376r81L5413J0766o313k6980J3543o491K07l415L0331
5146A8799r501m942K7302J9734j0897o329m079l780K887P560k4640K7977O003
5133D6094j2781P981k9796K417Q909J4130L1805K2801l657Q209m844N689j3349
5120H3608J3948r282J156L685K1451p881P284M1811r003k257k5844M4362r242
5107A53796J6905j0409J9543L5233L264J5950J375K3548N278o846M75J2749N4794
5094C25655M3032L0146J4620L1968K7195M546J1187P7362O1252J0513O4304O3861
$$ plain form
5186 25673 26412 3780 499 -17019 -24293 -8826 -12200 4970 -6219 -21570 -37887 -14687 -23352
5173 -23352 -28658 6622 -9039 -20829 -6182 23322 22354 -12538 12276 644 -909 7357 -21667
5160 -21667 -4150 45934 46095 -27281 -28262 7151 17917 11604 -15376 -1833 -8324 -8117 -11532 18799
5146 18799 9298 4356 31658 51392 40495 34166 30087 26307 29194 36754 12114 40091 46094
5133 46094 33313 41294 11498 13915 22824 36954 68759 91560 87903 96112 91268 96957 83608
5120 83608 97556 88274 89430 93115 114566 106685 113969 155780 146777 144520 118676 163038 153796
5107 153796 170701 160292 179835 215068 218332 234282 235657 259205 264483 257637 258112 270861 325655
5094 325655 368687 398833 413453 445421 472616 477162 488349 565711 626963 637476 701780 765641
5082G65641n804K5806N4637K5621M2932J2047N8218L139R304M2484O2209N8515
5070A154749L5284P0739N8375L9221J03140P5209O7315R0627J38969J46409J22032
5059B102069J88072K24710J75532K13741K47139K61373L60704L97340M79127N60158
5049E209965N44314N46521N64525M83861M85818M14055L45576K39261K32290L32389
5039I398575M53110L88566K28390J25002j73790m47504p63490r14258r54892q68760
5029F470949o65729n11575l90932m25921m63715l90354l90249l67491l44781k50884
5019B269318j66494j43099k08579j33464j30646j20102o7893q5089p9237n8221
5009A076494n7433o2385n5506m4433m8991n6535k2689l2286l8319j5370j6765
$$ plain form
5082 765641 759837 785643 840280 865901 908833 920880 979098 982237 991541 1034025 1096234 1154749
5070 1154749 1190033 1260772 1319147 1358368 1461508 1536717 1604032 1694659 1833628 1980037 2102069
5059 2102069 2290141 2514851 2690383 2904124 3151263 3412636 3773340 4170680 4649807 5209965
5049 5209965 5754279 6300800 6865325 7349186 7835004 8249059 8594635 8833896 9066186 9398575
5039 9398575 9851685 10240251 10468641 10593643 10419853 9972349 9208859 8294601 7339709 6470949
5029 6470949 5805220 5293645 4902713 4476792 4013077 3622723 3232474 2864983 2520202 2269318
5019 2269318 2102824 1959725 1751146 1617682 1487036 1366934 1299041 1213952 1134715 1076494
5009 1076494 1019061 956676 901170 856737 807746 751211 728522 696236 657917 642547 625782
4998F25782m89J003M317l4536k7764j0901j9709j7554k0598K0351p171l484n019
4985E04228j8479l2788j0272J8981J3655k5775J5743J5811n5030k8488M525l8899
4973C63212j7944k2650k7366J7209j1917k1069j5217R899j1979j8844L356Q649
4961B55339n97o087j760j9667J6712j4219n537R856j0810R273p98l1974K7615
4948B27346K9843k9211k9932L321j4914J0999K1919J6292j2260J8604J3128l1490
4936B23645J3597K8378l5788j7816K751O577k2304R173L0152K7157J082L857j7358
4923B53103k2305J3974K8604M0491L2596l402j9069J5505L5874j5030l1108R433
4911C38666K4858K5416k7315o457m6602k1744K7669K3839J7348j8030m0389j5362
$$ plain form
4998 625782 625293 626296 630613 596077 568313 557412 537703 520149 499551 519902 512731 509247 504228
4985 504228 485749 452961 442689 461670 475325 449550 465293 481104 426074 397586 402111 363212
4973 363212 345268 322618 295252 312461 300544 279475 264258 274157 262178 243334 246690 255339
4961 255339 254742 248655 246895 227228 243940 229721 224184 234040 223230 232503 231705 199731 227346
4948 227346 257189 227978 198046 201367 186453 197452 219371 235663 223403 242007 255135 223645
4936 223645 237242 265620 229832 212016 214767 221344 199040 208213 238365 265522 266604 270461 253103
4923 253103 230798 244772 273376 313867 346463 343061 323992 339497 375371 360341 329233 338666
4911 338666 363524 388940 361625 355168 308566 286822 314491 338330 355678 337648 297259 281897
4899B81897P363L1571J1975j145K8436k0249R269j4344J951O569j504M7386q187
4886C80988k9741j4486j7894J1833K7062M164K6710j1821p472k139P071l256q985
4873C62034N995n333O195n31K5645J3416l3957J0561J3654n079K2896p292M721
4860D12925M0389j8626l1690j850K0939J0130L3037J339P601k633J8025M283N301
4847D99170K9975N434k365N0790M2485J5034R955J2432K2491J0329j835M710j2174
4834F86431j4150K4587j8891k8795J8858K2561J4237M1518j117j9519L5764N6038
4822H17522M0601n599O939K9378M4950M3174L8163N4401M4949K0950L2925M6762
4810A215115J3975M1918R0385O7359K4275K7416M3055O2887N1090Q5585R1518
$$ plain form
4899 281897 289260 320831 332806 331661 360097 339848 349117 334773 336724 343293 341789 389175 380988
4886 380988 351247 336761 318867 330700 357762 361926 388636 376815 369343 367204 374275 371019 362034
4873 362034 368029 362696 368891 368360 394005 407421 373464 384025 397679 392600 415496 408204 412925
4860 412925 453314 434688 402998 401148 422087 432217 465254 466593 474194 471561 489586 493869 499170
4847 499170 529145 534579 532214 583004 625489 640523 650478 662910 685401 695730 693895 698605 686431
4834 686431 672281 696868 677977 649182 668040 690601 704838 746356 745239 725720 761484 817522
4822 817522 858123 852524 859463 888841 933791 976965 1015128 1069529 1114478 1135428 1168353 1215115
4810 1215115 1229090 1271008 1361393 1428752 1453027 1480443 1523498 1586385 1637475 1723060 1814578
4799A814578M6526Q6244J08793R3100P2320J21328R4395J17592J45249J08469
4789B808594Q1378J03728J55259J23659J00099J66214J98471J54223J91612K23001
4779D306238K04456K36787K31471K45398K92918K87903L30618L07281L33616L81649
4769G158335L95534M19909M37452M90373N02913M30984N22099N26408N92180O31451
4759A2107638O80073O58012P14390Q12066R80935J149638J244810J206346J223943
4750B0777851J115955R29875P71921O27691N36220L92339L66077L54694M02703
4741B6275326M10572M55465M76622N88993O38710P35572P60377Q22284Q99239
4732C2063160Q85592Q68523R00020R18340R21604R32774J017893J118237J291996
$$ plain form
4799 1814578 1861104 1947348 2056141 2149241 2221561 2342889 2437284 2554876 2700125 2808594
4789 2808594 2889972 2993700 3148959 3272618 3372717 3538931 3737402 3891625 4083237 4306238
4779 4306238 4510694 4747481 4978952 5224350 5517268 5805171 6135789 6443070 6776686 7158335
4769 7158335 7553869 7973778 8411230 8901603 9404516 9835500 10357599 10884007 11476187 12107638
4759 12107638 12787711 13445723 14160113 14972179 15953114 17102752 18347562 19553908 20777851
4750 20777851 21893806 22823681 23595602 24223293 24759513 25151852 25517929 25872623 26275326
4741 26275326 26685898 27141363 27617985 28206978 28845688 29581260 30341637 31163921 32063160
4732 32063160 32948752 33817275 34717295 35635635 36557239 37490013 38507906 39626143 40918139
4723D0918139J456740J431893J195372Q63434M17832j25750o10771r87439j266019
4714D3293431j349788j283406j212994j112834j084287j097001j100744j152659
4706C3899718j215828j156287j061208r86604q87347p98880o52702n22794m85733
4697B6132335l96867l74475l48740k88255k23146k41103l43035n56792p74449
4688B2585473r63763j173168j348568j428986j357582j224034j093839q99584
4680A3095949p76071p58491o74588o08373n46845n05592m82202m03053l81753
4671G958981l72417l27585l40837l03012k70940k81229k81527k87734k11326j89780
4661E092594k13777j94842k08472j47880j22896j49188j72820j58213r0847r1949
$$ plain form
4723 40918139 42374879 43806772 45002144 45865578 46283410 46157660 45546889 44559450 43293431
4714 43293431 41943643 40660237 39447243 38334409 37250122 36153121 35052377 33899718
4706 33899718 32683890 31527603 30466395 29479791 28592444 27793564 27140862 26618068 26132335
4697 26132335 25735468 25360993 25012253 24723998 24500852 24259749 23916714 23359922 22585473
4688 22585473 21621710 20448542 19099974 17670988 16313406 15089372 13995533 13095949
4680 13095949 12319878 11561387 10886799 10278426 9731581 9225989 8743787 8340734 7958981
4671 7958981 7586564 7258979 6918142 6615130 6344190 6062961 5781434 5493700 5282374 5092594
4661 5092594 4878817 4683975 4475503 4327623 4204727 4055539 3882719 3724506 3633659 3541710
4651C541710j06052p1361j02948o3971k7387j02735n3949n5315J2282k6312q6412
4640B857550n1566n0607o140o0077l4406j4375l5267m1437n5755k4658o1849o9913
4628B351500m6293p1178q2910j00455o6556m9128k4022o2119r9528m9387m9459
4617A650465j9914l0154p1420o9491k9425j1319k129n462j3560n0927m9842L016
4605A299838N08m3693m8747m1272l0437n155o4579n9721m4176m155l3086l1027
4593H94298k8220j3548p3087m8317K5465m3467l6904J534o593m3188k9946L1850
4581F29877P373m31j3509l2887l9950l723J7200j8403j7429k1512k716n20m3149
4568D60221L295J4727l8178O487M264k9207J9355K56k4654l1305J9415O935J55
$$ plain form
4651 3541710 3435658 3364297 3261349 3197378 3169991 3067256 3013307 2957992 2970274 2943962 2857550
4640 2857550 2805984 2755377 2749237 2689160 2654754 2640379 2605112 2563675 2507920 2483262 2421413 2351500
4628 2351500 2305207 2234029 2151119 2050664 1984108 1934980 1910958 1848839 1749311 1699924 1650465
4617 1650465 1630551 1600397 1528977 1459486 1430061 1418742 1416613 1411151 1397591 1346664 1296822 1299838
4605 1299838 1300346 1256653 1207906 1166634 1136197 1131042 1066463 1006742 962566 958411 925325 894298
4593 894298 866078 852530 779443 731126 756591 713124 676220 677754 671161 627973 598027 629877
4581 629877 637250 636819 623310 590423 550473 546750 563950 545547 528118 506606 503890 503370 460221
4568 460221 463516 478243 440065 446552 450816 421609 440964 441220 416566 385261 404676 411611 411766
4555D11766k4173r284m847k3240J7483j270J6799q284L0515k8351L194J7352j2836
4542C84824l1551o239J2241r166j4468j557K7984n696o092L155P957j5892K568
4529C48068q607J9663J0075k2718R440O318J0604J2147R392n2434k1351m033l230
4516C13334K0930L3757j4061Q877J1787l0091j0100R437J6389J1923k0590j0767
4504C40825l0866J1390J5675L088o34l3429l2541R936M0304k6035l3760O468r190
4491B61231j2909k581k3461j5718J6367j6866P561M6247K73j0027M3180l827l8485
4478B50985j4364J0781N394Q48n7057o058J5385k1024P882M650O824J6164L968
4465B24378j6573L0552j5037K223P423k2739R364l122k4530M319j3967L64J0310
$$ plain form
4555 411766 387593 378309 373462 350222 367705 366435 383234 374950 405465 377114 380308 397660 384824
4542 384824 353273 347034 359275 350109 335641 334084 362068 356372 350280 353435 361392 345500 348068
4529 348068 339461 359124 369199 346481 355921 362239 372843 384990 394382 341948 320597 316564 313334
4516 313334 334264 368021 353960 362837 374624 344533 334433 343870 360259 372182 351592 340825
4504 340825 309959 321349 337024 340112 339478 306049 273508 283444 323748 297713 263953 270421 261231
4491 261231 248322 245741 222280 206562 222929 206063 213624 259871 260144 250117 293297 289470 250985
4478 250985 236621 247402 252796 253644 196587 190529 205914 184890 192772 197422 204246 220410 224378
4465 224378 207805 238357 223320 225543 232966 210227 219591 216469 191939 196258 182291 182655 192965
4452A92965J324L3383J9148k4972R164J6340j4810j3458K326k8136M7448L500
4440B44222k2129M4540J2929j6521P314Q393K6964r154m373J3064K67o593m535
4427B94388K0307M454l9691L5853K5462m430L3635l01R856l2792j4647N2447J6721
4414D01262J198K4561p695k0790K1679q68K2919j7668k292K9123m736N356l7123
4401D14926q274J6468l2312K65J9468K3497n011k3017J7206l747j1043l4981n411
4388C68034K1506L1771O388L084l5564k3814K6980P668j4353N001j564j3463J50
4375C81824o0085O184J640q981L9534R017J2208K605k55K2124m863k1995P609
4362C86566Q566k9186j4795K5541K167j5582Q673J9395Q390P275L286M2005J0374
$$ plain form
4452 192965 194289 227672 246820 221848 231012 247352 232542 219084 221410 193274 240722 244222
4440 244222 222093 266633 279562 263041 270355 278748 305712 296558 292185 305249 305516 298923 294388
4427 294388 314695 319149 279458 315311 340773 336343 369978 369677 379533 346741 332094 384541 401262
4414 401262 402460 427021 419326 398536 420215 419347 442266 424598 422306 451429 446693 452049 414926
4401 414926 406652 423120 390808 391073 410541 434038 429027 406010 423216 419469 408426 373445 368034
4388 368034 389540 421311 427699 430783 395219 371405 398385 406053 391700 396701 395137 381674 381824
4375 381824 321739 327923 329563 320582 360116 369133 381341 383946 383691 405815 400952 378957 386566
4362 386566 395132 365946 351151 376692 378859 363277 371950 391345 399735 407010 410296 452301 462675
4349D62675N858L6112J9300k1696j3809n0595n730J1642l298q709J2223N156J609
4336D50738k4661K3762r86Q995j9663p265k0152j4436M6188j8105l024P402K4400
4323D53193J1613q512M0451K2351R448k238J3157L1214m956R951M4731O7178l5225
4310F52356K3931K3754J7941K4317J7751M1421P4859L0483K4971p143O0545M9699
4298A034885M3782M5754M9865Q4452O6658L1777R3256Q6827L9481Q7363P9417
4287A743517O0922P1916J30481P8941J28080P5270J11941J36363J61778K23879
4277B923088J44476K03678J76719J88156J85428J63770J86733K28483K90930K31805
4267D923266K66566L52969L60073L41894L98249L91586L76137L83580L32393L32769
$$ plain form
4349 462675 468533 504645 523945 502249 488440 437845 432115 443757 440459 431750 443973 449129 450738
4336 450738 426077 449839 448853 457848 438185 430920 410768 396332 442520 424415 421391 428793 453193
4323 453193 464806 456294 496745 519096 528544 526306 539463 570677 565721 575672 620403 687581 652356
4310 652356 676287 700041 717982 742299 760050 801471 876330 906813 931784 924641 985186 1034885
4298 1034885 1078667 1124421 1174286 1258738 1325396 1357173 1450429 1537256 1576737 1664100 1743517
4287 1743517 1804439 1876355 2006836 2085777 2213857 2289127 2401068 2537431 2699209 2923088
4277 2923088 3067564 3271242 3447961 3636117 3821545 3985315 4172048 4400531 4691461 4923266
4267 4923266 5189832 5542801 5902874 6244768 6643017 7034603 7410740 7794320 8126713 8459482
4257H459482K93862L18249L68893L81234M55638M75923N81022O63326O65817O54535
4247A3317981O82365O49602N64230M42915L16563K80835K39026K12784K55104
4238A6961405L72508M69330N78167O51074P36825P15809O87379N48547L73568
4229B2094612K38778L2490j11136k13717k28448k20266j60402m5857P7863J96587
4219B1660504K64507K73136K65646J41008l2029j95250m41132o27079p24549p76201
4209A9808561p43060o76814n97123m63074l02920k45227j43849j71833k40518
4200A6224143k98671m38989o10581p02739p70361q21974p51651p43078o52924
4191A0433175n08415m57342l52667l23644k67878k71224l02236l96110m18242
$$ plain form
4257 8459482 8753344 9071593 9440486 9821720 10277358 10753281 11334303 11997629 12663446 13317981
4247 13317981 14000346 14649948 15214178 15657093 15973656 16254491 16493517 16706301 16961405
4238 16961405 17333913 17803243 18381410 19032484 19769309 20485118 21172497 21721044 22094612
4229 22094612 22333390 22365880 22254744 22041027 21812579 21592313 21431911 21386054 21463917 21660504
4219 21660504 21925011 22198147 22463793 22604801 22572772 22377522 21936390 21309311 20584762 19808561
4209 19808561 19065501 18388687 17791564 17328490 17025570 16780343 16636494 16464661 16224143
4200 16224143 15925472 15486483 14875902 14173163 13402802 12580828 11829177 11086099 10433175
4191 10433175 9924760 9467418 9114751 8791107 8523229 8252005 7949769 7553659 7135417
4182G135417m28260m51242m40347m09559l67490l44344k87987k47201k26732j82197
4172C750058j30097j41330j40868j21607j45493j73828j51238j27429j06978j18523
4162B392667q2132r8298r7455j32083q3056n8450m0358l4796m4887p3388o7188
4151A580576l5514m8236m1178j8345l0470l3280j0744K5465n0341o2641j8983
4140A256309p961n458m1471l5430K4127l1622N322J3694l1778J6745J3626j9689
4128A156414p153j9398j0244o134k7836j5042l1530K3034P878p3504k6007l9021
4116I31457J2364L1065j1853k6639r319q897M701K0739K2009O911L1142j8741
4104I84939j9731j34J3574K1319m543Q160j3984L2702k039L1011L1481J3279J166
$$ plain form
4182 7135417 6707157 6255915 5815568 5406009 5038519 4694175 4406188 4158987 3932255 3750058
4172 3750058 3619961 3478631 3337763 3216156 3070663 2896835 2745597 2618168 2511190 2392667
4162 2392667 2310535 2212237 2114782 1982699 1899643 1841193 1800835 1766039 1721152 1647764 1580576
4151 1580576 1545062 1496826 1455648 1437303 1406833 1373553 1362809 1388274 1337933 1275292 1256309
4140 1256309 1248348 1242890 1201419 1165989 1190116 1158494 1163816 1177510 1145732 1162477 1176103 1156414
4128 1156414 1149261 1129863 1119619 1113485 1085649 1070607 1039077 1062111 1069989 996485 970478 931457
4116 931457 943821 974886 963033 936394 927075 918178 922879 943618 965627 972538 1003680 984939
4104 984939 965208 965074 978648 999967 995424 1003584 989600 1022302 1020263 1051274 1082755 1096034 1097200
4091A097200J4931O856L1076L546L0404J0767L5645N1893J9220J3924N4656L7925
4079A408043N9812O6495O7224M8602L4552P4923N3047M546J9002N2904Q4217N0112
4067B023479P3182P3377P6377R3087M7988P7599K7284K6392K9936k239K3363O5596
4055B635421M6687N8275P4956Q4772P9035P4731R7568M1893J5214l9717p5431
4044C093404n3682M374j3274k7913j1414L9338M5801N0462L9716L4464M6909k4853
4032C223332q6095n4256o4206q0881k9746k2632J625k4094l2844p999j2158M612
4020B814658p509j5563k6696m4033R091K0641K392q329P123M376K4431J341L8674
4007B820597N620L6273M8283K9699N2546J0836K7506L7448M0357L6707K4662O8187
$$ plain form
4091 1097200 1112131 1118987 1150063 1153609 1184013 1194780 1230425 1282318 1301538 1315462 1370118 1408043
4079 1408043 1467855 1534350 1601574 1650176 1684728 1759651 1812698 1817244 1836246 1889150 1973367 2023479
4067 2023479 2096661 2170038 2246415 2339502 2387490 2465089 2492373 2518765 2548701 2546462 2569825 2635421
4055 2635421 2682108 2740383 2815339 2900111 2979146 3053877 3151445 3193338 3208552 3168835 3093404
4044 3093404 3039722 3044096 3030822 3002909 2991495 3030833 3076634 3127096 3166812 3201276 3248185 3223332
4032 3223332 3137237 3082981 3018775 2937894 2908148 2885516 2887141 2863047 2830203 2822204 2810046 2814658
4020 2814658 2807149 2791586 2764890 2720857 2729948 2750589 2752981 2744652 2751775 2756151 2780582 2781923 2820597
4007 2820597 2826217 2862490 2910773 2940472 2993018 3003854 3031360 3068808 3109165 3145872 3170534 3238721
3995C238721Q5596L1580K2381N8875N2547M2315M5047R0011O7757Q4119O8435
3984C887384N8324P1543L3157N1548N8905N1430N4716L7784M2343L3768M4622
3973D425524K6082L9712N4450M2696J6789J1346P0543L5615p884M2027L5491J0723
3961D803114p874J7766L8862M9967N2152N1461M2581K8666L8427J6180N4807J9953
3949E206062L8039N6558N6133N2083J783l8966L9389M1415K6387O4527N2062R6244
3937E691716R1172Q4707J66388J91781J89110J79201J77850K26732K49678J75329
3927G423664J10422J18601J31070J09587J03666J43143R0182J52759K25791K57077
3917H865962K75364K97290L39151L74734L75431M48406N28474N44799O10112O26105
$$ plain form
3995 3238721 3324317 3355897 3378278 3437153 3489700 3532015 3577062 3667073 3734830 3818949 3887384
3984 3887384 3945708 4017251 4050408 4101956 4160861 4212291 4267007 4304791 4347134 4380902 4425524
3973 4425524 4451606 4491318 4545768 4588464 4605253 4616599 4687142 4722757 4714873 4756900 4792391 4803114
3961 4803114 4795240 4813006 4851868 4901835 4953987 5005448 5048029 5076695 5115122 5131302 5186109 5206062
3949 5206062 5244101 5300659 5356792 5408875 5410658 5371692 5411081 5452496 5478883 5543410 5595472 5691716
3937 5691716 5782888 5867595 6033983 6225764 6414874 6594075 6771925 6998657 7248335 7423664
3927 7423664 7534086 7652687 7783757 7893344 7997010 8140153 8230335 8383094 8608885 8865962
3917 8865962 9141326 9438616 9777767 10152501 10527932 10976338 11504812 12049611 12659723 13285828
3907A3285828O81890O89859O87442P44614Q01913Q44226R27282J135476J253974
3898B1052504J326867J365863J304106J149127R08380O59674M80142L72656L13509
3889B8932828L49621M57586O27806P59992Q97945R87587J019555J008551Q75297
3880C5916768P11838N68687M18068L29730K81523L66691M92812O24218P58801
3871D0469136R60295J197005J555368J786057J751272J500042R67391J84956o49230
3862D9722292j325491j850826k063883k012152j833960j531772j216527r56845
3854C6930836q45978o85811n65845m63572m52695n46509o91470q78086j032419
3845C0768451j172188j201742j103188j004429q23704o18457m63485l58648l57619
$$ plain form
3907 13285828 13967718 14657577 15345019 16089633 16891546 17735772 18663054 19798530 21052504
3898 21052504 22379371 23745234 25049340 26198467 27106847 27766521 28246663 28619319 28932828
3889 28932828 29282449 29740035 30367841 31127833 32025778 33013365 34032920 35041471 35916768
3880 35916768 36628606 37197293 37615361 37945091 38226614 38593305 39086117 39710335 40469136
3871 40469136 41429431 42626436 44181804 45967861 47719133 49219175 50186566 50371522 49722292
3862 49722292 48396801 46545975 44482092 42469940 40635980 39104208 37887681 36930836
3854 36930836 36084858 35399047 34833202 34369630 33916935 33370426 32678956 31800870 30768451
3845 30768451 29596263 28394521 27291333 26286904 25463200 24844743 24381258 24022610 23664991
3836B3664991l69360l90523o44556q36898j027741j158473j170565j192468j055835
3827A5818572r58761p84000p40258o33819o01304n35232n22047m39373m31771
3818A0172007l65048l09760k53424k02786j56192j49916j24812j01977j14725
3809H393367m1326n9308o0075n4258k7648o3703j16149j10949j09751j21645j52515
3798G476040j69684j45899j57048j16299j15577r8417p0590o2928K0931k7259
3788F533270n8815j4706k5644O030q032m0411m0189L5129Q791J2385j1933J0102
3776F405977J291n691K4553j4728n367K406M9449L6669K5851M8258Q3792M9893
3764F702353M9984P3137R6584J10464R3424J11446J09381P3028J48744J18770
$$ plain form
3836 23664991 23295631 22905108 22260552 21423654 20395913 19237440 18066875 16874407 15818572
3827 15818572 14859811 14075811 13335553 12701734 12100430 11565198 11043151 10603778 10172007
3818 10172007 9806959 9497199 9243775 9040989 8884797 8734881 8610069 8508092 8393367
3809 8393367 8352041 8292733 8232658 8178400 8150752 8087049 7970900 7859951 7750200 7628555 7476040
3798 7476040 7306356 7160457 7003409 6887110 6771533 6673116 6602526 6539598 6560529 6533270
3788 6533270 6474455 6459749 6434105 6440135 6432103 6391692 6351503 6386632 6395423 6407808 6395875 6405977
3776 6405977 6407268 6401577 6426130 6411402 6406035 6408441 6457890 6494559 6520410 6568668 6652460 6702353
3764 6702353 6752337 6825474 6922058 7032522 7125946 7237392 7346773 7419801 7568545 7687315
3754G687315J08163J83870J74350K01030J98515K47802K16916K22108K68550K79170
3744I787789L07826K98840L51967M00582M45061M83862N07661N65899O30496O91722
3734A4471705P74597Q97134J004826J118595J265790J393070J513110J675301
3726B4114128J805483J847367J781117J667484J493457J237689R09057N98293
3718C5454075K91019K1084j87769l35406m06198l33632k77836j75436q7607J758
3708C3964052o6084j48459l18857n46124q07996j051177j329977j558139j704248
3699B6432991j772934j779438j772623j707396j567253j376010j328158j059602
3691A4069577r84709q78992p32340o67710n54336n23932m35108l58176l40404
$$ plain form
3754 7687315 7795478 7979348 8153698 8354728 8553243 8801045 9017961 9240069 9508619 9787789
3744 9787789 10095615 10394455 10746422 11147004 11592065 12075927 12583588 13149487 13779983 14471705
3734 14471705 15246302 16143436 17148262 18266857 19532647 20925717 22438827 24114128
3726 24114128 25919611 27766978 29548095 31215579 32709036 33946725 34855782 35454075
3718 35454075 35745094 35766178 35578409 35243003 34836805 34503173 34225337 34049901 33962294 33964052
3708 33964052 33897968 33749509 33430652 32884528 32076532 31025355 29695378 28137239 26432991
3699 26432991 24660057 22880619 21107996 19400600 17833347 16457337 15129179 14069577
3691 14069577 13084868 12205876 11473536 10805826 10251490 9727558 9292450 8934274 8593870
3682H593870k89244k69724k24254k32837j88414j50812j56440j01556j35141j17570
3672F727878j04451q9349k8525p3546o2879j9294l2429p4791m6056m6563l6119
3661F113876k4695m2207j7816l0703l4328J2654J0295R228J5269P832K1443P3807
3649F114655O2982j0299N4728O1610J17052R6739N4454J05244J05188R7409J37548
3638F997310J14928J21777J87310J52292J51523J51978J85248J65698K17557K03858
3628H649479J88796J48846J61809J89797J95410J99767J84653J64688J85014J61229
3618A0429488J91476K12206K18728K40013K36090K49369K63707K83458L00652
3609A2625187K88070L65417M18293M23062M69201N39746O23357O90179P55311
$$ plain form
3682 8593870 8304626 8034902 7810648 7577811 7389397 7238585 7082145 6980589 6845448 6727878
3672 6727878 6623427 6534078 6505553 6432007 6369128 6349834 6317405 6242614 6196558 6149995 6113876
3661 6113876 6089181 6046974 6029158 5998455 5964127 5976781 5987076 5996304 6011573 6019405 6040848 6114655
3649 6114655 6177637 6167338 6222066 6283676 6400728 6497467 6551921 6657165 6762353 6859762 6997310
3638 6997310 7112238 7234015 7421325 7573617 7725140 7877118 8062366 8228064 8445621 8649479
3628 8649479 8838275 8987121 9148930 9338727 9534137 9733904 9918557 10083245 10268259 10429488
3618 10429488 10620964 10833170 11051898 11291911 11528001 11777370 12041077 12324535 12625187
3609 12625187 12913257 13278674 13696967 14120029 14589230 15128976 15752333 16442512 17197823
3600A7197823Q24944R59587J034238J205099J346311J528212J709726J943322
3592B7749262K117156K227048K272866K268104K195003J974235J742571J409145
3584D3955390J091233P70880M68176K92299J25976J17088P1734J50354K18694
3575D7261824J95915J53654L8343j08540l63156o73985j007455j300080j566806
3566D2629714j834110j993876k045356k054525j977401j829023j641916j444085
3558B7809422j275763j048160q93787p20345n61072m69229l42316k18389r4348
3549B2186013k198R6262J88908K68887L56260M53075N74532O44546P10436Q32208
3539B6308929R84144J105665J277000J425133J568929J735172J872420K117958
$$ plain form
3600 17197823 18022767 18982354 20016592 21221691 22568002 24096214 25805940 27749262
3592 27749262 29866418 32093466 34366332 36634436 38829439 40803674 42546245 43955390
3584 43955390 45046623 45817503 46285679 46577978 46703954 46821042 46892776 47043130 47261824
3575 47261824 47457739 47611393 47649736 47541196 47178040 46504055 45496600 44196520 42629714
3566 42629714 40795604 38801728 36756372 34701847 32724446 30895423 29253507 27809422
3558 27809422 26533659 25485499 24591712 23871367 23310295 22841066 22498750 22280361 22186013
3549 22186013 22183815 22280077 22468985 22737872 23094132 23547207 24121739 24766285 25476721 26308929
3539 26308929 27293073 28398738 29675738 31100871 32669800 34404972 36277392 38395350
3531C8395350K364639K575244K782993K992152L133402L198255L213840L116214
3523F1772089K996135K923140K754588K535527K333046K020378J630649J308938
3515H0274490Q36300L97661J01313j89316n16730p70160r70715j154331j281584
3506G6726928j458657j507157j628214j724443j708743j728655j701228j579549
3498F3690282j465471j295817j081273p66274k53620K35174M75555O76153P62107
3489F0976816P97231R30960J082700J364454J459092J706292J845795J962552
3481G2125892K104466K204552K412584K683472L064381L313950L460625L398985
3473I4768907L251450L024827K847758K722050K592930K621166K798259L130766
$$ plain form
3531 38395350 40759989 43335233 46118226 49110378 52243780 55442035 58655875 61772089
3523 61772089 64768224 67691364 70445952 72981479 75314525 77334903 78965552 80274490
3515 80274490 81110790 81508451 81609764 81420448 80903718 80133558 79162843 78008512 76726928
3506 76726928 75268271 73761114 72132900 70408457 68699714 66971059 65269831 63690282
3498 63690282 62224811 60928994 59847721 59081447 58827827 59063001 59538556 60214709 60976816
3489 60976816 61774047 62705007 63787707 65152161 66611253 68317545 70163340 72125892
3481 72125892 74230358 76434910 78847494 81530966 84595347 87909297 91369922 94768907
3473 94768907 98020357 101045184 103892942 106614992 109207922 111829088 114627347 117758113
3465A17758113L664133M159389M362932M593902M552036M353346M009991L446755
3457A50900597K577349J505581L20291j119835k468874l619293m482624m915503
3449A38697689m938302m635986m244390l828643l388815l085940k819002k689786
3441A09066825k702325k775350l012623l351029l672846l997140m258175m429975
3433H0867362m442496m380233m199544l929616l635328l304105k926995k525250
3425E1523795k161640j784276j456834j106228q59194n59385k94944J3715K47281
3416D3562290M54197P33046R99063J313888J583755J938478K220892K438653K620548
3407E7864810K677100K660194K604252K450385K268344K048056J815000J457137
$$ plain form
3465 117758113 121422246 125581635 129944567 134538469 139090505 143443851 147453842 150900597
3457 150900597 153477946 154983527 155303818 154183983 151715109 148095816 143613192 138697689
3449 138697689 133759387 129123401 124879011 121050368 117661553 114575613 111756611 109066825
3441 109066825 106364500 103589150 100576527 97225498 93552652 89555512 85297337 80867362
3433 80867362 76424866 72044633 67845089 63915473 60280145 56976040 54049045 51523795
3425 51523795 49362155 47577879 46121045 45014817 44155623 43596238 43301294 43315009 43562290
3416 43562290 44016487 44749533 45748596 47062484 48646239 50584717 52805609 55244262 57864810
3407 57864810 60541910 63202104 65806356 68256741 70525085 72573141 74388141 75845278
3399G5845278J046634O18474K48697j17057m84666p22681q77478j040929j104889
3390G3411383j105622j095388j080132j076478j077165j186860j265100j415564
3382F4109074j621590j784243k025919k265335k435602k518913k591829k606359
3374D6259284k562718k424654k308409k067111j841748j646761j397566j240242
3366C0770075j042464q66953p97337p41853o54903o06889m71232l86935k72737
3357B4928772j48052J576J19202K40325M01555N27631O41018Q42969R85517J054919
3347B9595432R49459P00625M68889M5118k64161n03861n29273m79756m25331k39902
3337B9317239j60047m1039l2763j6488n367J5513R4212P3977J17647J39235J98462
$$ plain form
3399 75845278 76891912 77510386 77759083 77642026 77157360 76434679 75557201 74516272 73411383
3390 73411383 72305761 71210373 70130241 69053763 67976598 66789738 65524638 64109074
3382 64109074 62487484 60703241 58677322 56411987 53976385 51457472 48865643 46259284
3374 46259284 43696566 41271912 38963503 36896392 35054644 33407883 32010317 30770075
3366 30770075 29727611 28860658 28063321 27321468 26666565 26059676 25588444 25201509 24928772
3357 24928772 24780720 24782296 24901498 25141823 25543378 26071009 26712027 27554996 28540513 29595432
3347 29595432 30544891 31245516 31714405 31759523 31495362 30991501 30462228 29982472 29557141 29317239
3337 29317239 29157192 29116153 29083390 29066902 29061535 29077048 29171260 29245237 29362884 29502119 29700581
3326B9700581L10393M31885N14387O38767Q05749R83372J100790R57303P76082
3317C6219309O16758L74944J68511J11331K09101M09839O90785J011993J337679
3308D1150250J559047J604622J705372J847349J964649K007676J971282J940380
3300E5750627J868890J718058J605334J486119J371256J297194J127288R76588
3292F7201354Q12337N59631L38092J62910o2767k49214m33724p04608j017997
3283F6606014j303804j626951j953715k136571k414157k646698k798051k937869
3275D8788198l034829l136080l100766l035680k898170k738695k492857k295656
3267B6055465k080618j876563j654076j505674j273230j117692r54358q02957
$$ plain form
3326 29700581 30010974 30442859 30957246 31596013 32401762 33385134 34485924 35443227 36219309
3317 36219309 36836067 37211011 37379522 37490853 37699954 38109793 38800578 39812571 41150250
3308 41150250 42709297 44313919 46019291 47866640 49831289 51838965 53810247 55750627
3300 55750627 57619517 59337575 60942909 62429028 63800284 65097478 66224766 67201354
3292 67201354 68013691 68573322 68911414 69074324 69011557 68762343 68328619 67624011 66606014
3283 66606014 65302210 63675259 61721544 59584973 57170816 54524118 51726067 48788198
3275 48788198 45753369 42617289 39516523 36480843 33582673 30843978 28351121 26055465
3267 26055465 23974847 22098284 20444208 18938534 17665304 16547612 15593254 14790297
3259A4790297p53295o29722n68056m73371m44126m29937l17263k49753k50432
3250A0674342j99827j96941k03972j65586j18012j01128o4579k3896r210j6962
3240I574229j5209m2708m6870o3414m0508n9910k6222o7935j05916j18416l1788
3229H955333n5942p8338p5335q9428r6981j09358j03620j12212j18018j75872
3219G940229k04036k24408j63768j89688k19934j70960j42315j93297j61749j24734
3209F145340j15056q1849r1412q7562n7068m8760p5180m6828o627l2422n2403
3198E450173l0429n585k6211k6360o6036n8218k9700n8658k8833m4669j3976j1299
3186E050199l6405l2431r396n949O476j7016K1994J2781P920J6902k3714K559
$$ plain form
3259 14790297 14037002 13407280 12839224 12365853 11921727 11491790 11174527 10924774 10674342
3250 10674342 10474515 10277574 10073602 9908016 9790004 9688876 9624297 9600401 9591191 9574229
3240 9574229 9559020 9516312 9469442 9406028 9365520 9305610 9279388 9211453 9105537 8987121 8955333
3229 8955333 8899391 8821053 8745718 8656290 8559309 8449951 8346331 8234119 8116101 7940229
3219 7940229 7736193 7511785 7348017 7158329 6938395 6767435 6625120 6431823 6270074 6145340
3209 6145340 6030284 5948435 5857023 5769461 5712393 5663633 5588453 5541625 5534998 5502576 5450173
3198 5450173 5419744 5414159 5387948 5361588 5295552 5237334 5207634 5148976 5120143 5075474 5061498 5050199
3186 5050199 5013794 4981363 4971967 4966018 4972494 4955478 4977472 4990253 4998173 5015075 4991361 4993920
3174D993920N6943J2923k7096k5910m3701M1570k926m8266K8170q850k0176j4951
3162D941650l1881q949N236p636j9925l7488J7555j2580n251j6318j2228j9254
3150D792931n8493k1943l9181o6918l1487L533j2077k920K9874N5595M7299N2916
3138D749129J17597R7697J07317J06700J14490J45610J48154J99826J68418J89826
3128F144764K21114K27537J98962K25301K07819K05503K10382K35132K30127K90839
3118H397480K68156L37386L79593M34373M46815M92004N50623N78969O51087P24508
3108A3260994P69352Q67379R81138J087279J145104J118796J141603J167392J166955
3099B2705992J074159R59333R09314Q65968P87565O46208O00192O28225P84167
$$ plain form
3174 4993920 5050863 5063786 5036690 5010780 4967079 5008649 5005723 4957457 4985627 4976777 4956601 4941650
3162 4941650 4909769 4900820 4906056 4898420 4878495 4841007 4858562 4845982 4840731 4824413 4812185 4792931
3150 4792931 4734438 4712495 4673314 4606396 4574909 4578442 4566365 4563445 4593319 4648914 4696213 4749129
3138 4749129 4866726 4964423 5071740 5178440 5292930 5438540 5586694 5786520 5954938 6144764
3128 6144764 6365878 6593415 6792377 7017678 7225497 7431000 7641382 7876514 8106641 8397480
3118 8397480 8665636 9003022 9382615 9816988 10263803 10755807 11306430 11885399 12536486 13260994
3108 13260994 14030346 14897725 15878863 16966142 18111246 19230042 20371645 21539037 22705992
3099 22705992 23780151 24739484 25648798 26514766 27302331 27948539 28548731 29176956 29961123
3090B9961123Q61718J024596J142523J190512J292882J363799J535901J721555
3082D0094609J865837K141507K432288K720867L171791L530703L824941M153988
3074F3936531M721708N314745O010708O637947P188645Q056793R137003J0320194
3066A21324274J1485516J2746514J4539721J7303055K0819134K3478043K3719020
3059B45415277K2158073J9839088J7115575J4005235R438729L699846k566836
3052C29104987r463581j6331614k2226135k6275690k8531768k8400136k5452606
3045A72423457k1177529j7363600j4919765j3424872j1935095j0263887q664507
3038G4674202p280916o179357n311979m554065l894936l424795k997277k676748
$$ plain form
3090 29961123 30822841 31847437 32989960 34180472 35473354 36837153 38373054 40094609
3082 40094609 41960446 44101953 46534241 49255108 52426899 55957602 59782543 63936531
3074 63936531 68658239 73972984 79983692 86621639 93810284 101867077 111004080 121324274
3066 121324274 132809790 145556304 160096025 177399080 198218214 221696257 245415277
3059 245415277 267573350 287412438 304528013 318533248 327971977 331671823 329104987
3052 329104987 319641406 303309792 281083657 254807967 226276199 197876063 172423457
3045 172423457 151245928 133882328 118962563 105537691 93602596 83338709 74674202
3038 74674202 67393286 61213929 55901950 51347885 47452949 44028154 41030877 38354129
3030C8354129k440952k239572k046738j887799j704413j553301j404451j303301
3022B3773602j183269j078079r96912r21923q18058q12636p05701o37184n55841
3013A6063999n44226n19061m65289m29828l94578l95214m07444l28789l67995
3004A2211575l12509l19180l44504k35232k51049k46432k39883k38792k43114
2995I780880j93808k05376k55990j85724k08571k44507k28567k10238k38767j97321
2985G612011j28708j83581j74190j66292n9481r7162j27125m1608n4267q1329
2975F498268p5503n1381k8992n8775r0223m8777p9814p6003q9915j05801p6738
2964E716346j18678j07149j01553j27077j62633j19676j57784j53649j11778j16560
$$ plain form
3030 38354129 35913177 33673605 31626867 29739068 28034655 26481354 25076903 23773602
3022 23773602 22590333 21512254 20515342 19593419 18775361 17962725 17257024 16619840 16063999
3013 16063999 15519773 15000712 14535423 14105595 13711017 13315803 12908359 12579570 12211575
3004 12211575 11899066 11579886 11235382 11000150 10749101 10502669 10262786 10023994 9780880
2995 9780880 9587072 9381696 9125706 8939982 8731411 8486904 8258337 8048099 7809332 7612011
2985 7612011 7483303 7299722 7125532 6959240 6899759 6802597 6675472 6633864 6579597 6498268
2975 6498268 6422765 6371384 6342392 6283617 6193394 6144617 6064803 5988800 5898885 5793084 5716346
2964 5716346 5597668 5490519 5388966 5261889 5099256 4979580 4821796 4668147 4556369 4439809
2954D439809j15482j08989q5558j09251r0330p0384r6929m2787o3353m9345k7519
2943C579882n5445p9711n3916l9853m9041n6264j2795j19455n5924j7222l7383
2932C002873l6655m0068o2561k0512j6846n2740l0371J5274j6096l0426l3457
2921B678415o3758o4570m9630o279o9133n1585o9346m3000o1823n6362r299o1015
2909B072615m3650r636l382k8822j0424j6051K030K5572j8177l9719k6448m6610
2897A857298K2739k620n0737n1872k8169m6848k2457n8146j13515m3562m712j0976
2885A446423l8766k4300l7412k9612J9403J4252K5425K1329J5150J7048K3654
2874A452594O292J9598L9052K652J3900L588q293j0393j9755l4296Q423K1351
$$ plain form
2954 4439809 4324327 4215338 4129780 4020529 3930199 3859815 3762886 3720099 3656746 3607401 3579882
2943 3579882 3524437 3444726 3390810 3350957 3301916 3245652 3232857 3113402 3057478 3040256 3002873
2932 3002873 2966218 2926150 2863589 2843077 2826231 2773491 2743120 2758394 2742298 2711872 2678415
2921 2678415 2614657 2550087 2500457 2494178 2425045 2373460 2304114 2261114 2199291 2142929 2133630 2072615
2909 2072615 2028965 2019329 2015947 1987125 1976701 1960650 1962680 1988252 1970075 1930356 1903908 1857298
2897 1857298 1880037 1877417 1826680 1774808 1746639 1699791 1677334 1619188 1505673 1462111 1457399 1446423
2885 1446423 1407657 1383357 1345945 1316333 1335736 1349988 1375413 1396742 1411892 1428940 1452594
2874 1452594 1458886 1478484 1517536 1520188 1534088 1537676 1529383 1518990 1499235 1464939 1473362 1494713
2862A494713J0551n0462K6889j8388J0159l7422l646J6846L3559J3994j2591R471
2850A493673R799J5849l0112j5936n372k3889j8853j6275l262k8607J3647j8069
2838A372593o142l3711p963J6647k0106j1509K1750K050l3737n91r872p816l6001
2825A245592m457L9339N059l689N4089p692m4714J8187J3650j6838N593Q067J8886
2812A331072o4673J9921l042j968l164r446k562K8378K2493q652K2434L9485k7232
2799A343044j6086J0245j872J2259j337L4724O616M2895R825k2171J4551O8688
2787A501381M4665J0498K6251N1331O5694P1973O6699R1420R5265Q0561J04013
2776B209751J37787J44143N3498N6230R0198L111l3794o6620r7957r6925j24562
$$ plain form
2862 1494713 1505264 1454802 1481691 1463303 1473462 1436040 1432394 1449240 1482799 1496793 1484202 1493673
2850 1493673 1503472 1519321 1489209 1473273 1467901 1444012 1425159 1408884 1405622 1377015 1390662 1372593
2838 1372593 1366451 1332740 1324777 1341424 1321318 1309809 1331559 1333609 1299872 1299281 1289409 1281593 1245592
2825 1245592 1241135 1280474 1285533 1281844 1335933 1328241 1283527 1301714 1315364 1298526 1304119 1312186 1331072
2812 1331072 1266399 1286320 1283278 1281310 1278146 1268700 1266138 1294516 1317009 1308357 1330791 1370276 1343044
2799 1343044 1326958 1337203 1335331 1347590 1346253 1380977 1387593 1430488 1440313 1418142 1432693 1501381
2787 1501381 1546046 1556544 1582795 1634126 1699820 1771793 1838492 1929912 2025177 2105738 2209751
2776 2209751 2347538 2491681 2545179 2601409 2691607 2694718 2660924 2594304 2496347 2399422 2274860
2765B274860j35697j84372j60247j08125j09490q0967p8529j01156q4202o5147
2755A166928k3001K650k8266l9492r192j4178k4722r211n670o020l0112k397K9913
2742A007230k2088n9609j6725J5380j8126j0834L1903l8391L2J3482j9656m6505
2730H36093r974j4730n575k2907k548J1289j7102k1542n370r295J9685j0543o0765
2717F86716j1054j5607L5030L2691j5157J3709j5051l2188L0974K604O829j8817
2705G00679J0668j263k8590n819J8317l3226J109n6548k2724K2133K9394j3342
2693F20788k7762j7600l9792K3079J0046K6886J8939l8385n2440P415L4168j9487
2681E45855J205J1496l7586L898p331K8626L4459l7055J0809l9865J6742K1949
$$ plain form
2765 2274860 2139163 1954791 1794544 1686419 1576929 1495962 1417433 1316277 1232075 1166928
2755 1166928 1143927 1146577 1118311 1078819 1069627 1055449 1030727 1021516 1015846 1009826 979714 977317 1007230
2742 1007230 985142 925533 908808 924188 906062 895228 927131 888740 888772 902254 882598 836093
2730 836093 826119 811389 805814 782907 780359 791648 774546 753004 747634 738339 758024 747481 686716
2717 686716 675662 660055 695085 727776 712619 726328 711277 679089 710063 712667 719496 700679
2705 700679 711347 710084 681494 675675 693992 660766 661875 605327 582603 604736 634130 620788
2693 620788 593026 575426 535634 558713 568759 595645 614584 576199 523759 531174 565342 545855
2681 545855 547060 558556 520970 524868 517537 546163 580622 543567 554376 514511 531253 553202
2669E53202k0261j4646J1841j1698J3059l6064l173K1756K3166J0708J6708J6771
2657E81369l0367R067J1539R619l2615j483J7569K0333k1009l3037O8l873k9329
2644D97851K8187k3993n131k1312N0866J9898m9970k3476L1313J8536l5873l2536
2632D54360J6188K6955N112J1208k2085k0406K2655l0253m3047J2265l101p168
2620D22683N913M02K8600L3032n03q331j8568J865j7511k2639M663K6425R612
2607D65643l1936k3003j4232K8212N6791l901l427J8869N784l6603l3677J182
2595D29702j8862L3029L4852n1922n642K4972j4945m4742J9994J1386L772L0904
2583D52498k4271o622L840J040j4860k9469P554K4884k4719K0993j0903j6772
$$ plain form
2669 553202 532941 518295 530136 518438 531497 495433 492260 514016 537182 547890 564598 581369
2657 581369 551002 560069 571608 581227 548612 547129 564698 585031 564022 530985 531053 527180 497851
2644 497851 526038 502045 496914 475602 526468 546366 496396 472920 504233 522769 486896 454360
2632 454360 470548 497503 502615 513823 491738 471332 493987 463734 420687 432952 429851 422683
2620 422683 428596 428998 457598 490630 490127 481796 463228 465093 447582 424943 429606 456031 465643
2607 465643 433707 410704 396472 424684 481475 477574 474147 493016 498800 462197 428520 429702
2595 429702 410840 443869 478721 426799 421157 446129 431184 386442 406436 417822 421594 452498
2583 452498 428227 421605 425445 426485 411625 382156 389710 414594 389875 410868 399965 383193
2571C83193J7752J8334K359K5478o789j6821J0968P980J483j3787K0353M244j6449
2558D38298J9478m1866m178L064p952J8147M5199j2124m3729R72l9652N31O837
2545C83025J9767K202j1865j5813J8630j9476q487o425J6500j162j7171M4229
2533D03954N434l0705q409K5907j1564k1909k097O50J129k831L8369j3445K7418
2520D11901j2890r658j0306J6502J1249n9083j7839N1913P908l4138N286o33N860
2507C66072L3802l1890j9729L4255j1817l8209j8830K777j2949o297J7710L2426
2495C47321k5406k7433k379K8506J8784K5788j2729k016j0573J8707Q802j3964
2483C53408p552k4186M744K9089k201m6227k7032K9511Q096N872N7864l68j1681
$$ plain form
2571 383193 400945 419279 421638 447116 440327 423506 434474 442454 443937 430150 450503 454747 438298
2558 438298 457776 415910 411732 414796 406844 424991 470190 458066 414337 415309 375657 376188 383025
2545 383025 402792 404994 393129 377316 395946 376470 367983 361558 378058 376896 359725 403954
2533 403954 409388 378683 370274 396181 384617 362708 360611 361261 362390 359559 397928 384483 411901
2520 411901 399011 389353 379047 395549 406798 347715 329876 381789 389697 355559 360845 360212 366072
2507 366072 399874 367984 348255 382510 370693 332484 313654 316431 303482 297185 314895 347321
2495 347321 321915 294482 292103 320609 339393 365181 352452 350436 339863 358570 367372 353408
2483 353408 345856 321670 326414 355503 353302 307075 280043 309554 317650 323522 381386 381018 369337
2470C69337L015j0771j6516j798p580k0826R02K8021J1593J5681j9464p216j091
2457C43287n208J289l1954K3919R30j3495k1837K9666P71k1969j488j6199J3821
2444C01533o287L6445k4372o765J5289O223P044k7717n361m020m952L9945O376
2431C33381l5968j2325P755k179j1499K1766j7455j8469j1635O091L4963J9978
2419C14404o270j3746J9837N671J1839k648j9103J4086k2204q807Q160m66o145
2406B94608j6046K1191k684n447k5647Q505K7392p269J273j152L5955K100k3603
2393C09176K078J057j2368J0681M643m0596o575J4126L0300R215j0171j0825J967
2380C02708K5931L951N09l3737k4707J2760L694k29J581K75K4789J8074l1504
$$ plain form
2470 369337 372352 361581 345065 343267 335687 314861 315763 343784 355377 371058 351594 344378 343287
2457 343287 338079 339368 307414 331333 332263 318768 296931 326597 327368 305399 303911 287712 301533
2444 301533 295246 331691 307319 300554 315843 322066 329110 301393 296032 292012 287060 327005 333381
2431 333381 297413 285088 292843 290664 279165 300931 283476 265007 253372 259463 294426 314404
2419 314404 308134 294388 314225 319896 331735 329087 309984 324070 301866 293059 301219 300753 294608
2406 294608 278562 299753 297069 291622 265975 274480 301872 294603 295876 294724 330679 332779 309176
2393 309176 311254 312311 299943 310624 315267 274671 268096 282222 312522 321737 311566 300741 302708
2380 302708 328639 332590 333099 299362 274655 287415 291109 290880 292461 292736 317525 335599 304095
2367C04095J4984M1136j42j8012k0677K6653K105l799J7291J9855L3422M633L2612
2354D54156L4395k3384M2203j3584J5104L9461M979N633m633L6763M1441M3316
2342F75850N1444Q5954P6497L0852L9291J7779K2554K3930l4061L7469K6514J8837
2330A072910L6126K0884N2873J9201M0800L9028N923L5659O4597O2606Q3145O2509
2318A596261O2661R2139J10628J51111J39583J67153K14351J79698J70112K31042
2308C114739K30460K43284K09673K81739L69309M29231M96945N16986N62847O64318
2298G119531R46463J456937J592347J252213J138447N72100j40813q62815j309975
2289A1764435j443597j580205j352673r94393o70252o24358o42082n58769l96955
$$ plain form
2367 304095 319079 360215 360073 342061 321384 348037 350142 346343 363634 383489 416911 421544 454156
2354 454156 488551 465167 507370 493786 508890 548351 553330 558963 554330 591093 632534 675850
2342 675850 727294 813248 889745 920597 959888 977667 1000221 1024151 990090 1027559 1054073 1072910
2330 1072910 1109036 1129920 1182793 1201994 1242794 1281822 1287745 1323404 1388001 1450607 1533752 1596261
2318 1596261 1658922 1751061 1861689 2012800 2152383 2319536 2533887 2713585 2883697 3114739
2308 3114739 3345199 3588483 3798156 4079895 4449204 4878435 5375380 5892366 6455213 7119531
2298 7119531 8065994 9522931 11115278 12367491 13505938 14078038 13937225 13074410 11764435
2289 11764435 10320838 8740633 7387960 6393567 5723315 5098957 4456875 3898106 3501151
2280C501151l53661k99161k35834k18330k03667j82149j39501j41872j33147r8976
2270A494853j28901o6712n9757o7919q6881l7730o3400n5942n806o0104l8710
2259H22991j3375m8826k1478l0089n1908p348j7212r140p097m0937l5303j53j2456
2246E27669l861p830j2520p140k3946M5491l710m2146J219o172J4664Q99j6573
2233D66044l9636J274K253l789k4320k332J0040l107L442N51j1942p087q833p526
2219C75032m723M1234j1886k4420j6971m8380o310q50j329n547O4698K5180m1807
2206C43921N467m064k5500O469k2403m6164j3670j1825n799l171K0758n648R8
2193B38469j6445J4408J0564q964q298q711p270l84J8948K3727q779q150k0449
$$ plain form
2280 3501151 3147490 2848329 2612495 2394165 2190498 2008349 1868848 1726976 1593829 1494853
2270 1494853 1365952 1299240 1239483 1171564 1084683 1046953 983553 927611 921805 861701 822991
2259 822991 809616 760790 739312 709223 657315 649967 632755 623615 616518 575581 540278 540125 527669
2246 527669 523808 515978 503458 496318 472372 517863 514153 472007 473226 467054 481718 482617 466044
2233 466044 426408 427682 429935 426146 401826 399494 409534 406427 409869 410420 398478 391391 382558 375032
2219 375032 370309 411543 399657 375237 358266 309886 303576 302726 301397 295850 360548 385728 343921
2206 343921 349388 345324 319824 326293 303890 257726 244056 232231 226432 223261 244019 238371 238469
2193 238469 222024 236432 246996 238032 229734 221023 213753 213369 232317 256044 247265 239115 218666
2180B18666j3036j2315K4306K7888k2363l572O625K564R463j167n7892o454J4168
2167A86881J2503k3662Q784K6464P127o468m5J456j3351l108J8039J2903k3855
2154B03668K280P581j8025k1346j6756j4623L764K1993k1073K1973L3927j4172
2142A89191O908l371k9344J2990j3964j1650R568J7786L140j106o655p835l5970
2129A29688J604J2927K8642k1024j6720P540m971j2741M526q759J9658K1038J1624
2116A73032j4872k0175J627M256K4049J0128K6090j9303l1168J6558L864k9445
2104A44641J5484j4324k9465n919K7090K4446l8430n656P9491r46n27l2070N714
2091A69529o794j0512K4873Q141k9893r578Q314l624k5001L4660q863k9695J8159
$$ plain form
2180 218666 205630 193315 217621 245509 223146 219574 226199 228763 238226 237059 179167 172713 186881
2167 186881 199384 175722 184506 210970 218097 211629 211584 213040 199689 196581 214620 227523 203668
2154 203668 205948 213529 195504 174158 157402 142779 146543 168536 147463 169436 203363 189191
2142 189191 196099 192728 163384 176374 162410 150760 160328 178114 181254 180148 173493 165658 129688
2129 129688 131292 144219 172861 151837 135117 142657 137686 124945 129471 120712 140370 161408 173032
2116 173032 158160 137985 139612 143868 167917 178045 204135 184832 153664 170222 174086 144641
2104 144641 160125 145801 116336 110417 137507 161953 123523 117867 197358 196412 195885 163815 169529
2091 169529 162735 152223 177096 185237 155344 145766 154080 150456 125455 160115 151252 121557 139716
2078A39716L0399j7560j6829O995L4914m419k0921l1031n030P233M5299r986k2289
2065A36491k0103j2753L5632j9092K215N729P107j3409K9333q755l5004M506J1361
2052A23258J0883J010J8923J2900l1379J2170l4363j8302J2323o603j9750n304
2040G5766k517J5275J9653R631k720k1678o88L3760j1607p451N209J275M7845
2027A61753L5622l4267r72M8851p5J1986m4046j3144q431o887J2636q877J0926
2014A65075m7394j1779O091m693Q544K2211n6807O666L5510j5133k7440J4518
2002I5369J6740J514j653m0543J070M9984J0977k2709k1391P570P940q39n06Q186
1988A11709R48k3429j2279K5753R617j4168J1051O99J1357j1975j8062O250J2923
$$ plain form
2078 139716 170115 152555 135726 142721 177635 173216 152295 121264 116234 123467 168766 158780 136491
2065 136491 116388 103635 139267 120175 122390 128119 135226 121817 151150 142395 107391 111897 123258
2052 123258 134141 135151 154074 166974 135595 147765 113402 95100 107423 100820 81070 75766
2040 75766 73249 88524 108177 117808 115088 93410 92722 126482 114875 107424 112633 113908 161753
2027 161753 197375 163108 162136 210987 210912 222898 178852 165708 157277 150390 163026 154149 165075
2014 165075 117681 105902 111993 107300 115844 138055 81248 87914 123424 108291 80851 95369
2002 95369 112109 113623 111970 71427 72497 122481 133458 110749 89358 96928 104868 104029 103523 111709
1988 111709 112657 89228 76949 102702 112319 98151 109202 109901 121258 109283 91221 97471 110394
1975A10394R015j0913J5448r99O654k7927N1J4717j9370j8027K5567K705j7442
1962H9873k2124o316J9994o957J2952K9335j4771k6238K1604O577j6405l9301
1950D8223J2444J7548o865L2729N068j0865J1795M8864J1226l6911j7919k7066
1938H8271K7635J7727j0099m2472J5954p054L8750K9700k0013k6260L655L361
1926A19155j7648J6692J338j368p180j6482j5174l2318K9967L8778j504k6472
1914H7784j5503K8883o969J0547j3431k2575j4199k042K2204j8045l224L413L0416
1901H7259J5456n770m5581K5116J1664k3411J90K779J3004J3774L510J3721L802
1888A15513k7884j1661k342j8964L1258M785l4193j5571R015J9420K3258j2430
$$ plain form
1975 110394 119409 108496 123944 122945 129599 101672 101723 116440 97070 79043 104610 107315 89873
1962 89873 67749 61433 81427 74470 87422 116757 101986 75748 97352 103929 87524 48223
1950 48223 60667 78215 71350 104079 109147 98282 110077 158941 170167 133256 115337 88271
1938 88271 115906 133633 123534 81062 97016 89962 128712 158412 138399 112139 115794 119155
1926 119155 101507 118199 119537 118169 110989 94507 79333 47015 76982 115760 114256 87784
1914 87784 72281 101164 94195 104742 91311 68736 54537 52495 74699 56654 53430 56843 87259
1901 87259 102715 96945 51364 76480 88144 64733 64923 67702 80706 94480 97990 111711 115513
1888 115513 87629 75968 73626 54662 85920 90705 56512 40941 49956 69376 92634 80204
1876H0204k5516J7711o7L4803R665l283k3529M655j713o82j7540R388K7561q961
1862A02696m2672n623j7899j021L3027L0069l0071k4883O531O384J5689j0780
1850F1447o645M7399J6456m3139j0003J2943o378l7977J9792O594j9120R637K1429
1837G2435K9608J6231k1483k6996j1328R538M1396k7100j6756j3092k5619J8999
1825D5833q409m858K5301j86o679M2685p535l7138o999J2694L084j7255L3732
1812G4270K7377j1388l632k3403M659k6152M3708j2615l6147K8896j7686R040
1800E6927j1407M0944o016l3429Q472j5698j7680L2840K7981K1928l2062j0372
1788F2428n735J0974j2393k6563L4838l2741j5809L3122K4860m239r200o171o218
$$ plain form
1876 80204 54688 72399 72332 107135 116800 113517 89988 94643 92930 92248 74708 84096 111657 102696
1862 102696 60024 54401 36502 35481 68508 98577 68506 43623 50154 56538 72227 61447
1850 61447 54802 102201 118657 75518 65515 78458 72080 34103 53895 60489 41369 51006 72435
1837 72435 102043 118274 96791 69795 58467 68005 109401 82301 65545 52453 26834 45833
1825 45833 37424 32566 57867 57681 51002 93687 86152 49014 42015 54709 57793 40538 74270
1812 74270 101647 90259 86627 63224 67883 41731 85439 72824 36677 65573 47887 56927
1800 56927 45520 86464 80448 47019 55491 39793 22113 54953 82934 104862 72800 62428
1788 62428 56693 67667 55274 28711 63549 30808 14999 48121 72981 68742 59542 53371 47153
1775D7153l942m3911J7965J5548K3257N740J1249m202p496O962j7231k5l993q885
1761C8189P682J8315j3578P065l1887N0343l4353Q512j6039J1367K9442q832l421
1748F2805l3097M8751K4189k0460m5150N428J9575J0743J461l9247q986J3315
1736C9327k125J2246r8k798j9051R593J4306k024l2080L0717K9032M602o539r716
1722F5392J1522J4959j9626m0022M092l5458L711J0399J680j6553m916K7088K0506
1709D2774j475l187q581P239k0596j0040p0O326M2796p684J3004O312K1093q412
1695G9499j9977k8748l0456J2631K4752K266k0937L159L5558k1907J1444N697
1683E2981l0433J0605m948J5115M356J5291l7939J0108K2678j2212l1623J2564
$$ plain form
1775 47153 43211 -700 17265 32813 56070 61810 73059 68857 61361 68323 51092 51067 47074 38189
1761 38189 45871 64186 50608 57673 25786 76129 41776 50288 34249 45616 75058 66226 62805
1748 62805 29708 78459 102648 82188 37038 42466 62041 72784 74245 34998 26012 39327
1736 39327 37202 49448 49350 46552 27501 37094 51400 49376 17296 48013 77045 81647 75108 65392
1722 65392 76914 91873 72247 32225 36317 859 4570 14969 16649 96 -4820 22268 42774
1709 42774 41299 38112 29531 36770 16174 6134 6064 12390 55186 47502 60506 66818 87911 79499
1695 79499 59522 30774 318 12949 37701 39967 19030 22189 57747 35840 47284 52981
1683 52981 22548 33153 28205 43320 47676 62967 25028 35136 57814 45602 13979 26543
1671B6543j966l0977k3396K2792J3248j4721K2670M5962M605p8595M8014L6169
1659G0348q109l1097Q338K178J3517j4766l1010K9525J5352k4394K04L9593j6445
1646E3234l3230J2916J0533P16j0031j7750K0654j2569J3472l1421J7397L4675
1634E8596K9062j2418N410n4j2440Q21J68m0024L602L0570k7040J1623j156k376
1620D4344l6615J2748O73P828j0946M8655K3321m0286l463m57k5339r531l464
1607G468J7643J4990K0494k4270l7139L1513L0633k7670O332L0881k2365R5k4055
1594B4550p668M430J1152K9012M2126j2755l9467N612J1958p716K2812k1183p105
1581E5758k2684j6730l708p634L5354K8197J7087j5909j9915q281m3740N156O104
$$ plain form
1671 26543 24577 -6400 -29796 -7004 6244 -8477 14193 60155 64760 -13835 34179 70348
1659 70348 62239 31142 39480 41658 55175 40409 9399 38924 54276 29882 30086 69679 53234
1646 53234 20004 32920 43453 44169 34138 16388 37042 24473 37945 6524 23921 58596
1634 58596 87658 75240 80650 80596 68156 68977 69145 29121 32723 63293 36253 47876 46720 44344
1620 44344 7729 20477 21150 28978 18032 66687 90008 49722 46259 45802 20463 10932 7468
1607 7468 25111 40101 60595 36325 -814 30699 61332 33662 39994 70875 48510 48605 24550
1594 24550 16882 21312 32464 61476 103602 90847 51380 56992 68950 61234 84046 62863 55758
1581 55758 33074 16344 12636 5002 40356 68553 85640 69731 49816 41535 -2205 2951 9055
1568I055J0423J1362p910M803j1854m842J2808J2036K857J4456k7417j267O941
1555C1451J2655j9104j7817K4268K9170p716j7507j0175o924l8126L6187J1564
1543B7926K5190p449j2753J5678k4114n471r842J689k2822k592K6182J7517m597
1530B4542p042j5539L7384k6705k2090J9963Q766j4869k2256k493j4146J8997
1518a5488M254J3094K2847k5595p106N1784k2861k1374P073M3O42J5596L904j2960
1504A3853K62r391r611J6305L0201q967j3232k3126j4395k5049K8507P18J1812
1491b113M6495k0442m1807K6832J1376o514J6134L995n558r838j5495m423Q474
1478G116L973j4033O891j7739k086J1427K7427J525L087K2516k0062q689k4828
$$ plain form
1568 9055 19478 30840 22930 27733 15879 11037 23845 35881 38738 53194 25777 24510 31451
1555 31451 44106 25002 7185 31453 60623 52907 35400 25225 18301 -19825 16362 27926
1543 27926 53116 45667 32914 48592 24478 19007 9165 10854 -11968 -14560 11622 29139 24542
1530 24542 17500 1961 39345 12640 -9450 10513 19279 4410 -17846 -20339 -34485 -15488
1518 -15488 -11234 1860 24707 -888 -7994 43790 20929 -445 6628 6671 7313 22909 26813 13853
1504 13853 14115 4724 -4887 11418 41619 32652 19420 -3706 -18101 -43150 -14643 -13925 -2113
1491 -2113 44382 23940 -17867 8965 20341 13827 29961 33956 28398 18560 3065 -1358 7116
1478 7116 11089 -2944 3947 -13792 -15878 -4451 22976 24501 27588 50104 30042 21353 -3475
1465c475J3126o716N9130K1249m0108o451K663N129k706j7534P200P995M200m04
1451D3298k5479n426o413j1317j3009N498K4052M978O854K1719Q51L680J887j1638
1437C9535j1767j6957q784Q923M955J0392l0165o0M800M614J8939L359J8077k5883
1423A9978m2156j418K4594J9764M2595l1740k4676k1020R94K238K044L7509j2312
1410A6394Q620R895j6192j9416R355n642R457k9272R184O635p841L612N546J7623
1396A7958l5002J4511K6216L4P352J2939j2201L247j2884r556J0929K55J2809
1383C6607j3285o919J125j4786m0777L1889J4322k3224J5033L0289j835k0765
1371G674K1082p022K3225j3274j2581L4520k1441j1978q831n066J6481n885P105
$$ plain form
1465 -3475 9651 2935 62065 83314 43206 36755 39418 44547 41841 24307 31507 39502 43702 43298
1451 43298 17819 12393 5980 -5337 -18346 -12848 11204 16182 23036 44755 45606 49286 51173 39535
1437 39535 27768 10811 2027 10950 15905 26297 -3868 -3928 872 5486 24425 27784 45861 19978
1423 19978 -22178 -23596 998 20762 63357 31617 6941 -14079 -13085 -10847 -8803 28706 16394
1410 16394 25014 34909 18717 -699 8656 3014 12471 -16801 -7617 -982 -8823 -5211 335 17958
1396 17958 -17044 -2533 23683 23717 31069 44008 31807 35054 22170 12614 23543 23798 36607
1383 36607 23322 16403 17528 2742 -38035 -6146 8176 -15048 -15 30274 28439 7674
1371 7674 28756 21734 44959 31685 19104 53624 32183 20205 11374 6308 22789 16904 24009
1358B4009K59J0594k0039r395k9322R286L6813J0207M130l4482k7144J4583j6326
1345b6827m621K6031J5685k8522N198K1966n206L1479k4709k758P412O676j5111
1332F693L942j4038L7804K504k2924k6243K2904J905J6291R22k7338r363K097
1319d844J6443j5503K8113K293p567r828P843j7286K9936l7882L5606J6388j8990
1306B4722l2055o168K1555p334k0679K5051R782o616p274k7267L3867j8001m401
1293a4818K4571k4055N04M1643l620K0856j8178m846n883J7912j8093j6231L3819
1280C3581j439K611n371J3105J2392N048k1920j4789R693p431r612k5901K0376
1267A0343p762j7380L107J9371K6292l7574j1203M1088J2209o254L1618l1435
$$ plain form
1358 24009 24268 34862 14823 5428 -23894 -14608 22205 32412 36542 2060 -25084 -10501 -26827
1345 -26827 -31448 -5417 10268 -18254 -13056 8910 3704 35183 10474 7716 15128 21804 6693
1332 6693 10635 -3403 34401 36905 13981 -12262 10642 12547 28838 29760 2422 -6941 -4844
1319 -4844 11599 -3904 24209 26502 18935 9107 16950 -336 29600 -8282 27324 43712 24722
1306 24722 -7333 -13501 8054 720 -19959 5092 14874 8258 984 -26283 7584 -10417 -14818
1293 -14818 9753 -14302 -13798 27845 24225 45081 26903 22057 16174 34086 15993 -238 33581
1280 33581 32142 34753 29382 42487 54879 59927 38007 23218 32911 25480 15868 -10033 10343
1267 10343 2581 -14799 -11692 7679 33971 -3603 -14806 26282 38491 32237 63855 32420
1255C2420l3495K1099P316j0240n389j1106J4754L815j2469k8789m915K604N813
1242a8582L3342m9605K7076p578J0569J1600j9062N72j1408j4560J4508k7063
1230e0191q807M0639o552r555L921L1488j3283o952J6222J0136K406j5312L646
1217b194L2496k4803J6379k6644L401k797j653j4467L3143J8346j4696J5343j1081
1204B0773k2583j722P767O535j8179j1572L7496m2094j7751J8354J1990K3252
1192A2266k265r351j4971P121p918j2324M7483J3623k3881J763M674j4528j0989
1179i297K1345J9250j6398J2906p892O731k8856k2184J8008P704k6456K6469j3338
1166a2008R876K378L998j0084l302K2335J1024l49j0484o682k6006J8843J2317
$$ plain form
1255 32420 -1075 20024 27340 17100 11711 605 15359 19174 6705 -22084 -26999 -24395 -18582
1242 -18582 14760 -34845 -7769 -15347 -4778 6822 -12240 -11668 -23076 -37636 -23128 -50191
1230 -50191 -58998 -18359 -24911 -34466 -30545 943 -12340 -19292 -3070 7066 9472 -5840 -2194
1217 -2194 30302 5499 21878 -4766 -1365 -4162 -5815 -20282 12861 31207 16511 31854 20773
1204 20773 -1810 -3532 4235 10770 -7409 -18981 18515 -23579 -41330 -22976 -10986 12266
1192 12266 10001 650 -14321 -7200 -15118 -27442 20041 33664 9783 11546 16220 1692 -9297
1179 -9297 12048 31298 14900 27806 19914 26645 -2211 -24395 -6387 1317 -25139 1330 -12008
1166 -12008 -2132 246 4244 -5840 -9142 13193 24217 23868 13384 6702 -19304 -461 11856
1153A1856r023m1548J9179M2481Q46k9574j3107K7216M83J8372m596k3806O944
1140E723J3851N666j143J62R376J0634o4782k953K2918J569O83L743k8804k0650
1126d4007K6673J6307j213Q01m164q186N922m668J4563m5684K1532K6643k1097
1113a6578j161j2544P857k6185L8069p172K9010j4575l944K5832k5053K1619j6205
1100a030M65O03J703L4887k1033R243k623k6843J9873k7549J1623k5134K3799
1087b016J3954R690n078j7969J6897p203k0767K7653J0800r763p3l6348k455L8962
1073A6284j3672o342r650J086K677k171q088p060L879k21N3339k5709J782l149
1059B985j5080k4939L2465p044m74M778L87j9851N24M422k263j127j8305k4534
$$ plain form
1153 11856 2833 -38715 -19536 22945 23791 -5783 -18890 8326 8809 27181 22585 -1221 5723
1140 5723 19574 25240 24097 24259 33635 44269 -20513 -23466 -548 1021 1704 5447 -23357 -44007
1126 -44007 -17334 -1027 -2240 -1439 -5603 -13789 -7867 -12535 2028 -43656 -22124 4519 -16578
1113 -16578 -17739 -30283 -22426 -48611 -10542 -17714 11296 -3279 -7223 18609 -6444 15175 -1030
1100 -1030 -565 38 1741 36628 15595 24838 22215 -4628 15245 -12304 -681 -25815 -2016
1087 -2016 11938 21628 16550 -1419 15478 8275 -12492 15161 25961 16198 16125 -20223 -22678 16284
1073 16284 2612 -3730 -13380 -12294 -9617 -11788 -19876 -26936 -23057 -23278 30061 4352 6134 2985
1059 2985 -12095 -37034 -4569 -11613 -12087 -7309 -6922 -26773 -26249 -21827 -24090 -25217 -43522 -68056
1045f8056L3303q22M3305J6650j6610j1406m008R071n1331Q009L2730P535j6963
1032a8593K0385J9532k1760j9017K4235J1007m2685K5450L1119k5890J0096j1567
1020B312l3335k432K0597k1301q872J3553K5630O781k420l3711k1872J8342J7223
1007a9505Q051J8156l8362j5172k5381L8679K5412j3993P1J4079J1114Q656o713
994E092L626j5248L641J929q500Q048p798J3978n220k8333j0439J7560j9893l8869
980h0426J9458M6939K8830k3630k3140k2546L2951L1520J8389N674n119k1601
968G299J5275k8638j9159J967p875K966o355J599K7852j8716j9546j545J8242
955b6634M0248j4785j580j5299K2111j4482j5378P550L0866k4801K9158j8027
$$ plain form
1045 -68056 -34753 -35575 7730 24380 7770 -3636 -7644 1427 -49904 -41895 -9165 -1630 -18593
1032 -18593 1792 21324 -436 -19453 4782 15789 -26896 -1446 29673 3783 13879 2312
1020 2312 -31023 -33455 -12858 -34159 -43031 -29478 -3848 2933 513 -33198 -55070 -36728 -19505
1007 -19505 -11454 6702 -31660 -46832 -72213 -33534 -8122 -22115 -22044 -7965 3149 11805 5092
994 5092 8718 -6530 -2889 -960 -9460 -1412 -9210 4768 -452 -28785 -39224 -21664 -41557 -80426
980 -80426 -60968 -14029 14801 -8829 -31969 -54515 -21564 9956 28345 34019 28900 7299
968 7299 22574 -6064 -25223 -23256 -31131 -28165 -34520 -32921 -5069 -23785 -43331 -44876 -26634
955 -26634 13614 -1171 -2751 -18050 4061 -10421 -25799 -18249 12617 -12184 16974 -1053
943a053k7628l327L9477j2923j4506k0941J6245L4481j3878j1894l275N15k0833
930c9540K5997r585k064L2514J3750j4526k7390j6127L3304K6539j0993j9642
918g763m017J5779K757m1796L499K9437j8155J6095J4110Q969j8717k3069l2202
905e5073L2228K066k1320L3048L8050j8665j8092k1818p938K7623J4086M592l666
892E121K9812p622l3065r086K2174L764j9891k3105K2439Q429j3461J3234K5795
879B4538l781j8512l6283j05M6966q062j6886j1354k1663K3536L4939j5926N390
866B797J2155j8628m0577K0221K2412j7876L7915k3108q598n260L8641j5276r915
853e097r680N549M2254L0607n9626m0127K7076o04j3035r083J3582P989k6270
$$ plain form
943 -1053 -28681 -32008 7469 -5454 -19960 -40901 -24656 9825 -4053 -15947 -19222 -18707 -39540
930 -39540 -13543 -23128 -25192 7322 21072 6546 -20844 -36971 -3667 22872 11879 -7763
918 -7763 -11780 3999 6756 -35040 -31541 -2104 -20259 -4164 9946 18915 198 -22871 -55073
905 -55073 -22845 -20779 -42099 -9051 28999 10334 -7758 -29576 -37514 -9891 4195 8787 5121
892 5121 34933 27311 -5754 -14840 7334 11098 -8793 -31898 -9459 -1030 -14491 -1257 24538
879 24538 20757 2245 -34038 -34143 12823 4761 -12125 -23479 -45142 -21606 13333 -2593 2797
866 2797 14952 -3676 -44253 -24032 -1620 -19496 18419 -4689 -13287 -18547 20094 4818 -5097
853 -5097 -14777 -9228 33026 63633 4007 -36120 -9044 -9648 -22683 -31766 -18184 -10195 -36465
840c6465n482M4081l917n264m199K1385N531j7753J2139j0238p601L4716k8412
827a479j893K434J8963m358l9200j4296J522o698P177R532O383j8918J7134N483
813a8214k1182P827J9994j7610l1325J7079K9641N66n177J6389M013k4834K3270
800D37K0508k6388l7341o670M0414J2420K879l9142Q517L5749P438j9919k3284
787b4382M989J0669j7364P308J7978j577J715j5906j0491L3975p624K741k0976
774a8945l5023N717n714K5790K13l5286K1118K0106M5346j0824l2438j9295P231
761c2004j4804l853M3676K0049J1204l4933Q025O543j5550J5054J1807o526O255
748A4943j6577m0305p032q52r946K8484N201j4640j959J6138o930q459j6308J1145
$$ plain form
840 -36465 -41947 2134 -1783 -7047 -11246 10139 15670 -2083 10056 -182 -7783 26933 -1479
827 -1479 -3372 -938 18025 13667 -25533 -39829 -38307 -45005 -37828 -28296 -21913 -40831 -23697 -18214
813 -18214 -39396 -31569 -11575 -29185 -60510 -43431 -13790 -13224 -18401 -2012 2001 -22833 437
800 437 20945 -5443 -42784 -49454 -9040 3380 6259 -32883 -24366 11383 18821 -1098 -24382
787 -24382 -19393 -8724 -26088 -18780 -802 -2379 -664 -16570 -27061 6914 -710 2031 -18945
774 -18945 -53968 -48251 -53965 -28175 -27962 -63248 -42130 -22024 23322 12498 -19940 -39235 -32004
761 -32004 -46808 -50661 -6985 13064 24268 -10665 -2640 3903 -11647 3407 15214 8688 14943
748 14943 -1634 -41939 -48971 -49823 -59769 -31285 -26084 -40724 -42683 -26545 -33475 -41934 -58242 -47097
734d7097J7712j2887J7194J0270r790Q216q680j4886J3968Q89K1382L5781k2546
721I526J808J0279k2452J3641L979p159J1021l6916j811J4729q336p740J353J5431
707b647Q451j7453K3878o372j9745q345N958J8116J4771k8187O563J1242o431
694b01J1808m982J1155K639m766k5283J8521J210j953l1735K0817Q279k5047r962
680b9500O662R545l0744j244L1544M935m807n021j573p166j9496J0570K520K4343
666i432L4842o3780j0653K5077j8646j3228N6190L3852k0093l3531K557O987Q392
653a466J5006K0303L903j5326N324k746j9005l086K112l1559J3745j181r821m921
639b8718N034N326j1562R767k3559J5237J2596k1222K5018j9973k7575L0567J7785
$$ plain form
734 -47097 -29385 -42272 -25078 -14808 -24598 -16382 -25062 -39948 -25980 -25091 -3709 32072 9526
721 9526 11334 21613 -839 12802 16781 9622 20643 -16273 -18084 -3355 -11691 -19431 -18078 -2647
707 -2647 5804 -11649 12229 5857 -13888 -22233 -16275 1841 16612 -11575 -5012 6230 -201
694 -201 11607 6625 17780 20419 15653 -9630 8891 10101 8148 -23587 -2770 5509 -19538 -29500
680 -29500 -22838 -13293 -44037 -45281 -13737 -8802 -13609 -18630 -20203 -27369 -46865 -36295 -33775 -9432
666 -9432 25410 -38370 -49023 -23946 -42592 -55820 370 34222 14129 -19402 -16845 -9858 -1466
653 -1466 13540 33843 37746 22420 27744 24998 5993 2907 5019 -26540 -12795 -13976 -23797 -28718
639 -28718 -23684 -18358 -29920 -20153 -43712 -28475 -15879 -37101 -12083 -32056 -59631 -29064 -11279
626a1279o3455J1316L5888M5264K026k5252l11J6322n415j4279O251M112L992
613E180o322J813K6640J1508j0170k5231l2276J0593l4042j3579R732j1502l75
600f8031J4798J6793l118K156k0694o824L5455L3170m9453J2958P1131n626l7021
587d306O904J8093l5841M290k9255J0005K7413j9826J8084m1512J7856K5763m145
574f477Q592n179K701M350k0123k7185J2943l663J9596K6652j6299j6691j3865
561c4648J7451J6878J0718k1927k8772J1635J7607J7570J4193k5544k4942l519
549c3300J9362J2203j8937K1303O89J1931M993p858J685J005J517N120l0159N598
535d848j6792P48q378P135K2005p780J5982j3140J3259J1324l8728r967k037K530
$$ plain form
626 -11279 -74734 -63418 -27530 17734 19760 -5492 -5803 10519 5104 -9175 -2924 1188 5180
613 5180 -1142 671 27311 38819 28649 3418 -28858 -18265 -52307 -65886 -56154 -67656 -68031
600 -68031 -53233 -36440 -39558 -37402 -58096 -64920 -29465 3705 -45748 -32790 38341 32715 -4306
587 -4306 2598 20691 -15150 -10860 -40115 -30110 -2697 -22523 -4439 -45951 -28095 -2332 -6477
574 -6477 2115 -3064 -363 3987 -16136 -43321 -30378 -34041 -14445 12207 -4092 -20783 -34648
561 -34648 -17197 -319 10399 -11528 -40300 -28665 -11058 6512 20705 -4839 -29781 -33300
549 -33300 -13938 -1735 -20672 631 1320 13251 18244 10386 12071 13076 14593 19713 -10446 -4848
535 -4848 -21640 -20892 -29270 -22135 -130 -7910 8072 -5068 8191 19515 -19213 -29180 -31217 -28687
521b8687J4929j8796N154L892p190J8280k4541K1997J6225O855j5710K0031o296
508F143O539J3187j473k2617q410L290o159M564n352N727l6799L7465l5718M543
494c5070k12m8999K1656N8182N223k3839K1741L0820l4508m7500j3530L8261J5941
481a1834J3885m099k6516k577J9418M8903J558l5435l590P672j5736M323L2272
468B8244O519k3461k223k7172j8008K5916r842j4396M2802j3467R340J4953j4070
455E135m342k3074k2182K6826j2532j4968q671K0592R816J7534O6221l6130j0806
442A3419n303j2522k3471J4461O620K827K1522k9641L5156J889j8873n629m6662
429d6207N4600J3766k708j9417j3798R543N075N711Q117l1832o053M0252l595
$$ plain form
521 -28687 -13758 -32554 -27400 -23508 -30698 -12418 -36959 -14962 1263 8118 -7592 12439 6143
508 6143 12682 25869 24396 1779 -6631 -3341 -9500 -4936 -10288 -4561 -41360 -3895 -39613 -35070
494 -35070 -35282 -84281 -62625 -4443 780 -23059 -1318 29502 -5006 -52506 -66036 -27775 -11834
481 -11834 2051 -2048 -28564 -31141 -11723 37180 38738 3303 -287 7385 -8351 -4028 28244
468 28244 34763 11302 9079 -18093 -36101 -10185 -20027 -34423 8379 -5088 4252 19205 5135
455 5135 793 -22281 -44463 -17637 -30169 -45137 -53808 -33216 -23400 -5866 60355 24225 13419
442 13419 8116 -4406 -27877 -13416 -6796 -3969 17553 -12088 23068 24957 6084 455 -46207
429 -46207 8393 22159 19451 34 -13764 -4221 854 6565 14682 -17150 -23203 17049 13454
416A3454j5015m0389J2009J7489j2327L238k68R174P336l473k147j5190M8297
403B2188R537m8514J3200p835j4479L2319K0628n0894j6197K1370L3410K388Q309
390B5430j9260m489k289L604M2053Q176m3875k7704p032K9064J9348n401j6346
377A279J1749m0772N521P0076j6405l9347K3532L8938l2822K7526Q447k6662m9299
364a8239M328J5169J2728J4182K1649l2116K6167j0238m5655O708k779L005J386
351c705j4651L3770K862n000j2365o77l8538o053L4916J8595p691Q25L729n336
337F81j852k8492K2484P704j8384O426l0338J0785J0585K9053r613k156j0746
324a3863j9660O3034r700k420k7771n674K6277j0267k6391j1173J3853M697J5687
$$ plain form
416 13454 -1561 -41950 -29941 -12452 -24779 -21541 -21809 -12635 -5299 -8772 -10919 -26109 22188
403 22188 31725 -16789 -3589 -11424 -25903 6416 27044 -23850 -40047 -18677 14733 17121 25430
390 25430 6170 1681 -608 2996 45049 53225 9350 -18354 -25386 3678 23026 17625 1279
377 1279 13028 -27744 -22223 47853 31448 -7899 15633 54571 21749 49275 57722 31060 -18239
364 -18239 -13911 1258 13986 28168 49817 17701 43868 33630 -12025 -5317 -8096 -5091 -3705
351 -3705 -18356 15414 18276 13276 911 234 -38304 -44357 -9441 9154 1463 2288 6017 681
337 681 -1171 -29663 -7179 525 -17859 -11433 -41771 -30986 -20401 8652 -961 -3117 -13863
324 -13863 -33523 29511 19811 17391 -10380 -16054 10223 -44 -26435 -37608 -23755 -19058 -3371
311c371K9148j0142j4512K9254j5020k5707R095M966Q320N425j6206j5228M318
298i660J1943j8235o038J6881L3786p4m0888j3372j157N3188J0911M717k407R79
284D0574k3303K2676k0077r135j2396r305J7506K3175Q590l8666P95K6501J2674
271C9609L910k0948k2916J6251J2366K0794j8346j4474J2005n452l728l4986J2471
258c444R918j1493Q02l658M50K4622O190l2265j8931L4323Q02O32j364J6984M479
243B8047k4957n879k1180L3593K6700k7061k2867r102L3223r329j068J3266m412
230H974k3706j9285P297K3018K5767k2183j5414k0195o731J3824L2106j4432l716
217a4676N472R866K3269n631J679j4313k3080L1953L0859j6900p651k6833J4761
$$ plain form
311 -3371 25777 15635 1123 30377 15357 -10350 -1255 3711 12031 17456 1250 -13978 -9660
298 -9660 2283 -15952 -21990 -5109 28677 28603 -12285 -25657 -26814 26374 37285 42002 39595 40574
284 40574 17271 39947 19870 10735 -1661 -10966 6540 29715 38305 -361 434 26935 39609
271 39609 43519 22571 -345 15906 28272 49066 30720 16246 28251 22799 19071 -15915 -3444
258 -3444 6474 -5019 -4217 -7875 -7425 17197 23387 -8878 -27809 6514 7316 7948 6584 23568 28047
243 28047 3090 -2789 -23969 9624 36324 9263 -13604 -22706 10517 1188 120 13386 8974
230 8974 -14732 -34017 -26720 -3702 22065 -118 -15532 -35727 -42458 -28634 3472 -10960 -14676
217 -14676 -9204 662 23931 18300 19979 5666 -17414 14539 45398 28498 20847 -5986 8775
204H775J9767O995l337l4385r859L5260p340k787K6455m886k4523o227J3673j0263
190G318l238J2953L2582l8981K280k994l592k3118M689n115K2305R952n414l0579
176b0952K1499p319J0369J3777J3889j7887p977k4055K7016P738k7734k814L011
163a1439n428P376L3803l9391K989J2583r164J3676o772m987K5693j7664K2586
150B3861l6874J827O130O693q579o078L6359L2157k3770j8192p18k6458J5630
137A988M8197m268k5694k2700J9695j0280J6660N552k868j0920j4572M47O252
124G489N175j0227j6374q840L3865J7322j2460R272J5911k014J0353j0271k6804
111A2397k3070L3661j4073j6608K7133L8249k3789j8675J36j3863K776J4557Q660
$$ plain form
204 8775 28542 35537 32200 -2185 -12044 23216 15876 13089 39544 34658 10135 3908 17581 7318
190 7318 4080 17033 49615 10634 12914 9920 6328 -16790 -12101 -17216 5089 15041 9627 -20952
176 -20952 547 -6772 3597 17374 31263 13376 5399 -18656 8360 16098 -11636 -14450 -11439
163 -11439 -16867 -9491 24312 -15079 -12090 493 -8671 5005 -1767 -6754 18939 1275 23861
150 23861 -13013 -11186 -5056 1637 -6942 -13020 23339 55496 31726 13534 12816 -13642 1988
137 1988 50185 45917 20223 -2477 17218 6938 23598 29150 26282 15362 790 1237 7489
124 7489 12664 2437 -13937 -22777 11088 28410 15950 25222 41133 39119 49472 39201 12397
111 12397 -10673 22988 8915 -7693 19440 57689 33900 15225 15361 1498 4274 18831 27491
98B7491r802M126J0129j148k7970Q875p43l799j2266P270p042O222J4212J0080
84B5635n43J7839o127m547k2990L39n131K116l0720q690L0320j7588Q515J0774
70g98P324j8466J4535K5831j5625n235J7141q928l4200N878K5306r653r127k510
56h527J4440L069j6980O797R057J1226n53l082o88l36j4173r832m583K6058J6242
41B8135p484j4810N495m617N87J0570k4575O642K1768k619k587p086m400J7640
27B2659j0706M697m718J6317k2431q225j5437L8471J308j1398K4694J0612l3802
14A2041P095j147J5536j8744l5965J5210K7465J0013j4336o151k49O179p847k127
0F973
$$ plain form
98 27491 17689 21815 31944 30796 2826 11701 10958 7159 -5107 2163 -4879 1343 15555 25635
84 25635 25092 42931 36804 32257 9267 9606 4475 6591 -24129 -32819 -2499 -20087 -11572 -798
70 -798 6526 -11940 2595 28426 12801 7566 24707 15779 -18421 -12543 12763 3110 -6017 -8527
56 -8527 5913 8982 -7998 -1201 7856 19082 18529 15447 14759 14423 250 -9582 -14165 11893 28135
41 28135 20651 5841 11336 6719 7306 17876 -6699 -57 21711 19092 16505 9419 5019 22659
27 22659 11953 16650 11932 28249 5818 -2407 -17844 20627 21935 10537 35231 45843 12041
14 12041 19136 17989 33525 14781 -21184 -5974 21491 31504 17168 11017 10768 16947 9100 6973
0 6973
$$ Imaginary data points
##PAGE= N=2
##DATA TABLE= (X++(I..I)), XYDATA
16383a345420K3210J1437J486J8355J0441L6719K266O875K5767K1101K4409K2462
16371a140892J5409r29o13K5568L2450K7765L691J0600L9364L9230j130n85p766
16358i57838J9539J7053L0592J4329J7685N151L7740j0437J2244L0958L3812J4554
16346g34618L4599J4638o360K9183j7106l572K2657J3557J7060N272M3752J7333
16334e63605K607K7014j1743K0258M088l539P942J8013J1084L2075N9018r322
16322d06110J133O8636L1855j9279J001N917J2051K1444m227J4828J446K2200
16310b49105K5441K9003o745R856m504L7483J0015K0210K0661m221O12K4734L3240
16297e3320R669m16K690O044p8P781M2209J8149L0486Q086J2407n293o592O669
$$ plain form
16383 -1345420 -1322210 -1310773 -1309287 -1290932 -1280491 -1243772 -1241506 -1234631 -1208864 -1187763 -1163354 -1140892
16371 -1140892 -1125483 -1126412 -1127025 -1101457 -1069007 -1041242 -1037551 -1026951 -987587 -948357 -949487 -950072 -957838
16358 -957838 -938299 -921246 -890654 -876325 -858640 -853489 -815749 -826186 -813942 -782984 -749172 -734618
16346 -734618 -700019 -685381 -691741 -662558 -679664 -683236 -660579 -647022 -629962 -624690 -580938 -563605
16334 -563605 -560998 -533984 -545727 -525469 -521381 -524920 -516978 -498965 -487881 -455806 -396788 -406110
16322 -406110 -404977 -336341 -304486 -323765 -322764 -316847 -304796 -283352 -287579 -272751 -271305 -249105
16310 -249105 -223664 -194661 -201406 -191550 -196054 -158571 -148556 -128346 -107685 -111906 -111294 -86560 -53320
16297 -53320 -43651 -44067 -41377 -35333 -35411 -27630 14579 32728 63214 71300 83707 78414 71822 78491
16283G8491P72J9229R276j656Q707L4875o340J9956L9930J2615L3041P688j1192
16270B45392L0244k2597L563K7420J8090r73O069L2272j7817K1867K2615k7105
16258C39040J9414J7021m728J5926J2092j2921K6848L4513j2014r811K2434J6538
16246D64352J1073K3919J2422k0144Q234J9731l573j0164K5342K7932K8325n69
16234E86880k2662J2565R411J9655k201P753K639K0150L0124l9698j5969L6688
16222F45335K797r42k174M414N9072J2090J1571j7632K6900Q098n3776J3910K1027
16209G30690R991K1473q688P526N892J679L6716J277k4420J7445j931Q210K570
16196H08430K202K750R37M0969l3123j8293P846L2732j1035J4210K2402j3246
$$ plain form
16283 78491 79263 98492 107768 106112 114819 149694 143354 163310 203240 215855 248896 256584 245392
16270 245392 275636 253039 256602 284022 302112 301139 307208 339480 321663 343530 366145 339040
16258 339040 358454 375475 370747 386673 398765 385844 412692 447205 435191 425380 447814 464352
16246 464352 475425 499344 511766 491622 499856 519587 516014 505850 531192 559124 587449 586880
16234 586880 564218 576783 586194 605849 603648 611401 614040 634190 664314 624616 608647 645335
16222 645335 648132 647190 645016 649430 708502 720592 732163 714531 741431 749529 695753 709663 730690
16209 730690 740681 762154 753466 760992 766884 768563 805279 806556 782136 799581 797650 805860 808430
16196 808430 810632 813382 814319 855288 822165 803872 811718 844450 833415 847625 870027 856781
16184H56781J2301J7290n934L3011J59j6540L5710n856k281q343j4701J9727p448
16171I13876J6813L580P423L504q331J4084p092L1724M663k675K6842L3083k6033
16158A011461j6380J2361j1153O910j9746Q653L4343j9592o532j5271M0626l365
16146A022315j2561M5269k1663k7388j5737p965j23K8519J546K5225K577J9105
16134A059119j8873J3427Q257O248j557l9299L497K6297k3653l738L4991j0552
16122A054164J2275M253J8320K8437r129l3444j0726k3479N6183l290J7210j0365
16110A100409N001n0902L2577l626m5840J0089K53q461K5950J1181j722K5517
16098A100426o186k1635M0777j5768L71r921J558R657j8706J1319j4365K9534
$$ plain form
16184 856781 869082 886372 880438 913449 913608 897068 932778 926922 924641 916298 901597 921324 913876
16171 913876 930689 934269 941692 945196 936865 950949 943857 975581 980244 977569 1004411 1037494 1011461
16158 1011461 995081 1007442 996289 1003199 983453 992106 1026449 1006857 1000325 985054 1025680 1022315
16146 1022315 1009754 1055023 1033360 1005972 990235 982270 982147 1010666 1012212 1037437 1040014 1059119
16134 1059119 1040246 1053673 1061930 1068178 1066621 1027322 1030819 1057116 1033463 1029725 1064716 1054164
16122 1054164 1066439 1070692 1089012 1117449 1108320 1074876 1064150 1040671 1096854 1093564 1110774 1100409
16110 1100409 1105410 1054508 1087085 1083459 1037619 1047708 1047961 1039500 1065450 1076631 1074909 1100426
16098 1100426 1094240 1072605 1113382 1097614 1097985 1088064 1089622 1099279 1080573 1091892 1077527 1107061
16086A107061j5016K7222k6654M337Q325Q073J0695L4313N399k574l5231K932
16074A128882M349P464O137k9515J9118r30k6404K9541p619P380k0066k7517O144
16061A096964L6316j6649j2815O441j818j8669K1182L0624L2590l0891k4771n938
16049A112566N592L0148j2137l8418o585L1775L6897j8426l1259k3909M1622O824
16037A134690J657q156M555J3514l5605L0671Q06P461k1959J1839J8538L1705
16025A189716j9018j1049k469p933L164j891k8105j3492Q853j206j3158K5474
16013A128886K176J9674R868J1845j8884j2326R551K2121o009j9279J9618j710
16001A165531m0976j0074j883J3928Q780N0204j4909k8402j7366k5384J1370N049
$$ plain form
16086 1107061 1092045 1119267 1092613 1096950 1105275 1113348 1124043 1158356 1163755 1161181 1125950 1128882
16074 1128882 1133231 1140695 1146832 1117317 1136435 1135505 1109101 1138642 1131023 1138403 1118337 1090820 1096964
16061 1096964 1133280 1116631 1103816 1110257 1108439 1089770 1110952 1141576 1174166 1143275 1118504 1112566
16049 1112566 1118158 1148306 1136169 1097751 1091166 1122941 1159838 1141412 1110153 1086244 1127866 1134690
16037 1134690 1136347 1128191 1132746 1146260 1110655 1141326 1142132 1149593 1127634 1139473 1158011 1189716
16025 1189716 1170698 1159649 1157180 1149247 1152411 1150520 1122415 1108923 1117776 1116570 1103412 1128886
16013 1128886 1131062 1150736 1160604 1172449 1153565 1141239 1150790 1172911 1166902 1147623 1167241 1165531
16001 1165531 1124555 1114481 1112598 1126526 1135306 1185510 1170601 1142199 1124833 1099449 1110819 1115868
15989A115868q945N645n593K3149q156J4601L236N70o110j2099K9055j6536J1191
15976A145876J0531Q575m616k7155k8337K9536K0534L198J5278Q067j7059l498
15964A160930j1235m470l4060J4140L6626q442j8410K9162j5345J2057j0084k8938
15952A121931K0581k3956K0880O1k3781K2259j975N151J267k7338n643R560L8547
15939A157544J152n8185J1921L3248j0794N114k960j19J2993K2627j0664k00n820
15926A155857l5854O982o59J2883j0051J3914K2846J0394N8l3708m065m60j3445
15913A124692n458l337J0180q600J7285j6696j2701K6200J6249p751l229o50J9180
15900A155364l0179K5693P170j1823K3360J3095J7813l6047M4j8214J083J0764
$$ plain form
15989 1115868 1106923 1112568 1106975 1130124 1121968 1136569 1139805 1140375 1134265 1122166 1151221 1134685 1145876
15976 1145876 1156407 1164982 1160366 1133211 1104874 1134410 1154944 1158142 1173420 1181487 1164428 1160930
15964 1160930 1149695 1145225 1111165 1125305 1161931 1153489 1135079 1164241 1148896 1160953 1150869 1121931
15952 1121931 1142512 1118556 1139436 1139497 1115716 1137975 1136000 1141151 1142418 1115080 1109437 1118997 1157544
15939 1157544 1158696 1100511 1112432 1145680 1134886 1140000 1137040 1136921 1149914 1172541 1161877 1161677 1155857
15926 1155857 1120003 1126985 1126326 1139209 1129158 1143072 1165918 1176312 1176370 1142662 1138597 1138137 1124692
15913 1124692 1119234 1115897 1126077 1117477 1134762 1118066 1105365 1131565 1147814 1140063 1136834 1136184 1155364
15900 1155364 1125185 1150878 1158048 1146225 1169585 1182680 1200493 1164446 1164490 1146276 1147359 1158123
$$ [...]
##END NTUPLES=NMR SPECTRUM
##END=
