##TITLE=1H_DE-80H_X3
 200.13MHz, d2o
 8 sc
 
 19ns.26.2.2025
##JCAMPDX= 6.0         $$ Bruker NMR JCAMP-DX V2.0
##DATA TYPE= NMR SPECTRUM
##DATA CLASS= NTUPLES
##ORIGIN= UXNMR, Bruker Analytische Messtechnik GmbH
##OWNER= pz
$$ XWIN-NMR		Version 3.5
$$ Wed Jul 29 10:44:07 2026 Russian Standard Time (UT+4h)  Yarkov@DPX200
##.OBSERVE FREQUENCY= 200.1313
##.OBSERVE NUCLEUS= ^1H
##.ACQUISITION MODE= SIMULTANEOUS
##.ACQUISITION SCHEME= undefined
##.AVERAGES= 8
##.DIGITISER RES= 18
##SPECTROMETER/DATA SYSTEM= spect
##.PULSE SEQUENCE= zg30
##.SOLVENT NAME= DMSO
##.SHIFT REFERENCE= (INTERNAL, DMSO, 0, 15.5034)
##AUDIT TRAIL= $$ (NUMBER, WHEN, WHO, WHERE, WHAT)
$$ ##TITLE= Audit trail, XWIN-NMR		Version 3.5
$$ ##JCAMPDX= 5.01
$$ ##ORIGIN= Bruker BioSpin GmbH
$$ ##OWNER= Yarkov
$$ C:/Bruker/XWIN-NMR/data/yarkov2/nmr/H-C/1/pdata/1/auditp.txt
$$ ##AUDIT TRAIL=  $$ (NUMBER, WHEN, WHO, WHERE, WHAT)
(   1,<2026-07-29 10:42:11.48 +0400>,<Yarkov>,<DPX200>,
      <created by zg, POWCHK disabled, PULCHK disabled
       configuration hash MD5:
       00 E9 B6 7A A2 85 ED C7 34 08 36 98 17 FE 4E 26
       data hash MD5: 16K
       0F FE AB 17 BC A0 34 AF D2 92 8B D9 90 A0 6F C1>)
(   2,<2026-07-29 10:42:27.81 +0400>,<Yarkov>,<DPX200>,
      <Start of raw data processing
       efp BC_mod = 2 LB = 0.25 FT_mod = 6 PKNL = 1 PHC0 = -7253.183 PHC1 = 2.82197 SI = 16K 
       data hash MD5: 16K
       F8 4C DC D0 37 C5 57 CB 8A 98 49 5D 48 35 BD 59>)
$$ ##END=
$$ 
$$ hash MD5
$$ D8 5C BF 32 19 26 8A 3E 6F FC 93 84 C0 56 E8 87
##$RELAX= 
##$RELAX= 
##$RELAX= 
##$RELAX= 
##$RELAX= 
##$RELAX= 
$$ Bruker specific parameters
$$ --------------------------
##$DU= <C:/Bruker/XWIN-NMR>
##$EXPNO= 1
##$NAME= <H-C>
##$PROCNO= 1
##$TYPE= <nmr>
##$USER= <yarkov2>
##$AMP= (0..31)
100 100 100 100 100 100 100 100 100 100 100 100 100 100 100 100 100 100 
100 100 100 100 100 100 100 100 100 100 100 100 100 100 
##$AQSEQ= 0
##$AQ_mod= 1
##$AUNM= <au_zg>
##$AUTOPOS= <>
##$BF1= 200.13
##$BF2= 200.13
##$BF3= 200.13
##$BF4= 200.13
##$BF5= 200.13
##$BF6= 200.13
##$BF7= 200.13
##$BF8= 200.13
##$BYTORDA= 1
##$CFDGTYP= 0
##$CFRGTYP= 5
##$CHEMSTR= <none>
##$CNST= (0..31)
1 1 145 1 1 1 1 1 1 1 1 1 1 1 1 1 1 1 1 1 1 1 1 1 1 1 1 1 1 1 1 1 
##$CPDPRG= <>
##$CPDPRG1= <>
##$CPDPRG2= <>
##$CPDPRG3= <>
##$CPDPRG4= <mlev>
##$CPDPRG5= <mlev>
##$CPDPRG6= <mlev>
##$CPDPRG7= <mlev>
##$CPDPRG8= <mlev>
##$CPDPRGB= <>
##$CPDPRGT= <>
##$D= (0..31)
0 0.7 0 0 0 0 0 0 0 0 0 0.03 0 0 0 0 0 0 0 0 0 0 0 0 0 0 0 0 0 0 0 0 
##$DATE= 1785307330
##$DBL= (0..7)
120 120 120 120 120 120 120 120 
##$DBP= (0..7)
150 150 150 150 150 150 150 150 
##$DBP07= 0
##$DBPNAM0= <>
##$DBPNAM1= <>
##$DBPNAM2= <>
##$DBPNAM3= <>
##$DBPNAM4= <>
##$DBPNAM5= <>
##$DBPNAM6= <>
##$DBPNAM7= <>
##$DBPOAL= (0..7)
0.5 0.5 0.5 0.5 0.5 0.5 0.5 0.5 
##$DBPOFFS= (0..7)
0 0 0 0 0 0 0 0 
##$DE= 6
##$DECBNUC= <off>
##$DECIM= 32
##$DECNUC= <off>
##$DECSTAT= 4
##$DIGMOD= 1
##$DIGTYP= 9
##$DL= (0..7)
0 120 120 120 120 120 120 120 
##$DP= (0..7)
$$ [...]
##$SUBNAM2= <"">
##$SUBNAM3= <"">
##$SUBNAM4= <"">
##$SUBNAM5= <"">
##$SUBNAM6= <"">
##$SUBNAM7= <"">
##$SUBNAM8= <"">
##$SUBNAM9= <"">
##$SW= 18.0517328524113
##$SWIBOX= (0..15)
0 0 2 0 0 0 0 0 0 0 0 0 0 0 0 0 
##$SW_h= 3612.71676300578
##$TD= 16384
##$TD0= 1
##$TE= 0
##$TE2= 300
##$TE3= 300
##$TEG= 300
##$TL= (0..7)
0 120 120 120 120 120 120 120 
##$TP= (0..7)
150 150 150 150 150 150 150 150 
##$TP07= 0
##$TPNAME0= <>
##$TPNAME1= <>
##$TPNAME2= <>
##$TPNAME3= <>
##$TPNAME4= <>
##$TPNAME5= <>
##$TPNAME6= <>
##$TPNAME7= <>
##$TPOAL= (0..7)
0.5 0.5 0.5 0.5 0.5 0.5 0.5 0.5 
##$TPOFFS= (0..7)
0 0 0 0 0 0 0 0 
##$TUNHIN= 0
##$TUNHOUT= 0
##$TUNXOUT= 0
##$USERA1= <user>
##$USERA2= <user>
##$USERA3= <user>
##$USERA4= <user>
##$USERA5= <user>
##$V9= 5
##$VALIST= <valist>
##$VCLIST= <CCCCCCCCCCCCCCC>
##$VD= 0
##$VDLIST= <DDDDDDDDDDDDDDD>
##$VPLIST= <PPPPPPPPPPPPPPP>
##$VTLIST= <TTTTTTTTTTTTTTT>
##$WBST= 1024
##$WBSW= 4
##$XGAIN= (0..3)
0 0 0 0 
##$XL= 0
##$YL= 0
##$YMAX_a= 89585
##$YMIN_a= -138260
##$ZGOPTNS= <>
##$ZL1= 120
##$ZL2= 120
##$ZL3= 120
##$ZL4= 120
##$ABSF1= 0
##$ABSF2= 0
##$ABSG= 0
##$ABSL= 0
##$ALPHA= 0
##$AQORDER= 0
##$ASSFAC= 0
##$ASSFACI= 0
##$ASSFACX= 0
##$ASSWID= 0
##$AUNMP= <proc_1d>
##$AZFE= 0.1
##$AZFW= 0.1
##$BCFW= 0
##$BC_mod= 2
##$BYTORDP= 0
##$COROFFS= 0
##$CY= -3
##$DATMOD= 1
##$DC= 0
##$DFILT= <>
##$DTYPP= 0
##$F1P= 0
##$F2P= 0
##$FCOR= 1
##$FTSIZE= 16384
##$FT_mod= 6
##$GAMMA= 0
##$GB= 0
##$INTBC= 1
##$INTSCL= 3.241238e-09
##$ISEN= 128
##$LB= 0.25
##$LEV0= 0
##$LPBIN= 0
##$MAXI= 10000
##$MC2= 0
##$MEAN= 0
##$ME_mod= 0
##$MI= 1.114404
##$NCOEF= 0
##$NC_proc= -8
##$NLEV= 6
##$NOISF1= 3.799351
##$NOISF2= 2.8
##$NSP= 0
##$NTH_PI= 0
##$NZP= 0
##$OFFSET= 15.50339
##$PC= 1
##$PHC0= -7253.183
##$PHC1= 2.82197
##$PH_mod= 1
##$PKNL= yes
##$PPARMOD= 0
##$PSCAL= 0
##$PSIGN= 0
##$REVERSE= no
##$SF= 200.130003664566
##$SI= 16384
##$SIGF1= 3
##$SIGF2= 2
##$SINO= 0.751879
##$SIOLD= 32768
##$SREGLST= <19F.Aceton>
##$SSB= 0
##$STSI= 16384
##$STSR= 0
##$SW_p= 3612.71676300578
##$SYMM= 0
##$S_DEV= 0
##$TDeff= 16384
##$TDoff= 0
##$TI= <>
##$TILT= no
##$TM1= 0
##$TM2= 0
##$TOPLEV= 0
##$USERP1= <user>
##$USERP2= <user>
##$USERP3= <user>
##$USERP4= <user>
##$USERP5= <user>
##$WDW= 1
##$XDIM= 16384
##$YMAX_p= 384663323
##$YMIN_p= -1315034
$$ End of Bruker specific parameters
$$ ---------------------------------
##NTUPLES= NMR SPECTRUM
##VAR_NAME=  FREQUENCY,     SPECTRUM/REAL,   SPECTRUM/IMAG
##SYMBOL=    X,             R,               I
##VAR_TYPE=  INDEPENDENT,   DEPENDENT,       DEPENDENT
##VAR_FORM=  AFFN,          ASDF,            ASDF
##VAR_DIM=   16384,         16384,           16384
##UNITS=     HZ,            ARBITRARY UNITS, ARBITRARY UNITS
##FACTOR=    0.220516191357247, 1,           1
##FIRST=     3102.69355999275, 0,            0
##LAST=      -510.023203013033, 0,           0
##MIN=       -510.023203013033, -1315034,    0
##MAX=       3102.69355999275, 384663323,    0
$$ Real data points
##PAGE= N=1
##DATA TABLE= (X++(R..R)), XYDATA
$$ [...]
9305b99312J45184j26851k20122J38525j07016j11831J69988N9047J25372J2571
9295b14445M525m378J96066K26443n99575O0932m8428j69588J58896j1920J42234
9284b59238r0341j70798J84950j49232J42657m5945k05143J00397k6264J96113
9274c22844K05713P0114j53618P2090N0296j83291Q1413k5187J76154m83k68922
9263b98565j64890k1930J77664k7643J26930j53956m8043O633J46937k50484j58003
9252f65350L62975K3280k07950j23012J46129J26028j30742k0967K18454L800
9242b67355j3294K61599n4181k25878K1585M6176o3156j99705j52110P1954N7614
9231e16751K04269l3800R3674l13279j1767R2118k00224L29277J61534j68015
$$ y = [-299312, -154128, -280979, -501101, -362576, -469592, -581423, -411435, -352388, -227016, -214445, -209920, -214298, -18232, 208211, -391364, -330432, -378860, -548448, -389552, -401472, -259238, -349579, -520377, -335427, -484659, -342002, -387947, -593090, -492693, -518957, -322844, -117131, -47017, -200635, -128545, -78249, -261540, -180127, -205314, -29160, -29643, -298565, -463455, -485385, -307721, -335364, -208434, -362390, -410433, -403800, -256863, -507347, -665350, -302375, -279095, -487045, -610057, -463928, -337900, -468642, -489609, -271155, -267355, -280649, -19050, -73231, -299109, -277524, -231348, -294504, -494209, -646319, -574365, -516751, -312482, -346282, -252608, -565887, -577654, -485536, -685760, -356483, -194949, -362964]
9221c62964l02533q2655L24056k97535k2360J93374n0514K69702O5519j3791j88781
9210d68482j63560q117K09331q4589K45301n6867O4130k603L805m26369k0586
9199g08606K92806J29930l4829k15682N8294O1677Q1317k7958j00380l1054j34867
9188f29352K90117K7010j90193J86302K35811J6417m2501M1074o5900j8231n0477
9177a99923P6062j14183k68317j35831J30928O3257J87478j56274J36734J28987
9167a51082j86824o4577J8639o6714N2268J90521m8039m4832l6209r2813o9364
9156d99026r3296R333j76273K99828L8150J66220o4171J23748m9584j00950r2298
9145d38319k8099K15512P1776j51758Q203q8402O855N5365j67719M9030J16516
$$ y = [-362964, -665497, -748152, -424096, -721631, -743991, -550617, -601131, -331429, -265910, -279701, -468482, -632042, -640159, -430828, -515417, -270116, -326983, -262853, -265456, -261651, -688020, -708606, -415800, -285870, -320699, -536381, -478087, -416410, -335093, -363051, -463431, -494485, -629352, -339235, -312225, -502418, -316116, -80305, -63888, -106389, -65315, -131215, -149446, -199923, -123861, -238044, -506361, -642192, -511264, -448007, -260529, -416803, -280069, -151082, -337906, -402483, -383844, -450558, -398290, -207769, -255808, -300640, -336849, -429662, -499026, -592322, -582989, -759262, -459434, -421284, -255064, -319235, -195487, -245071, -346021, -438319, -466418, -250906, -179130, -330888, -322685, -411087, -404232, -348867, -516586, -467556, -351040]
9134c51040N48J983j01963j89408J02503o595m5874J48584J41681j47240K72244
9123a74577K47169k99132n2949k7196O0718M7833p4151R4753o9208l9470m1767
9112c27977j0509j71327k02625J18950R6801M7096Q0195j43614L65814k33636
9102c80832L1114J49405p4023r8228J14235j35883r2910P7738j58613K29791m6255
9091c84461J4239K20233p4323j33377j17077l8062J28761k75486j65767L39254
9081d86066K72626j05494n7913M9J19860K34592j5288j10767q0438O2287K29609
9070F3057k07442l45136Q8598J5960O7481J29883J25249k86858J8823l56230J22395
9059e64220L29682J02449n9003n3438J3107J30462o5090K10126k7635p1113k63411
$$ y = [-351040, -350492, -348509, -450472, -639880, -537377, -543972, -589846, -441262, -299581, -446821, -174577, 72592, -226540, -279489, -306685, -245967, -198134, -272285, -177532, -246740, -286210, -327977, -338486, -509813, -712438, -593488, -496687, -449591, -369396, -513010, -147196, -380832, -349718, -200313, -274336, -372564, -258329, -394212, -487122, -409384, -567997, -338206, -384461, -370222, -149989, -224312, -357689, -474766, -512828, -384067, -659553, -825320, -486066, -213440, -318934, -376847, -376798, -256938, -22346, -37634, -148401, -228839, -166552, 63057, -144385, -489521, -400923, -384963, -317482, -187599, -62350, -349208, -330385, -686615, -564220, -234538, -132089, -191092, -244530, -231423, -100961, -166051, 44075, 16440, -54673, -318084]
9048c18084j777j31644k06494K07384K3867q979l57071J51302p6335J56902O397
9037e54532k70871K2248K47752K23368K46952j53037j15091j03297J32599L6858
9027b87051j72812l8934L46498J70464j29592o9604J04011k49252L8087Q7955
9017b00230q6670P3968Q2614l06605q376K06864R3739o2612p3172j06767J62379
9006b24868J46791k86427p2862j08487J14373J92501j34745J34100K25172l39120
8996c53572Q1041J1616l7599J73406j80456L036r8556J48243k15035L0929K48359
8985a88588L3790n9718J56346J78394j61619m6227p73p7042j34753M92p4273N096
8973c68875O1279l8786O9480L0452Q6957L8190l10830M5550j9587K77762j1619
$$ y = [-318084, -319861, -451505, -657999, -450615, -426748, -435727, -792798, -641496, -717831, -560929, -554532, -825403, -803155, -555403, -332035, -85083, -238120, -353211, -456508, -323909, -287051, -459863, -498797, -152299, 18165, -111427, -181031, -77020, -326272, -288185, -200230, -286900, -212932, -130318, -436923, -445299, -238435, -144696, -207308, -280480, -387247, -224868, -78077, -364504, -437366, -545853, -431480, -238979, -373724, -239624, -14452, -353572, -272531, -260915, -298514, -125108, -305564, -302528, -401084, -252841, -467876, -436947, -188588, -154798, -214516, -58170, 120224, -41395, -87622, -88395, -165437, -300190, -299698, -373971, -368875, -307596, -346382, -276902, -246450, -159493, -121303, -432133, -386583, -406170, -128408, -140027]
8962a40027O5887l63874k94211J49218J76154J99873n2352k21382J88325K12730
8952g9659k58719m5377j00077P0064m9631p3275R9720R2119J19148n8441k13949
8941d98077J13947j87993J6975J32378k98738L02710Q2136l25571J15967L62121
8931a84145j68557j59059j8586q3667r9611k4154L16224r7426K2782l45708K19752
8920f22155P7581q9778j52137p667j15766l0802M50181J92663J17580j70793n0035
8909d01128j52231R3543j29626k417M5875R4068R3041o3556j56403J96641k46544
8898f28737J0357p4391K01127o207k44963k7036K77151R1797L4944K55405n33232
8887f43785N55K44709J41641k77535r5716K56163p3508m4849J01801K35265j06308
$$ y = [-140027, -74140, -438014, -732225, -583007, -406853, -206980, -259332, -480714, -292389, -79659, -338378, -383755, -483832, -413768, -463399, -536674, -436954, -344835, -225687, -284128, -498077, -384130, -572123, -555148, -422770, -721508, -418798, -336662, -662233, -546266, -184145, -352702, -511761, -530347, -614014, -713625, -737779, -421555, -518981, -496199, -841907, -622155, -544574, -634352, -786489, -794156, -909922, -940724, -490543, -297880, -180300, -351093, -401128, -553359, -459816, -589442, -591859, -545984, -451916, -358875, -422431, -578834, -382193, -628737, -618380, -692771, -491644, -497851, -742814, -769850, -492699, -400902, -365958, -110553, -643785, -643230, -398521, -256880, -534415, -630131, -373968, -447476, -492325, -390524, -155259, -261567]
8876b61567m2556k4324j78951p2267j34577k3318J32511q8146J67350J35360J42519
8865b47966j71045j82063J6860K37924J18668k35270j4638l9382k38092J01710
8855f53294M01424j05717j85138J6807K25302k305J51359j79233k38511K44474
8845c24832j19206k0801j03042l0816L03496M4513j75020m25445M13894j0475
8835d47734m0229k02493J03282q9606L17665J34330j06520N2563k34128L49872
8825a62998j11763r1508k89992L3018J75572L4150J96535m8393k08846j79499
8815f53724K20605m7873K30158J61207k76740q8768j3733k01311l094L81004l822
8804b96091j69679L3495m8022o2017J51020L03099K38187j15506n53656p3583
$$ y = [-261567, -304123, -328447, -507398, -579665, -714242, -737560, -605049, -693195, -525845, -390485, -247966, -419011, -601074, -584214, -346290, -227622, -462892, -477530, -516912, -755004, -653294, -251870, -357587, -542725, -525918, -300616, -302921, -151562, -330795, -569306, -324832, -444038, -464839, -567881, -598697, -295201, -250688, -425708, -851153, -437259, -447734, -487963, -690456, -587174, -676780, -359115, -224785, -331305, -278742, -512870, -162998, -274761, -366269, -656261, -623243, -447671, -413521, -216986, -265379, -474225, -653724, -433119, -480992, -250834, -89627, -366367, -455135, -468868, -670179, -673273, -292269, -296091, -465770, -432275, -480297, -542314, -391294, -88195, 149992, 34486, -519170, -592753]
8794e92753L252J70724L9590P2820m2920j59693J23076j66061l1800m3543K39900
8783c87408N8497p1395l9175J38401k69922K53906P5745M2544k0446n3751Q3345
8772a89659j42630n9398j16720R7374J14976N8181l7621J6400j56454n34204P7352
8761h72403M87390j53326k5410J8802L8673L6230P2945Q8149j23012J70225K0502
8750b41235L10k28500J71518k69171q7955J57249n8613M47P9620N5691J8044j04098
8738e06693K36678m7828l33781L65910J13513M7655r9756p5391j56500L2668k27343
8727f50868P2604L35715J09590j65198l9225R984o3048J07702q6279R7200K78276
8716F453k09570k34139o0293J10230j27031l05093K23426P8317J3778N3194l5827
$$ y = [-592753, -589501, -418777, -379187, -306367, -349287, -508980, -385904, -551965, -583765, -627308, -387408, -328911, -400306, -439481, -301080, -571002, -317096, -241351, -198807, -219253, -273004, -189659, -332289, -391687, -508407, -411033, -296057, -237876, -275497, -259097, -415551, -949755, -872403, -385013, -538339, -563749, -544947, -506274, -470044, -397099, -308950, -431962, -261737, -241235, -240925, -469425, -297907, -567078, -655033, -497784, -556397, -555950, -476330, -420639, -402595, -506693, -270015, -317843, -651624, -285714, -172201, -124546, -224302, -299693, -456193, -423525, -650868, -578264, -242549, -132959, -298157, -337382, -327398, -390446, -282744, -369023, -271823, 6453, -203117, -437256, -497549, -387319, -514350, -819443, -596017, -517700, -503922, -450728, -486555]
8705d86555k5433J40565J94246J8529j61251L3296j58458j3827J3959j19602K05154
8694c59377l65169k4250L52158R463o2106k48453K28122K09105m0757k29824k50764
8683g81852L10621J02470K4857q0834J4759m5782R0052K34554j35233j6640k36785
8672e19813J52470L49612j48204k7763K75388l17256j52840m697o6532J02623
8662c57012L0448o3098k59713q8132J26035L2843r2379J80945q3902o577R4811
8651d85731L7898l7303j55052Q755K27479q9641k71999K77570N90248l74334K44590
8640b7520j73906k06812K73572k74250k06032K22990J49612o404j22490o2381
8630d33621j59177J52327j22068n4615L82638k04872q5164n3313j5015p9563J06188
$$ y = [-486555, -511988, -371423, -177177, -158648, -319899, -286603, -445061, -458888, -444929, -564531, -359377, -724546, -748796, -396638, -387175, -449281, -697734, -469612, -260507, -301264, -531088, -781852, -471231, -368761, -343904, -424738, -409979, -455761, -365709, -131155, -266388, -283028, -519813, -367343, -17731, -165935, -193698, 81690, -235566, -388406, -393103, -459635, -357012, -326564, -389662, -649375, -737507, -611472, -578629, -671008, -490063, -573965, -580542, -485731, -447833, -485136, -640188, -631433, -403954, -493595, -765594, -488024, 102224, -272110, -27520, -201426, -408238, -134666, -408916, -614948, -391958, -242346, -248750, -371240, -433621, -592798, -440471, -562539, -617154, -234516, -439388, -524552, -577865, -592880, -672443, -566255]
8619e66255n8101q0856L6446K24996l3078K0302J89973p2622j03319Q7195R3127
8608b62192j51425j95063M4331K36048n9000k97003j11481k6566J22301k375J77699
8597e24726r6385Q6824n3862K9984Q5060j86697K47222j4479M277m0338j44689
8586f07809k60867J29016M13029k46630j7883L1614j28304j04810o7622J3454
8576h46812L28765r1349R329r9734K04358n6431P1261J58969j46902M2190m7951
8565d74307r4060j41775J28229J57263J55296k21184J6170J69690J04748j13099
8555c13029q7159P4972l22252j74452K52421Q4781L23156q4320L1010O2612q8229
8544b40489q5375j16410q8999j20588J14006Q845j06871J06705R0944k4762K8954
$$ y = [-566255, -624356, -705212, -668766, -443770, -476848, -456546, -266573, -339195, -442514, -355319, -262192, -413617, -608680, -564349, -328301, -387301, -684304, -795785, -822351, -700050, -702425, -524726, -621111, -534287, -588149, -558165, -473105, -659802, -412580, -427059, -422782, -463120, -607809, -868676, -739660, -326631, -573261, -591144, -559530, -687834, -792644, -860266, -846812, -518047, -609396, -600067, -699801, -495443, -551874, -480613, -321644, -468546, -426356, -474307, -568367, -710142, -581913, -424650, -269354, -490538, -474368, -304678, -199930, -313029, -400188, -325216, -647468, -821920, -569499, -484718, -161562, -245882, -214872, -152260, -240489, -325864, -442274, -531273, -651861, -537855, -529010, -635881, -529176, -438232, -462994, -434040]
8533d34040k2836Q5293j50878j45896L543K98858J89633j03326J49529j14740
8523b44860l19992j22332k29312R5336K71593L60259o1853k67372p0396j0179
8513e99108o2850J5074J89651o6895m5761k8663N9632k2403J68345P124M3679
8502c42175k6371k22712M8601r3836l28389J38866M0411K97051K92145m4974j86705
8491d28088j88628M9064l9727J32402J37101p5457j02504n8671M5816k87659J54909
8480f61442J93007O1637j20077j29482j4385K70750Q4520k61579K29321j44752
8470d92482n442j9487m0457K08464J44855m5353m6537J32935j68538q4735K10213
8459b06564N4636M9970l17750k85539q5564N4903J47471K68542L9070P1741r9537
$$ y = [-434040, -456876, -371583, -522461, -668357, -664814, -365956, -176323, -279649, -130120, -244860, -564852, -687184, -916496, -821160, -549567, -189308, -251161, -518533, -588929, -599108, -661958, -646884, -457233, -524128, -569889, -598552, -538920, -561323, -392978, -385854, -342175, -368546, -591258, -542657, -636493, -964882, -826016, -785605, -488554, -196409, -241383, -428088, -616716, -567652, -607379, -474977, -337876, -413333, -515837, -574508, -528692, -816351, -661442, -468435, -406798, -526875, -656357, -670742, -399992, -315472, -577051, -347730, -492482, -497924, -517411, -557868, -349404, -204549, -249902, -296439, -163504, -332042, -416777, -206564, -151928, -101958, -419708, -705247, -790811, -735908, -588437, -319895, -280825, -209084, -308621]
8448c08621j81638j0332l4465J68000J01160j42361j80643j24524K15708J3262
8438d84454k45563l224J1074J30830J51347L8306k0795j38647o3896L1471J12509
8427d81042j03706j38229J62931p8367j27447K1328J005K7511N3251r8287P6398
8416f84654P7078N3794M2960l09220J2371J72768K2259j08896K46963j06728o5570
8405f46875q9376K4264L08830k17100j30849j59525K42305r8485O3594K2172j02431
8394g83476J43026p1416p6015K68340n1341o4920J71900L901P4395j83402r9151
8383f68159M4782j09071R5187j10377P6925L33030j90966j62321J28061j27325
8373f90234n6947K73440j4187k13654J08902J81611k92701k97444K17109K14935
$$ y = [-308621, -490259, -500591, -535056, -367056, -265896, -408257, -588900, -713424, -497716, -484454, -730017, -733241, -722167, -591337, -439990, -401684, -422479, -561126, -625022, -593551, -481042, -584748, -722977, -560046, -638413, -765860, -744532, -743527, -716016, -662765, -761052, -684654, -607576, -553782, -510822, -820042, -807671, -634903, -612644, -721540, -474577, -581305, -646875, -736251, -711987, -403157, -620257, -751106, -910631, -668326, -766811, -703217, -681045, -783476, -640450, -711866, -787881, -519541, -570882, -635802, -463902, -460001, -385606, -569008, -668159, -623377, -732448, -637261, -747638, -670713, -337683, -528649, -690970, -562909, -690234, -747181, -473741, -487928, -701582, -592680, -411069, -703770, -1001214, -784105, -569170]
8363e69170P0791K99522j75295k31405M9312N1348r8683K8949L08828N9195K50317
8352D3709k64645k65510o5684O141m0296l91262J6540K51863L02488J71436j86626
8341d21846k87436J26271P4459m0775j31934K87484j08635r0401N768r661J69233
8330d27473p1819M29644j532j95064j21930l98114M1697J83796J91994k15330
8320e84131j1921J38503k55860j7564J34690J26013q5586j04253J15638j82813
8310g27284j583K1043J57445J33055j02434q2488P7271K30786j62038p1570l4736
8299e62533j72585Q8509J18421j43753J9469L6756J2745J03235M8803j5338J2999
8288d53272j26674J18495j5644q6000J88604l48330j99512K38016j96863J77671
$$ y = [-569170, -498379, -198857, -374152, -605557, -556245, -504897, -603580, -574631, -265803, -206608, 43709, -220936, -486446, -552130, -545989, -586285, -977547, -961007, -709144, -406656, -235220, -421846, -709282, -583011, -508552, -549327, -681261, -393777, -502412, -592813, -587045, -596706, -427473, -499292, -69648, -71180, -266244, -388174, -786288, -744591, -560795, -368801, -584131, -596052, -457549, -713409, -730973, -596283, -470270, -555856, -660109, -544471, -727284, -728867, -707824, -550379, -417324, -519758, -602246, -524975, -294189, -456227, -527797, -562533, -735118, -646609, -528188, -671941, -652472, -615716, -602971, -499736, -450933, -466271, -453272, -579946, -461451, -477095, -563095, -374491, -722821, -922333, -684317, -881180, -703509]
8278g03509N2404q4250q515K90817Q7654m45476R6399J27871Q6249J8961P2566
8267d08829K708J93429L298o45167j53539L50388O6026l0697M7164m6358P2287
8256e49290J15941O3950p1701l3868p5699L624n0375m7428K65676J60207k73269
8245d92232J584K86411j0766j80852j04910J01259n6516j77219p2267N5164J06389
8234e43955K86653j84677j25408J97373j19889J41285m55458N1195K04428k90657
8224h39110j1374K09188R0346j33581K22088J8213j14642k1291m2279l19006L0293
8213i11155J63131L4114r616n6336L40427o5575l02692J88715J3682j18819J4005
8202g10119l7366j90938J1272J29491M5269l11207k07833K88826N6836l89265
$$ y = [-703509, -651105, -735355, -743870, -453053, -365399, -810875, -714476, -586605, -500356, -481395, -408829, -406121, -212692, -209394, -854561, -1008100, -657712, -591686, -622383, -575219, -621577, -549290, -433349, -369399, -441100, -474968, -550667, -547043, -597418, -644846, -379170, -218963, -492232, -490648, -204237, -215003, -395855, -500765, -399506, -456022, -633241, -705508, -650344, -543955, -257302, -441979, -567387, -370014, -489903, -348618, -804076, -752881, -548453, -839110, -850484, -641296, -550950, -684531, -462443, -444230, -558872, -580163, -622442, -941448, -911155, -748024, -713910, -723526, -779862, -439435, -505010, -807702, -618987, -605305, -724124, -710119, -747485, -938423, -927151, -797660, -752391, -1063598, -1271431, -982605, -925769, -1315034]
8192a315034L218751K03438j766334J33466m19019j08672o4815R7493k02896K12111
8182a1511j84345O8882l88075J17927K21902M179l02157j80657j00002L54606
8172c99251j81652j8637L9912J39857j87971K9019J04839j57413K13722j31206
8162e48781N4226q6109l22299L41822K08489o9846j3838r6196r6524p4357K13465
8151d89948L2159J86857J16757k27679n3045J08585j29034J07649O2001N8366
8141b27332j98324M0800J26673j72980j59245K00480o2704j49562J66793l0866
8131d66267q0664P4967k15611K36749m785k18923K83177k1348r0637o5003J02317
8120d66028Q0297k74664J07428j6770L20326J90940k41394n9215k30413m1405
$$ y = [-1315034, 1903717, 2107155, 340821, 474287, 55268, -53404, -118219, -20726, -223622, -11511, -195856, -126974, -515049, -397122, -175220, -171041, -473198, -653855, -753857, -399251, -580903, -599540, -559628, -419771, -607742, -578723, -473884, -631297, -417575, -548781, -494555, -580664, -902963, -561141, -352652, -422498, -436336, -532532, -629056, -703413, -489948, -457789, -270932, -154175, -381854, -434899, -326314, -455348, -347699, -285698, -227332, -425656, -384856, -258183, -431163, -590408, -389928, -452632, -602194, -435401, -466267, -546931, -471964, -687575, -450826, -455611, -674534, -391357, -412705, -503342, -568345, -466028, -385731, -660395, -552967, -569737, -249411, -58471, -299865, -359080, -589493, -630898]
8110f30898K26720J53243P8750j6976j11561J6584j30295j14503j24799N0862
8100f02873R170J19836o0757J10623o5084P0584K81820j92575k64852k14956L13126
8089d95938o0114j15294P1882j42091L9705J37312n8859J37093l34954j57819
8079i79077L00897p505M4831J4575K05663l0899j85185K63311K67627k1984k94837
8068d22583k61859M1357o825l640Q8378N3528L5134p7466J31318N5309J0664j24313
8056d80998M8648o3259k57366K02704K11593j563n3069l89140M3709l9908J18824
8045f59825J16818J6161J28785l50652n6342j32405M8076K47733J56560J01844
8035c83247j99230J3328J04656j22694j11244m957J07404p0031k09675J31569
$$ y = [-630898, -404178, -250935, -172185, -189161, -300722, -284138, -414433, -528936, -653735, -602873, -593703, -473867, -534624, -424001, -489085, -418501, -136681, -329256, -594108, -809064, -495938, -556052, -671346, -599464, -741555, -701850, -564538, -623397, -486304, -821258, -979077, -678180, -685685, -640854, -626279, -420616, -451515, -636700, -373389, -105762, -127746, -422583, -684442, -643085, -649910, -653550, -565172, -511644, -476510, -553976, -422658, -367349, -356685, -480998, -432350, -495609, -752975, -550271, -338678, -340241, -393310, -782450, -738741, -778649, -659825, -543007, -526846, -398061, -748713, -805055, -937460, -889384, -641651, -485091, -383247, -582477, -569149, -464493, -587187, -698431, -703388, -595984, -666015, -875690, -744121]
8025g44121O7494p9352k2992j8916O6768P2172J80713l9646k71213J44901J68664
8014d75528M0755j06470l1379Q1442L5283K6601j38916j28651j14267K29846O9344
8003e11940J49320j87364l9004M8096R2943O1197K06481j55419k26457L9428K5995
7992d96724l6676L0867j27956k26347q5712L26149n3330j2433J50922Q8750j49580
7981e92070k28881J15497J48726K02225m3545j0260j38235K9636l37035k91410
7971a145352M94377Q8719M5011O9602j94011O6858r2453J09569k51678J51216
7961f58142K53743q2622J39541k12179O7741j05633j6471J07182j37895N3480
7951e91255J84917j59067J04938N757j28898K58193k21750j6352o4205K19364
$$ y = [-744121, -676627, -755979, -778971, -797887, -731119, -658947, -478234, -517880, -789093, -644192, -475528, -434773, -541243, -572622, -491180, -455897, -429296, -568212, -696863, -811130, -581284, -511940, -362620, -549984, -588988, -540892, -447949, -386752, -180271, -335690, -562147, -522719, -496724, -533400, -502533, -630489, -856836, -942548, -616399, -669729, -682162, -531240, -442490, -592070, -820951, -705454, -556728, -354503, -398048, -408308, -546543, -516907, -853942, -1145352, -650975, -562256, -517245, -447643, -641654, -574796, -667249, -557680, -809358, -658142, -404399, -487021, -347480, -559659, -491918, -597551, -614022, -506840, -644735, -591255, -406338, -565405, -460467, -454710, -583608, -325415, -547165, -563517, -627722, -408358]
7941d08358J87023j72974j19508j45333J36659L69310k95831k04768L51010k14600
7931e17370n2614l09852l58221L17335J41615J18034J72710q0903j72994O1076
7921f81184L89711M0953J85677m14650j03121K39261p8646k61805l7638K26724
7911d94718O0397N0991n3815J38380k18753k7379J27209m3473k08882N40959m4603
7900a73687j33340O6078Q7354l39938k26043Q6681l7989Q5538L1191J26538o943
7889d34560j2793K07702j5183P4009k117l54647J47842L8459j7868P7068k65168
7878e57256k11071J97704p6463k09902M0156j30166J73360K67410P2049j46393
7868e80572J74410k6412L0447K7118J94106l6547J42261l06106N9717J25871M5299
$$ y = [-408358, -221335, -394309, -513817, -659150, -522491, -153181, -449012, -653780, -302770, -517370, -569984, -879836, -1238057, -920722, -779107, -661073, -488363, -569266, -742260, -681184, -291473, -250520, -64843, -479493, -582614, -343353, -421999, -683804, -721442, -494718, -434321, -383330, -437145, -298765, -517518, -544897, -417688, -461161, -670043, -129084, -173687, -307027, -240949, -153595, -493533, -719576, -632895, -670884, -585346, -554155, -427617, -434560, -447353, -239651, -254834, -180825, -182942, -537589, -389747, -351288, -369156, -292088, -557256, -768327, -570623, -647086, -856988, -816832, -946998, -773638, -506228, -434179, -580572, -406162, -432574, -402127, -375009, -180903, -217450, -75189, -381295, -321578, -195707, -150408]
7857a50408J64899l62878J00838O1632q379j43256K91549q5959p5130K78958J36815
7846B08681j07106P16O647j83152J8729J34091K34875j96278k57159P1974j73779
7835b41761L3972k09511k14870K31357K02060L642K16112L0201k85113o2964K08084
7824h8791j77693R6423k86435O6616J51654J61027k50002j94185K6273J24637
7814c70476j04189M0448o1868l2485L6511N60273j18974J376784M95150k111018
7804b89844k50800j34029J92578N2923J67372j71210N4704k5487k01019j02459
7794g07271J9581n0583K25378K6709J09858p7330k67809k56181J98946J25330
7784f53372j3037j35167m5032R0474J79893K81605N7519k31942k97105K03058
$$ y = [-150408, 14491, -348387, -247549, -185917, -194296, -337552, -46003, -131962, -207092, 71866, 208681, 101575, 102291, 108938, -74214, -55485, 78606, 313481, 117203, -139956, -67982, -241761, -207789, -417300, -632170, -400813, -198753, -195111, 21001, 51202, -233911, -296875, -88791, -266484, -170061, -456496, -389880, -238226, -77199, -327201, -521386, -495113, -370476, -474665, -434217, -496085, -528570, -492059, 68214, -50760, 1326024, 1821174, -289844, -540644, -674673, -482095, -429172, -261800, -433010, -378306, -403793, -604812, -707271, -687690, -738273, -512895, -486186, -376328, -453658, -721467, -977648, -778702, -653372, -666409, -801576, -846608, -756134, -576241, -294636, -237117, -469059, -766164, -563106]
7774e63106K5008k66862J58471L81396n2956k40075J30126l8724M9800J27717
7764b89205l47227J13814J16632N6720q0073K13005J4693j23748j31391l1034
7754d87814j47062K27179o8269j65073J52656J37812k11865K50804R5312k54217
7744d70537p3106k2740r586q2584K36082J91059j54212k6527o9694Q5375J7072
7733c79398j39805K26942Q7112O1944k04638q9267J22538j11792J38623M1890
7723b45851P0785j48032j11799n6371R548L30341M1613m89947N4611J65265J04179
7712b75658R7195j26679j46098J62067M0786N6194J26193n63065L4074J94551
7702d00440R0185Q9479j60018j92237L09387K0344n9373l50992Q5956J93766j65586
$$ y = [-563106, -538098, -804960, -646489, -265093, -318049, -558124, -427998, -466722, -416922, -289205, -636432, -522618, -405986, -349266, -429339, -216334, -201641, -325389, -456780, -487814, -634876, -407697, -475966, -641039, -488383, -350571, -562436, -311632, -216320, -470537, -543643, -566383, -575969, -658553, -422471, -231412, -385624, -412151, -481845, -396470, -379398, -519203, -292261, -205149, -143205, -347843, -437110, -314572, -426364, -287741, -245851, -175066, -323098, -434897, -491268, -481720, -151379, -109766, -599713, -545102, -379837, -275658, -178463, -305142, -451240, -289173, -248387, -192193, -66000, -629065, -594991, -400440, -310255, -220776, -380794, -573031, -263644, -243300, -302673, -653665, -567709, -373943, -539529]
7691e39529J68355K44970R6133j78745K90612j4415l56319J14082k84367L4837
7681d24386J1090j04173k23792K76131m1858J53483m4103k89286O5205K81151
7671c40538m567j68191J25926P9241j22923p949J32084K1102Q3060L3058Q5960
7660h3737K07574j67719j77997M85541j14475P9062j14631j70119k79596J21516
7650b14581J62571k01405L18291L7826N871K37468M3582m98408J00677K46607
7640B38499l7179j95178K22159J27887L4463L0580k10027l9298j31212k1705K24594
7629B43583L7663J85281J85156p2731K21351N286k14870j53782j3490K13747J58029
7618G95223j62758K26963j78301j65566K90912j68941m37916J34944J93544J74981
$$ y = [-539529, -371174, -126204, -30071, -208816, 81796, 67381, -288938, -174856, -459223, -424386, -413296, -517469, -741261, -465130, -506988, -353505, -397608, -686894, -621689, -340538, -345105, -513296, -387370, -308129, -431052, -439001, -306917, -285815, -202755, -169697, -83737, 123837, -43882, -221879, 263662, 149187, 228249, 113618, -56501, -336097, -214581, -52010, -253415, 64876, 102702, 108573, 346041, 389623, -108785, -8108, 238499, 201320, 6142, 228301, 356188, 390651, 421231, 211204, 171906, 40694, 18989, 243583, 281246, 466527, 651683, 578952, 800303, 805589, 590719, 436937, 423447, 637194, 795223, 632465, 859428, 681127, 515561, 806473, 637532, 199616, 334560, 528104, 703085]
7608G03085K06549k2763R8554j11158L3510J29151k419p1754P97J94098L97274
7597A554924j51776m9803N331j95544K17236Q0098K0424M01656P0009r8949l8786
7586A814820k0465n3519K9956K07333p3175J46939K12011K95009j73786J27384
7576B512507M24439J42728K58480J87101O7776L10601L89320j5626R4193L32505
7566D704024L31295O84923L90944N71982k74043L37570N63677Q4626M24589K95559
7556H115146L90134M43749L08958N11650O07677L76438O62378R12379P55166Q68953
7546A3952628J267409J376681J461051J597710J807155J984999K450478K820964
7538B8719075K919004L685717M021836M541194N658476O616359P021987P686311
$$ y = [703085, 909634, 886871, 985425, 874267, 907777, 1036928, 1034509, 962755, 963552, 1157650, 1554924, 1403148, 1353345, 1358676, 1163132, 1380368, 1460466, 1480890, 1882546, 1952555, 1853606, 1814820, 1794355, 1740836, 1770792, 1978125, 1904950, 2051889, 2263900, 2558909, 2385123, 2512507, 2936946, 3079674, 3338154, 3525255, 3593031, 3903632, 4292952, 4277326, 4371519, 4704024, 5035319, 5720242, 6111186, 6683168, 6409125, 6746695, 7310372, 7394998, 7819587, 8115146, 8505280, 8949029, 9257987, 9769637, 10377314, 10753752, 11416130, 12328509, 13083675, 13952628, 15220037, 16596718, 18057769, 19655479, 21462634, 23447633, 25898111, 28719075, 31638079, 35323796, 39345632, 43886826, 49545302, 56161661, 63183648, 70869959]
7530G0869959Q670003R478011R209010Q916376P683790N947161L462756J426861
7522A25663927r64802l733307n370669o421861p829788p866418p884834p892411
7514G7699837p188835o905282n726659n486378m612460l950973l721200l260435
7506C6847615k629467k690457k411082k067301j936064j594211j247001j408017
7498B0864015j124545j170108j196907j020398p78253n55776o43667n58250m82373
7489A3333738o36364o59255p09359o35196k89593k35750m04192o1520n21397l23924
7479H857188k55885k62507o0807n51504l04456K5407k97389l30300q9430k10400
7469F519917l11682K1773j08089N9623l85441l37106j30129j11858k12626q2199
$$ y = [70869959, 79539962, 89017973, 98226983, 107143359, 114827149, 120774310, 124237066, 125663927, 124699125, 120965818, 115595149, 109173288, 101343500, 93477082, 85592248, 77699837, 70511002, 63605720, 57879061, 52392683, 47780223, 43829250, 40108050, 36847615, 34218148, 31527691, 29116609, 27049308, 25113244, 23519033, 22272032, 20864015, 19739470, 18569362, 17372455, 16352057, 15573804, 15018028, 14374361, 13816111, 13333738, 12697374, 12038119, 11328760, 10693564, 10403971, 10168221, 9764029, 9702509, 9181112, 8857188, 8601303, 8338796, 8277989, 7726485, 7422029, 7447436, 7150047, 6819747, 6730317, 6519917, 6208235, 6230008, 6121919, 6181542, 5796101, 5458995, 5328866, 5217008, 5004382, 4922183]
7459D922183J7140n7795l33218l362j28719k72991j45323j78376j54160j63382
7449C501997q9912R2680m2210j26683n1666l39178J34043K98200Q6179J27053
7439C590503j99279k82978j37330j6316j12268l15602j41745K72354J95689j99566
7429B653462k12481k33498j1748r5481j54558P5942J55041l5833p1376j13984
7419A955486N4816K4907j00992J07533P9961k08273j48160p774j88714P1040J38945
7408A778775o5144L696k43922M3747l3063q495O7817J73244j28662k60226P8366
7397A406133R3830k15891q2936k0191j20593J20987k24991k33872J47762K65430
7387A135668J97145l75762K1270M74164j34710k61019j24978M7960J43814P7503
$$ y = [4922183, 4939323, 4881528, 4548310, 4544948, 4416229, 4143238, 3997915, 3819539, 3665379, 3501997, 3412085, 3504765, 3462555, 3335872, 3284206, 2945028, 3079071, 3377271, 3463450, 3590503, 3391224, 3108246, 2970916, 2954600, 2842332, 2526730, 2384985, 2657339, 2853028, 2653462, 2440981, 2207483, 2195735, 2100254, 1945696, 2021638, 2176679, 2140846, 2069470, 1955486, 2010302, 2035209, 1934217, 2041750, 2121711, 1913438, 1765278, 1757504, 1568790, 1639830, 1778775, 1713631, 1717327, 1473405, 1517152, 1484089, 1475594, 1543411, 1716655, 1587993, 1327767, 1406133, 1499963, 1284072, 1201136, 1180945, 1060352, 1181339, 956348, 722476, 870238, 1135668, 1332813, 957051, 978321, 1452485, 1317775, 1056756, 931778, 979738, 1123552, 1201055]
7377A201055m9253r2320M5940j90479r7591k7809L7304K5149J31197J73479j60466
7366I96206n6743M684K88162L61619j81264k2104l57917k76976R2571J80687j0324
7355A018601O5497j48408j45444k02629J00475l4655j62785j03039J07952l14918
7345A80647j37904J55442j35930N31553j06980j80979K64355j73115j77922n218
7335B13949j4909J08090M287l8133K66J26671j30865o6696K66035Q8427j74203
7324C82919k32816k20524J04005O0287J06623J5465j58714R5779n8628N5098q8209
7313F1285Q6984k67049l7889k2628J84964j03022J53371p6996N3682n09r8474
7302f6281R7910j72313L52131j80436j84555j1525J73216L41633J23131k15271
$$ y = [1201055, 1151802, 1059482, 1105422, 914943, 817352, 789543, 826847, 851996, 983193, 1156672, 996206, 939463, 944147, 1232309, 1593928, 1412664, 1390560, 1032643, 755667, 848238, 1028925, 1018601, 1084098, 935690, 790246, 587617, 688092, 653437, 490652, 387613, 495565, 180647, 42743, 198185, 62255, 593808, 486828, 305849, 570204, 397089, 219167, 213949, 199040, 307130, 311417, 273284, 273550, 400221, 269356, 202660, 468695, 557122, 382919, 150103, -70421, 33584, 93871, 200494, 215959, 57245, 153024, 94396, 149494, 61285, 148269, -118780, -156669, -179297, 5667, -97355, 56016, -20980, 32702, 32193, -66281, 31629, -140684, 211447, 31011, -153544, -165069, 8147, 349780, 472911, 257640]
7292B57640j7383j36038l2140j59985K43114N2902r4173p5091J69610j5246k02994
7281i784K4132l944j34677M46796K34555k32318k57666j07854o9743R0066P3931
7270E3494j69875O175R1302j33484J07885j54670J08681J20828L965k49452r9248
7259c14399J41905k3436J46467r4288m4713N0858l4766j20548j48663K66070L21801
7248A46288R6210O739l9210k34550k10084j0088l983J01591n0213R0814K97724
7237A91238j41710m0565r1868l7915K98086n712k19049K86104l7039k75018M8574
7226b4874k50404j05459L09862O4037j16092K3988l7082K7495j05468o1572K76103
7215E34k15749k1274R0488k29663J4355L81857J01837j57775L50495J6672j17036
$$ y = [257640, 240257, 104219, 72079, -87906, 155208, 208110, 113937, 38846, 208456, 193210, -9784, 14348, 10404, -124273, 322523, 557078, 324760, 67094, -40760, -110503, -20437, 53494, -116381, -110206, -18904, -152388, -44503, -199173, -90492, 30336, 34301, -215151, -314399, -172494, -195930, -49463, -143751, -188464, -137606, -172372, -292920, -441583, -175513, 146288, 242498, 249237, 210027, -24523, -234607, -244695, -248678, -147087, -197300, -106486, 191238, 49528, 8963, -82905, -120820, 177266, 171554, -47495, 238609, 201570, -73448, -24874, -275278, -380737, -70875, -6838, -122930, -98942, -136024, -108529, -213997, -275569, 534, -215215, -236489, -146001, -375664, -361309, 20548, 122385, -35390, 315105, 331777, 214741]
7204B14741o6108J24576q2861J09550j37399k67389J46745K68631J0081O0295
7194C80862J35268P66j41378k74947P4721N0174L0046K647j37692q2208j29597
7183i1338J24476o4118j4496j30430j35866L21544n9919p7090R9098l4920N497
7172e7562p104K169R9266K319j2284J23500R7300K1537j53235o2511j2321M1918
7160H2992p4413R6809O8636j39695r9466R1235k22427J36805j90152j35386K53227
7149a31835M2696J17996j62468k60475j9364o0953L91878k08126j0132o1781k27585
7138e90149K03037M5371p4023n8967j3184m820L58692j91511j52014J85233j2112
7127c04447J0337Q0877R1816j18262r7124M2697N5881K4509J90819j64670k07315
$$ y = [214741, 148633, 273209, 190348, 299898, 162499, -104890, 41855, 310486, 320567, 380862, 516130, 516896, 375518, 100571, 175292, 225466, 255512, 258159, 120467, 38259, -91338, 33138, -30980, -45476, -175906, -311772, 9772, -50147, -127237, -28139, -63059, -57562, -64666, -62497, 36769, 39088, 26804, 150304, 247604, 269141, 115906, 53395, 41074, 82992, 8579, 105388, 174024, 34329, -65137, 26098, -196329, -59524, -249676, -385062, -131835, -89139, 28857, -133611, -394086, -413450, -474403, -82525, -290651, -300783, -362564, -590149, -387112, -341741, -415764, -474731, -487915, -492735, -134043, -325554, -477568, -292335, -304447, -294110, -213233, -121417, -239679, -336803, -294106, -238225, -213716, -22897, -187567, -394882]
7116c94882k4139k15363J11295J84185j34674J8493P9453J1485n87514J96406
7106g55255p398l4228J02761O6235K63124j4695P2834r5457j3913N5996Q7463
7095b72533J72268l6698j70159J5429l20359J17601p7042R8166l1770J10355K30366
7084a64376Q299j79983k0373K9559p3292j87702M30006k40176J27271k8650L2578
7073b66839o7851O8760J10222k19744m5481j14869J47189J32907J70065q3504
7063a69145j75237k78430M0590R2059j42380J72245n4536Q571J27095n0399j9586
7052d49153K418m8309K24938j64482N1354K42650O7865m9457j28750l30456p8062
7041f59444K35098N2135K56766j31968r0934k5987r5041K23635J44303Q7886p8373
$$ y = [-394882, -419021, -634384, -523089, -338904, -473578, -455085, -375632, -364147, -951661, -755255, -762653, -796881, -694120, -627885, -364761, -379456, -306622, -402079, -415992, -359996, -272533, -100265, -136963, -307122, -291693, -612052, -494451, -571493, -473327, -505097, -394742, -164376, -156077, -336060, -356433, -326874, -400166, -587868, -157862, -398038, -270767, -299417, -266839, -334690, -265930, -155708, -375452, -420933, -535802, -388613, -255706, -85641, -169145, -344382, -622812, -582222, -490163, -632543, -460298, -514834, -506263, -379168, -429567, -449153, -446735, -495044, -270106, -434588, -383234, -140584, -72719, -122176, -250926, -581382, -659444, -424346, -372211, -115445, -247413, -338347, -364334, -459375, -235740, -91437, -3551, -81924]
7030h1924l21194K2880j76376m2635n3159j0325J85050k02639J3797K51297P7294
7019c37934m3018J90411j91904m41530J68249l7292J15858K42722J18576j44691
7009c60553K07066j94781k41264N6316N9697N0513n7894J67739p9617j90326k30163
6998h13267J47014Q0876j7784J04697n4347K209J13882N4240m2347j57928K83287
6987b99468J8989l52326o6498J99041M21896l80550j58455q8740k2503K44063
6977d84551m3138r790L221J8982j16738J09452n1149j72214L97410R4880j49982
6966d03617j18455K51611p2232O686k26820r5531K61935M8939o4604j20850p0303
6955f03241J41001k5037J80221l67828j41120K42937J59075O5609O30J4488q9293
$$ y = [-81924, -403118, -380238, -556614, -599249, -652408, -662733, -477683, -680322, -666525, -415228, -337934, -380952, -190541, -382445, -823975, -655726, -693018, -577160, -334438, -215862, -360553, -153487, -348268, -589532, -533216, -473519, -423006, -480900, -313161, -392778, -583104, -813267, -666253, -585377, -603161, -498464, -552811, -550602, -436720, -382480, -424827, -582755, -299468, -280479, -632805, -699303, -500262, -78366, -458916, -617371, -706111, -728614, -484551, -527689, -537479, -534258, -515276, -632014, -522562, -573711, -745925, -348515, -253635, -403617, -522072, -270461, -342693, -336007, -562827, -658358, -396423, -347484, -412088, -532938, -603241, -462240, -487277, -307056, -674884, -816004, -573067, -413992, -348383, -347753, -333265, -422558]
6944d22558P3317k75770K6757J53177R6766Q7285j45059L0723j75299m3079j90292
6933g84032J07780K80208j63579j18941K51822P522k6364j78348J939J29292J7506
6922d75195P7111k24782P4312J28685r9996k11096M9465l17913K18233J17586
6912f63590j85695K29424M21950o4426j24947j22058o2536m9390J91662j65478
6902e95084K95472j3701l5218N4358k95830M9638J28967K17205k61133k89102
6892g44428K79276p3325k02015R1555L60039L5200k30298J00657O3207j81663
6882e01795k10604j02307O9044K7577j16359l903R5254Q4027K36293j29636j64436
6871g16845J99900j52029J9298o5723q2199K0846p388K89652j01540J42915L01879
$$ y = [-422558, -349241, -625011, -598254, -445077, -348311, -261026, -406085, -375362, -550661, -593740, -784032, -676252, -396044, -559623, -678564, -426742, -419220, -445584, -623932, -621993, -492701, -475195, -398084, -622866, -548554, -419869, -519865, -730961, -681496, -999409, -781176, -663590, -849285, -619861, -197911, -262337, -387284, -509342, -571878, -621268, -429606, -595084, -299612, -313313, -348531, -294173, -590003, -540365, -411398, -194193, -455326, -744428, -465152, -538477, -740492, -648937, -288898, -253698, -483996, -383339, -320132, -501795, -712399, -814706, -745662, -718085, -834444, -838347, -743093, -659066, -422773, -552409, -716845, -516945, -668974, -649676, -715399, -797598, -776752, -784140, -494488, -596028, -453113, -151234]
6860a51234j72795k63583J68341N0827n4833o7399n0584R1856K79859k24251j99773
6849e93569j52002l8411K5333k4167N96801M3308m3499k17197J91370l7816O0043
6838a89806k4503l3710j79140p6058l6333j01912Q3907Q8875q8949Q0567k97320
6827g74382j03459L19307J78922n6895k2269K8340K01063M8458J35350q6852k03107
6816c35524K7121J35719J65302j69619r9883j50902L96761K2926l8045n935j34202
6805a86281J01799J75726j91982L06990q0100k24234N2720M4982J29202R9414
6795B28236M3083k53513j57853J04413N2738j95943j12688k3480K8955J4846j36228
6784d07434J48182n2698R3714l3495l34843Q6836J76162k14943J23372K25616
$$ y = [-151234, -324029, -587612, -419271, -368444, -423277, -490676, -541260, -449404, -169545, -393796, -593569, -745571, -783982, -758649, -782816, -186015, -142707, -186206, -403403, -212033, -249849, -189806, -214309, -248019, -427159, -503217, -539550, -641462, -557555, -468680, -557629, -477062, -774382, -877841, -558534, -379612, -436507, -458776, -430436, -229373, -180915, -45565, -132417, -335524, -308403, -172684, -7382, -177001, -276884, -427786, -31025, -8099, -46144, -52079, -186281, -84482, 91244, -100738, 206252, 126152, -98082, -45362, -380, 128822, 228236, 271319, 17806, -140047, -35634, 17104, -178839, -291527, -315007, -286052, -271206, -407434, -259252, -311950, -218236, -251731, -586574, -499738, -323576, -538519, -415147, -189531]
6774a89531j26319l69172L12529J31871l37044K16696n6072j05015J12150J82598
6764b27309N1871J5039j94034l7138P3073j12829J19331J16875j19773m6580q2770
6753d44244j43035M3307j75560K36047M7076k32957J73300j41565J79093J36689
6743c21849N5324n6893j50224J8466J84338l15823j07968r1661Q7864L16161j28175
6732e10440o6024p686j46061K5435Q7013n8124M5196Q3632p698J65672m6428j39723
6720e75236O4439Q853j03003K7711P0851K1292J60098K2805k94286j17889P4338
6709f40027R4262j06159L48902m2793n9172k65835j73084J38205p0853J75001
6699f01553J36195p1867j02777L35844R6582k89625k03255L63820J52152m31049
$$ y = [-189531, -315850, -685022, -372493, -240622, -577666, -360970, -417042, -522057, -409907, -227309, -175438, -160399, -354433, -391571, -318498, -431327, -311996, -195121, -314894, -361474, -444244, -587279, -543972, -719532, -483485, -436409, -669366, -496066, -637631, -458538, -321849, -266525, -323418, -473642, -455176, -270838, -586661, -694629, -786290, -698426, -382265, -510440, -576464, -584150, -730211, -704776, -617763, -675887, -630691, -547059, -554757, -389085, -435513, -575236, -510797, -501944, -604947, -577236, -506385, -485093, -324995, -302190, -596476, -714365, -640027, -545765, -651924, -303022, -345815, -404987, -670822, -843906, -705701, -776554, -601553, -465358, -537225, -640002, -304158, -207576, -497201, -700456, -336636, -184484, -615533]
6689f15533j14126K66299J77777K77285k22757R0004p8453p3260M2168k33970
6679d84566R5462o870k15213J88392j4382r0590k1256J61154j32654j6300K69209
6668b67614m03753j1299J0972R1472L05324j31685p0557j79902j2722J9770J15705
6657e34289P4342l441J47704J51162k56273k09127J32740K53718k49013l21990
6647h14467Q5730J41371R0822r1661J78336J62747N4522J12590j31118k45200
6637d56328n1436J30156M559j30054K29102N738P0453k38085J45687k3613J40839
6626a72982M4346k42851J66666O2705J88541k62466j64197K11215r7283j09057
6616c75363K03486J16059M9369j60563N129l47137J4114M09952O6646j36328j56722
$$ y = [-615533, -729659, -463360, -285583, -8298, -231055, -141051, -219504, -292764, -250596, -484566, -389104, -395974, -611187, -422795, -437177, -527767, -549023, -387869, -520523, -536823, -267614, -671367, -682666, -671694, -580222, -274898, -406583, -477140, -657042, -669764, -649994, -534289, -459947, -463388, -315684, -164522, -420795, -629922, -497182, -243464, -492477, -814467, -728737, -587366, -496544, -588205, -409869, -247122, -192600, -80010, -211128, -456328, -507764, -377608, -373049, -503103, -274001, -268263, -197810, -435895, -290208, -313821, -172982, -128636, -371487, -204821, -142116, 46425, -216041, -380238, -169023, -266306, -375363, -171877, -55818, -6449, -167012, -161883, -509020, -494906, -84954, -18308, -154636, -311358]
6605c11358q1636p0563J05810j21205J1035K8652K04945L05347J85786J51236
6595D08049l84570m71317L07399K29197q8368M9384k18352N0114M237k24538j39384
6584d78149L67043j08711l3137N3677O5337K33029o9588j45642R8399J79089j63698
6573b351J30693O9531k8801r3904K6823K20544J95180j93888k1347o29j44694
6562A57157r1307n3045K74853n7520o9244L5216k48577j34550n9081O5750K29031
6551D8683J49121o9400p2302p8940J29759J35128J89202K24842j67097k08679
6541B80317m7463k75362j33066J37208K13441J76388p715n2220K49928m21496
6531A19960j34084J38390j25417J05761n7867J58295J0963q9076M749K02838J94375
$$ y = [-311358, -392994, -463557, -357747, -478952, -467917, -439265, -234320, 71027, 256813, 408049, 23479, -447838, -140439, 88758, 390, 49774, -168578, -118464, -114227, -338765, -478149, -111106, -219817, -252954, -199277, -133940, 99089, 29501, -116141, -17742, 161347, -2351, 128342, 197873, 169072, 75168, 101991, 322535, 517715, 323827, 302480, 301851, 157157, 65850, 12805, 287658, 230138, 160894, 196110, -52467, -187017, -246098, -180348, 48683, 197804, 128404, 56102, -22838, 106921, 242049, 431251, 656093, 488996, 280317, 232854, -42508, -175574, -38366, 175075, 351463, 343748, 291528, 541456, 119960, -14124, 124266, -1151, 104610, 46743, 205038, 216001, 126925, 131674, 334512, 528887]
6520E28887k19307K7217j05622p8668L07054P0930j17642j98695R7800m5322m3569
6509B23063K61341j11263J20972P4749j52555J66329o0610k94030J92233j45262
6499B74967K7085p4007o1123J09813J58719j58026O851j11538P9983J50567J75626
6488E78917J22450m75847O0074J33186J3957j08781M8774P2319N23865k40853
6478G28061k44077N2571M2853N8323M4334k19712J46611J16983J05530j29708
6468G01769L1180j27596J30838P4031k65975P599M12423K25028p9238J76147j64010
6457A122196j08818J67035n872J21153l6991r3183j59828k22010l124L17485J08062
6446A206105J55470L6935M8598J33940K5814N2703M1596l2699p8350J92904J09811
$$ y = [528887, 309580, 336797, 231175, 152507, 459561, 530491, 412849, 214154, 311954, 266632, 223063, 484404, 373141, 494113, 568862, 416307, 582636, 522026, 227996, 420229, 274967, 302052, 228045, 166922, 276735, 435454, 277428, 284279, 172741, 252724, 403291, 578917, 701367, 225520, 285594, 418780, 432737, 323956, 372730, 445049, 968914, 728061, 483984, 536555, 579408, 637731, 682065, 462353, 608964, 725947, 831477, 701769, 732949, 605353, 736191, 810222, 544247, 551846, 964269, 1189297, 1110059, 1286206, 1122196, 1013378, 1180413, 1174541, 1295694, 1258703, 1165520, 1005692, 783682, 780558, 1098043, 1206105, 1361575, 1398510, 1447108, 1581048, 1606862, 1659565, 1701161, 1668462, 1590112, 1783016, 1892827]
6435A892827M0342j03503L60399J54126k627J69483k42114K3096J67052k1455
6425B437626L45707j03520j03445N6385R5984Q434L02507j7073K0896k39724m29593
6414B374184R8824K64541J29769K36578o2105K01302K47783j44947r3327J26544
6404C379146R9916J14775J97244L45925J26400R3389j03278L8400J8056j12637
6394D197336J91698M32602r9010O0397m8635p3291N3246J62256K1224K16749J84566
6383E299138R555J56382K24812O9341J88233J02284j77287j09896O7619K66416
6373F096597n1676M90997J86841J14420L4423L08641Q9875L38399j3125L47214
6363G942606K2927J05310L83175K05211J64054K55777K39331M89287L33496M00266
$$ y = [1892827, 1933169, 1829666, 2190065, 2344191, 2341564, 2511047, 2268933, 2292029, 2459081, 2437626, 2783333, 2679813, 2576368, 2632753, 2728737, 2737171, 3039678, 3022605, 3043501, 2803777, 2374184, 2473008, 2737549, 2867318, 3103896, 3041791, 3243093, 3490876, 3345929, 3252602, 3379146, 3479062, 3593837, 3791081, 4137006, 4263406, 4356795, 4253517, 4291917, 4309973, 4197336, 4389034, 4821636, 4722626, 4783023, 4734388, 4661097, 4714343, 4876599, 4897823, 5114572, 5299138, 5308693, 5465075, 5689887, 5759228, 5947461, 6049745, 5872458, 5762562, 5830181, 6096597, 6044921, 6535918, 6722759, 6837179, 6871602, 7180243, 7270118, 7608517, 7595392, 7942606, 7965533, 8070843, 8454018, 8659229, 8823283, 9079060, 9318391, 9807678, 10141174, 10541440]
6353A0541440L40572J43562L39606L17881K70991M52369P26274K06424K53288
6344A3592407M97494J001753P29963L88627Q09871O01465O93718P96878P19049
6335A9831225O24851Q90668J049663Q90453J288223J225057J066075P51240J172601
6326B8790056J209875J686678J568990J697959K010937K010591K194476K125763
6318D3295325K841717K608438L216414L581592L840276M390544M670989N392215
6310G3837510N475756O360034P427120Q597733R120054J0389909J1820635J2829091
6302A45857842J4750596J6351563J8239061J9924724K1716179K3486519K3939189
6295B84265673K3943219K2853493J9691993J6060465J1451286O127054K70140
$$ y = [10541440, 10882012, 11025574, 11365180, 11683061, 11954052, 12406421, 13132695, 13339119, 13592407, 14089901, 15091654, 15821617, 16210244, 17020115, 17621580, 18315298, 19112176, 19831225, 20456076, 21346744, 22396407, 23286860, 24575083, 25800140, 26866215, 27617455, 28790056, 29999931, 31686609, 33255599, 34953558, 36964495, 38975086, 41169562, 43295325, 46137042, 48745480, 51961894, 55543486, 59383762, 63774306, 68445295, 73837510, 79313266, 85673300, 93100420, 101698153, 110818207, 121208116, 133028751, 145857842, 160608438, 176960001, 195199062, 215123786, 236839965, 260326484, 284265673, 308208892, 331062385, 350754378, 366814843, 378266129, 384393183, 384663323]
6288C84663323n143847j0086150j4225295j7218216j9640283k0847401k0895411
6281B76606720k0276235j9304189j7958294j6700901j4909397j3054068j1498297
6274A62905339r986162q777557p233547n890448m861435m899460m599402m642548
6266A12014780m413966m601987n256729n119133m926773m601689m571380m236664
6258G4286459l326143l462659l142511k537043j976925j583497j580940j080703
6250E5596038j123703o80798m10691P0791M08810J225385J324375K074325L251791
6241F1736323M787821N868380P139903P131414O718383M998354K614501J27950
6233A01123029k467607m148115n541657o177105o570111n908621n874933n188661
$$ y = [384663323, 379519476, 369433326, 355208031, 337989815, 318349532, 297502131, 276606720, 256330485, 237026296, 219068002, 202367101, 187457704, 174403636, 162905339, 152919177, 144141620, 136908073, 131017625, 126156190, 121256730, 116657328, 112014780, 107600814, 102998827, 97742098, 92622965, 87696192, 83094503, 78523123, 74286459, 70960316, 67497657, 64355146, 61818103, 59841178, 58257681, 56676741, 55596038, 54472335, 53791537, 53380846, 53451637, 53860447, 55085832, 56410207, 58484532, 61736323, 66524144, 72392524, 79532427, 86663841, 93382224, 98380578, 100995079, 101123029, 98655422, 94507307, 88965650, 82788545, 76218434, 70309813, 64434880, 59246219]
6225E9246219m130787l202265k563082j937803j261485j118284p76827m04951
6217D3850735m8807L46319N21817J071019J603006K089243L111770M288147N704813
6208F2538062O628984P831732Q574065Q085003O378492L941777J935661r42955
6200A04970821k942170m319932m853345n086837n006580m296331l909039l439309
6192G1117278k539796j768460j713422j113980r45947p58495m82980m75161k74746
6183F1044291j0706M5402J31126O91778R28419J474607J471091J767971K425969
6174F9969948K452153K032528J858208J215053Q12551r5051j063336j522225j810050
6165G3849779j755310j866191j900051j951516j559801j449777j138945j092139
$$ y = [59246219, 55115432, 51913167, 49350085, 47412282, 46150797, 45032513, 44255686, 43850735, 43801928, 44148247, 44670064, 45741083, 47344089, 49433332, 52545102, 56833249, 62538062, 69167046, 76998778, 85572843, 93657846, 100036338, 103978115, 105913776, 104970821, 102028651, 97708719, 92855374, 87768537, 82761957, 78465626, 74556587, 71117278, 68577482, 66809022, 65095600, 63981620, 63035673, 62277178, 61794198, 61319037, 61044291, 61033585, 61078987, 61210113, 61901891, 62830310, 64304917, 65776008, 67543979, 69969948, 72422101, 74454629, 76312837, 77527890, 78340441, 78245390, 77182054, 75659829, 73849779, 72094469, 70228278, 68328227, 66376711, 64816910, 63367133, 62228188, 61136049]
6157F1136049r52422j237306q92505p65501q82303j133212r17087j051305n94098
6148E2710310r90517r40930o00601n29024k71306o66484n12262p86027o39205
6139D6773954n47177l90158n00510n37597j020465j020160j193325j091199j150241
6130C9323122j304474j432818j319921j404001j685726j346863j609709j579993
6122B7639617j087772j070258j300189r10795r80747j117174o89248r10229o65792
6113A8907413o53745r26409p70917n05966o65593o26319l63830k27217n45037
6104A3622380m99179m59175k38937j55992l34817k37335l58123m97359m53719
6095A0387744j97118K4149k90956l46768n23490k04583J34772j77169O1794k89011
$$ y = [61136049, 60183627, 58946321, 58053816, 57288315, 56406012, 55272800, 54355713, 53304408, 52710310, 51719793, 50778863, 50178262, 49649238, 49377932, 48711448, 48199186, 47413159, 46773954, 46226777, 45836619, 45336109, 44798512, 43778047, 42757887, 41564562, 40473363, 39323122, 38018648, 36585830, 35265909, 33861908, 32176182, 30829319, 29219610, 27639617, 26551845, 25481587, 24181398, 23270603, 22289856, 21172682, 20483434, 19573205, 18907413, 18253668, 17327259, 16556342, 16050376, 15384783, 14758464, 14394634, 14167417, 13622380, 13123201, 12664026, 12425089, 12269097, 11934280, 11696945, 11338822, 10841463, 10387744, 10190626, 10214775, 9923819, 9577051, 9053561, 8848978, 8983750, 8806581, 8868375, 8579364]
6085H579364m31985n1185l64430k8001r3164j09232M1555M3804l76154n15082
6075F695490R2508R9052j69695j56281j20369o0932k50100K14966j00344m76798
6065E767497j22894k32432J44582p2112K0150J10452Q4841o5967k56032k77939
6055E100146j95661N9024J23042j00883j09650j35679J51551j17316j81273j36901
6045D456400o890J20299k51685p5745p2512O0512k59566J22384N57125m00833
6035D249489l45300j31200o4638R7030L73895k87718q8982j42558p4286j96964
6025C388768J80947k58299J63740Q1923q3236k3169l9149J12820j93777k49437
6015C081131K51119l32305j39516K53087j87815K7134R662k2347K4752J03432
$$ y = [8579364, 8147379, 8096194, 7731764, 7703763, 7610599, 7501367, 7542922, 7586726, 7210572, 6695490, 6787998, 6887050, 6717355, 6561074, 6440705, 6379773, 6129673, 6344639, 6244295, 5767497, 5644603, 5412171, 5556753, 5484641, 5504791, 5615243, 5700084, 5634117, 5378085, 5100146, 4904485, 4963509, 5086551, 4985668, 4876018, 4740339, 4891890, 4774574, 4593301, 4456400, 4449510, 4569809, 4318124, 4242379, 4169867, 4230379, 3970813, 4093197, 4650322, 4249489, 3904189, 3772989, 3708351, 3805381, 4179276, 3891558, 3802576, 3660018, 3585732, 3388768, 3569715, 3311416, 3475156, 3557079, 3473843, 3450674, 3411525, 3524345, 3330568, 3081131, 3332250, 2999945, 2860429, 3113516, 2925701, 2952835, 2962497, 2940150, 2964902, 3068334]
6005C068334j13801m2155j04805N13365m30560l26335M9954K25006O1331N3755
5995B954089l56733k25603R9921O7726K87624K0678j53817k65671j32106l846
5985B292262P2100j91960j9496J46178o28o7981K18543p4159j84661K73293j02331
5974B361160r5689K57053l57187m17184Q7892k040m0941L3717M17014j61754k22664
5963A859377j85532K33973K5599J24485j32690l04234K55027J35348k16304k64526
5953A530523Q6350O467L19959j57400j44629J308j04203m3970J98186K30430l52303
5942A570718P2316K4702N7099J54692n6388P4323j71474k51564K5522j56665K24285
5931A567566J49567k89688j58318o2964N1915P2392k08500N5636K99531O1936
$$ y = [3068334, 2954533, 2912378, 2807573, 3320938, 2890378, 2564043, 2613997, 2839003, 2900334, 2954089, 2597356, 2371753, 2471674, 2539400, 2827024, 2847702, 2693885, 2428214, 2296108, 2292262, 2364362, 2172402, 2152906, 2299084, 2298456, 2230475, 2449018, 2374859, 2190198, 2463491, 2361160, 2265471, 2522524, 2165337, 1748153, 1836045, 1834005, 1793064, 1826781, 2243795, 2082041, 1859377, 1673845, 1907818, 1933417, 2057902, 1925212, 1620978, 1876005, 2011353, 1795049, 1530523, 1616873, 1623340, 1943299, 1785899, 1641270, 1642578, 1538375, 1494405, 1692591, 1923021, 1570718, 1643034, 1667736, 1724835, 1879527, 1823139, 1897462, 1725988, 1474424, 1499946, 1343281, 1567566, 1717133, 1427445, 1269127, 1206163, 1258078, 1330470, 1121970, 1177606, 1477137, 1539073]
5921A539073j04138J49422j14205K07165m9182k07706p0356o174L0606k70996
5911A103509K88637j55518k5555K40450q0446k87244J81071J3044J81830L8453
5901A498231l93171o0191K64423J56867J08221j08658n6108J56831r4414p2899
5891A399132M2115J99074j7591m24918j80307K57892l83923n189O6927k46687
5881G06525M4202K6950L60655J19262N0094k23623J69238O144l17204J30294J02849
5870A175386O1035L7216J49432m3790j62851o5664O7604K35567j47031m707N1475
5859A353672j70513j85818j05725L44686j38312j64541J11689J28789L101P0301
5849A247329n2560J54385N0896l85264j47675j40310K51135J39634j83610M8045
$$ y = [1539073, 1434935, 1584357, 1470152, 1677317, 1628135, 1420429, 1350073, 1343899, 1374505, 1103509, 1392146, 1236628, 1211073, 1451523, 1371077, 1083833, 1264904, 1277948, 1459778, 1498231, 1105060, 1044869, 1309292, 1466159, 1574380, 1465722, 1409614, 1566445, 1472031, 1399132, 1441247, 1640321, 1622730, 1197812, 1017505, 1275397, 891474, 886285, 953212, 706525, 750727, 777677, 1138332, 1257594, 1307688, 1084065, 1253303, 1259447, 942243, 1072537, 1175386, 1236421, 1273637, 1423069, 1379279, 1216428, 1150764, 1218368, 1453935, 1306904, 1302197, 1353672, 1183159, 997341, 891616, 1236302, 1097990, 933449, 1045138, 1173927, 1177028, 1247329, 1194769, 1349154, 1400050, 1014786, 867111, 726801, 977936, 1117570, 933960, 982005]
5839I82005R6725J46265o0579m0189o2923j48873N2357O5934P6943j64241J21533
5828A064957L90200k13709j86943Q7760k18612n6234j82039J73809K44734j38883
5818I65040m1710J59201k96021J74067J00575p3784O7016j6594P4136R3409K252
5807A207587k63562l63929J0290P8977J99828J64479p9911L07892J67515m3489
5797A385677k86762j83534j31141j98032K55059j3325J41594o975n915K22593
5787A179239k85012m87409K10103J09671j12290L040k70500P8163J80495M01878
5777A007378M1723m0742m4526q8489J0574l9188m10556k20279K2946m2226k1940
5766A74675L71601K88916j61915l01339o9418J12885k8333O6845M20j77388J40992
$$ y = [982005, 1078730, 1224995, 1164416, 1124227, 1061304, 912431, 964788, 1030722, 1107665, 943424, 1064957, 1455157, 1241448, 1054505, 1142265, 923653, 867419, 685380, 859189, 1103923, 965040, 923330, 1082531, 786510, 960577, 1061152, 987368, 1054384, 1037790, 1111926, 1205335, 1207587, 944025, 580096, 590386, 669363, 869191, 1033670, 953759, 1261651, 1429166, 1385677, 1098915, 915381, 784240, 586208, 841267, 827942, 969536, 962561, 956646, 1179239, 894227, 406818, 616921, 726592, 614302, 617342, 346842, 425005, 605500, 1007378, 1049101, 1008359, 963833, 875344, 885918, 846730, 436174, 215895, 238841, 196615, 174675, 546276, 835192, 673277, 371938, 302520, 415405, 387072, 453917, 454337, 276949, 417941]
5755D17941J40758M9435J53761K4944j05810q132j7485J8988Q9883j80654j00329
5744D83300L2481l67077K13825K95002r3787k89298K68440l9489j6421k4051k05337
5733B57588J33449j40559k02167L2160M1923j6647J10427J62577R5979j22133
5723C52597J10971Q7647J28730n3262m01696J9991P5477j26919j41537J07201
5713A59200P9893K95620L11074m01982k47661o0662J32046K52787J73586j98754
5703D95147J44237j3067k17793j72870k3062M7270p4210M31493j11361k15498
5693B90286J45344J58399k20238j29614N391J57555J45142j53673Q422J78328
5683E85342k23016L53K08126l84346p9176j20427K36136n8244K49241L1572m12240
$$ y = [417941, 558699, 608134, 761895, 786839, 681029, 672897, 655412, 674400, 764283, 583629, 483300, 515781, 148704, 362529, 657531, 563744, 274446, 542886, 503397, 486976, 462925, 257588, 391037, 250478, 48311, 80471, 122394, 105747, 216174, 378751, 474730, 352597, 463568, 551215, 679945, 626683, 224987, 244978, 320455, 193536, 51999, 159200, 239093, 534713, 845787, 443805, 196144, 135482, 267528, 520315, 693901, 495147, 639384, 626317, 408524, 235654, 212592, 259862, 185652, 617145, 505784, 290286, 435630, 594029, 373791, 244177, 249568, 407123, 552265, 398592, 407014, 585342, 362326, 362679, 570805, 186459, 107283, -13144, 222992, 164748, 413989, 445561, 33321]
5672C3321K30771K75928o3372P5143L3689j83808j68879l13613N3408N7012J95296
5661B24896q8265l15802J61566j03548M874K53621n1229r078J95099Q2675r3427
5650B61382k18420J34655j91173l42658L62868M55194j87132j14878J58371J40239
5640D58448j57284j48964K23322R4729k33815Q9716k20143M1577K73939K4678
5630D46203K45976k93113j29425O9554J18620K47293j62942l07371j17049j04690
5620A3056j72116K12275K0814R9852P5620j16527K27287J38339j10234q9273J15192
5609D14285o7582k15627J60650K24588l50813J06742Q787J64249j20652q038k07422
5598A09167L8478L32167j53790p1978j81345p1181R5654n0450r926j49935J38897
$$ y = [33321, 264092, 540020, 476648, 551791, 585480, 401672, 232793, -80820, -27412, 29600, 224896, 136631, -179171, -17605, -121153, -116279, 137342, 86113, 77035, 272134, 354809, 261382, 42962, 177617, -13556, -356214, 6654, 461848, 274716, 159838, 318209, 458448, 301164, 152200, 375522, 470251, 236436, 326152, 106009, 147586, 421525, 446203, 692179, 399066, 269641, 339195, 457815, 705108, 542166, 234795, 117746, 13056, -159060, 53215, 74029, 173881, 249501, 132974, 360261, 498600, 388366, 299093, 414285, 346703, 131076, 291726, 516314, 165501, 272243, 281030, 445279, 324627, 316589, 109167, 147645, 479812, 326022, 254044, 72699, 1518, 97172, 46722, 36796, -113139, 25758]
5587B5758M9816J46565K56795l5932l4085j76570L3561N3971J67068j27999O3674
5576D22622k4252N901j65344m7122J811j46909j6267L35722O5326N5865M3768
5565E31121l22955N9864M1319J26312m1714l2259j61855P3673o96K8732L8397
5554C39939m5158J67900M3579N6483j15060j81396j38883J24653J03436j38379
5544B17114k96083n7900m480J80528N5831K58028o0091L8421J79810j26668k83818
5533A00692n1594L17550j68341l9015j88812o5176j8338k297J10976J5911L2903
5522D4459r5261J57074K00240j14276j94065N1170J22448M4150k6288p4481n1461
5511F3709j96014K94321J90560J9871Q493m1398l0116L9556k98118j66868L54407
$$ y = [25758, 75574, 222139, 478934, 443002, 408917, 232347, 265908, 319879, 486947, 358948, 422622, 398370, 404271, 238927, 191805, 193616, 46707, 30440, 366162, 431488, 487353, 531121, 208166, 268030, 309349, 435661, 393947, 361688, 199833, 273506, 272810, 301542, 339939, 294781, 462681, 506260, 562743, 447683, 266287, 127404, 252057, 355493, 217114, -78969, -136869, -141349, 39179, 95010, 353038, 292947, 331368, 511178, 384510, 100692, 49098, 366648, 198307, 159292, -29520, -94696, -113034, -115331, -4355, 11556, 44459, -50802, 106272, 306512, 192236, -1829, 49341, 171789, 215939, 189651, 115170, 63709, -132305, 162016, 352576, 372447, 380940, 339542, 309426, 348982, 50864, -116004, 238403]
5500B38403q0301N9767J76238j55647J75875M03254n6561k68820j02952k3728
5490C65528M1502K74174p2082m32598K32344j56072j84814L07965m6662p9723
5480B49562p1620j93153J73576J60835j30901p8960l7998L3103j01224R780K37128
5469B50128M4089j52307k2168K23414k15721K8983K01759j01809k42062j7146
5459b840J56137o7629o284J46977l9483j69035m5986N0968J27147P6707j24388
5448A02291J10607j7031l07348N5158K42241L30766k33208l67012Q1078J37372
5438A34914r6763J0664J0058k08370j25097n0671K14023l5370J87924j18576l6762
5427a14026J8527L0110J19993j95620J08619j12107p0063M9346N1246R1548J95517
$$ y = [238403, 158102, 217869, 394107, 238460, 414335, 817589, 761028, 492208, 389256, 365528, 407030, 681204, 609122, 176524, 408868, 252796, 67982, 375947, 329285, 249562, 177942, -15211, 158365, 319200, 188299, 109339, 71341, 104444, 3220, 13000, 250128, 294217, 141910, 119742, 343156, 127435, 156418, 358177, 256368, 14306, -2840, 153297, 85668, 79384, 226361, 186878, 17843, -28143, 22825, 149972, 226679, 102291, 212898, 195867, -111481, -56323, 185918, 516684, 283476, -83536, -2458, 134914, 38151, 48815, 58873, -149497, -274594, -325265, -111242, -146612, 41312, -77264, -114026, -95499, -65389, 54604, -141016, -32397, -144504, -214567, -165221, -113975, -22427, 173090]
5416A73090j44626j16314m1569M0275Q2989j5002q4408K83930j46855l1237j40501
5405a40228J77542J30242J500N7822j98556p617m9364O6628J94989K18014O3367
5394E14339m16488n692j07345l650J07994n7322o397j31311p2832K87920M4965
5383A54181q762M2208l15775l1416J24674K29391j15525j5134K7455L26436k76729
5372A41004k77190K04139r9210J42847K15414J51818k59564l00495J5617M06809
5362C41189n5481k24411P9254J7330j07849j59937J3537j60158j23610L14564
5352f5572K87410p0181k08957J06730l2512L0053J53890J7149m8940k68665n379
5341a04974o662J75405k69556r0010J98868Q3357j4213j63972K3084K19056j36417
$$ y = [173090, 28464, -87850, -129419, -89144, -6155, -21157, -105565, 178365, 31510, 273, -140228, 37314, 167556, 169056, 226878, 28322, 20705, -28659, 37969, 232958, 450972, 514339, 97851, 92159, -15186, -18836, 89158, 31836, 25439, -105872, -178704, 109216, 154181, 145419, 187627, -128148, -159564, -34890, 194501, 78976, 63842, 91297, 417733, 141004, -136186, 67953, -31257, 111590, 327004, 478822, 219258, -81237, -65620, 341189, 285708, 61297, 140551, 157881, 50032, -109905, -96368, -256526, -380136, -65572, 221838, 151657, -57300, 49430, 16918, 46971, 200861, 218010, 169070, -99595, -104974, -111636, 63769, -205787, -295797, -96929, -13572, -27785, -191757, -168673, 50383, -86034]
5330h6034L32059J95727k75238p0937M8536k54347R971j55088O3988K64216J85177
5319B58030n9144j690n6104j31122J01184j71242J24381M0364k57420N461R0994
5308e6308R3570J0760M1065K3594p4537J10972p7802N5249J0870o3542j96908
5297a23017j80158L5918J09517J77760k49979N867l8264J34691j19800N9123J71233
5286a7109k15690j79741J74069L77370K04550j90670k50046q1130o7943L1879
5276b14461o6192o2501j4140J74785K50106N8686m41675L5945j420J74160N7791
5265d8916k85732O7537L43515j538K69003k92365R0581J33943l27782j50114K37924
5254C6056p9596n9241J85711j46223j27517K32524o0881M0058K7287j24007j05816
$$ y = [-86034, 246025, 441752, 166514, 95577, 144113, -110234, -100263, -255351, -191363, 72853, 258030, 198886, 197196, 141092, 9970, 111154, -60088, 64293, 104657, -152763, -147302, -56308, 37262, 48022, 89087, 112681, 38144, 149116, 71314, 126563, 137433, 73891, -123017, -303175, -267257, -157740, 20020, -229959, -224092, -262356, -127665, -247465, -188342, -17109, -232799, -412540, -238471, 138899, 343449, 152779, -97267, -178397, -246340, -214461, -280653, -343154, -357294, -182509, 67597, 126283, -315392, -279447, -280867, -106707, -48916, -334648, -267111, 76404, 74866, 343869, 51504, 142085, 276028, -51754, -201868, 36056, -43540, -102781, 82930, -63293, -190810, 41714, -19167, 20891, 48178, -75829, -181645]
5243a81645Q3432Q9086k5888P210r6940J12791J03709K10191m07607P3566l6706
5232f8801Q1770j0031j65558l0054J75052J59277j79892j06919O2139K0472M0502
5221b2043j55440J47679K7118l49825J06794K49222j38323j43856K92106K0572
5211C4004j04993Q5934M5015n1066p22P131m5548m8957o0926p861q3034N5758
5199a75265L97574P119k09545J29127J559K39793j27241j64198N3163j36497r4151
5188g8562k30916j14071K09131J32485m2391j3063L2352r220l09961K32583J71051
5177b0582R8238j18096k1516J27953o6253P275j21900j63098K7989k2348J68098
5166a04240L04300m6425j34084J46997j79582j87353j14952K50206P5752n205
$$ y = [-181645, -98213, -9127, -35015, -27805, -124745, -11954, 91755, 301946, -105661, -32095, -68801, 12969, 2938, -162620, -192674, -17622, 141655, -38237, -145156, -83017, -62545, -22043, -177483, -29804, -2686, -352511, -245717, 3505, -134818, -278674, 13432, 34004, -70989, 14945, 59960, 8894, 8172, 15303, -30245, -79202, -140128, -147989, -231023, -175265, 222309, 229428, 19883, 149010, 150569, 390362, 263121, 98923, 152086, 15589, -78562, -309478, -423549, -214418, -81933, -124324, -137387, -105035, -114255, -424216, -191633, -20582, 77656, -40440, -61956, 65997, -256, 7019, -114881, -277979, -249990, -272338, -104240, 200060, 153635, 19551, 166548, -13034, -200387, -315339, -65133, 10619, 5414]
5156E414R8483n4539J80150K499J7410k10382q0226K23546j7432q4660q9093j92888
5144b01718k4289J41330r7790P2030r1588j16773J48916J51875p9196J24028j98874
5133a72049n4608k16007J87816L84852n3332K24487l56683R1765J07329l28628
5123a85058j25190J63671o1249L72258N7793j14719K70635p6979l11813J58888
5113A48237j83177p4421L29144j93288k6295P2384j00085K7541J39777K83531
5103D23348k3696j8461j78550K70027j07263k02157P9330J34839J29660q3055
5093D24022p887q7727p6696Q51j8632K716J07134p1098l64716J35828J35658j3134
5081A66319K13894J47425j3799j9132O4551K11149k68219k64201k1861L3224J61366
$$ y = [5414, 103897, 49358, 229508, 232007, 249417, 39035, -41191, 182355, 164923, 80263, -8830, -201718, -226007, -84677, -182467, -110437, -202025, -318798, -169882, -18007, -97203, 26825, -172049, -226657, -442664, -254848, 130004, 76672, 301159, -55524, 36241, 143570, -185058, -310248, -146577, -207826, 164432, 222225, 107506, 378141, 301162, -10651, 148237, -34940, -109361, 219783, 26495, 200, 72584, -27501, 40, 139817, 423348, 399652, 381191, 202641, 472668, 365405, 163248, 242578, 377417, 507077, 424022, 416135, 328408, 251712, 252563, 233931, 236647, 343781, 272683, -92033, 43795, 179453, 166319, 380213, 527638, 513839, 494707, 559258, 770407, 502188, 237987, 216126, 249350, 410716]
5070D10716N9506m7721J91367l99908p9996K17181J89805J81938p2960J853k37608
5059D14173K09557j71279k04889K13110J28063k57297k99128R2955K38217L23804
5049F87286K38236l32680j7487j38662Q9246P6940P1216k01842N9255n4335k14670
5038B62503l00856M3594R0328k7682K4252n1912R9204l2583K85772J32699k73843
5027B51476K4680R8586n8749n0768K5911l01947J93885l8998P678J66675l35230
5016a6801P2755J34682J90412l423k02604j09484M14432J7500k74391J44206Q9853
5005D57137J01298L7236J27829l54995j23090J70181J98865j38042j06597M9092
4995D18914j52845k22425j75933J39609K0895K66325N5265L8500o8014O1750J16244
$$ y = [410716, 470222, 422501, 613868, 213960, 133964, 351145, 540950, 722888, 649928, 651781, 414173, 623730, 452451, 247562, 460672, 588735, 331438, 32310, 125265, 363482, 687286, 925522, 592842, 575355, 436693, 525939, 602879, 674095, 472253, 531508, 477173, 262503, -38353, 5241, 95569, 67887, 92139, 40227, 139431, 106848, 392620, 525319, 251476, 276156, 374742, 315993, 265225, 291136, -10811, 183074, 144076, 151754, 318429, -16801, 55954, 190636, 381048, 377625, 175021, 65537, 479969, 497469, 223078, 367284, 457137, 558435, 595671, 723500, 368505, 245415, 415596, 614461, 476419, 369822, 418914, 266069, 43644, -132289, 7320, 28215, 294540, 349805, 388305, 320291, 382041, 498285]
4984D98285J84453o188j31015j73043Q7527r4793l28640P1618m7964R0311j07454
4973D3097q8228L01559m6090k8316R3813J42350J9227q7677R5818j50503j24309
4962A70741J86852K07832m1093Q42N1029M4522o3683J13575q7347k29604M69013
4951H22679J5473p2951j13532J07153j12736k1427L1201k26418K09526j8200r2103
4940E28665K77100k38242J65623j29979q8850N7333J25362R3723k50959L50777
4930H90553o5596J12056k40570j56252K97416j15600j52619M0906K03842j04755
4920G09381K08656m4377l5294m6725j60780j45906J57238L88004j43011R1226
4910I78412O5840K35004L6740j25914L3508J4276l01L14479Q8927Q6640J06032
$$ y = [498285, 682738, 676550, 545535, 372492, 460019, 365226, 36586, 108204, 60240, 150551, 43097, -45131, 256428, 210338, 182022, 275835, 418185, 437412, 349735, 445553, 295050, 170741, 357593, 565425, 524332, 525174, 576203, 620725, 557042, 670617, 583270, 353666, 822679, 838152, 765201, 651669, 758822, 646086, 624659, 655860, 429442, 638968, 620768, 528665, 805765, 567523, 733146, 603167, 514317, 571650, 697012, 790735, 539776, 890553, 824957, 937013, 696443, 540191, 837607, 722007, 569388, 610294, 814136, 709381, 918037, 873660, 838366, 791641, 630861, 484955, 642193, 1030197, 887186, 978412, 1044252, 1279256, 1315996, 1190082, 1223590, 1237866, 1237565, 1552044, 1640971, 1727611, 1833643]
4899A833643k22253K05109J06716O3576Q8331j46971M971P5599J46699m36473
4889A718947K75878K2372k9j94242j7185K57978J26941j5636o4204p3703k83867
4878A753250N4303K2593K785J17249j74855j88702J9616j00816J47800k0617k65378
4867A367228N7658J55917K04820q3560L9647J68333J33415J37286L7531J0388
4857B228663o1326j28589J42088Q7938l1983N13622j13975n7188k5893L54175
4847B907532k00733j39855K32244Q010Q8601M96485o758j53795L71469K97594
4837C900794J49157R3986J05713k7836K93159L54995L37239L27013P5067K16915
4827E826202L38273K08068L95223K95609J71352P5202K70449N75060K99410O9756
$$ y = [1833643, 1611390, 1816499, 1923215, 1986791, 2075122, 1928151, 1933122, 2008721, 2155420, 1718947, 1994825, 2017197, 2017168, 1822926, 1805741, 2063719, 2190660, 2175024, 2110820, 2037117, 1753250, 1807553, 1830146, 1832931, 1950180, 1775325, 1586623, 1606239, 1505423, 1653223, 1632606, 1367228, 1424886, 1580803, 1785623, 1702063, 1741710, 1910043, 2043458, 2180744, 2218275, 2228663, 2167337, 2038748, 2180836, 2268774, 2236791, 2750413, 2636438, 2579250, 2553357, 2907532, 2706799, 2566944, 2799188, 2807198, 2895799, 3392284, 3385526, 3231731, 3603200, 3900794, 4049951, 4143937, 4249650, 4221814, 4514973, 4869968, 5207207, 5534220, 5609287, 5826202, 6164475, 6372543, 6767766, 7063375, 7234727, 7309929, 7580378, 8155438, 8454848, 8524604]
4817H524604P53755Q81136N99111N86861M06046N17811R97928O19998O26809R81767
4807A5495826J048709P56122Q73624J062703J033888J090148J066655J055465
4799B3483140P02258R72374J164546Q32402J323286J052980R11600J367961J195636
4790C3006183J177805J139814J354903J280602J329481J395111J743941J230944
4782D3658784J589418J314426J280382J464768J545045J627802J359542J130301
4774E4970468J515349Q43982Q92382R99646O27582M82084P601l80885j50846j88227
4764E9619136o41915o98939m19105n45593j107192q95122j083767q30184q77607
4755E2519712j244088j039445r29072j418980j154158j187395q95306j090303
$$ y = [8524604, 9278359, 10159495, 10758606, 11345467, 11751513, 12269324, 13267252, 13887250, 14514059, 15495826, 16544535, 17300657, 18174281, 19236984, 20270872, 21361020, 22427675, 23483140, 24185398, 25157772, 26322318, 27154720, 28478006, 29530986, 30442586, 31810547, 33006183, 34183988, 35323802, 36678705, 37959307, 39288788, 40683899, 42427840, 43658784, 45248202, 46562628, 47843010, 49307778, 50852823, 52480625, 53840167, 54970468, 56485817, 57329799, 58222181, 59221827, 59849409, 60331493, 60339094, 59958209, 59807363, 59619136, 58977221, 58278282, 57859177, 57313584, 56206392, 55311270, 54227503, 53397319, 52519712, 51275624, 50236179, 49307107, 47888127, 46733969, 45546574, 44651268, 43560965]
4747D3560965j288101j301010j191830j130229j232796j250651j202346j171177
4739C3792825j013268q79207r00125j214284j208410j012285q14214p59692r47839
4730B5043501p47483n13583n55728n10273p44286n68735n32799n54744l00167
4721B0015703k78900j90121r5120l46092j90640K9527J51585j13527k21922K41540
4711A9002033N42103M233N2372J88622J39444L47798K26455M30170O62161L93949
4701B1989340P76058Q24794N15660P13687J017029J153911P72808O52531J206372
4692B9622190J093309R42151J198609J140697J267732J473957J395538J365121
4684C9499304J134659J498956J127455R80547J178391J274339J058078J475639
$$ y = [43560965, 42272864, 40971854, 39780024, 38649795, 37416999, 36166348, 34964002, 33792825, 32779557, 31900350, 31000225, 29785941, 28577531, 27565246, 26751032, 25991340, 25043501, 24296018, 23782435, 23226707, 22716434, 21972148, 21403413, 20870614, 20315870, 20015703, 19736803, 19546682, 19451562, 19105470, 18914830, 18944357, 19095942, 18982415, 18760493, 19002033, 19544136, 19548369, 19600741, 19789363, 19928807, 20276605, 20503060, 20933230, 21595391, 21989340, 22765398, 23590192, 24105852, 24819539, 25836568, 26990479, 27763287, 28415818, 29622190, 30715499, 31657650, 32856259, 33996956, 35264688, 36738645, 38134183, 39499304, 40633963, 42132919, 43260374, 44240921, 45419312, 46693651, 47751729, 49227368]
4676D9227368J368140J221119J398861J101261J330506J343138J145598Q42427
4668E8978418R99263J162954P91567K54796M52792K62278K78694j24220j70536
4659F2886006m05911o37755o54497r48247j075977j255339j149415j165120j267417
4650E4326328j495848j056192j059584j644132q90472j095941j060744j133588
4642D4889827p71390j030828j328653j052581j177669j212967j082851r54154
4634C6278734n38527o55205j002327p00791j011157q34776p19024q78496q33866
4625B9104565o31838n48358l71279k63950l04574R0246k38467j09483K82344O07175
4615B7616381N26118J099237J245668J635560K388789L406598M238651N168311
$$ y = [49227368, 50595508, 51816627, 53215488, 54316749, 55647255, 56990393, 58135991, 58978418, 59977681, 61140635, 61932202, 62186998, 62639790, 62902068, 63180762, 63056542, 62886006, 62480095, 61842340, 61187843, 60239596, 59163619, 57908280, 56758865, 55593745, 54326328, 52830480, 51774288, 50714704, 49070572, 48180100, 47084159, 46023415, 44889827, 44118437, 43087609, 41758956, 40706375, 39528706, 38315739, 37232888, 36278734, 35740207, 35085002, 34082675, 33381884, 32370727, 31535951, 30816927, 29938431, 29104565, 28472727, 27924369, 27553090, 27289140, 26984566, 27074812, 26836345, 26726862, 27009206, 27616381, 28142499, 29241736, 30487404, 32122964, 34511753, 37918351, 42157002, 47325313]
4607D7325313O187542O985649O337930O249959O107690O417576P137637Q450590
4599A01199886R122486R615178R187921P979725O479865N802101N696603O003613
4591A61087378O858298P547841O918747M797170K316073p48112k578552l211573
4583A82987270l099028l439280l320580m118876n661324o973068p910331q645828
4575A39818955q342359q028632p328306p354361p494184p707771p874648p424586
4567G8264108p373924p215632o600776o223891n366588m849310m017499l623402
4559C2993086k786284k112000j751037k027891j284303j200113j022815p72005
4551B0036638j038480q14551r97154r43976k92128l90343m26260m31488n63130
$$ y = [47325313, 53512855, 60498504, 66836434, 73086393, 79194083, 85611659, 92749296, 101199886, 110322372, 119937550, 129125471, 137105196, 143585061, 149387162, 155083765, 161087378, 167945676, 175493517, 182412264, 187209434, 189525507, 188777395, 186198843, 182987270, 179888242, 176448962, 173128382, 169009506, 163348182, 156375114, 148464783, 139818955, 131476596, 123447964, 116119658, 108765297, 101271113, 93563342, 85688694, 78264108, 70890184, 63674552, 57073776, 50849885, 45483297, 40633987, 36616488, 32993086, 30206802, 28094802, 26343765, 24315874, 23031571, 21831458, 20808643, 20036638, 18998158, 18183607, 17186453, 16242477, 15950349, 15560006, 15133746, 14702258, 14139128]
4542A4139128p23366j52066j70373m68194l90283k71270j70933l24448n24640
4533A0943555o6494M7109k94297l35014k54620k39021k40498j78173l02385k35677
4523H844485j34914l20851M8482l22485j12423k42470o151j06557j80961r8601
4513G367554k34037N0918m702k30288l74642j18356J03933j15453m25432K01222
4503F220717j12187P2075k74593l30537j12895m2741j57176k91820o4032J13154
4493E019965k41049l7176J55330J32789j80301k91078k0738q4607j34694l2657
4483D285784r8168l1442j66283l15227l0268K61271q5049Q9660o1373O8378p1236
4472C846047j3054l2009J51393j61912j6627J23999k25980j58045Q409M0766K3836
$$ y = [14139128, 13415762, 13263696, 13093323, 12625129, 12234846, 11963576, 11792643, 11468195, 10943555, 10877061, 10924170, 10629873, 10294859, 10040239, 9801218, 9560720, 9382547, 9080162, 8844485, 8709571, 8388720, 8437202, 8114717, 8002294, 7759824, 7753673, 7647116, 7466155, 7367554, 7133517, 7184435, 7179733, 6949445, 6574803, 6456447, 6560380, 6444927, 6019495, 6220717, 6108530, 6180605, 5906012, 5575475, 5462580, 5419839, 5262663, 4970843, 4906811, 5019965, 4778916, 4741740, 4897070, 5029859, 4849558, 4558480, 4537742, 4453135, 4318441, 4285784, 4187616, 4156174, 3989891, 3674664, 3644396, 3905667, 3820618, 3910278, 3848905, 3917283, 3846047, 3832993, 3800984, 3952377, 3790465, 3773838, 3897837, 3671857, 3513812, 3522221, 3562987, 3586823]
4461C586823o0816q3435k52126q2820K02094j2989k61511j78549K0835K89457
4451C166963M3671k74900r5402N0028k90162J05273M16182K6250j53572L3745
4441C028076j33556J11256o5995j80853J2835P6012j18524r2696J30906L59195
4431C126656r368m57049P675J0838K39856J96793j22808k62275r4312k29769K99626
4420B705863j9328o9666J83112Q5966j92885K63630J39633n3371J08528J03307
4410C254789M5522Q5488J49498J99039j7576J15636m2292J07623J252J72682K13264
4399D284925k40993O0844J50547j44602N9410J73924j3742J56166J15549q0430
4389D521598m7916J26508p6291j54069l0184R8400J3787n4130l67939m7438j23005
$$ y = [3586823, 3526007, 3442572, 3190446, 3107626, 3309720, 3296731, 3035220, 2856671, 2877506, 3166963, 3210634, 2935734, 2840332, 2890360, 2600198, 2705471, 3121653, 3147903, 2994331, 3028076, 2894520, 3005776, 2939781, 2758928, 2771763, 2847775, 2729251, 2636555, 2767461, 3126656, 3117288, 2660239, 2667914, 2678752, 2918608, 3115401, 2992593, 2730318, 2636006, 2406237, 2705863, 2686535, 2616869, 2799981, 2885947, 2693062, 2956692, 3096325, 3042954, 3151482, 3254789, 3300311, 3385799, 3535297, 3734336, 3716760, 3832396, 3790104, 3897727, 3898979, 4071661, 4284925, 4043932, 4104776, 4255323, 4110721, 4170131, 4344055, 4330313, 4486479, 4602028, 4521598, 4473682, 4600190, 4523899, 4369830, 4339646, 4438046, 4451833, 4397703, 4029764, 3982326, 3859321]
4378C859321J64173p3344O3053R0972j7185r8222K0987k18312M477L99738j29484
4367D066174P6059J91809l56939k24187L74581j83195M3020k4997l970k621K36994
4356D192728K8788o6384Q4398j01365j11642m2946L36265M37051o9548j15592
4346D571753k8376J47847P5477L9273J05752j23794P7457j68656M6674J74182
4336D917589Q8267M1873m6792j26185O8133L06166K6425N5219J14710K16080j0691
4325E650794j28361o6140J02471M2281L21543p0399M60744K50047j86666L24876
4315F701190o9180l6960N04986M07881J36119L08472Q6924J07299K00152M12821
4305H759704L97263N09223M21339J20614N16712N75981O43276M26322P45107Q56354
$$ y = [3859321, 4023494, 3950150, 4013203, 4104175, 4086990, 3988768, 4009755, 3791443, 3795920, 4195658, 4066174, 4142233, 4334042, 3977103, 3752916, 4127497, 3944302, 3987322, 3962325, 3958355, 3955734, 4192728, 4221516, 4155132, 4239530, 4138165, 4026523, 3983577, 4319842, 4756893, 4687345, 4571753, 4543377, 4691224, 4766701, 4805974, 4911726, 4787932, 4865389, 4696733, 4743407, 4917589, 5005856, 5047729, 5000937, 4874752, 4942885, 5249051, 5275476, 5330695, 5445405, 5661485, 5650794, 5522433, 5456293, 5558764, 5601045, 5922588, 5852189, 6312933, 6562980, 6376314, 6701190, 6632010, 6595050, 7100036, 7507917, 7644036, 7952508, 8039432, 8146731, 8346883, 8759704, 9156967, 9666190, 10087529, 10208143, 10724855, 11300836, 11944112, 12370434, 13115541, 13971895]
4295A3971895N47445Q94899R42677N63685P84292J275185J247555J102321J132190
4286B2462144J193572J275942J417945J410955J848033J667856K135751J735432
4278C5147630J955304K108653K334184K313108K391901K421463K261893K624627
4270E3558763K462299K746479K677903K519499K537830K727707K623029K538482
4262G4391991K396045K496958K339996K352906K143710J836408J958154K041523
4254I1957691J338560J305439J246968J022958J009935L71176m468O7445R51m80255
4244I7836400m58520o45226j055356j187498j473161j328424j714765j809406
4236H8164044j764515j995336k079482k344582k199033k248057k465531k642973
$$ y = [13971895, 14519340, 15414239, 16356916, 16920601, 17704893, 18980078, 20227633, 21329954, 22462144, 23655716, 24931658, 26349603, 27760558, 29608591, 31276447, 33412198, 35147630, 37102934, 39211587, 41545771, 43858879, 46250780, 48672243, 50934136, 53558763, 56021062, 58767541, 61445444, 63964943, 66502773, 69230480, 71853509, 74391991, 76788036, 79284994, 81624990, 83977896, 86121606, 87958014, 89916168, 91957691, 93296251, 94601690, 95848658, 96871616, 97881551, 98252727, 98248259, 98315704, 98316655, 97836400, 97377880, 96732654, 95677298, 94489800, 93016639, 91688215, 89973450, 88164044, 86399529, 84404193, 82324711, 79980129, 77781096, 75533039, 73067508, 70424535]
4228G0424535k353901k320534k332021k360696j969341j979557j947225k165235
4220E2996025j654816j709775j509623j263266j211336r70543r89792q1740P89835
4211D4394969J412334M337811O770802P285710P292420O723997K464198m28057
4203H0254184k268610o109180p062297o824401o459691n968883n668132m687179
4195C5205811l664407k811409j748917j502608j299601q67382p36425j004417
4187B1570645o41381n05293n49637n08014l64332o59896L5768p2653j36686k07779
4177A7960742k60585L04778o1640k67514M3683j03690Q9931l67015k1727M86139
4167A7803102L23964J89912J59288O5331P9463K10453J02799K19682M5853M32750
$$ y = [70424535, 68070634, 65750100, 63418079, 61057383, 59088042, 57108485, 55161260, 52996025, 51341209, 49631434, 48121811, 46858545, 45647209, 44676666, 43686874, 43605134, 44394969, 45807303, 50145114, 56915916, 64201626, 71494046, 78218043, 80682241, 80254184, 77985574, 71876394, 64814097, 57989696, 51530005, 45561122, 39892990, 35205811, 31541404, 28729995, 26981078, 25478470, 24178869, 23311487, 22575062, 21570645, 20929264, 20423971, 19874334, 19366320, 19001988, 18342092, 18377860, 18305207, 18168521, 17960742, 17700157, 18004935, 17943295, 17675781, 17719464, 17615774, 17705705, 17338690, 17316963, 17803102, 18127066, 18316978, 18476266, 18541597, 18621060, 18831513, 18934312, 19153994, 19199847, 19632597]
4157A9632597M50086K97030O32717L43984L22822M36277L94884O24020O78689
4148B3813106P16206P00875Q85469Q03510P04158J113043Q29241J304688J617848
4139C2488144J403266J532593J574563J888677K243835K339901K620570K997042
4131D9088591K949292L437410M172442M410396M587750N225803N784124O351727
4123H6007535P079004P576457Q611647R121878R547193R976625J0412128J1077879
4115A59410346J1126887J0755969J0208071R360853Q527269P592126O008576N035778
4107B28025875L828142L026357J995234L19184k5041q43071j729626k582851l277130
4098B28737073m171483m906720o166221p201990p476704q306568r183517r493355
$$ y = [19632597, 20082683, 20379713, 21012430, 21356414, 21679236, 22115513, 22510397, 23134417, 23813106, 24529312, 25230187, 26115656, 26919166, 27623324, 28736367, 29565608, 30870296, 32488144, 33891410, 35424003, 36998566, 38887243, 41131078, 43470979, 46091549, 49088591, 52037883, 55475293, 59647735, 64058131, 68645881, 73871684, 79655808, 86007535, 93086539, 100662996, 109274643, 118396521, 127943714, 137920339, 148332467, 159410346, 170537233, 181293202, 191501273, 200862126, 209389395, 216981521, 222990097, 228025875, 231854017, 234880374, 236875608, 237194792, 237169751, 236326680, 234597054, 232014203, 228737073, 224565590, 219658870, 213492649, 206290659, 198813955, 190507387, 181323870, 171830515]
4090A71830515r543319r767485r076153r209214q737176q372540p701370p268017
4082A02155241o989229o056822n608030n090120m481828m185556l962065l757818
4074F2023773l159469l058753k708472k536253k235601k128021k154603j800120
4066D2242481j407094j285343j247274j375009r41056j212859j127436q90595
4058C2755815o84309j428111q99021o00386q74506p39403o50222m53386m17443
4049B6009028n23416r37016m17838o37390n18557m46715n65925p11777n14633
4040B0735761l76794m71129o52632l49577m33201k08378m89670l53923l76375
4031A7024082n73730l85062j98856k07716k01306l62263k00042l79856k88565
$$ y = [171830515, 162287196, 152519711, 143443558, 134234344, 125497168, 117124628, 109423258, 102155241, 95166012, 89109190, 83501160, 78411040, 73929212, 69743656, 65781591, 62023773, 58864304, 55805551, 53097079, 50560826, 48325225, 46197204, 44042601, 42242481, 40835387, 39550044, 38302770, 36927761, 35986705, 34773846, 33646410, 32755815, 32071506, 30643395, 29744374, 29143988, 28269482, 27530079, 26879857, 26426471, 26009028, 25485612, 24548596, 24130758, 23493368, 22974811, 22528096, 21962171, 21250394, 20735761, 20358967, 19887838, 19235206, 18885629, 18452428, 18244050, 17754380, 17400457, 17024082, 16450352, 16065290, 15866434, 15658718, 15457412, 15095149, 14895107, 14515251, 14226686]
4022A4226686L4924J41651l19473m80685n0416j6868l63300p7433j34742j85401
4012A2774943l23027l96522l7152j35926k76883J25776k94159q7991l3130J73040
4002A1488969P4732k25501m8511j28387l582J59607m30443k06005Q1503j39378
3992A0623004J5126K68729Q2096k02569K58560k5950j9086l3000O2838k92364
3982A0737384R3400L1616m7317j58975j05291K5812N7359o0121K68745J69642
3972A1012254K8673k35313L4850Q083K45111J637J07532j56286j16113J47188
3962A1077616j65392L24602K43391P7126j73778K01469K00136o7545K70175J09824
3952A2097624j44261K60929K89538P6284J05112K11224M56048L77975K97287Q0108
$$ y = [14226686, 14261610, 14403261, 14083788, 13603103, 13552687, 13535819, 13172519, 13095086, 12960344, 12774943, 12451916, 12055394, 12018242, 11882316, 11605433, 11731209, 11437050, 11349059, 11315929, 11488969, 11563701, 11338200, 11289689, 11161302, 11157720, 11317327, 10886884, 10680879, 10762382, 10623004, 10638130, 10906859, 10988955, 10786386, 11044946, 11018996, 10999910, 10966910, 11029748, 10737384, 10830784, 10862400, 10815083, 10656108, 10550817, 10576629, 10633988, 10573867, 10842612, 11012254, 11040927, 10805614, 10840464, 10848547, 11093658, 11095295, 11202827, 11046541, 10930428, 11077616, 10912224, 11236826, 11480217, 11557343, 11383565, 11585034, 11785170, 11717625, 11987800, 12097624, 11953363, 12214292, 12503830, 12580114, 12685226, 12896450, 13352498, 13730473, 14027760, 14107868]
3942A4107868J38118K33373L53601N92573L48439M22469K00043M32152L71542
3933A7200178O47269M30981M20651K65094L63791O36414M62454O11825M36559
3924B1475216N53460Q01501Q48228N30628M30576Q39781Q38416P30364Q63372
3915B7911542Q26269Q01275J088659J381127Q16008J323835J685473J332800J442515
3906C8609503J781511K071902J989374K115490K321060K583162K542520K645407
3898E6659929K413968L043422L138915K904820K602817K773949K831979L029648
3890G9399447L249874K878377L325752K991537L453099L358394L160212L243342
3882A05060034L283148L441984L224143K706178L060103L154225L106975L131639
$$ y = [14107868, 14245986, 14479359, 14832960, 15425533, 15773972, 16196441, 16396484, 16828636, 17200178, 17847447, 18278428, 18699079, 18964173, 19327964, 19964378, 20426832, 21038657, 21475216, 22028676, 22830177, 23678405, 24209033, 24639609, 25479390, 26317806, 27048170, 27911542, 28737811, 29539086, 30627745, 32008872, 32824880, 34148715, 35834188, 37166988, 38609503, 40391014, 42462916, 44452290, 46567780, 48888840, 51472002, 54014522, 56659929, 59073897, 62117319, 65256234, 68161054, 70763871, 73537820, 76369799, 79399447, 82649321, 85527698, 88853450, 91844987, 95298086, 98656480, 101816692, 105060034, 108343182, 111785166, 115009309, 117715487, 120775590, 123929815, 127036790, 130168429]
3874A30168429L100503K629556K637838K027692K071476J203591N70061J79362
3866A44588508p30065r84936j702425j856001j697992k108277k130469j944437
3858A31433906k304218k097921k230530k155117k416359k171452k459977k204358
3850A13393974k445524k257523k331194j808985j805926k044135j220509j247622
3842I8232556j144440j409757r58111m80304m85473k09996j74307K55893N82486
3833I4208547O21004J161988J451473J678604J850183K188643K403243K491784
3825A08055469K980829L113482K708438K672307L166951L198565L169189K991021
3817A32056251L031401K859892K794981K861778K369048K399005K396253J684407
$$ y = [130168429, 133268932, 135898488, 138536326, 140564018, 142635494, 143839085, 144409146, 144588508, 143858443, 142873507, 141171082, 139315081, 137617089, 135508812, 133378343, 131433906, 129129688, 127031767, 124801237, 122646120, 120229761, 118058309, 115598332, 113393974, 110948450, 108690927, 106359733, 104550748, 102744822, 100700687, 99480178, 98232556, 97088116, 95678359, 94720248, 94239944, 93754471, 93544475, 93370168, 93626061, 94208547, 94829551, 95991539, 97443012, 99121616, 100971799, 103160442, 105563685, 108055469, 111036298, 114149780, 116858218, 119530525, 122697476, 125896041, 129065230, 132056251, 135087652, 137947544, 140742525, 143604303, 145973351, 148372356, 150768609, 152453016]
3809A52453016J645222J348245J271959Q50540Q07370O99691M21481j1951q215
3800A59477358k61238m54744q21288p09135m71035r42186j380717j563233j518064
3791A51355718j671844k093230k054033k080983k613637k698215l135416l163651
3783A31844709l448761l067729l408575l773512l516904l597019m044143l842562
3775A03145504l716561l463830l654932l662575l353063l707780m065747l648738
3767G3872278l527673l052947l142423l251528k825638k809140k352571k132224
3759E0778134j975993j714671j710310j729636j089267q83100j171420p44774
3751C9758963o25388n38128n56696j70787l70799j15156n6327n02407n0512N5744
$$ y = [152453016, 154098238, 155446483, 156718442, 157568982, 158376352, 159076043, 159497524, 159485573, 159477358, 159216120, 158761376, 157940088, 157230953, 156759918, 155817732, 154437015, 152873782, 151355718, 149683874, 147590644, 145536611, 143455628, 140841991, 138143776, 135008360, 131844709, 128395948, 125328219, 121919644, 118146132, 114629228, 111032209, 106988066, 103145504, 99428943, 95965113, 92310181, 88647606, 85294543, 81586763, 77521016, 73872278, 70344605, 67291658, 64149235, 60897707, 58072069, 55262929, 52910358, 50778134, 48802141, 47087470, 45377160, 43647524, 42558257, 41675157, 40503737, 39758963, 39133575, 38595447, 38038751, 37867964, 37497165, 37382009, 37325682, 36823275, 36772763, 36828507]
3741C6828507l00486l33081K8380o399j4054o0515l36145k48151n073l17407m68183
3730C4767393l41504o86010q97727n69775o22439n72765q92300q52008m66389
3721B8866476r41866p69950q18293r92193o76564r12804q58972o13530n33174
3712B1749130q85579q81880p85191m73089p27522o19007n44093q25472n90397
3703A5416900p08240k48687j89067m57216m73893l42069l95598k18281o12748
3694A1771101j06121J1801k81598j86886r6208k90134l76412j76040j33058m6797
3684A0089648k74239l66408j84379j40834m34579k3952j76651N7862J78284l17631
3674H407121j95315j50632M9904K6179j41795q0902K9957k26985l44539q4139
$$ y = [36828507, 36528021, 36194940, 36223320, 36216921, 36202867, 36142352, 35806207, 35558056, 35552983, 35235576, 34767393, 34425889, 33739879, 32842152, 32272377, 31649938, 31077173, 30184873, 29332865, 28866476, 27924610, 27154660, 26336367, 25344174, 24667610, 23754806, 22895834, 22282304, 21749130, 20863551, 19981671, 19196480, 18723391, 17995869, 17376862, 16832769, 16007297, 15416900, 14708660, 14459973, 14270906, 13813690, 13339797, 12997728, 12602130, 12383849, 11771101, 11664980, 11676781, 11395183, 11208297, 11112089, 10821955, 10445543, 10269503, 10136445, 10089648, 9815409, 9449001, 9264622, 9123788, 8689209, 8665257, 8488606, 8546468, 8724752, 8407121, 8211806, 8061174, 8111078, 8137257, 7995462, 7914560, 7944517, 7717532, 7372993, 7288854]
3664G288854j15435p9571q572L6061P176n7686k87065r5088K0368O7020k49029
3653F527033j07654M0093J10040K11362j75065l93321J11999j1773l19294k28089
3643E765331K63894k90336l8481l2726j73465J79915l03304j50406L76139P8451
3633E675012k99062r7037L9933K91536k16480j16742P5490l3525J09888j8485
3623E410528j56929k40390M7494J42373J09518p6946j7959K04664P9731M6392
3613E548476j56119K97438J54750p6057k15017k16482J15768K5747j27046o0514
3603E290944q0041J12911m0712L29768J20537j36973k39400l23143K98443J7711
3593E350045M5123Q4342J77760K49256r2354j7069L96480L30399O249k99792J39357
$$ y = [7288854, 7173419, 7093848, 7085276, 7121337, 7128513, 7070827, 6783762, 6688674, 6709042, 6776062, 6527033, 6419379, 6459472, 6569512, 6780874, 6605809, 6212488, 6324487, 6312714, 5993420, 5765331, 6029225, 5738889, 5700408, 5667682, 5494217, 5674132, 5370828, 5220422, 5596561, 5675012, 5375950, 5278913, 5318846, 5610382, 5393902, 5277160, 5352650, 5319125, 5429013, 5410528, 5253599, 5013209, 5060703, 5203076, 5312594, 5235648, 5217689, 5422353, 5502084, 5548476, 5392357, 5689795, 5844545, 5768488, 5553471, 5336989, 5452757, 5478504, 5351458, 5290944, 5210903, 5323814, 5283102, 5612870, 5733407, 5596434, 5357034, 5033891, 5332334, 5350045, 5395168, 5479510, 5657270, 5906526, 5814172, 5797103, 6193583, 6523982, 6530231, 6230439, 6369796]
3582F369796Q2111m1628K89705j81350J8919O2924K67762L50501K11036J41535
3572G571311l6650L33007K10538L25040K9071J80393N73060O52786O29309P02104
3562A1169969Q07579Q68192O98342J015983J306585J723310J963659K494303L091044
3553B5138966L898402N537055O791036Q675149Q949642Q576286P131312M540601
3545G9238449J939294o53542l413576m897593n818859o140219o010762n615010
3537D8628182m752221l943460l302424k165117j422521j040812o38861k56968
3529C1105798M97798N86763J231343J753686K186837K802693L787585N232220
3521D9184723P029823R420610J3196342J6954809J8491062J8795739J5912848
$$ y = [6369796, 6451907, 6410279, 6699984, 6518634, 6537553, 6600477, 6868239, 7218740, 7429776, 7571311, 7534661, 7867668, 8078206, 8403246, 8432317, 8612710, 9185770, 9838556, 10467865, 11169969, 11977548, 12845740, 13544082, 14560065, 15866650, 17589960, 19553619, 22047922, 25138966, 29037368, 34574423, 41365459, 50040608, 58990250, 67566536, 74697848, 79238449, 81177743, 80524201, 77110625, 72213032, 66394173, 60253954, 54243192, 48628182, 43875961, 39932501, 36630077, 34464960, 33042439, 32001627, 31362766, 31105798, 31603596, 32190359, 33421702, 35175388, 37362225, 40164918, 43952503, 49184723, 56214546, 65635156, 78831498, 95786307, 114277369, 133073108, 148985956]
3514A48985956R980450L862976k074606p854336j1872210j3777728j3995476j3662309
3506I9592717j2828677j1635141r699234p641402n909664m307579l627702k603924
$$ y = [148985956, 158966406, 162829382, 160754776, 152900440, 141028230, 127250502, 113255026, 99592717, 86764040, 75128899, 65429665, 57788263, 51878599, 47571020, 43943318, 41339394]
$$ [...]
##END NTUPLES=NMR SPECTRUM
##END=
