##TITLE=1H_DE-80H_X3
 200.13MHz, d2o
 8 sc
 
 19ns.26.2.2025
##JCAMPDX= 6.0         $$ Bruker NMR JCAMP-DX V2.0
##DATA TYPE= NMR SPECTRUM
##DATA CLASS= NTUPLES
##ORIGIN= UXNMR, Bruker Analytische Messtechnik GmbH
##OWNER= pz
$$ XWIN-NMR		Version 3.5
$$ Wed Jul 29 10:37:38 2026 Russian Standard Time (UT+4h)  Yarkov@DPX200
##.OBSERVE FREQUENCY= 200.1313
##.OBSERVE NUCLEUS= ^1H
##.ACQUISITION MODE= SIMULTANEOUS
##.ACQUISITION SCHEME= undefined
##.AVERAGES= 8
##.DIGITISER RES= 18
##SPECTROMETER/DATA SYSTEM= spect
##.PULSE SEQUENCE= zg30
##.SOLVENT NAME= DMSO
##.SHIFT REFERENCE= (INTERNAL, DMSO, 0, 15.5034)
##AUDIT TRAIL= $$ (NUMBER, WHEN, WHO, WHERE, WHAT)
$$ ##TITLE= Audit trail, XWIN-NMR		Version 3.5
$$ ##JCAMPDX= 5.01
$$ ##ORIGIN= Bruker BioSpin GmbH
$$ ##OWNER= Yarkov
$$ C:/Bruker/XWIN-NMR/data/yarkov2/nmr/H-C/1/pdata/1/auditp.txt
$$ ##AUDIT TRAIL=  $$ (NUMBER, WHEN, WHO, WHERE, WHAT)
(   1,<2026-07-29 10:36:44.96 +0400>,<Yarkov>,<DPX200>,
      <created by zg, POWCHK disabled, PULCHK disabled
       configuration hash MD5:
       00 E9 B6 7A A2 85 ED C7 34 08 36 98 17 FE 4E 26
       data hash MD5: 16K
       F1 3A 63 9D 81 C7 7A A2 58 9A B9 36 38 58 E7 54>)
(   2,<2026-07-29 10:36:58.95 +0400>,<Yarkov>,<DPX200>,
      <Start of raw data processing
       efp BC_mod = 2 LB = 0.25 FT_mod = 6 PKNL = 1 PHC0 = -7253.183 PHC1 = 2.82197 SI = 16K 
       data hash MD5: 16K
       75 3B 66 52 8E 51 66 18 DE 17 97 08 F7 F3 47 DC>)
$$ ##END=
$$ 
$$ hash MD5
$$ 90 D8 96 DB DA B4 E5 42 CA AE 27 3A E0 0E 87 7E
##$RELAX= 
##$RELAX= 
##$RELAX= 
##$RELAX= 
##$RELAX= 
##$RELAX= 
$$ Bruker specific parameters
$$ --------------------------
##$DU= <C:/Bruker/XWIN-NMR>
##$EXPNO= 1
##$NAME= <H-C>
##$PROCNO= 1
##$TYPE= <nmr>
##$USER= <yarkov2>
##$AMP= (0..31)
100 100 100 100 100 100 100 100 100 100 100 100 100 100 100 100 100 100 
100 100 100 100 100 100 100 100 100 100 100 100 100 100 
##$AQSEQ= 0
##$AQ_mod= 1
##$AUNM= <au_zg>
##$AUTOPOS= <>
##$BF1= 200.13
##$BF2= 200.13
##$BF3= 200.13
##$BF4= 200.13
##$BF5= 200.13
##$BF6= 200.13
##$BF7= 200.13
##$BF8= 200.13
##$BYTORDA= 1
##$CFDGTYP= 0
##$CFRGTYP= 5
##$CHEMSTR= <none>
##$CNST= (0..31)
1 1 145 1 1 1 1 1 1 1 1 1 1 1 1 1 1 1 1 1 1 1 1 1 1 1 1 1 1 1 1 1 
##$CPDPRG= <>
##$CPDPRG1= <>
##$CPDPRG2= <>
##$CPDPRG3= <>
##$CPDPRG4= <mlev>
##$CPDPRG5= <mlev>
##$CPDPRG6= <mlev>
##$CPDPRG7= <mlev>
##$CPDPRG8= <mlev>
##$CPDPRGB= <>
##$CPDPRGT= <>
##$D= (0..31)
0 0.7 0 0 0 0 0 0 0 0 0 0.03 0 0 0 0 0 0 0 0 0 0 0 0 0 0 0 0 0 0 0 0 
##$DATE= 1785307004
##$DBL= (0..7)
120 120 120 120 120 120 120 120 
##$DBP= (0..7)
150 150 150 150 150 150 150 150 
##$DBP07= 0
##$DBPNAM0= <>
##$DBPNAM1= <>
##$DBPNAM2= <>
##$DBPNAM3= <>
##$DBPNAM4= <>
##$DBPNAM5= <>
##$DBPNAM6= <>
##$DBPNAM7= <>
##$DBPOAL= (0..7)
0.5 0.5 0.5 0.5 0.5 0.5 0.5 0.5 
##$DBPOFFS= (0..7)
0 0 0 0 0 0 0 0 
##$DE= 6
##$DECBNUC= <off>
##$DECIM= 32
##$DECNUC= <off>
##$DECSTAT= 4
##$DIGMOD= 1
##$DIGTYP= 9
##$DL= (0..7)
0 120 120 120 120 120 120 120 
##$DP= (0..7)
$$ [...]
##$SUBNAM2= <"">
##$SUBNAM3= <"">
##$SUBNAM4= <"">
##$SUBNAM5= <"">
##$SUBNAM6= <"">
##$SUBNAM7= <"">
##$SUBNAM8= <"">
##$SUBNAM9= <"">
##$SW= 18.0517328524113
##$SWIBOX= (0..15)
0 0 2 0 0 0 0 0 0 0 0 0 0 0 0 0 
##$SW_h= 3612.71676300578
##$TD= 16384
##$TD0= 1
##$TE= 0
##$TE2= 300
##$TE3= 300
##$TEG= 300
##$TL= (0..7)
0 120 120 120 120 120 120 120 
##$TP= (0..7)
150 150 150 150 150 150 150 150 
##$TP07= 0
##$TPNAME0= <>
##$TPNAME1= <>
##$TPNAME2= <>
##$TPNAME3= <>
##$TPNAME4= <>
##$TPNAME5= <>
##$TPNAME6= <>
##$TPNAME7= <>
##$TPOAL= (0..7)
0.5 0.5 0.5 0.5 0.5 0.5 0.5 0.5 
##$TPOFFS= (0..7)
0 0 0 0 0 0 0 0 
##$TUNHIN= 0
##$TUNHOUT= 0
##$TUNXOUT= 0
##$USERA1= <user>
##$USERA2= <user>
##$USERA3= <user>
##$USERA4= <user>
##$USERA5= <user>
##$V9= 5
##$VALIST= <valist>
##$VCLIST= <CCCCCCCCCCCCCCC>
##$VD= 0
##$VDLIST= <DDDDDDDDDDDDDDD>
##$VPLIST= <PPPPPPPPPPPPPPP>
##$VTLIST= <TTTTTTTTTTTTTTT>
##$WBST= 1024
##$WBSW= 4
##$XGAIN= (0..3)
0 0 0 0 
##$XL= 0
##$YL= 0
##$YMAX_a= 143376
##$YMIN_a= -209126
##$ZGOPTNS= <>
##$ZL1= 120
##$ZL2= 120
##$ZL3= 120
##$ZL4= 120
##$ABSF1= 0
##$ABSF2= 0
##$ABSG= 0
##$ABSL= 0
##$ALPHA= 0
##$AQORDER= 0
##$ASSFAC= 0
##$ASSFACI= 0
##$ASSFACX= 0
##$ASSWID= 0
##$AUNMP= <proc_1d>
##$AZFE= 0.1
##$AZFW= 0.1
##$BCFW= 0
##$BC_mod= 2
##$BYTORDP= 0
##$COROFFS= 0
##$CY= -3
##$DATMOD= 1
##$DC= 0
##$DFILT= <>
##$DTYPP= 0
##$F1P= 0
##$F2P= 0
##$FCOR= 1
##$FTSIZE= 16384
##$FT_mod= 6
##$GAMMA= 0
##$GB= 0
##$INTBC= 1
##$INTSCL= 3.241238e-09
##$ISEN= 128
##$LB= 0.25
##$LEV0= 0
##$LPBIN= 0
##$MAXI= 10000
##$MC2= 0
##$MEAN= 0
##$ME_mod= 0
##$MI= 1.114404
##$NCOEF= 0
##$NC_proc= -6
##$NLEV= 6
##$NOISF1= 3.799351
##$NOISF2= 2.8
##$NSP= 0
##$NTH_PI= 0
##$NZP= 0
##$OFFSET= 15.50339
##$PC= 1
##$PHC0= -7253.183
##$PHC1= 2.82197
##$PH_mod= 1
##$PKNL= yes
##$PPARMOD= 0
##$PSCAL= 0
##$PSIGN= 0
##$REVERSE= no
##$SF= 200.130003664659
##$SI= 16384
##$SIGF1= 3
##$SIGF2= 2
##$SINO= 0.751879
##$SIOLD= 32768
##$SREGLST= <19F.Aceton>
##$SSB= 0
##$STSI= 16384
##$STSR= 0
##$SW_p= 3612.71676300578
##$SYMM= 0
##$S_DEV= 0
##$TDeff= 16384
##$TDoff= 0
##$TI= <>
##$TILT= no
##$TM1= 0
##$TM2= 0
##$TOPLEV= 0
##$USERP1= <user>
##$USERP2= <user>
##$USERP3= <user>
##$USERP4= <user>
##$USERP5= <user>
##$WDW= 1
##$XDIM= 16384
##$YMAX_p= 300832617
##$YMIN_p= -322580
$$ End of Bruker specific parameters
$$ ---------------------------------
##NTUPLES= NMR SPECTRUM
##VAR_NAME=  FREQUENCY,     SPECTRUM/REAL,   SPECTRUM/IMAG
##SYMBOL=    X,             R,               I
##VAR_TYPE=  INDEPENDENT,   DEPENDENT,       DEPENDENT
##VAR_FORM=  AFFN,          ASDF,            ASDF
##VAR_DIM=   16384,         16384,           16384
##UNITS=     HZ,            ARBITRARY UNITS, ARBITRARY UNITS
##FACTOR=    0.220516191357247, 1,           1
##FIRST=     3102.69355999419, 0,            0
##LAST=      -510.023203011591, 0,           0
##MIN=       -510.023203011591, -322580,     0
##MAX=       3102.69355999419, 300832617,    0
$$ Real data points
##PAGE= N=1
##DATA TABLE= (X++(R..R)), XYDATA
$$ [...]
11206 -164882 -224114 -208529 -159478 -124089 -159080 -188973 -175272 -207178 -234257 -184841 -99274
11195 -99274 -49613 5630 40018 -21590 -21027 -109646 -217908 -171549 -123667 -125095 -111645 -63846
11183 -63846 -76273 -97258 -146653 -154619 -120247 -181450 -195405 -198994 -175513 -130598 -173041 -180951
11171 -180951 -211505 -166735 -159073 -135610 -80559 -90668 -123841 -91763 -52928 -111790 -113301 -100445
11159 -100445 -159818 -135113 -140060 -117884 -174377 -268069 -178970 -104444 -108638 -121523 -132879 -125249
11147 -125249 -113067 -126157 -164074 -76543 -42619 -41727 -85779 -89556 -65164 -78425 -160560 -144964
11135 -144964 -111186 -87414 -97126 -118150 -107070 -71403 -144637 -197359 -176295 -160370 -170934 -220089
11123 -220089 -240718 -149807 -161540 -96131 -66372 -165529 -156588 -168166 -102984 -12052 -85190 -130286
11111 -130286 -161175 -159505 -94045 -127143 -106640 -109435 -127821 -163432 -125777 -120848 -128837 -96102
11099 -96102 -55461 -93286 -71251 -84503 -175415 -133119 -116290 -92528 -47159 -115003 -101240 -131502
11087 -131502 -121761 -175726 -161209 -118199 -186272 -197882 -141746 -107520 -117255 -122056 -121522 -143496
11075 -143496 -149548 -168329 -112598 -45930 -30650 -23499 -105977 -123890 -129639 -96985 -45477 -36510
11063 -36510 -52065 -99221 -98336 -150867 -197716 -130934 -75234 -108234 -94418 -122991 -163728 -132044
11051 -132044 -83319 -121688 -159670 -189379 -110521 -91446 -88122 -119412 -159954 -147566 -160896 -127273
11039 -127273 -174318 -184959 -109353 -98991 -140877 -158571 -75057 -25893 -98624 -183941 -204180
11028 -204180 -123977 -85739 -140021 -185879 -163105 -136505 -147630 -128141 -143211 -124917 -131831 -175668
11016 -175668 -199942 -153271 -95967 -70261 -97271 -77972 -80370 -100809 -55582 -132057 -102593 -160892
11004 -160892 -101242 -56726 -84511 -131294 -84827 -119161 -120005 -120367 -62724 -92016 -147804 -116849
10992 -116849 -130233 -194063 -102836 -72107 -41751 -17733 -70315 -111096 -136594 -85193 -63558
10981 -63558 -80912 -114306 -78946 -150699 -138438 -138963 -134891 -96257 -135569 -119448 -97952 -131081
10969 -131081 -116422 -110194 -153202 -158183 -189111 -153785 -173240 -148432 -156106 -181075 -134730 -188983
10957 -188983 -153337 -103324 -116085 -107548 -111146 -158130 -168274 -173046 -81746 -77168 -110316 -117055
10945 -117055 -92476 -134796 -143043 -181895 -162411 -115523 -70516 -67338 -116149 -99530 -119721 -113472
10933 -113472 -43294 -62789 -76745 -141642 -164311 -98931 -83591 -153420 -161253 -170512 -166471 -135711
10921 -135711 -105928 -96523 -83043 -133248 -143292 -134684 -146623 -126363 -107627 -136985 -53093 -69469
10909 -69469 -110593 -154297 -148825 -100602 -100508 -149771 -136565 -99291 -77074 -81408 -69664 -21722 -132917
10896 -132917 -82746 -10933 -17809 -39401 -10514 -25079 -41896 -23161 34897 -27380 -53364 -44523
10884 -44523 -80989 -60032 -83342 -84725 -36378 49967 47111 -92762 -93602 -53304 -69859 -103486
10872 -103486 -93315 -61138 -29586 -99291 -93372 -115707 -124133 -66276 -113988 -129990 -47366 -6711
10860 -6711 -25521 -81572 -80838 -73729 1257 -34372 38331 49135 107450 59680 -14101 38187
10848 38187 96086 23782 2028 37514 11253 22033 48507 89934 26751 -58596 -10781 22718
10836 22718 39934 119553 62229 55699 71399 58644 36374 56429 135695 184942 165664 167118
10824 167118 121099 88259 120305 129823 128920 68087 109731 149670 171555 180254 145743 86350
10812 86350 89554 93281 93258 102267 140320 153607 103498 188314 157724 200316 180963 225330 151608
10799 151608 205771 242275 246119 271244 283451 301278 308059 329888 308531 299186 299510 346262
10787 346262 406666 391699 347005 294168 357921 437746 445677 437866 413215 426167 449278 498574
10775 498574 485674 588594 570268 512961 582322 603791 672622 697679 634178 703524 814131
10764 814131 817988 803756 881598 835581 807817 925676 943904 1008595 1126978 1153539 1153048 1148279
10752 1148279 1136201 1220562 1258839 1260548 1328788 1353134 1383396 1523447 1527847 1590464 1722172
10741 1722172 1811779 1833396 1885001 1948479 2056117 2204822 2323845 2398999 2541278 2666844
10731 2666844 2761186 2886038 3016864 3089390 3133628 3240613 3410290 3517715 3630960 3629994
10721 3629994 3719019 3890650 3922045 3961280 4015254 4078824 4115316 4159278 4210376 4226587 4253849
10710 4253849 4297015 4345382 4444904 4485599 4485492 4494285 4583581 4669115 4691594 4718172 4717227 4722001
10698 4722001 4796768 4820237 4853012 4879027 4867853 4816403 4850946 4909686 4925275 4860446 4873310
10687 4873310 4828911 4832526 4838698 4776053 4704181 4643987 4697414 4715779 4641119 4598814 4481242
10676 4481242 4460103 4495317 4410401 4310395 4272316 4289013 4277929 4232464 4212802 4100050 3982331
10665 3982331 3848824 3757206 3635722 3575248 3486518 3411684 3350911 3218141 3087607 3005434
10655 3005434 2838276 2703334 2645341 2605644 2482513 2371179 2273352 2198088 2151752 2029126
10645 2029126 1922357 1814387 1811366 1797256 1712658 1579872 1566504 1486213 1351501 1341164 1274722
10634 1274722 1267390 1233320 1166889 1105233 1076302 1105484 1053780 1032518 1005858 969446 935112
10623 935112 916735 903329 839777 777915 809415 840314 770279 679932 746143 699350 702533 740135
10611 740135 675252 606148 640832 659656 669775 613014 498734 604772 602908 483491 426325
10600 426325 398961 441468 474917 404728 454165 438947 436770 411282 380280 400107 376251 398791
10588 398791 444655 381232 321210 318257 340598 378153 313720 301328 279991 290956 305439 347165
10576 347165 327541 320411 279560 275052 289915 232914 244192 232913 289455 299644 202278 184124
10564 184124 199973 191671 157358 194312 160573 135384 136945 144619 140454 192626 171833 148910
10552 148910 148013 133722 77543 190640 169625 172095 204825 158669 150988 207080 202891 92665
10540 92665 112232 163161 119096 104537 95036 93879 133754 206616 149725 92795 109156 78094
10528 78094 100550 140627 135163 140937 121964 87772 35356 87279 69555 74418 151775 93327
10516 93327 60908 83392 48964 -4635 42677 75290 84054 76322 99936 111384 69978 45836
10504 45836 105541 96714 65769 39332 20511 35080 82094 11010 19174 1600 46504 -17596
10492 -17596 -1810 -14792 3340 35777 32933 15710 -4045 -48685 -91101 -55204 -15660 -3884
10480 -3884 -39046 -38011 -11052 52369 46393 32167 59462 51823 26321 51496 78807 70799 54015
10467 54015 63728 94190 98781 127398 61424 53283 43965 26857 95610 92219 -6471 -14940 -2410
10454 -2410 68652 83690 69844 63960 87658 68318 12853 -12647 -33722 10216 38260 16671
10442 16671 25613 -35996 -78976 -16349 -20757 -24929 -20159 -19794 -6312 16895 6146 -43851 15526
10429 15526 -22629 -56040 -32974 -64964 -76589 -25368 -10493 -37271 -20681 -59192 -27771 -36053
10417 -36053 -81948 -66814 -71879 -105942 -58658 -56351 -65267 -98671 -74093 -76193 -113472 -75106
10405 -75106 -152378 -95855 -7984 -68840 -67029 -63564 -38350 -76490 -84146 -85179 -49767 -52250 -43659
10392 -43659 -3943 10291 -33558 -11678 -45235 -17104 24407 48936 -4389 -23360 4500 31260
10380 31260 36777 -304 9447 33356 72105 97906 87209 80212 19603 -99600 -47517 -6875
10368 -6875 -12843 -41737 28173 82496 46181 83613 -7841 -29035 48794 39075 -32744 24931
10356 24931 49434 66546 20882 9311 86975 -5268 -48134 -44913 -45403 -40327 -52842 -35438
10344 -35438 6354 -27372 -47177 -44678 -12082 96073 99544 30830 -58375 -75814 -63482 -43872
10332 -43872 -7193 -48111 -69824 -93189 -64293 -68942 7909 -29241 657 -40227 -49351 -22457
10320 -22457 -76054 -89469 -123267 -60128 -109884 -102440 -111279 -88522 -41754 -1350 12384 -21898
10308 -21898 -93162 -98730 -18039 -16684 -62359 -15835 5850 -57890 -66578 -106359 -66765 -46790
10296 -46790 -65043 -46474 -21120 -15345 -34171 3538 -31245 -64159 -51628 -87711 -40799 19901
10284 19901 -9009 -29184 -77119 -89672 -76220 -80463 -169154 -157317 -72805 -89176 -76166 -8496
10272 -8496 -6296 -131775 -133486 -91429 -63538 -20868 -14854 -53585 -84009 -98638 -99821 -88254
10260 -88254 -99917 -6684 3587 -37908 -84673 -23556 -23441 -55883 11223 -60352 -76943 -101748
10248 -101748 -143577 -133283 -132773 -160651 -150311 -101787 -111737 -93577 3666 -26039 -102918 -123820
10236 -123820 -67259 -72231 -19738 -53111 -91138 -79938 -121606 -160520 -131646 -139718 -117913 -96980
10224 -96980 -80624 -116128 -79126 -114209 -115189 -121613 -127144 -77448 -144329 -170645 -105305 -105335 -154554
10211 -154554 -70093 -57924 -89469 -125704 -86190 -135663 -125526 -100158 -91137 -117442 -162203 -150264
10199 -150264 -195553 -156653 -46719 -82224 -66910 -43134 -97886 -122975 -182715 -157014 -136506
10188 -136506 -132147 -81538 -62448 -113677 -138714 -148248 -126512 -165590 -88520 -56528 -48019 -122923
10176 -122923 -195732 -163320 -82798 -72960 -128542 -108964 -77661 -79958 -94565 -30858 -43366 -44560
10164 -44560 -72690 -86241 -78168 -53551 -96797 -94515 -48115 -50007 -93559 -131482 -110268 -60749
10152 -60749 -98859 -102047 -52249 -41441 -80747 -29044 -91083 -140985 -109846 -155034 -157628 -90637
10140 -90637 -93107 -78748 -83864 -44028 -36400 -3929 -40174 -28516 -90909 -74823 -65744 -124278
10128 -124278 -127822 -133069 -99380 -124146 -102194 -82816 -47598 -96796 -115030 -157834 -147909 -90758
10116 -90758 -112662 -77248 -112584 -127194 -120602 -75263 -36022 -79904 -49277 -53102 -81186 -82417
10104 -82417 -104189 -48951 -31578 -76618 -65007 -78247 -105345 -126161 -143280 -160472 -131033 -96821
10092 -96821 -37503 -35322 -51937 -61237 -108533 -128029 -94643 -86618 -61921 -100417 -143109 -148022
10080 -148022 -95938 -46934 -69573 -103527 -63988 -92886 -110218 -105861 -121505 -83227 -24383 -31949
10068 -31949 -96271 -145774 -82247 -61523 -32073 -54502 -63387 -21269 -101887 -52263 -46429 18942
10056 18942 1306 -29849 -23849 -60938 -103474 -86885 -55364 -64158 -79754 -87124 -57173 -24720
10044 -24720 2194 -33321 -67812 -100991 -133807 -157159 -101567 -77927 -31254 -39029 -31030 -18569
10032 -18569 -23339 -5051 -28152 7991 51167 41402 37028 73516 24788 10285 -31446 -89102
10020 -89102 -52328 -39681 -121785 -192716 -122189 -130618 -110477 -77678 -53345 -14205 -24924 -38635
10008 -38635 -38540 -74914 -7682 18056 17019 18554 7531 -28445 -4060 6893 -54134 -61704 -3113
9995 -3113 14112 -44288 -19481 -60596 -3991 7801 -10091 -20994 -39999 -112198 -137855 -118547
9983 -118547 -78581 -1816 -29792 13116 -29784 17616 -26170 -23163 17254 55729 10633 33631
9971 33631 144135 63598 46310 64607 104010 69720 106740 129245 86219 115136 84082 32844
9959 32844 70742 74773 69688 82573 134904 192236 140115 171463 251367 221296 165052 246024
9947 246024 278036 305426 334475 358843 388536 437194 461820 466295 510209 575405 699049 670121
9935 670121 694718 800024 922550 1042708 1170622 1244620 1376146 1446458 1624109 1953844
9925 1953844 2284169 2623011 3149849 3872411 4733264 5835442 7099271 8563658 9921230
9916 9921230 11053488 11900067 12312586 12373498 12045073 11525861 10630318 9622059 8590716
9907 8590716 7494806 6435600 5479820 4654287 4051331 3551393 3198112 2839847 2519491
9898 2519491 2365973 2113573 1958482 1764415 1618738 1468347 1367892 1332778 1231164 1170391
9888 1170391 1127099 1098092 1034203 1000130 908078 827925 795518 769300 724562 733663 686508 681662
9876 681662 639110 674301 675300 671844 650731 698921 729771 619439 573066 479256 538202 514156
9864 514156 498523 456936 399945 352378 308433 259814 272852 286183 320841 378912 346684 289140
9852 289140 266442 281704 229944 185925 248990 295766 329930 356437 316122 275275 246054 249513
9840 249513 232006 212642 261542 328435 444401 441302 392551 369840 364226 287528 302443 292902
9828 292902 265811 201238 184037 161895 105928 125358 97726 125198 141406 130466 117611 100748
9816 100748 68239 103663 116140 125366 106539 23694 72534 79960 90369 70725 100643 90172
9804 90172 68234 116521 55033 55092 133681 97408 137207 129390 109922 95055 103608 108403 139061
9791 139061 163322 155899 80610 50229 48844 49932 141185 108284 13159 -36431 22843 73070
9779 73070 86897 78315 31464 -34923 4365 29651 45021 32158 -5287 -109916 -50547 -6183
9767 -6183 -33463 -6907 -52337 -54684 -21887 -4365 17395 -9628 15156 24395 19364 -47883 -22863
9754 -22863 83097 48496 102745 57485 32811 74583 57130 47504 33633 21213 56042 82649
9742 82649 23130 -44752 -54097 -18184 -27596 -32927 -9508 -1555 12001 24143 -4470 -30331 15883
9729 15883 20361 -32690 -28956 -34327 11749 -23628 24791 49374 -11487 -2224 -35471 -2668 59046
9716 59046 119540 247824 290751 327675 328110 297701 336431 333109 289317 211710 205553 187427
9704 187427 128955 116099 74227 42254 64816 22728 -4212 32447 48594 60298 56582 64975
9692 64975 -5855 7693 28006 28042 76479 68115 40741 54803 120822 214045 258067 307755 451785
9679 451785 482332 526672 559801 512622 499943 434683 402153 344374 296908 271296 246266 153687
9667 153687 74485 68218 94520 40850 7792 -28294 -32666 40246 45295 5650 2861 -12309
9655 -12309 -7749 -73211 -60642 49026 42065 45684 23052 -44965 -37949 -44216 -46263 -51389 -34431
9642 -34431 87005 70261 47993 -38962 -25634 -19198 10218 51833 4926 -46194 13798 51726
9630 51726 -11633 -16872 37431 -3803 -72156 -55951 29042 85042 10705 -46885 -69646 -88324
9618 -88324 -29482 -8703 -33125 -53679 2671 -27375 -72523 -53853 -906 -9173 -13974 -18437
9606 -18437 -33416 -78831 -114309 -43342 -12179 22617 27618 -45000 -67377 -41651 -47606 -23730
9594 -23730 -30906 -61250 -28141 -23819 -106219 -91897 -106359 -95423 -34530 -53900 -69137 -49192
9582 -49192 -72802 -101503 -92439 -75340 -55638 19508 773 -89818 -116614 -91728 -70492 -19653
9570 -19653 -20487 -29436 -41178 -73557 -67071 -63669 -63430 -84207 -36720 -97309 -66536 44987 -23667
9557 -23667 -29730 -33658 -33168 -19748 -19369 -25913 -9497 11986 -73151 -76580 -94462 -66049 -72239 -68607
9543 -68607 -37601 13230 -43033 -115719 -68544 -67240 -55789 -27256 -4504 -3349 -38436 -39730
9531 -39730 -44124 -49630 -39410 -24935 40697 51490 40474 -19853 43758 118511 138136 122433
9519 122433 142554 190337 193516 184072 205165 203178 242311 323986 368333 335845 357710 369925
9507 369925 314265 315224 239545 240572 264107 235605 177169 132310 127863 91421 68442 75219 25936
9494 25936 -8620 -15103 -34805 -9245 29014 8202 12448 41584 30438 -996 -16245 522
9482 522 -37636 3560 -13468 27659 6134 62445 45216 46351 81039 13394 5573 -4547 54434
9469 54434 64724 115275 81997 -19722 -16866 -25207 -6315 26515 -141 -1165 -22698 -21934 21876
9456 21876 -25744 -4872 -44042 -88152 -24610 -66276 -87042 -82104 -55135 -38926 -68154 -100981
9444 -100981 -58064 -87577 -97996 -93046 -72902 -57004 -20474 -6089 -1577 -89020 -152855 -112700
9432 -112700 -62038 -84424 -71442 -47281 -69298 16995 -71036 -126830 -97347 -97352 -44468 -12649
9420 -12649 -24076 -91492 -61972 -91371 -149601 -159178 -150067 -160219 -185534 -182466 -95804 -84958
9408 -84958 -29436 -86289 -146975 -98484 -74665 4893 43077 70153 3692 -57208 -29272 -18133
9396 -18133 -51687 16788 -51300 -57350 -92305 -76754 -85628 -57170 -37723 -131436 -75664 -68505
9384 -68505 -79009 -148591 -170887 -164013 -192041 -175126 -117888 -75617 -108989 -64050 -116568 -169920
9372 -169920 -107294 -128135 -127734 -115230 -197382 -146315 -121674 -142157 -118396 -157243 -127358 -65698
9360 -65698 -27411 -39076 -37083 -31067 -50622 -70867 -60082 -93107 -31328 20882 -34789 -67275
9348 -67275 -106077 -59221 -85888 -100478 -108788 -108691 -84545 -74304 -74250 -71474 -56056 -68649 -72744 -82238
9334 -82238 -82518 -75949 -92213 -34603 10648 -48030 -16397 -83833 -102731 -122182 -119785 -104565 -50822
9321 -50822 -30866 -102382 -92612 -74632 -65920 -23455 -42553 -66399 -43293 -95701 -111120 -39349
9309 -39349 -35994 -87864 -106499 -79338 -11974 -12187 12303 -21769 -38105 -61853 -34057 -9246
9297 -9246 -30622 2390 -15275 865 -8325 -37702 -63840 -22268 -83586 -116687 -148412 -117368
9285 -117368 -69275 -38342 -87409 -88640 -84737 -85533 36109 32722 -38198 -50585 16559 -10643
9273 -10643 -13547 -93994 -96774 -111804 -104417 -67982 5066 -60106 -88951 -69782 -66482 -17199 -8975
9260 -8975 -42595 -50074 -12719 -85222 -99165 -64161 -77818 -181334 -169755 -125953 -94209 -7670
9248 -7670 -27501 -42299 -24006 -36328 3109 19202 -56435 -38902 -31310 -48071 -47209 -39115 -25561
9235 -25561 -63978 -38677 -71536 -59193 -75215 -100549 -951 35879 -975 -54938 -61619 -48926
9223 -48926 -3056 -28037 -824 -19653 -83036 6629 -11099 -5782 -73170 -37320 34783 43711
9211 43711 108969 44595 -66280 -52352 -67709 -62257 1086 -31581 -59143 -35010 -33671 -25306
9199 -25306 13764 -18807 -57305 -52012 -46406 -66657 -74552 -38600 -10656 -25233 -42450 -57721
9187 -57721 -71504 -22337 -28179 -62055 -98604 -108714 -77693 -57082 -32534 25224 -59278 -52726
9175 -52726 -36338 -43021 -53425 3025 60040 -5167 34877 -52101 -53932 3982 31218 -65485
9163 -65485 -125825 -168188 -146215 -47427 -45867 -99652 -139221 -174452 -152843 -119182 -91361 -32311
9151 -32311 -77628 -104225 -62515 -69589 -61460 -40030 63404 74821 12556 -25872 -61796 -21414
9139 -21414 -42902 -99034 -52662 -64205 -24671 -52616 -76349 -88015 -82344 -94839 -171057 -140706
9127 -140706 -108904 -118146 -121576 -67629 -84332 -85868 -104584 -126627 -156349 -118150 -83973 -73964
9115 -73964 -64506 -113038 -107775 -95861 -84250 -15142 -20005 -72249 -71893 -46089 -10697 -27365 -2521
9102 -2521 -51449 -70809 -66418 -72225 -50935 -120170 -116666 -93568 3415 64901 -11977 11035 510
9089 510 -86424 -133777 -121362 -107152 -92218 -69813 -93548 -93514 -110462 -106223 -80360 -31418 -89825
9076 -89825 -61524 -96544 -73574 -64164 -96690 -95292 -124007 -142135 -107745 -86036 -53599 -42411
9064 -42411 -43684 -40654 -102053 -60620 -44023 -10572 -9516 -105262 -131704 -176377 -170349 -91590 -103036
9051 -103036 -158683 -86548 -70918 -74575 -39931 -67958 -96981 -56754 -104609 -90503 32406 -9679
9039 -9679 -43680 -23881 -31127 -14311 -55778 -107068 -111806 -199543 -178702 -120187 -103567 -69299
9027 -69299 -92659 -114278 -150625 -55577 -44656 -49820 -34268 -80304 -100628 -128388 -37715 -88939
9015 -88939 -45512 -65025 -76026 -55524 -70599 -75815 -149767 -202137 -133053 -88195 -126783 -101234
9003 -101234 -50844 -64635 -112734 -147354 -200540 -140998 -103193 -90635 -92599 -145263 -51048 -40709
8991 -40709 -68144 -79424 -28417 -29032 -38981 -81297 -56854 -48639 -31917 7867 -44876 14122 53196
8978 53196 -34799 -33166 -23657 -36124 -68989 -63432 -62060 -19333 -16018 -59286 -26460 19589 38281
8965 38281 -44660 -28353 -25206 -65676 -64437 5514 -11723 -47016 -5310 -77740 -142606 -94971
8953 -94971 -14232 -6214 -29664 -9524 8694 40485 -41338 -66423 -10712 7146 3817 34862
8941 34862 -18173 -17048 -19500 -29484 -55711 -26469 -27673 -56730 -30015 -28646 8689 -64284 -153744
8928 -153744 -132756 -61843 -82327 18501 -13530 -67363 15005 46215 96073 51121 -6735
8917 -6735 51741 155850 178533 243100 423031 669050 770257 829096 849350 783118 807235
8906 807235 772990 699279 537014 400859 402556 328905 224159 193344 154075 148806 130881
8895 130881 93279 109389 68987 26670 -4198 48037 -27700 -12215 -31118 -120877 -64120 9466
8883 9466 -8082 -62281 -69048 -37598 -73587 -33023 -5363 11183 10 -51402 -40455 3154
8871 3154 -108078 -123135 -76306 -100232 -66443 -32163 -84642 -118341 -76387 -109609 -17226 -27026
8859 -27026 13590 -62340 -28584 -56800 -139828 -85378 -65037 -38970 -20791 -74563 -82645 -75346
8847 -75346 -43521 -12769 -20077 -112933 -126417 -68582 -112634 -106229 -135583 -155894 -164736 -89763
8835 -89763 -59497 -29701 -61320 -42143 -45169 -118501 -154836 -136083 -142195 -130454 -86855 8010
8823 8010 -13612 -12688 -19814 -14530 -19063 -98639 -76804 -106974 -104959 -70731 -91547 -110645 -56739
8810 -56739 -93298 -60047 -92331 -121808 -82066 3643 -3063 -21947 -19782 -24914 -76415 -54117
8798 -54117 -152675 -170846 -52336 6267 -22913 -63717 -82471 -104598 -65080 -70410 -107731 -129344
8786 -129344 -74024 -61074 -62857 -113501 -73833 -26216 -72035 -57030 -43173 -56432 -60535 -78767
8774 -78767 -81015 -140304 -158930 -129234 -61073 -98690 -142054 -46015 -44315 -90182 -184145 -131219
8762 -131219 -85181 -75941 -88792 -71522 -53674 -81425 -91624 -91514 -17018 -62028 -67916 -88392
8750 -88392 -73755 -52025 -108177 -107601 -77870 -99087 -88957 -102477 -95562 -27826 -50471 -98317
8738 -98317 -36309 -52322 -132198 -46030 -3963 -59148 -57738 -68389 -104244 -158432 -175866 -99705
8726 -99705 -140525 -119585 -66816 -70900 -38591 -81033 -72693 -86193 -24249 -23776 -13442 -104439 -106056
8713 -106056 -54659 -15166 -26022 -56374 -79984 -128148 -79346 -47555 -36662 -44198 16683 -47642
8701 -47642 -60899 -110012 -156664 -117721 -82368 -93423 -82245 -48116 -62452 -66525 -30746 -28824
8689 -28824 -78484 -89259 -72528 -21966 -48891 -1263 7257 -71943 -144726 -81659 -95203 -99733
8677 -99733 -101655 -86209 -81689 -168830 -113494 -111687 -51570 -53687 -88133 -140481 -78576 -74533 -61818
8664 -61818 -73605 -161456 -152819 -134881 -139641 -157545 -175939 -150238 -142645 -67357 -95309 -94799 -69541
8651 -69541 -26995 -44359 -113913 -57735 -40177 -52745 -101564 -128642 -128393 -142783 -152795 -105246
8639 -105246 -101332 -95132 -120698 -161465 -137345 -137405 -152704 -95330 -154461 -133100 -142564 -140473 -97776
8626 -97776 -86129 -11086 -41007 -36593 -39602 -55085 -129739 -215280 -161749 -93176 -143410 -143996 -135292
8613 -135292 -99916 -71524 -99795 -95566 -116371 -78221 -77522 -68825 -103973 -210075 -148992 -75280
8601 -75280 -106211 -101925 -101999 -45883 -89615 -110395 -121993 -127149 -116270 -79215 -89922 -136056 -145679
8588 -145679 -149250 -174549 -155577 -164772 -192630 -192547 -146354 -145229 -152613 -178608 -132933 8560 -44056
8575 -44056 -97342 -104807 -96024 -77275 -42725 -91330 -92136 -90647 -85844 -143216 -201465 -190475 -133352
8562 -133352 -130370 -160098 -67917 -28982 -59388 -96382 -82161 -33684 -125526 -152349 -140112 -182453
8550 -182453 -138170 -171381 -182014 -82253 -69026 -64843 -88489 -120673 -116637 -98560 -133921 -122054
8538 -122054 -97825 -82612 -82939 -64845 -24354 -86265 -134542 -162594 -132061 -162208 -134206 -91526
8526 -91526 -73831 -16162 -87005 -134390 -83502 -78819 -52679 -65848 -85316 -62430 -80141 -130296
8514 -130296 -126413 -125140 -62415 -18876 -1361 -94870 -227915 -179535 -143912 -132021 -132541 -148825
8502 -148825 -137314 -92446 -72776 -77472 -78647 -115427 -113282 -170153 -140491 -87577 -88678 -122221
8490 -122221 -149952 -83170 -94233 -110336 -79152 -36193 -75023 -58591 -96030 -127223 -94760 -39817
8478 -39817 -48836 -63317 -155368 -155341 -178857 -208724 -177531 -190468 -172571 -126244 -69610 -60454 -58301
8465 -58301 -86088 -122124 -74613 -57351 -155186 -143411 -112608 -113186 -99970 -163858 -173554 -102824
8453 -102824 -115599 -145694 -102638 -79727 -63112 -117398 -130781 -122637 -149557 -173204 -192577 -159219
8441 -159219 -173923 -135188 -147896 -187690 -175666 -120730 -103960 -103572 -98895 -104681 -117684 -115647 -102589
8428 -102589 -130153 -168501 -182275 -115826 -134128 -110513 -83202 -101979 -89894 -155156 -129402 -103605
8416 -103605 -127369 -63661 -56979 -73317 -101223 -104130 -88528 -202163 -178614 -168245 -86921 -81096
8404 -81096 -65138 -22980 -115202 -173528 -149231 -175344 -189617 -164601 -132821 -88088 -87264 -38979
8392 -38979 -71431 -146841 -159009 -156799 -165457 -233555 -72538 -12284 -36950 -67740 -110355 -138383
8380 -138383 -138323 -107730 -137130 -117490 -189473 -199750 -123181 -72576 -83998 -163116 -116581 -70857
8368 -70857 -126430 -101312 -102505 -127646 -145001 -163330 -125554 -172696 -212153 -155266 -153243 -145461
8356 -145461 -102176 -100109 -155537 -179549 -170119 -129159 -118442 -105326 -159113 -142104 -167835 -180340
8344 -180340 -177962 -140759 -133046 -181156 -167987 -178574 -212533 -156114 -157673 -124730 -151206 -170861
8332 -170861 -202952 -143937 -78094 -101852 -117536 -120555 -97356 -58357 -144928 -190024 -125125 -120384
8320 -120384 -103516 -144616 -212679 -240997 -191893 -194018 -179012 -152839 -152072 -166381 -115582 -87026
8308 -87026 -151730 -212676 -176429 -193029 -162967 -153245 -160164 -111351 -129501 -162149 -133402 -144778
8296 -144778 -153236 -171357 -234574 -156323 -96512 -121269 -135061 -137922 -169922 -181166 -148912 -132403
8284 -132403 -117689 -206410 -99951 -108575 -138796 -101152 -149844 -172800 -136534 -72534 -130825 -102756
8272 -102756 -94309 -131379 -149984 -171256 -195753 -133696 -193519 -212373 -177443 -170359 -152037 -154773
8260 -154773 -115516 -142828 -162749 -103494 -71275 -74352 -130615 -94867 -51868 -104470 -56933 -52792
8248 -52792 -61663 -77165 -79912 -94232 -86766 -38104 -46066 -161276 -137706 -136232 -197825 -166639 -144894
8235 -144894 -136054 -134948 -141922 -109617 -66720 -123532 -171412 -208840 -137655 -129827 -188699 -171942
8223 -171942 -157456 -203491 -142081 -111371 -87758 -49521 -100106 -132966 -121311 -117624 -87044 -171576
8211 -171576 -193539 -195803 -189982 -119237 -122081 -124846 -59118 -157744 -177869 -190892 -159571 -141241
8199 -141241 -210067 -157971 -182169 -141967 -121441 -199380 -250969 193929 106789 -120439 -119124
8188 -119124 -54523 5732 -83947 -37471 -8390 -68754 -135892 -70750 -92385 -159511 -143200 -177153
8176 -177153 -127025 -150995 -123015 -92427 -113341 -87493 -159452 -149463 -114181 -187484 -120341 -70749
8164 -70749 -125517 -132909 -109622 -96072 -102973 -101214 -63598 -1937 -71439 -131182 -75119 -38246
8152 -38246 -120702 -159753 -142866 -99554 -98510 -119170 -110181 -37988 -78142 -84795 -83288 -93727 -66882
8139 -66882 -81074 -80611 -67300 -65929 -72801 -122239 -168638 -166372 -165812 -168880 -145881 -107271 -39755
8126 -39755 -68535 -100191 -106195 -84921 -105396 -62337 -59696 -105068 -102313 -109030 -94147 -77847 -154666
8113 -154666 -195464 -179283 -181209 -112069 -106177 -125544 -185498 -148392 -96042 -126671 -88218 -120455
8101 -120455 -150391 -158593 -195411 -160013 -151579 -91323 -108028 -105078 -129164 -72730 -53146 -131242
8089 -131242 -147234 -135753 -130504 -144357 -191627 -162157 -137641 -134542 -131980 -78538 -61823 -76353
8077 -76353 -73108 -146430 -60372 -94033 -97808 -125369 -138073 -113578 -75242 -12168 -10913 -68412
8065 -68412 -45256 -86739 -127558 -112503 -92737 -126559 -93802 -64204 -137079 -131483 -143393 -165073
8053 -165073 -108703 -122934 -102534 -55595 -55997 -92456 -133805 -176003 -194442 -131416 -146617 -214090
8041 -214090 -212892 -148743 -99913 -87453 -78958 -67314 -81060 -99120 -129716 -106162 -99049 -129179
8029 -129179 -160086 -143042 -196193 -166393 -121161 -116835 -56223 -78553 -130535 -47854 -38437 -66715
8017 -66715 -73687 -70081 -69763 -110153 -145889 -105772 -126571 -141255 -104608 -112520 -146321 -164010 -147292
8004 -147292 -145370 -166217 -166694 -146550 -141313 -102037 -51357 -58809 -63802 -96163 -96653 -147585 -140826
7991 -140826 -182902 -151416 -68003 -95654 -55412 -46176 -62719 -130708 -141668 -157966 -104352 -54980
7979 -54980 -116570 -64116 -49596 -54324 -93448 -117382 -71710 -113668 -172785 -107696 -63770 -113249
7967 -113249 -229891 -208283 -136348 -111624 -166022 -150640 -69802 -79008 -37170 -56567 -91475 -97954
7955 -97954 -72845 -22214 -59314 -90499 -108449 -85835 -77676 -111959 -129198 -168971 -173408 -170312
7943 -170312 -81660 -44165 -5293 -43619 -103256 -111231 -162789 -237465 -156144 -106380 -103438 -122873
7931 -122873 -120389 -79913 -102620 -177300 -189988 -155954 -200270 -207660 -181725 -149279 -79280 -70359
7919 -70359 -99635 -99275 -152380 -149329 -63089 -39534 3019 -31956 -72836 -94901 -61331 -40991
7907 -40991 -46146 -115792 -98450 -54301 -80508 -108639 -57966 -44355 -44458 -63692 -158303 -103782
7895 -103782 -74252 4839 -12416 -109958 -132112 -142659 -48442 -86837 -83304 14466 -34958 -94590
7883 -94590 17536 50613 -11317 -11307 -8028 -54256 -42507 -58599 -73366 -49413 -31393 -6871
7871 -6871 -33842 -48081 -82479 -115147 -74912 -33451 -83159 -145025 -122728 -130293 -191059 -145249
7859 -145249 -83907 -18778 -36803 466 -85411 -1534 49196 40497 37651 39194 27886 -16912
7847 -16912 2735 -34262 -31108 37770 44227 -13418 -57025 -51427 -66158 -92943 -108121 -157068
7835 -157068 -170833 -138227 -62282 -46077 -83403 -80832 -103114 -111032 -97932 -79196 -137425 -78949
7823 -78949 -83658 -99391 -98634 -87101 -78423 -29949 -30505 -68058 -55396 -123194 -87390 -34906 -46384
7810 -46384 -65388 -103207 -155085 -249561 -43297 122268 6727 57963 -12775 -33225 -12323
7799 -12323 -12147 34968 57114 73627 37569 -100159 -77327 -188534 -202697 -76774 -86150 -128085
7787 -128085 -82069 -103375 -98209 -39497 -96467 -61587 -3967 -5714 3278 -27270 -40036 -24942
7775 -24942 -48837 -59069 -33111 -41238 -114866 -96352 -84418 -75406 -22005 -46440 -69901 -53113
7763 -53113 -40057 -101455 -120642 -83841 -113434 -83944 -25397 -52763 -35074 -54743 -35115 -67714
7751 -67714 -81998 -87728 -107592 -95915 -41188 -80311 -127525 -88763 -114120 -104276 -60939 -70047
7739 -70047 -96200 -69544 -78380 -100071 -179359 -96215 -51423 -58884 -30748 7084 -63490 -115357
7727 -115357 -70270 -57662 -107802 -140053 -124956 -81646 -39504 -96868 -118189 -96762 -81337 -65550
7715 -65550 -88480 -112421 -133012 -77812 -115372 -129647 -88080 -67396 -67884 -45270 -85495 -145774
7703 -145774 -112608 -130521 -112712 -107086 -87397 -101401 -149892 -129801 -111808 -99661 -10345 -83429
7691 -83429 -138109 -62174 -69652 -172534 -243775 -196853 -90821 -59846 -113758 -81587 -44968 -82959
7679 -82959 -165842 -188730 -162819 -96358 -60081 -71298 -67984 -102138 -110633 -151774 -165525 -63938
7667 -63938 -45808 -20812 -41128 -89393 -48368 -32823 -39159 19235 21243 6326 -14022 -137
7655 -137 -15450 -60416 -108335 -110167 -77965 -80641 -70684 -122460 -28352 -40322 -9729 -45126 -17874
7642 -17874 8620 -51860 -161994 -122057 -93042 -75691 -102409 -17249 -51698 -81230 -31878 -52752
7630 -52752 -81769 -132838 -50819 -61611 -79503 -106843 -56016 -49716 5528 -22120 43677 47977
7618 47977 20248 34794 35126 23029 35871 81182 142327 110888 62992 26508 11701 72781
7606 72781 87026 81085 104639 122115 128326 81663 25638 34948 -11529 14798 109176 110925 100458
7593 100458 144719 184152 143340 129172 201812 185533 102032 90935 80368 122234 201605 224698
7581 224698 213321 174268 174730 183694 256326 229216 194852 173304 182818 212773 98969 137575
7569 137575 135839 199563 185347 144455 159982 213004 199794 197473 208305 291444 219329 158007
7557 158007 168272 241838 248512 253367 311546 308337 317275 348696 384235 323764 318306 350565 456410
7544 456410 444368 422055 433524 411258 411921 486879 447965 448235 510954 518362 537623 612599 649637
7531 649637 658061 649323 721455 772000 774702 786345 918429 884050 885244 995035 1057988 1033022
7519 1033022 1054346 1139179 1193950 1256535 1360837 1441328 1568118 1606480 1700854 1851458 2032286
7508 2032286 2215427 2361165 2477770 2639900 2819051 3099380 3408503 3804630 4191510 4604970
7498 4604970 5019253 5518007 6156715 6963224 7791953 8725243 9861237 11052158 12377159
7489 12377159 13742354 15015362 16125406 17126164 17728261 17987756 17851640 17467135 16882229
7480 16882229 15972637 14907504 13695059 12418895 11380899 10323051 9403119 8553297 7805348
7471 7805348 7070541 6419797 5948449 5458024 4994361 4608032 4209168 3964737 3699077 3519691
7461 3519691 3263007 3042043 2880103 2674817 2545046 2407664 2229064 2131868 2126517 2025046
7451 2025046 1891589 1836055 1754279 1696025 1619106 1518547 1409485 1388793 1318471 1240799 1252588
7440 1252588 1234453 1234925 1243462 1184632 1109847 1075926 1041431 1042090 964671 938925 843418 834353 836440
7427 836440 793779 804126 815130 770091 709880 666044 721178 700578 637148 690235 584529
7416 584529 596364 566874 528703 537264 561696 523124 510311 497177 490948 495029 443736 478793
7404 478793 440787 504293 469738 436247 425222 397264 484371 479298 418588 417104 385862 407028
7392 407028 463222 485478 442512 408063 398218 367824 325407 285048 298962 332667 372711 402687
7380 402687 375866 397248 316343 333432 330716 302794 330849 299954 294273 297681 320642 333215
7368 333215 329649 318106 265853 273322 283863 233925 233241 257091 274196 247221 276019 197103
7356 197103 165920 205895 180106 223701 248417 295430 199960 156073 182024 158476 125047 143961
7344 143961 133270 100514 132618 125333 88639 135094 123003 70570 62197 58516 83428 80844
7332 80844 75749 137119 182633 97248 87450 105145 68257 98124 156352 197011 133881 100344
7320 100344 106803 48621 53941 67066 23409 41512 29281 -32152 1521 46930 78597 49279
7308 49279 43277 84049 81536 119327 154004 100577 62118 6482 41901 63193 41966 81939
7296 81939 167807 131052 26656 -5117 35170 16365 23325 41989 -19349 -35985 27142 26483
7284 26483 -21845 -42341 2306 43900 21427 -10722 20195 56142 2248 -38064 -61977 -21269
7272 -21269 44270 24116 42135 37783 10658 -16675 -17483 -4473 -5241 34751 81415 77950 39218
7259 39218 -57398 -80830 -78010 -33726 1643 -36661 -1230 10447 -16911 22807 -43028 -31328
7247 -31328 -40787 -55420 16882 36548 66286 -48695 -49830 -75546 -56311 23051 3183 -55011
7235 -55011 -97964 -68490 -63573 -89715 -93314 -22737 -29109 -82272 -18441 5580 -36498 -61478
7223 -61478 -94158 -105962 -36815 -76953 -99796 -73725 -105212 -41353 -1228 33879 20806 -42892
7211 -42892 -20097 -26033 27609 497 -5878 -28902 -13979 -24957 12958 7379 29651 108251
7199 108251 80247 39848 20718 24677 14958 41093 45548 14553 -14176 -8736 -15052 35222 65971
7186 65971 52212 26501 -3250 29928 41366 -2776 17675 -7339 13931 2090 -49771 -36475
7174 -36475 -103800 -73746 -64167 -33031 -1239 5041 12906 29761 44531 39080 32314 75551 25116
7161 25116 -45139 -4827 -4075 -52353 -8607 8290 40550 33661 -57737 -57340 24978 57180 13504
7148 13504 -18297 -27126 -4474 -25951 -1182 -64806 -55223 -21386 -3198 -35168 -3546 -9604
7136 -9604 -49451 -26930 -18381 -26522 -24531 -34339 -24362 -71072 -11273 -10132 -49938 -36006 -24336
7123 -24336 -116398 -78844 -72211 -56875 -40126 -9363 950 11422 43102 -34072 -85292 -49901
7111 -49901 -48709 -136424 -167539 -58579 16538 -55084 -108594 -148798 -36647 -60892 -130920 -138665
7099 -138665 -79778 -83039 -83186 -52646 -54398 -53758 -64978 -88518 -172850 -139261 -38356 -30134 -40845
7086 -40845 -65020 -98734 -122798 -55514 -37547 -39093 -62648 -50837 -112016 -93333 -83631 -71737
7074 -71737 -66871 -45758 -54234 -100887 -81141 -76517 -113145 -72418 -99208 -98473 -45550 -105124 -128668
7061 -128668 -154676 -113667 -94495 -78041 -83702 -85215 -94403 -92316 -42165 -31967 -73989 -53523
7049 -53523 -54285 -41220 -13951 13644 85484 72969 17616 -30916 -18566 1202 18541 -42829
7037 -42829 -71856 -96586 -109905 -76480 -43444 -22803 -10550 -22518 -60290 -76677 -77821 -22103
7025 -22103 -83016 -71380 -25837 -88721 -91587 -58524 -15307 -15023 -62269 -78673 -70870 -68036 -73328
7012 -73328 -88264 -108347 -75618 -98711 -47432 -67830 -52541 -88550 -92218 -61336 -99184 -137065
7000 -137065 -125064 -85817 -62516 -117089 -159466 -179875 -152304 -134026 -113474 -83680 -95393 -118651
6988 -118651 -133019 -101281 -52833 -84009 -157342 -57704 -54197 -77243 -64006 -76289 -99874 8406
6976 8406 29030 -7412 -73242 -71259 -90020 -74066 -114012 -75507 4462 6914 -11379 -107643
6964 -107643 -127183 -44676 -43524 -62481 -80071 -81415 -57492 -82222 -115098 -132183 -88763 -87117
6952 -87117 -90191 -56823 -64262 -103442 -81812 -60992 -64564 -76653 -93399 -89731 -45111 -101693 -139612
6939 -139612 -85121 -40026 -33824 -10287 -4774 -57705 -97621 -18483 -57190 -49638 -39733 -32480 -99583
6926 -99583 -129195 -66070 -62933 -132245 -128313 -126441 -150158 -99392 -70404 -50254 -80334 -89697 -90884
6913 -90884 -100954 -117192 -111203 -70392 -28982 -68188 -39572 -66815 -90387 -77976 -72230 -75825
6901 -75825 -38692 -76908 -140353 -115735 -115254 -96514 -104415 -176154 -210038 -198136 -168829 -108161
6889 -108161 -77676 -52038 -30938 -28240 -87969 -118302 -60069 -18116 -34179 -19828 -54553 -55783
6877 -55783 -67643 -111524 -89327 -109810 -90958 -71401 -121095 -114972 -119226 -147771 -141792 -92242
6865 -92242 -143414 -162597 -137352 -127416 -183363 -172626 -101169 -109462 -144971 -205986 -186056 -113937
6853 -113937 -94038 -80632 -97565 -48712 -105581 -166158 -123666 -117814 -137358 -151951 -124068 -141032
6841 -141032 -94664 -95865 -64337 -86174 -48122 8080 -44037 -70745 -14273 -82470 -100227 -100656
6829 -100656 -81871 -85271 -87626 -92730 -122267 -113298 -72423 -80783 -124476 -171844 -141383 -97070 -149698
6816 -149698 -156528 -172921 -208989 -138183 -97035 -108372 -107659 -77638 -89787 -58872 -107366 -167388
6804 -167388 -150079 -142816 -149180 -140582 -146240 -133713 -63869 -20047 -89040 -74040 -70997 -73942 -36930
6791 -36930 -7327 -44268 -119391 -115526 -130602 -149675 -95075 -89854 -129727 -99792 -111838 -78892
6779 -78892 -121190 -149778 -175710 -91598 -98344 -59637 -61649 -109098 -71586 -58292 -115009 -47520
6767 -47520 -48042 -154620 -129780 -7879 -15888 -56157 -79698 -100614 -79477 -52146 -72184 -135217
6755 -135217 -125263 -44920 -49476 -110101 -147170 -80594 -80859 -44829 -43622 -20526 -94483 -129956 -157380
6742 -157380 -134212 -96563 -52881 -51453 -31356 -19473 -65753 -82043 -74501 -16766 -52724 -48904
6730 -48904 -109315 -73526 -99190 -118023 -121658 -156275 -128937 -110918 -72801 -99025 -65208 -25480
6718 -25480 -59510 -34047 -77417 -83344 -59315 -47069 -105464 -80527 -123087 -170968 -97177 -63018
6706 -63018 -56843 -73978 -120536 -108507 -120114 -98500 -74573 -103458 -141390 -88572 -59672 -55254
6694 -55254 -111740 -166929 -102932 -95518 -113591 -78587 -66434 -118615 -133400 -71843 -33303 -21709
6682 -21709 -60429 -16951 -95496 -127991 -179021 -133448 -110610 -119658 -180192 -211974 -82691 -8445
6670 -8445 -4048 -31651 -56678 -76310 -31705 -19620 -35019 -92918 -102517 -68324 -45467 -20546
6658 -20546 -47969 -61421 -47121 -67200 -111939 -137768 -74794 -36136 -82358 -109469 363 16943
6646 16943 -13936 -36750 -43767 -36414 -86026 -97745 -90348 -55328 6732 -49488 -31451 -53216
6634 -53216 -69742 -41673 -18441 32056 48929 -44103 -93900 -29963 -52363 -91972 -87413 -33513
6622 -33513 -118574 -81423 -38759 -49563 -68304 -58269 -41098 -102464 -69849 -66719 -51874 -51898 -22488
6609 -22488 -61782 -89339 -65367 -75428 -101665 -12794 -38124 -42984 -42916 -71689 -51084 -50230 -61407
6596 -61407 -76770 -74082 -78056 -76417 -46580 -35137 -91543 -55083 12267 -25142 -43164 -11998
6584 -11998 65329 84760 25741 51664 7593 -40513 -38544 -80076 -59075 -77481 -42234 -26893
6572 -26893 -10615 15834 -63483 -129247 -123622 -127367 -77700 -107743 -143453 -78519 -10097 47951
6560 47951 -11423 50410 33717 4894 -56342 -82302 -72162 -70850 -66721 -27639 -52611 -31839
6548 -31839 -14672 -18727 8972 -10823 -9498 -37208 55124 8480 -1262 10593 4272 13347 62181
6535 62181 26388 0 3046 -4145 1461 4012 -6056 -32910 -68823 -9682 -30462 1913 50777
6522 50777 -34126 661 -58595 -67168 -51286 -68750 -50760 -70914 -19592 39704 14681 38374
6510 38374 608 23297 62151 59622 1817 -6526 -13122 4156 11858 -47123 -83249 -19948 -17114
6497 -17114 -56808 -39843 -73180 -138144 -90964 -90888 -74610 12856 -26552 -83923 -49574 21152
6485 21152 19283 -28800 -15282 -7704 -15876 92151 75215 48752 55701 49365 57267 9664 -34240
6472 -34240 -67165 9599 41206 41444 38963 -18550 21285 26361 -19015 -54376 -77720 -62054 -94381
6459 -94381 -80428 -2193 57487 93912 27322 -94905 -98913 -31247 16608 -34517 -42078 -98115
6447 -98115 -29832 15959 2077 -19074 -56917 -64767 -52172 -34007 38641 49963 -13558 14723
6435 14723 -13101 -46786 -3149 54377 -2035 -43635 -40237 -76959 -37758 26741 -15858 -27992
6423 -27992 24280 80866 100704 51296 -4747 28423 65493 9797 -49917 -13393 -14549 -74928
6411 -74928 -25406 33871 40623 45644 16188 73949 44909 26653 48827 -5554 11156 87465
6399 87465 43649 33151 -29872 -84453 -142818 -79357 10686 26283 30202 57510 75927 34251
6387 34251 52211 51762 43630 54601 -6023 68737 84253 84158 72191 53137 62540 78119 107803
6374 107803 76055 85813 32827 29674 73940 49419 69627 -5714 19409 100233 70774 13539
6362 13539 -24225 -27486 -20171 29786 92117 92143 105752 142049 167333 147797 122326 151476 150659
6349 150659 136684 117965 100030 42633 74856 107292 86473 112630 83207 82642 122536 123242
6337 123242 112762 84757 155667 216147 228378 214587 201687 213147 199583 186912 211772 198349
6325 198349 213750 214922 153324 90961 205369 215792 188171 223615 283078 304824 257354 199641
6313 199641 210389 181921 271512 275490 318482 350719 332022 366520 398232 452522 526331 523428
6301 523428 426107 412310 390785 417501 496643 527771 545492 539379 551770 602022 602047 639974
6289 639974 639259 695512 761003 797716 936759 999943 975522 1124522 1180706 1348229 1519492
6278 1519492 1715940 2025255 2276858 2615719 2960753 3245353 3486848 3700226 3722349 3605768
6268 3605768 3494437 3400261 3241120 2979798 2746471 2683125 2534491 2363058 2230647 2152324
6258 2152324 2158013 2126987 2152907 2201394 2280436 2381378 2490040 2665146 2895527 3220433 3600755
6247 3600755 4077066 4644846 5444278 6459275 7515512 8590038 9547322 10182214 10528608
6238 10528608 10621275 10465544 10087397 9522726 8804192 7996995 7169290 6413950 5817231 5312297
6228 5312297 4876484 4548439 4316752 4124986 3991934 3976287 3906528 3911209 4012766 4148703
6218 4148703 4429211 4635630 4909275 5443719 6058688 6785276 7812469 8859597 10003990
6209 10003990 11038717 11743979 12143301 12311320 12191575 11797587 11237734 10568789 9802926
6200 9802926 9152419 8521858 7889165 7369596 7058394 6864377 6695869 6644633 6578417 6622612
6190 6622612 6763543 6875343 6958785 7086658 7247977 7355371 7520571 7661166 7985528 8294240
6180 8294240 8581439 8885450 9201160 9482001 9748248 9952474 10022503 9993423 9874357 9730647
6170 9730647 9505873 9265765 9034089 8810996 8595900 8401615 8227068 8097775 7997009 7934636
6160 7934636 7892168 7823823 7729998 7671568 7684044 7611093 7524667 7455283 7377420 7380340 7285125 7244666
6148 7244666 7251909 7164430 7033963 6963691 6869947 6810459 6725466 6557836 6458743 6408808 6307924
6137 6307924 6223923 6136308 6065790 5945815 5834798 5736800 5566561 5393146 5281742 5177702
6127 5177702 4919615 4805649 4711702 4460937 4258908 4053788 3890041 3677873 3482723 3353672
6117 3353672 3143171 3021052 2909126 2801293 2683852 2534805 2440736 2331656 2258261 2146993
6107 2146993 2024915 1939382 1934200 1845950 1785016 1734706 1692381 1596149 1466321 1437915 1412126
6096 1412126 1399868 1372956 1323522 1287545 1264936 1271840 1236709 1233475 1170908 1193284 1111603 1073287
6084 1073287 1048407 1028945 1013140 974926 1000443 966712 934907 903423 867753 863936 777569 792169
6072 792169 806469 777739 770185 764760 838288 790737 708856 704872 646208 623060 664509 688897
6060 688897 656029 641331 645180 641024 612735 518638 536617 553056 518138 562629 513758 493995
6048 493995 572781 512480 536405 536256 537158 438401 492939 538960 471446 477438 477103 462522 453834
6035 453834 472894 487676 472698 408514 415587 430590 405145 421518 393255 422116 419967 447033
6023 447033 433582 359903 336787 358756 338970 320187 330991 344441 350103 423439 408153 424571
6011 424571 433835 404943 345174 321201 312283 310858 292898 288100 333556 320605 334897 375328
5999 375328 339160 368614 394525 336297 320082 304201 315196 366935 318232 338168 319098 249142
5987 249142 276044 306432 323355 292584 265093 265870 315023 331050 321971 284757 332227 382667
5975 382667 371643 388315 346454 269707 332088 383668 426692 359611 328182 247325 266474 303210
5963 303210 298875 317641 258079 335383 388046 341803 344770 386332 417254 401500 417660 423111
5951 423111 404305 358972 344673 297067 280705 310613 272692 273867 340911 279000 244282 269898
5939 269898 312059 350786 314945 321149 335833 349766 322731 317251 312103 292036 251126 362493
5927 362493 433441 424915 397048 400469 413897 410756 335501 320929 311357 276942 318569 388889
5915 388889 455187 391735 353176 294229 271199 315982 278034 232397 245647 249187 270219 253295
5903 253295 294109 362002 389473 373776 381890 331896 362907 329658 328640 284868 330288 378449
5891 378449 371688 391167 359227 339082 305794 279496 333106 404422 391307 352508 321069 379197
5879 379197 420032 435681 447673 459996 460460 495629 490861 458611 466380 443200 440271 401824 362226
5866 362226 384170 448079 455573 415297 424689 446055 461461 458734 494850 431732 472045 459190
5854 459190 476189 502664 554336 581943 575548 559671 543349 527206 629201 560039 572172 639285
5842 639285 622799 625085 697526 837358 860847 868131 1001006 1295436 1601401 2156640 2805403
5831 2805403 3622903 4224202 4554813 4603543 4527822 4452055 4112920 3624777 3243937 2824321
5821 2824321 2339903 1937403 1635839 1451712 1287307 1193508 1116091 1049730 1010434 905201
5811 905201 837904 743513 730093 733244 743054 777573 752840 753546 734947 776820 740311 714386
5799 714386 757047 681213 711836 844778 781447 729167 715609 759053 759997 662601 575908 566134
5787 566134 576862 610460 634453 625436 684989 672622 661233 635892 574873 560858 592054 605555
5775 605555 624606 654632 639988 667684 722264 673615 636829 636114 678686 744849 735251 691831
5763 691831 583264 632907 630092 620095 609510 635654 672101 733881 745415 694567 699478 709638
5751 709638 673811 736993 813430 760891 750399 749438 734965 687880 730831 731807 753014 710700
5739 710700 763763 833581 817498 754878 741610 825854 867476 883405 920165 899504 862185 899852
5727 899852 874816 934887 919019 916053 977214 965853 986994 1036778 1026401 996345 1010466 1031482
5715 1031482 1030148 1019938 1060395 1060553 1113503 1076046 1097217 1189430 1186098 1233893 1188301 1217905
5703 1217905 1243054 1219004 1191674 1197056 1239013 1213034 1214311 1105779 1165391 1273039 1296215
5692 1296215 1316815 1268100 1292383 1350933 1375426 1338256 1355869 1398156 1442416 1422493 1419543 1432114
5680 1432114 1455533 1476569 1493298 1486833 1487784 1460172 1403434 1421632 1483795 1510807 1509182 1571514
5668 1571514 1612530 1590250 1552810 1597533 1645208 1651747 1638147 1634681 1685862 1762085 1736597 1766387
5656 1766387 1777343 1779287 1802986 1836351 1851801 1877012 1852572 1914008 1951770 1965643 2019310 1975917
5644 1975917 2014099 2034559 2041031 2039961 2048643 2101116 2148047 2236426 2233518 2221905 2272025 2319629
5632 2319629 2338216 2390588 2393167 2365006 2437091 2501047 2551426 2622048 2542249 2630082 2670155 2771748
5620 2771748 2850797 2755976 2738450 2799493 2891246 2916585 2894916 2933379 3002363 3078881 3227984
5609 3227984 3227312 3213657 3234227 3283890 3314834 3332232 3386876 3498911 3523691 3543820 3545673 3643419
5597 3643419 3725702 3793229 3866249 3894588 3888190 3975626 4060644 4182240 4276250 4353571 4356980 4461067
5585 4461067 4558830 4610457 4736268 4819928 4853608 4892076 4911454 4994389 5049764 5127325 5201578
5574 5201578 5249086 5399114 5451674 5510793 5629899 5718166 5805318 5903600 6006792 6087196 6120796
5563 6120796 6210784 6289390 6343831 6493216 6659511 6721225 6832518 6925477 7002375 7084402 7195309
5552 7195309 7375629 7493490 7638325 7776555 7867652 8019057 8140842 8315755 8419353 8532530
5542 8532530 8755596 8890037 8993073 9162403 9332142 9517361 9624065 9821993 10043186 10199054
5532 10199054 10407777 10591056 10706012 10887397 11121999 11345982 11615154 11787484 12083934
5523 12083934 12385594 12586601 12864745 13130504 13415974 13681579 13929319 14208973 14583607
5514 14583607 14908266 15209137 15619146 15943740 16318444 16673364 16950561 17351523 17764938
5505 17764938 18215781 18663664 19157621 19718673 20211611 20661879 21192571 21827148 22437343
5496 22437343 23082566 23728855 24374532 25035066 25767066 26603454 27330094 28137021 29048958
5487 29048958 30016103 30908628 31883010 32897868 34014316 35243484 36501388 37762918 39035146
5478 39035146 40518212 42010587 43536454 45221063 47003695 48883881 50852685 52956044
5470 52956044 55180544 57569957 60199669 62854150 65756952 68876724 72173648 75724203
5462 75724203 79524666 83638232 88030931 92639552 97713686 103185405 108926871 115161764
5454 115161764 121892104 129154831 136805765 145030753 153755982 163062547 172999571 183333073
5446 183333073 194100012 205253633 216679198 228235125 239682388 250818870 261485876
5439 261485876 271393585 280218209 287711477 293719210 297993292 300389202 300832617 299490087
5431 299490087 296175386 291206540 284790184 276965012 268151918 258573564 248424947 237881812
5423 237881812 227254232 216582155 205964382 195760195 185937887 176531556 167425555
5416 167425555 158893130 150806563 143201101 136143320 129384538 123071967 117250609 111776268
5408 111776268 106544380 101720051 97240319 93059149 88988616 85302215 81859777 78578699
5400 78578699 75475919 72539973 69756438 67162194 64677328 62386889 60223383 58168789
5392 58168789 56236683 54359963 52517327 50784311 49209882 47675913 46182497 44780701
5384 44780701 43506117 42219210 41018582 39817832 38727833 37556887 36519428 35587322
5376 35587322 34598783 33835530 32957231 31998323 31243913 30553757 29840856 29056588 28267722
5367 28267722 27531270 26920557 26368910 25703069 25067949 24528469 23877638 23331824 22750400
5358 22750400 22206702 21786208 21270781 20779275 20357240 19922299 19473056 19084364 18753181
5349 18753181 18393452 17948395 17609337 17217571 16836532 16515020 16244256 15931122 15652945
5340 15652945 15312986 15027847 14832737 14475895 14218747 13930974 13667010 13396895 13125579
5331 13125579 12980975 12774224 12540629 12318335 12090477 11905098 11690803 11511392 11301564
5322 11301564 11012688 10828995 10574589 10458264 10356112 10182648 9993661 9823884 9738194 9489601
5312 9489601 9248625 9088626 8950457 8838039 8784264 8589105 8379443 8248797 8152269 8105697
5302 8105697 7953026 7856685 7701420 7614288 7514874 7446099 7335244 7161634 7049265 6992621
5292 6992621 6917340 6735194 6669334 6586270 6525803 6420360 6315377 6173841 6054403 5971395
5282 5971395 5894918 5815919 5788706 5718020 5622098 5576239 5502433 5472037 5395634 5386716 5349030 5223463
5270 5223463 5138512 5011739 4997052 4984341 4938039 4860490 4806813 4673462 4663639 4652818 4578833
5259 4578833 4497784 4408540 4328310 4279050 4276004 4242672 4175833 4116255 4086840 4079522 4078230 3968024
5247 3968024 3904613 3775712 3781089 3778356 3771461 3717907 3694834 3612098 3598110 3541616 3462928 3424305
5235 3424305 3387790 3377333 3373982 3384270 3370947 3341489 3303012 3235982 3141367 3182023 3161755 3049792
5223 3049792 3056639 3087032 2999396 2932381 2922135 2870787 2824933 2764599 2690648 2743939 2808470 2726184
5211 2726184 2633124 2656079 2589428 2604154 2536342 2528356 2481115 2510589 2518158 2485337 2457133 2388071
5199 2388071 2436980 2361724 2298533 2325995 2330985 2301252 2271697 2232043 2196071 2159170 2155381 2193333
5187 2193333 2147745 2157280 2168112 2096250 2065133 2074650 2038152 2034916 2027081 1953583 1977744 1891843
5175 1891843 1905010 1893286 1804059 1810525 1848607 1856934 1822604 1811410 1857659 1875330 1853037 1796165
5163 1796165 1752590 1692336 1679611 1691515 1648181 1600892 1647323 1573941 1629542 1672212 1590591
5152 1590591 1549969 1524693 1552650 1592870 1614521 1622446 1525129 1522214 1585050 1515689 1558419 1535140
5140 1535140 1536960 1505158 1512672 1529153 1470023 1432649 1406323 1388593 1395678 1383888 1434242 1473217
5128 1473217 1458605 1403324 1379456 1490911 1491840 1351929 1294904 1361711 1392225 1357013 1384137
5117 1384137 1306222 1297994 1328121 1331191 1348645 1279718 1260587 1294430 1285988 1336101 1396470 1302625
5105 1302625 1268265 1283048 1288674 1225020 1192159 1238672 1278739 1200917 1181130 1209048 1228725 1206437
5093 1206437 1116719 1142615 1104516 1184183 1212852 1135220 1137566 1143474 1180220 1188583 1197370 1153815
5081 1153815 1087224 1074946 1091119 1063611 1036387 1047904 1021379 1014434 1004824 1005501 1062184 1118045
5069 1118045 1156152 1125425 1063068 1057879 1018843 1014573 1031572 1084473 1023716 965019 943447 1010801
5057 1010801 969507 978928 1006721 1025322 1054621 1077249 1015459 996402 1009466 1007679 1073980 999926
5045 999926 1035120 1007869 954272 939384 916120 882480 926679 863700 887352 892859 907194 885829
5033 885829 828142 791142 839931 835956 867376 883649 870623 880831 910875 923908 938920 932559
5021 932559 913985 827687 769407 787717 823615 845419 840762 926588 863984 838359 889369 869550
5009 869550 830790 823451 750790 814343 830669 828245 818769 896835 855779 787112 822446 761404
4997 761404 840289 863705 835216 870614 853442 815367 850882 862595 894804 917093 868521 897358
4985 897358 895659 879022 885040 847181 799600 904707 885410 869328 757662 792485 865831 840756
4973 840756 820443 815273 828691 862607 837514 829642 860517 921741 948844 941660 992948 958937
4961 958937 1066145 1112461 1155301 1188912 1366710 1557082 1805514 2023991 2199352 2331019
4951 2331019 2352018 2340197 2282644 2133479 1946538 1782919 1648752 1523653 1402712 1226470
4941 1226470 1107637 1092924 1036278 961341 976538 969632 914664 896452 900201 934527 930165 903225
4929 903225 949284 949833 876538 786648 791999 805388 803553 799788 876110 853111 873513 890122 764036
4916 764036 708901 722670 829921 840825 810450 876777 892490 909714 879869 901444 918910
4905 918910 857247 859881 885313 874395 848690 912453 923652 997700 980982 963301 963119 944374
4893 944374 948838 959219 909583 944643 991107 937805 979859 1006374 903259 932897 944238 973419
4881 973419 945520 887998 915503 889632 885828 907998 895054 907946 944545 939353 888803 918088
4869 918088 968982 927633 909365 995990 1010503 994283 1010329 1024597 1029585 978313 966289 953788
4857 953788 1125354 1205565 1149940 1103596 1110330 1160398 1165988 1208959 1208940 1256174 1289917 1327373
4845 1327373 1403818 1370093 1513326 1627502 1629103 1584832 1639700 1770030 1836802 1980982 2290902
4834 2290902 2591070 3039436 3628361 4279133 4755984 4870459 4977514 4990396 4882712 4748862
4824 4748862 4626105 4328591 4120657 3923887 3777151 3762242 3796630 3868349 3855241 3921595
4814 3921595 4024709 4169808 4361696 4616578 4840877 5071311 5450616 5866416 6185255 6572510
4804 6572510 6811413 6938068 7029854 7028441 7092696 7116390 7146152 7143769 7212079 7265263 7417194
4793 7417194 7578285 7770510 7917757 8124363 8337780 8445464 8621861 8790932 8944758 9056790
4783 9056790 9131222 9310282 9402925 9410970 9417843 9459457 9371399 9266814 9185793 9101178 9132751
4772 9132751 9049761 8878054 8682589 8542483 8477410 8384293 8167824 8011052 7801728 7623036
4762 7623036 7387087 7189755 6969447 6776536 6641026 6418740 6261755 6116782 6022653 5773553
4752 5773553 5604655 5493039 5245002 5081597 4933425 4796275 4644360 4517152 4323443 4200828
4742 4200828 4044030 3971841 3917550 3847747 3791721 3732764 3669728 3598146 3497041 3439478 3401372
4731 3401372 3343513 3321553 3280746 3246091 3247723 3209501 3121214 3171311 3194644 3192212 3173261 3152159
4719 3152159 3164114 3186829 3197977 3251707 3315294 3370793 3409955 3539879 3587990 3647397 3758102
4708 3758102 3821137 3919815 4019446 4089043 4201607 4390844 4559188 4718343 4908193 5097544
4698 5097544 5244272 5469456 5639676 5809885 6051498 6145062 6420446 6633769 6741357 6924324
4688 6924324 7119649 7347985 7539832 7752841 7922393 8108762 8266213 8496582 8640773 8769932
4678 8769932 8917822 9123005 9338985 9431367 9562088 9630691 9711667 9850926 9884733 9872573
4668 9872573 9854011 9805909 9698516 9595755 9537199 9379807 9232572 9083235 8899435 8747609
4658 8747609 8586271 8419910 8207192 8053190 7896502 7707065 7561463 7462830 7261116 7054769
4648 7054769 6930263 6796772 6684061 6587487 6488795 6377876 6294852 6248207 6109019 6033854
4638 6033854 6057760 6039815 5993143 6018245 6002117 6001616 6255571 6459563 6839892 7481003 8576346
4627 8576346 10144731 11904647 13560686 14473007 14760637 14798789 14634271 14002219 13117366
4618 13117366 12225308 11197325 10231581 9414944 8788607 8574465 8646724 8944340 9525002
4609 9525002 10315380 11180072 12268463 13314236 14208923 15260532 16385476 17645586 19112070
4600 19112070 20796542 22513437 24060470 25270690 26312737 27378996 28436469 29570890
4592 29570890 30963529 32295278 33525224 34285880 34497600 34393458 34113814 33671484 33179264
4583 33179264 32727993 32119081 31308366 30189760 28841438 27437302 25963010 24547159 23223852
4574 23223852 21893099 20589641 19125289 17563208 16190718 14842396 13545949 12275052
4566 12275052 11086549 9918454 8870214 7999972 7184037 6495564 5942122 5508705 5156756
4557 5156756 4847743 4531848 4302288 4079059 3887983 3712425 3489258 3388055 3304571 3184711
4547 3184711 3086425 2940742 2940130 2849083 2727880 2669723 2577675 2465416 2379409 2291313 2238694
4536 2238694 2193591 2208793 2232459 2078603 2066934 2057707 2036766 1984302 1913340 1884005 1827600
4525 1827600 1811735 1788575 1794537 1747356 1692124 1603890 1593655 1581591 1493226 1490701 1444940 1477020
4513 1477020 1453203 1406562 1370101 1370493 1403743 1337450 1306095 1276893 1286986 1278865 1298623 1299546
4501 1299546 1314193 1286311 1278412 1313583 1245464 1159104 1178118 1178199 1130738 1080541 1076518 1071897 1083951
4488 1083951 1022030 978623 1001258 1049976 1062337 1010139 973814 1031731 1040600 1084727 1019149 966947
4476 966947 909786 935423 946015 922116 916792 927664 885361 784437 754247 801641 864372 857703
4464 857703 823693 762241 798847 751935 756916 743008 859492 860631 794017 847823 845137 776034
4452 776034 828149 800746 707938 766235 842953 790956 748301 806495 870347 861644 789378 784789
4440 784789 827846 836456 797023 829512 861410 812938 797463 823933 855791 843465 771927 704125
4428 704125 687069 720706 737407 759173 726195 712634 686645 698295 743355 778913 756355 740142
4416 740142 792778 795447 790547 711535 682203 709373 740625 757663 747576 745301 795063 793620
4404 793620 791684 854554 891786 865233 816821 815764 834122 858595 867571 867954 862995 892377 911512
4391 911512 850128 930983 980475 922988 865252 830504 880396 901011 942032 968401 979172 925372
4379 925372 914713 943721 986845 1030988 1021750 1019195 956367 1018841 1042401 928541 986269 1004297
4367 1004297 983685 1017766 918255 936358 915051 904989 964913 1041758 1019097 1026550 1037427 1062114
4355 1062114 1084854 1006728 1016419 1050655 1101638 1144722 1048269 1029133 1124475 1130330 1187239 1167746
4343 1167746 1164283 1271538 1345077 1289888 1252427 1302712 1328249 1453518 1404197 1427640 1441756
4332 1441756 1446824 1515318 1576120 1567486 1577855 1652460 1776651 1855471 1877890 1977656 2026408 2087310
4320 2087310 2212052 2364606 2408952 2522212 2711810 2789419 2896237 3093894 3271495 3496098
4310 3496098 3661705 3853017 4086039 4348381 4627184 4900410 5168285 5492805 5703901 6014898
4300 6014898 6311046 6681614 7097847 7449846 7825241 8164634 8541952 8942530 9344877 9752868
4290 9752868 10173607 10545464 10906960 11246834 11585573 11974873 12359950 12699808 12994135 13288819
4280 13288819 13591439 13851996 14044544 14261094 14425239 14617468 14706964 14714188 14772634 14774562
4270 14774562 14790614 14757894 14618743 14408857 14254524 14156634 13876770 13624509 13357383 13111806
4260 13111806 12827379 12464661 12198346 11864980 11537220 11231220 10824554 10435049 10134887
4251 10134887 9776261 9400801 9054595 8674098 8365320 8129438 7818573 7468365 7099621
4242 7099621 6828605 6588502 6388088 6115406 5836566 5640612 5437093 5234984 5043238 4884490
4232 4884490 4696168 4628657 4526657 4429017 4384718 4252134 4231253 4326038 4322576 4345074 4474357
4221 4474357 4673286 4935625 5320945 5774614 6648790 8262507 10638779 13468928 16222864
4212 16222864 17662771 17877190 17869045 17632772 16521648 14837583 13136344 11367679 9673373
4203 9673373 8128465 6790326 5765724 5079698 4723310 4497387 4212769 3985374 3793360
4194 3793360 3577829 3437437 3296873 3165248 3157036 3118485 3074034 2967547 2908594 2872953 2857917
4183 2857917 2793967 2786018 2784335 2760180 2758697 2795404 2844019 2916898 2873461 2871351 2894236 2869025
4171 2869025 2917789 2920380 2893766 2955712 2968125 2995802 3025279 3037682 3026382 3117782 3072175 3145628
4159 3145628 3149720 3166753 3224871 3317336 3322595 3403306 3407872 3426785 3495596 3576706 3721466 3783019
4147 3783019 3898694 4012109 4081369 4187450 4305496 4320928 4457858 4616243 4779358 4953865
4137 4953865 5123915 5337623 5523144 5772584 5989113 6245570 6580932 6909073 7279603 7632024
4127 7632024 8042243 8511487 9050006 9721118 10384391 11085449 11864677 12761046 13797744
4118 13797744 14869156 16056064 17297281 18707187 20186029 21715955 23296470 24847901
4110 24847901 26373994 27846826 29232834 30474497 31558842 32554885 33307837 33920370 34344606
4101 34344606 34627885 34797608 34941514 34878944 34671038 34368313 33942340 33353065 32667160 31844671
4091 31844671 30839452 29710890 28530855 27267554 25922457 24503211 23116399 21699455
4083 21699455 20337186 19065170 17830467 16700531 15676389 14664080 13768920 12994553
4075 12994553 12211634 11498167 10865035 10359215 9879286 9319420 8837440 8422154 8110586
4066 8110586 7838112 7448629 7085238 6933281 6802918 6562504 6313394 6186745 6090806 6021606
4056 6021606 6004277 6037956 5996307 6018065 6183922 6522420 7073317 7896265 9011012 10141804
4046 10141804 10668234 10721203 10743219 10592480 10095931 9379437 8686989 7904480 7086340 6432838
4036 6432838 5913145 5418936 5074016 4928960 4771454 4590088 4420663 4289967 4174510 4098781
4026 4098781 4048929 3940085 3907926 3860790 3733145 3668298 3545297 3448581 3320501 3176788
4016 3176788 3119489 3017899 2927343 2861407 2814794 2803645 2741351 2687015 2654804 2649850 2683697
4005 2683697 2622116 2624487 2627425 2661206 2601951 2574461 2503051 2538341 2545922 2564748 2553360 2499206
3993 2499206 2436589 2436773 2407866 2437443 2448222 2432251 2456392 2439497 2389620 2372449 2433720 2471161
3981 2471161 2470095 2491698 2490147 2457489 2502403 2480687 2442848 2511882 2524107 2472804 2544475 2578604
3969 2578604 2545001 2548828 2661745 2773435 2748606 2818031 2846180 2925718 3004661 3049621 3121199
3958 3121199 3133806 3243363 3347565 3333896 3349580 3415699 3472299 3534385 3663986 3759521 3840303
3947 3840303 3875892 3930005 4045636 4116891 4245928 4281401 4361046 4485103 4656381 4826364
3937 4826364 4944835 5135592 5279180 5454026 5566999 5722836 6038883 6207142 6490018 6790296
3927 6790296 7074955 7409087 7743928 8127296 8399810 8710543 9050151 9469612 9907846 10291946
3917 10291946 10748140 11115471 11535162 11880733 12354991 12831541 13261325 13825254 14326227
3908 14326227 14891236 15372261 15826621 16262419 16682827 17074901 17459752 17918759 18263323
3899 18263323 18571688 18959201 19296944 19678588 20018223 20367659 20636848 20831112 20986183
3890 20986183 21064544 21018078 20846147 20696672 20524222 20255798 20002101 19716123 19453761 19196271
3880 19196271 18909874 18728794 18473694 18260766 18073485 17787307 17507538 17221924 16906867
3871 16906867 16651434 16408664 16134399 15878049 15660038 15566141 15433631 15271393 15286341 15201406
3861 15201406 15274761 15290183 15336061 15474331 15638321 15867823 16192457 16586241 16950297 17397467
3851 17397467 17855716 18284151 18843594 19423465 20033341 20691256 21345228 22046652 22695141
3842 22695141 23261960 23921235 24512414 25141792 25730398 26239392 26697645 27085970 27429040
3833 27429040 27694043 27984958 28159420 28291489 28357262 28321266 28200315 28075370 27938220 27739506
3823 27739506 27467716 27058138 26638003 26145511 25584327 24911722 24284850 23704823 23072971
3814 23072971 22362643 21579489 20860190 20087584 19431156 18618744 17865237 17159642 16416114
3805 16416114 15665953 14899975 14271611 13592806 12952138 12304260 11740212 11170604 10554586
3796 10554586 10095056 9650745 9192446 8767787 8440828 8102350 7804645 7488255 7233408
3787 7233408 7002287 6819024 6706556 6549045 6350825 6201604 6119846 6047734 5870434 5796185
3777 5796185 5775646 5584624 5485077 5463871 5381452 5311867 5239189 5128608 5103693 5024331 4968177
3766 4968177 4965644 4952650 4896850 4804989 4617740 4511001 4462498 4403822 4346683 4279520 4219075
3755 4219075 4122798 3980708 3807866 3708173 3634866 3546580 3498829 3422000 3306622 3181851 3069571
3744 3069571 2983442 2892800 2767268 2665997 2597620 2531699 2441591 2440054 2366654 2245758 2228820
3733 2228820 2199034 2121871 2079832 2046576 1983951 1946294 1920652 1861091 1763627 1797423 1805932 1766158
3721 1766158 1661468 1679604 1627948 1581415 1570181 1537051 1570957 1616392 1562154 1590505 1469133
3710 1469133 1366329 1389987 1376280 1405763 1373825 1340535 1343449 1304784 1298876 1247426 1270102 1201978
3698 1201978 1149208 1160942 1154041 1195300 1167606 1150075 1182746 1092973 1055318 1057133 1073246 1100788
3686 1100788 1048650 1073997 1130271 1076205 1030246 1059799 1020779 1022570 956145 1039788 1017202 932416
3674 932416 937673 933982 862456 890199 913099 919772 966248 945335 922633 915197 910005 929838 895597
3661 895597 876177 909954 890478 892715 877215 866043 872460 912098 866150 827273 848118 848049 841210
3648 841210 798995 839489 880613 891212 898089 861759 859341 885354 843061 828236 839049 834696
3636 834696 809867 759458 799323 813885 847000 869721 851252 911986 852736 861386 903684 900028
3624 900028 889758 915844 855391 887436 972708 945547 966423 1000585 973270 997437 942490 928785
3612 928785 964732 955512 948868 970068 988640 1040230 1139691 1088166 1076543 1069833 1058715 1040058
3600 1040058 1047328 1118988 1152903 1207333 1186752 1225137 1223917 1253653 1226119 1186762 1211102 1297947
3588 1297947 1376141 1402385 1474019 1538700 1563390 1600263 1694836 1840034 1961632 2143228 2284944
3577 2284944 2364965 2503115 2664267 2913905 3247707 3734253 4240468 4881713 5700862 6724285
3567 6724285 8006628 9243276 10281866 11027680 11480524 11580390 11368650 10902395 10252531
3558 10252531 9521283 8678783 7861898 7126256 6447453 5894631 5505805 5226179 5083976
3549 5083976 4993630 4964039 4985304 5040741 5098670 5283280 5502910 5870837 6344217 6955433
3539 6955433 7728431 8877178 10448585 12533000 15046546 17728886 20158603 21742408
3531 21742408 22473822 22587828 22186421 21059253 19456698 17676689 15694235 13766716 11957115
3522 11957115 10373155 9169372 8177834 7431586 6924998 6449098 6131149 5781231 5602424
3513 5602424 5531313 5484614 5482632 5570523 5711007 5815344 6059046 6540868 7102295 7926630
3503 7926630 8927515 9890178 10802287 11511790 11835387 11778046 11452699 10943351 10293221 9439600
3493 9439600 8493636 7569794 6692957 5871980 5187467 4643821 4290184 3995856 3692367 3454599
3483 3454599 3234243 3088559 2936292 2777734 2691342 2573237 2467879 2333368 2272300 2175690
3473 2175690 2080791 2038336 1966469 1912599 1860184 1899031 1836527 1794218 1786392 1716574 1673187 1577903
3461 1577903 1595823 1608195 1581134 1558779 1515548 1508945 1525025 1457930 1503943 1438881 1481814 1530248
3449 1530248 1493614 1433047 1425774 1477541 1475693 1458035 1455116 1467801 1478352 1492178 1509265 1522956
3437 1522956 1541344 1620220 1628540 1600136 1602444 1504394 1447280 1517034 1482045 1375806 1304307 1200622
3425 1200622 1132111 1132141 1179518 1119828 1064192 1061957 1003452 918507 974921 996439 956426 893053
3413 893053 819583 805052 782017 792401 829393 749730 671104 668063 694618 798272 782515 788606
3401 788606 751429 805309 742475 682867 683546 692201 642389 569686 578503 626087 644690 662378
3389 662378 641823 598515 683090 641155 647292 668330 633598 634113 594626 599293 599874 577827 642322
3376 642322 641314 654791 726492 782855 781606 785650 830035 797601 686133 645258 616837 620579
3364 620579 621930 585115 573336 523933 459528 432043 490673 470997 484323 466304 479581 452303
3352 452303 440618 460955 475762 559608 570918 560450 550088 578179 563606 616297 551682 560644
3340 560644 520193 505719 548015 534633 483254 458214 490091 396334 330226 390810 401217 436474
3328 436474 419682 417584 458760 375394 421052 330505 327587 412876 450149 425347 386471 445426
3316 445426 504590 580943 608820 588699 530154 541020 578134 529546 545574 493769 411647 414867
3304 414867 410020 294669 278574 286291 306185 353363 354548 353983 344825 295826 322942 311522 289429
3291 289429 330908 352494 337438 350174 393549 406381 395569 346831 360806 419930 478848 426524
3279 426524 457332 483047 539001 620622 602855 529288 448279 463559 425753 349797 280745 324919
3267 324919 378626 329916 285423 284641 313413 323950 284770 248601 282754 303320 261843 265446
3255 265446 243519 266899 289105 271754 312846 360183 425225 444880 442748 380201 430848 425260
3243 425260 395605 398860 335647 284990 305889 336002 336023 341147 375465 330361 256413 260376 245863
3230 245863 238215 196046 267723 300055 268991 211706 235509 196466 224787 248576 223375 205958
3218 205958 210052 335552 304943 286485 284651 256400 288880 236467 215210 240148 291885 229476
3206 229476 162190 228706 193255 190860 175228 170586 219338 209610 194510 203824 172203 211953
3194 211953 214052 182173 182510 117529 199186 188535 151221 156271 229497 196527 179611 225976
3182 225976 189851 162675 126716 166551 209079 195702 166456 153257 88582 112102 143225 168614
3170 168614 142873 104902 113961 127889 146014 129956 81239 142128 194432 210416 170697 225024
3158 225024 148253 173794 176765 167791 175134 177210 200742 224600 188689 165301 204165 200195 238200
3145 238200 174824 150259 228726 241022 210582 242189 229140 225401 156896 129841 179732 185157
3133 185157 238510 238803 196163 138676 179592 171008 193150 177395 200937 199478 254042 253980 223142
3120 223142 259974 199338 213108 180348 179645 231469 328601 340861 301422 295359 284445 278997
3108 278997 285726 292445 248753 141643 159655 217495 203829 251897 221985 184482 223212 222433
3096 222433 280189 283003 318304 326939 207275 214029 212247 185082 240778 250066 288953 248666
3084 248666 242469 205100 225889 271581 290319 244498 255040 289373 266639 255542 285595 271939
3072 271939 277781 274543 276534 286891 269718 174477 191796 157158 170162 181299 197905 151319
3060 151319 161949 218230 217829 208723 217879 245605 223482 226422 202608 162987 158294 167316 184852
3047 184852 154397 137648 166849 161779 148898 148869 127947 68917 125590 210656 166036 129116
3035 129116 210902 178147 136140 139514 138599 156442 167450 148959 117220 115260 141154 74613
3023 74613 109028 138500 105129 100437 78761 49333 136003 90187 81323 51171 53161 84014
3011 84014 70787 58979 85221 72243 46991 126494 182567 157025 115395 112921 122882 93175
2999 93175 56149 47638 35582 49062 110866 157382 114688 27657 -16017 3086 59816 76688
2987 76688 70395 120884 118531 121973 91306 -7690 -15099 11943 3670 12140 23114 84161 122164
2974 122164 94908 67481 55486 49184 33008 86655 122146 76071 80015 47822 85525 160518
2962 160518 153650 109358 82464 100898 47016 41408 37953 22450 41437 94003 87454 41525
2950 41525 49271 45438 56283 54574 39276 62568 75969 96288 89357 78674 54189 51724 134426
2937 134426 98834 63742 109174 64150 70941 108503 35120 -2601 74870 56773 10792 81416
2925 81416 121062 41970 3542 46124 65104 -19048 -37764 -35069 13620 42738 29920 72039
2913 72039 25929 31815 9055 57774 91588 44857 35299 16936 16817 11650 -32031 -59313 30517
2900 30517 47066 24549 89135 44396 26790 36402 45956 102124 79842 16120 -22396 15860
2888 15860 107069 134653 71356 -9646 20896 64115 52844 15416 60913 22619 43909 32929
2876 32929 4243 -51575 -35618 5968 -9065 49339 86132 33706 18269 72901 88709 1200
2864 1200 6446 52379 -39249 -73236 -43229 -24423 -67527 -81628 -41603 -56681 -29609 30565
2852 30565 16953 8568 51697 126742 66436 -21104 -15136 58477 64751 32238 16122 12119 -20696
2839 -20696 -4894 -28687 -23459 18718 151542 141072 64999 23068 63410 70343 28959 16577
2827 16577 11402 80688 124616 112240 84632 52691 -10603 -77834 -35425 -4028 34758 74787
2815 74787 70595 82056 14378 7676 78617 58569 54013 88127 35825 41902 58527 48384 67015
2802 67015 47707 42379 63998 64939 133047 109341 32449 49860 59000 13054 78037 29298 23030
2789 23030 31991 68450 78549 10628 10371 -53458 -11311 -29342 -27500 -7736 -30728 -16565 -40441
2776 -40441 -25603 59759 42921 597 49915 17149 40807 13246 35013 52035 22482 -42683
2764 -42683 45913 46235 25670 9329 30140 41038 41103 45927 53388 98679 94172 91791 23409 -223
2750 -223 -7586 39078 -39005 39656 101603 25025 21716 869 -29781 -30310 60609 87645 33370
2737 33370 -1391 -14957 39013 102042 50391 26192 14163 -13518 -6436 -49802 -40285 20079
2725 20079 -11326 63132 112757 -33637 -29318 -33152 2003 31456 -58075 -84102 -10417 41368
2713 41368 59105 57315 79387 66759 37229 -23782 8129 35284 392 -37874 -61642 -55724
2701 -55724 -87855 -48965 -24641 -37970 -23028 5487 20519 45290 14658 12314 37540 17565
2689 17565 87388 67382 83092 138785 124833 75840 67493 79820 128356 65461 18713 37768
2677 37768 69118 111000 75736 64345 5714 -13402 -5648 36550 -13679 1510 31521 22744
2665 22744 44336 51166 38679 63014 112609 99243 72485 45227 28960 56121 78811 45586
2653 45586 22118 -43375 34072 24298 2429 -34182 -27010 -13669 48865 2953 -19636 4185
2641 4185 1771 14858 -15119 53170 34747 -40390 -43899 -77652 -71744 -45346 3745 -34299 -16259
2628 -16259 12586 3044 86955 84513 6371 -59628 -31543 20257 54131 39238 40466 19735
2616 19735 39121 24485 34409 68447 64606 44743 51048 51969 81143 21765 27913 4124 -33720
2603 -33720 6632 83090 57497 63071 59769 31939 -1701 75987 119765 105826 89374 107321
2591 107321 106210 68329 3118 -6779 28339 85116 79731 76833 59166 19601 70237 70834 45952
2578 45952 82557 55786 24366 12334 41426 5776 -8962 -30938 -34092 -2672 -37012 -41579
2566 -41579 -25166 51485 36551 16055 49992 -8984 8177 -3878 34369 69576 13907 4348
2554 4348 18973 -19911 10684 60002 15765 -33265 -31432 26017 -11738 34008 31261 -18863
2542 -18863 17069 33345 39624 62587 36563 98641 95873 68852 99423 77619 34450 12773
2530 12773 -31965 28806 57702 84852 48571 45857 53888 89268 136340 109294 29983 -2206
2518 -2206 -58740 -17698 22941 34825 -8046 -27745 32956 68747 54876 57494 32904 15858
2506 15858 61922 81788 61503 18875 1741 17254 969 57643 71988 -5379 -55892 23065
2494 23065 86482 74056 32992 19570 5874 -12407 -19117 -11207 24430 25679 29156 1336 -9600
2481 -9600 -63431 45093 43776 -11055 -38288 2827 28918 63119 85051 -16061 1790 34129
2469 34129 39207 53089 52314 52286 -15381 -7852 67196 112192 96350 25907 45060 99568 149203
2456 149203 114789 95714 10934 -10613 19595 -5035 53788 55754 36257 -49383 7595 26351
2444 26351 32179 138318 91040 61513 73510 67049 48339 93026 81300 102947 86938 79607
2432 79607 96657 91631 92060 -8390 25513 62811 52308 69990 49365 24611 8038 22578
2420 22578 71222 97778 88603 36716 52436 106701 61866 104149 15201 -59221 -436 41531
2408 41531 67520 25603 -14540 18155 71702 49952 46761 90267 150919 112512 127398 106389
2396 106389 90150 95058 89022 45218 34378 118843 176115 155365 114740 177922 168656 149616
2384 149616 145565 69615 39506 29152 41678 60994 104329 92537 92421 99054 95440 58498 91223
2371 91223 157082 183176 196209 221509 163099 143581 91202 129874 183495 194567 166171 195198
2359 195198 159503 132660 197332 220520 254187 213438 251922 221230 211460 275333 313324 322896
2347 322896 267908 273298 350567 378812 381340 380889 387089 473658 496212 504774 557759 492782 598371
2334 598371 687248 747424 831471 957002 1020702 1047176 1078028 1254750 1395697 1532175 1700648
2323 1700648 1906074 2301350 2760513 3606717 5041055 6966647 9229841 11178483 11939934
2314 11939934 11978781 11900562 11554508 10575852 9347774 8097756 6680116 5439315 4284159
2305 4284159 3335835 2720898 2323125 2107412 1928580 1786852 1656847 1481803 1339135 1128544
2295 1128544 1082568 1103798 967517 917369 786717 726296 626578 588199 535786 478157 510406
2284 510406 454421 356018 374857 423187 354717 332260 381325 421410 362614 295691 264580 352904
2272 352904 340948 324468 252233 290447 306916 276321 275172 307965 294476 272733 263054 266992
2260 266992 244589 227522 208983 187899 157388 138763 198332 158874 174170 110962 141139 161500
2248 161500 103830 163554 207228 257029 228269 198979 209115 162986 157908 187734 136342 83800
2236 83800 93926 254354 218882 139241 69347 101644 109010 93891 90312 45262 38561 31890
2224 31890 -7734 45471 82248 101587 104389 -546 -18390 38116 100232 14017 67368 101108
2212 101108 90412 98001 103659 32245 27623 121954 139483 101944 71148 12266 38677 66065
2200 66065 60115 102913 66850 1901 76264 33772 29650 36602 54618 86605 104836 67376
2188 67376 41849 27463 31790 8526 66529 74041 29724 55120 298 -10695 -10711 -17551 -7484
2175 -7484 18421 65542 11741 -4327 1379 -5504 -22669 18593 73430 49423 56069 45987 52055
2162 52055 110122 132144 39990 35814 1886 -26011 -4649 23248 11896 -36661 -46951 507
2150 507 -30832 -48588 -27233 -19557 11938 -39955 -14828 -9841 4783 13182 -27022 -27669 -1128
2137 -1128 16017 103492 23895 -9275 2475 -11846 10964 24743 29599 17117 -26454 -46238
2125 -46238 20334 -24040 -24363 -74767 -52890 -54617 10649 72568 43654 -8816 3734 69241
2113 69241 60132 -51800 7587 51880 3897 4553 49058 68936 57430 39415 18148 -9722
2101 -9722 -53626 -89898 -86981 -32906 34916 -27005 -86647 11101 -30673 -43440 -14736 34957
2089 34957 -22650 15151 15114 -14013 34735 27261 32749 32745 65190 32766 -19808 27141 45477 -33785
2075 -33785 47440 26991 -2397 -42695 -45395 -19412 188 -25874 -100167 -67921 -22013 -51693
2063 -51693 -87853 -53332 -49576 -60396 -19445 -22607 -53910 -40159 -36280 -5101 -70940 -42319
2051 -42319 18753 26979 20014 105841 144076 82223 14960 23428 68929 94720 80189 87987 -2806
2038 -2806 -64167 -60374 -22464 -74001 -111159 -59497 -30708 10529 22909 13929 -38613 -9344
2026 -9344 -13109 -48458 -76296 -76141 -63224 -19049 -25581 59066 35016 49717 66718 29314 789
2013 789 23624 35585 57326 -78849 -44819 13797 -26097 -44378 -81766 -19439 7758 91186
2001 91186 57077 60624 38861 -27678 870 58178 102799 -36073 -22489 -9345 -15414 68713
1989 68713 22972 36581 -9656 -34213 -42953 -15384 15320 81125 82739 6273 30939 37432
1977 37432 61013 88013 -10069 -68052 -19776 38888 53316 18140 19932 57058 -15750 -28218
1965 -28218 -34332 -84774 -10461 -17240 34022 -1060 27898 82355 44089 -15723 -80062 -9378
1953 -9378 23471 -8627 -35922 10336 -87752 -46391 -868 41169 54993 -43275 -32780 -3731
1941 -3731 -35952 10768 2104 -19092 -30997 -39534 -8080 18714 55972 72853 42860 18079
1929 18079 26678 42210 18162 24319 14106 -14441 -55100 3777 40197 -15645 -36447 -14164
1917 -14164 42446 32942 -46691 -47474 -47898 -6396 38494 22205 -8010 -15283 -37333 -377 -7190
1904 -7190 -10708 -28170 -27596 -102408 16533 -8466 -43378 14639 -37931 -18954 31710 -2731
1892 -2731 -80191 -72414 -49008 -77114 -134370 -36338 32119 39932 -11642 -3703 -409 42172 27508
1879 27508 43317 -32701 -30593 -96188 -65053 -53127 -14756 -38626 -49022 -128361 -99739 -50024
1867 -50024 -22362 -28901 -16546 -6723 -27141 3070 -8439 -37907 4746 -25039 7152 21875
1855 21875 5873 -27378 -86724 -86490 -29075 15870 -3766 -7653 15906 -62357 -56862 11669 -10128
1842 -10128 -83341 -94194 -64573 -65394 -48572 19967 113092 34267 23099 61283 36699 -11548
1830 -11548 20311 34919 29773 23165 36967 21323 19429 -19644 -36828 -35476 10459 18632 14515
1817 14515 -47760 16832 -22842 -105194 -92657 -31218 -80895 -81222 -57421 -116796 -152303 -125549
1805 -125549 -35542 -24987 -30020 -66336 -63774 -76636 -101653 -55730 -60184 -54104 -33394 -22089
1793 -22089 -112672 -105063 -86979 8738 -454 31318 19198 -16217 -51680 -83254 -94464 -69492
1781 -69492 9283 -11739 31014 -28205 -47231 -45625 -35721 28795 41364 11704 24283 28116
1769 28116 70189 38544 -18106 -31449 -47874 -6931 -26306 -42673 -59025 -57374 -89590 -94561
1757 -94561 -38681 -31403 -17989 -31635 -10522 10378 37918 44875 6346 -10936 73211 34305
1745 34305 -55348 -58231 -4964 -38664 -42088 -45912 -45010 -64157 -58132 -70524 399 -709 -15476
1732 -15476 -3888 -36026 -65985 30149 75778 -12690 -27181 -39550 -4154 -37246 5468 -16122
1720 -16122 30446 18500 -8681 4165 -85660 -38555 -5055 -26777 -59494 3431 6620 1623
1708 1623 -27100 -13909 -28117 -12591 88554 68686 36498 7032 -798 -19904 -20829 -78877
1696 -78877 1379 25320 67303 38736 -38143 25141 58685 -55163 -84644 -68983 -68489 -53286
1684 -53286 -46550 15829 12406 32013 -66372 -70009 -62555 -8316 -10003 -3741 -8073 12285 7933
1671 7933 5978 27952 -4533 -19616 -51131 -130151 -47219 28158 -4959 3746 -10932 44904
1659 44904 -49407 -50672 33246 36583 -51763 -23103 12025 -26499 -67526 6284 -30347 -96295
1647 -96295 -91858 -18423 45799 -65056 -113877 -89334 -106529 -60397 -4599 30610 8251 -15188
1635 -15188 -36965 -117585 -4872 16618 29872 28108 -47217 -56238 -38254 14534 -9284 -51351
1623 -51351 -56200 -62126 12679 -7536 -48375 -37556 -30808 -11555 -53333 -7626 -48016 -36868
1611 -36868 37873 1197 -10561 7783 20379 -8060 14950 -34178 -56395 -58903 -121204 -100069
1599 -100069 -119286 -32905 1658 -20269 -96007 -117850 -18416 -12674 19324 -1798 -45003 -52113
1587 -52113 -47598 -45403 -50952 -39739 -49938 -36493 -8052 8135 -7383 -53989 -52611 -39987 -14954
1574 -14954 17481 38392 34240 -21365 -17601 42836 -14868 -78947 -56980 -38878 -39983 -77155
1562 -77155 -24112 -15995 -43333 -50955 -97512 -58489 -77228 -39915 -78816 -97348 -61033 -90569
1550 -90569 -84458 -109165 479 -2750 32316 50159 80478 92383 77543 73859 36718 -57025
1538 -57025 -68893 19766 38723 13875 -23431 -61697 -55132 -53626 -77529 -70447 -43379 -30075
1526 -30075 -47802 -2268 -17177 -12609 -55724 -16608 20152 11196 -3219 -50730 -33156 -30957
1514 -30957 -52678 -4956 -58876 -13848 10296 11237 -17404 57884 55570 20910 -49634 -24790
1502 -24790 17215 28326 4844 -44773 -37745 -1186 20156 -20808 -875 -11987 -25497 -47198
1490 -47198 -8548 -10297 -13577 -43270 -835 -1922 29843 13117 -125057 -115206 -55278 -19866
1478 -19866 -42189 -5423 6069 -18549 27206 -2795 9290 -23665 -65078 -61164 6553 45934
1466 45934 55677 -4822 -84482 -112535 -52588 -87391 -78574 -58687 -49323 -23664 -52114 -73216
1454 -73216 -74619 11344 -18712 50569 63366 1059 -34644 -56622 -56282 -14880 -26101 -36821
1442 -36821 -52029 -89582 -105166 -25958 -20750 -99074 -45961 -79590 -83392 -41807 -53178 -19381
1430 -19381 -6427 -25916 -14221 -17792 -42999 18804 10316 -69972 -38828 -60599 -81066 -71915
1418 -71915 -3217 -48645 1172 41469 22716 -23366 -33128 1893 13753 -38586 -47558 -31624
1406 -31624 6653 45964 43116 6746 -59363 -38990 -3161 -14957 -41200 17090 -2284 -68329
1394 -68329 -7644 -13768 -5675 -43129 -97613 -21742 27960 -3434 16550 -40228 -26184 -60451
1382 -60451 22427 52817 84285 95012 5371 -25727 -70225 -87288 -110452 -62899 -53267 -12244
1370 -12244 -32914 -25690 -75210 -86243 -22332 20062 49783 -33495 -92060 -61505 -128039 -93010
1358 -93010 -81677 24884 107625 23617 -51331 -68724 -66542 -12882 -42846 -73070 -122316 -74919
1346 -74919 -64561 -10559 -58820 -88122 -83242 -59353 12302 50349 -10694 -61184 -102988 -27201
1334 -27201 -54466 -110088 -60902 -22932 -29760 -27899 -47600 -43575 -24105 -62445 -48600 -62504
1322 -62504 -55144 -69687 -47975 3508 66391 31312 45775 67316 23189 -16467 -61606 -78253
1310 -78253 -30835 -79731 -40121 -55645 -45793 -22354 -25803 56403 100241 111664 86447 41433
1298 41433 70982 20119 3509 -1443 1723 -59478 -69343 -94386 -88482 -19660 13148 -50639 27119
1285 27119 68200 -31031 -25960 -3047 3634 -6896 -9457 -3934 -90403 -99461 -82450 -15052 25746
1272 25746 -38596 -44217 -38194 37747 45416 22504 30256 37887 -8099 -15407 -26725 1731 23184
1259 23184 13928 6006 75837 29594 67081 26257 5207 -17922 -53302 25986 48683 -31027
1247 -31027 -121261 -75809 -33960 6583 -75352 -64322 -49988 -23754 21292 61812 41016 42811
1235 42811 47171 6848 -31126 803 -41421 -56341 209 -12153 -40017 -69561 43692 43881
1223 43881 -42313 -69565 -59226 -44229 -98958 -106943 -29677 5886 56817 2502 -22206 -25028
1211 -25028 6919 46205 -8815 -22392 -48451 -51361 19312 29871 -36103 -72290 -108924 -40002
1199 -40002 -9934 10115 45383 13520 -89259 -113673 -27847 11737 16862 -15761 -38880 -61223
1187 -61223 -17267 -47395 -18636 -6215 -44369 -10379 37438 2048 -59776 -28636 -3636 -44308
1175 -44308 -76842 -274 2106 -17488 -68364 -109725 -86280 -40052 25334 44468 13663 -46786
1163 -46786 -52140 -103639 -93491 -58458 -65731 -51956 -29913 -48071 -23326 -1692 -56632 -27657
1151 -27657 -27533 -77029 -12802 -5384 35610 -27974 -67759 15054 19612 21618 -4939 -95528 -86489
1138 -86489 -17044 -79871 -108054 -102008 -53675 -60442 -26146 22916 34613 30743 -14569 -124798
1126 -124798 -83951 -21784 15652 20903 -27599 -85665 -80720 -63220 -43933 -43299 -12879 20225
1114 20225 -8659 997 3676 12779 16719 37832 8479 -30861 20962 16740 -31959 -8238 406
1101 406 -55123 -18150 18886 -13549 -76283 -137424 -86200 -29021 54130 8050 -70045 -83447
1089 -83447 -61178 -40761 16420 20300 20808 23812 -58413 -54768 -13405 -27028 -44296 -61807 23003
1076 23003 17800 -33821 -53844 -26868 -14622 -93368 -7347 7837 13664 -32574 -65113 -72776
1064 -72776 -84579 -42774 13306 30891 -21033 12640 -21688 -75107 -51239 -55637 -40564 31862
1052 31862 -34265 -24696 38521 31301 -14711 -69815 -87926 -61194 -3496 -30239 -26566 -60174
1040 -60174 -7171 25185 -40429 -23204 5579 32539 -1998 31787 42091 -11756 -33227 10163
1028 10163 28789 -3722 -17018 -27948 44963 20278 -33568 -46414 -4807 5751 -29227 -5054
1016 -5054 -42576 -86205 -142832 -103679 -66067 -70421 -86495 -110446 -57372 -41020 -76978 -47906
1004 -47906 -56766 -40815 -59627 -95954 -72706 -61444 38854 -15093 -69160 -116227 -166575 -73817
992 -73817 24340 -5926 -95943 -80842 -10719 37486 22654 -14922 -52145 -32632 -53240 -63550
980 -63550 -97944 -106357 -110349 -80468 -66169 -95436 -75586 -71920 -49230 -78622 -69152 -92204 -54218
967 -54218 23134 -36796 -28114 -70358 -30862 -27495 -24291 -3072 1030 19323 -8780 -49540 -71619
954 -71619 -98668 -78941 -1365 2128 -33040 6487 48134 16086 30676 -49700 -27443 4389
942 4389 16521 4773 -7204 -12462 -53047 -80533 -26441 -102281 -89809 -87472 -88631 -47903 -67470
929 -67470 -92063 -108171 -111232 -123484 -81250 2611 -5752 -19513 -27262 -63978 -80649 -31086 -11492
916 -11492 -74828 -81461 -54523 -66669 -75968 -105958 -100284 -50427 -32685 -7485 -33661 -26228 24674
903 24674 -9187 -24183 -64308 -30536 2871 -39269 -42399 -38378 -81382 -83474 27772 -33745
891 -33745 -113205 -109800 -69505 -1388 -60364 -126031 -90168 -59580 -34431 25054 52699 -37504
879 -37504 -55631 -49362 -23683 -56136 -57331 -6820 -32114 -65135 -21833 3611 -4894 -15804 11091
866 11091 8298 1233 -28932 -39571 -35591 -21005 21902 -49879 -2311 -32881 -117206 -1708
854 -1708 -1466 -25280 -89909 -34610 -52398 -106807 -104714 -84513 -78355 -114908 -135633 -148982 -98346
841 -98346 -79330 -63722 -43804 -112491 -127364 -74688 -3452 23761 -48854 -52885 -66356 34385
829 34385 41161 18909 -6374 -59376 -18198 -59077 -96239 -71338 -98771 -70499 -56713 -7408
817 -7408 7412 -67725 -30289 -16849 -80724 -138456 -105318 -70520 -49966 -50958 -19591 14680 -18052
804 -18052 2984 5096 -10968 -69807 -87975 -26167 58567 71214 -2572 -67896 -53431 -14031
792 -14031 -5849 46689 34615 28795 -28280 17944 3394 -18185 -61851 2075 -24939 -45362
780 -45362 -3159 -28869 -51890 -80600 -41908 -45493 -34858 -19234 -43193 -76548 -92116 -86421
768 -86421 4112 -60732 -55273 -63859 -40523 -22422 -27814 418 51747 54948 -19470 -57049 -20834
755 -20834 -12722 8852 21849 57784 66469 -5522 -71460 -77816 -124435 -97730 -47294 -76779 -93555
742 -93555 -104028 -94322 -83797 -34949 2902 11357 -20734 -55246 -22367 -27537 -19065 -90365 -43569
729 -43569 -18431 -31888 -73090 -55674 -34150 -69771 -98899 -110009 -124586 -97923 -17994 -14347
717 -14347 -54797 -38020 -10733 -77262 -71619 -55114 -13913 -55667 -45779 28088 14618 -16733
705 -16733 29303 -983 -32482 -67403 -25843 -60907 -56071 43759 92750 49079 16156 12642
693 12642 -25780 -22761 -129677 -126567 -43910 -9289 10486 -83320 -30428 -9569 -67062 -81683
681 -81683 -62325 -82876 -42326 13919 -15522 -8424 38244 83989 51831 54512 8452 21955
669 21955 22576 6087 6309 -8939 20600 35899 43494 46809 -26122 -107918 -53504 -956 -7595
656 -7595 -97556 -116090 -83430 -115976 -113517 -100587 -34817 -27656 -107091 -79720 -8040 1370 30246
643 30246 10898 -39023 -63270 -73778 -117116 -52292 -4704 -63643 -43705 -99255 -142956 -93577
631 -93577 -61136 -85429 -43550 -40720 -106892 -107810 -93687 -39436 -6154 575 63048 5698 -55195
618 -55195 -49500 -80356 -48358 -28116 -39149 -66088 -41739 -48728 -54747 -73293 -87867 -4162 -22983
605 -22983 -39346 -21421 -57641 -72470 -61699 -94736 -27890 -14976 -21024 -42760 -15518 -40069
593 -40069 -70389 -82368 -57253 -47301 -41323 -75957 -98128 -33894 -94035 -48933 -76525 -49103
581 -49103 -74389 -129806 -74254 -66886 -28088 -61562 -89296 -59839 -24888 -32152 -77324 -97845
569 -97845 -161710 -136968 -93668 -55557 -91034 -134813 -114887 -20058 -10860 -37982 7884 -49963
557 -49963 -25987 76911 13579 -29368 -21254 -46675 -97980 -66590 -13793 -27717 -90300 -80772
545 -80772 -66379 -62560 -31924 -55210 -69903 -58096 -61654 -238 24022 12615 -51154 -76729
533 -76729 -1876 49391 26706 -70168 -67969 -40904 -47255 -2197 -10539 -69896 -61304 -71697 -38476
520 -38476 -54102 -114567 -80791 -79727 -69766 -3862 -69508 -67953 -49302 -20855 9360 -25295 -22317
507 -22317 7478 -96097 -98381 -20879 58531 14057 -12135 -87674 -58245 -65054 -30689 1484
495 1484 -39119 -45397 -38058 -70348 -86722 -43622 -76457 -18401 -36809 -78191 -59639 -34848 -2761
482 -2761 -31284 -72734 13731 44968 15579 -45609 -3601 -14405 -14322 -71145 7769 -10669 695
469 695 49070 -16824 -35145 -36735 -8942 52905 14940 -38873 -52594 -8189 -77511 -130371 -68876
456 -68876 -161399 -139015 -100624 -64013 -58694 -3424 -7924 -67669 -26382 -57296 -17491 -67783
444 -67783 -77115 -33353 -72029 -45736 -46070 -77142 -55029 -77779 -77871 -31339 -7016 -28042 -43793
431 -43793 -54190 -98066 -75313 -35253 -21788 -13770 -36203 -71863 -98316 -60975 -44585 -40501
419 -40501 -84528 -46655 -24109 14759 26487 -37858 2971 -61682 -159671 -133055 -105313 -139739
407 -139739 -162139 -154943 -68011 -29435 -69409 -88830 -66214 -91818 -80508 -99173 -47601 -55432
395 -55432 -71371 -51589 -31949 -43572 -66741 -72515 -59652 6215 -6642 7531 -49730 -47136
383 -47136 -38313 -7317 31973 -52128 -91034 -16506 15378 -25946 -30118 -30093 9728 -22704 11995
370 11995 -57820 -110625 -80172 -53309 -108349 -96427 -76762 -73288 -78547 -56304 -86332 -54456
358 -54456 -9964 32495 7435 -3904 -33696 -96572 -41867 -32828 -28793 -45737 -8246 -8034 3066
345 3066 39142 -13854 10221 -48778 -124847 -106332 -80498 -39952 -46686 -23591 -73638 -104979
333 -104979 -36889 -55972 -68163 -21042 25191 -3014 -20529 -100502 -112498 -53783 -38560 -17417
321 -17417 -79989 -56812 -118097 -78489 -45640 -42559 -59178 -59780 -91451 -96696 -57775 -128397 -110360
308 -110360 -66968 -75081 -120647 -88992 -104996 -113743 -102220 -105600 -16520 1050 -43890 -64268
296 -64268 -22084 6754 501 32590 -57583 -57913 23574 -82767 -52052 -49688 -103223 -168413 -91517
283 -91517 -80053 -57471 -2468 -15704 -10740 -34697 -46086 -11757 -12715 -52087 -77329 -120979 -84955
270 -84955 -41070 -10533 -43560 -74508 -98982 -89232 -53440 -118665 -98250 -102613 -57240 -53607 -46377
257 -46377 -14638 55497 -27300 -45577 -64773 -45786 -25393 -9279 -1614 -57163 -37914 -64137
245 -64137 -91281 -87751 -62241 -48429 -38424 -64735 -37789 -74516 -52967 -23102 -93266 -126040
233 -126040 -79377 -34835 -51149 -58774 -46679 -51669 -56483 -56403 -38259 -59942 -131298 -103853 -57676
220 -57676 -67798 3446 -40415 18730 -2105 -65877 -83924 -71707 -68966 -31834 -48721 -91199
208 -91199 -63880 -118066 -98720 -116851 -70478 -93456 -123756 -82152 -34678 5224 -4505 -114838
196 -114838 -143915 -123998 -105599 -50494 -119179 -107030 -92498 -118182 -192313 -111636 -38667 -37259
184 -37259 -69774 -91743 -90434 -106021 -141768 -88036 -36986 -79937 -101762 -61706 -88518 -68533
172 -68533 -26220 -10552 -46690 -53238 -91137 -11473 18191 -17087 -43681 18281 -22876 2740
160 2740 -55892 -146473 -64271 -63596 -71034 -99416 -78222 -68616 -87767 -95642 -39372 -45457 -85772
147 -85772 -95538 -59218 -81176 -68896 -90762 -112989 -93283 -116197 -96837 -66146 -75966 -57970
135 -57970 -64445 -44475 -113810 -146639 -110960 -88137 -102560 -65744 -92259 -98299 -69781 -56297
123 -56297 -19697 -67951 -96413 -50677 -62913 -63366 -61449 -43217 -62811 -116210 -112218 -110200 -101887
110 -101887 -63944 -108313 -85566 -97432 -142270 -129210 -76356 -70545 -91062 -73559 -124808 -120684
98 -120684 -118767 -58328 -81699 -123596 -81372 -82265 -121314 -134607 -156960 -162885 -122668 -139467 -156388
85 -156388 -190119 -180658 -196725 -155931 -105900 -51111 -96157 -76437 -39121 -89083 -108071 -123732
73 -123732 -100253 -102744 -131640 -151167 -144275 -122299 -93895 -112659 -100083 -125754 -144642 -142411 -107087
60 -107087 -117678 -88798 -66744 -76710 -81542 -124633 -116851 -70270 -41084 -102402 -158295 -179452 -137098
47 -137098 -64915 -72205 -127242 -169008 -182523 -157641 -165101 -152453 -115707 -102953 -162667 -122446
35 -122446 -95006 -102573 -97165 -121091 -154811 -149656 -117701 -115809 -128031 -123787 -136633 -110453 -99879
22 -99879 -155906 -113562 -156524 -124456 -142847 -189361 -154390 -159587 -147138 -142991 -125079 -137349 -179633
9 -179633 -206939 -189837 -161395 -197268 -170377 -151552 -171892 -174861 -204376
0 -204376
$$ Imaginary data points
##PAGE= N=2
##DATA TABLE= (X++(I..I)), XYDATA
16383 -439845 -459909 -532014 -508962 -467272 -482207 -445656 -409532 -398100 -380131 -355311 -355993 -394167
16371 -394167 -394474 -396533 -394562 -401845 -370531 -341176 -350913 -291629 -313867 -306790 -329069 -368619 -327321
16358 -327321 -248782 -246905 -242981 -185248 -221086 -223762 -207058 -205714 -232798 -207950 -144852 -144144 -196923
16345 -196923 -158409 -114667 -133533 -78410 -22711 -7315 -10052 -9951 -20065 -43226 -18648 -12393
16333 -12393 -48578 -9999 8081 -2653 37216 10659 17023 -58873 -47190 42397 73186 59412
16321 59412 41982 54380 17286 44549 77350 65300 29704 58946 98646 88786 108650 76779
16309 76779 105670 162191 215841 202397 189036 244700 209958 182348 193495 185680 219640 242517
16297 242517 239627 231083 220354 268976 289486 199341 214165 279434 292108 272808 301633 326962
16285 326962 321909 315992 286506 322086 340730 398182 408382 420261 337611 303470 330785 385885
16273 385885 383051 440034 463361 421055 413411 391987 431110 496504 484573 484208 477930 490499
16261 490499 491274 460832 510401 492990 494884 518425 548544 487404 501861 512121 500189 538067
16249 538067 574993 550910 578135 605452 610871 560074 524825 582335 573502 588113 564493 620973
16237 620973 607305 544526 620490 662465 635486 673420 671392 609426 635403 675817 710518 631494
16225 631494 659783 644383 691698 735464 696116 673533 762358 729211 701154 729275 732518 751403
16213 751403 770933 717549 625813 590370 675355 755368 777630 743071 686364 712154 689623
$$ [...]
##END NTUPLES=NMR SPECTRUM
##END=
