##TITLE=1H_DE-80H_X3
 200.13MHz, d2o
 8 sc
 
 19ns.26.2.2025
##JCAMPDX= 6.0         $$ Bruker NMR JCAMP-DX V2.0
##DATA TYPE= NMR SPECTRUM
##DATA CLASS= NTUPLES
##ORIGIN= UXNMR, Bruker Analytische Messtechnik GmbH
##OWNER= pz
$$ XWIN-NMR		Version 3.5
$$ Tue Jul 28 10:56:27 2026 Russian Standard Time (UT+4h)  Yarkov@DPX200
##.OBSERVE FREQUENCY= 200.1313
##.OBSERVE NUCLEUS= ^1H
##.ACQUISITION MODE= SIMULTANEOUS
##.ACQUISITION SCHEME= undefined
##.AVERAGES= 8
##.DIGITISER RES= 18
##SPECTROMETER/DATA SYSTEM= spect
##.PULSE SEQUENCE= zg30
##.SOLVENT NAME= CDCl3
##.SHIFT REFERENCE= (INTERNAL, CDCl3, 0, 15.5078)
##AUDIT TRAIL= $$ (NUMBER, WHEN, WHO, WHERE, WHAT)
$$ ##TITLE= Audit trail, XWIN-NMR		Version 3.5
$$ ##JCAMPDX= 5.01
$$ ##ORIGIN= Bruker BioSpin GmbH
$$ ##OWNER= Yarkov
$$ C:/Bruker/XWIN-NMR/data/yarkov2/nmr/H-C/1/pdata/1/auditp.txt
$$ ##AUDIT TRAIL=  $$ (NUMBER, WHEN, WHO, WHERE, WHAT)
(   1,<2026-07-28 10:55:27.48 +0400>,<Yarkov>,<DPX200>,
      <created by zg, POWCHK disabled, PULCHK disabled
       configuration hash MD5:
       00 E9 B6 7A A2 85 ED C7 34 08 36 98 17 FE 4E 26
       data hash MD5: 16K
       E9 6E 97 1C 31 46 C1 AA AD 53 1A B9 5B AF 9B 5F>)
(   2,<2026-07-28 10:55:46.12 +0400>,<Yarkov>,<DPX200>,
      <Start of raw data processing
       efp BC_mod = 2 LB = 0.25 FT_mod = 6 PKNL = 1 PHC0 = -7253.183 PHC1 = 2.82197 SI = 16K 
       data hash MD5: 16K
       20 4A F6 94 3D 76 39 60 6D 9A BD 2E C4 8A 9E 9E>)
$$ ##END=
$$ 
$$ hash MD5
$$ D9 27 EF 30 C4 1E D5 2F 99 50 39 38 71 D9 EE CF
##$RELAX= 
##$RELAX= 
##$RELAX= 
##$RELAX= 
##$RELAX= 
##$RELAX= 
$$ Bruker specific parameters
$$ --------------------------
##$DU= <C:/Bruker/XWIN-NMR>
##$EXPNO= 1
##$NAME= <H-C>
##$PROCNO= 1
##$TYPE= <nmr>
##$USER= <yarkov2>
##$AMP= (0..31)
100 100 100 100 100 100 100 100 100 100 100 100 100 100 100 100 100 100 
100 100 100 100 100 100 100 100 100 100 100 100 100 100 
##$AQSEQ= 0
##$AQ_mod= 1
##$AUNM= <au_zg>
##$AUTOPOS= <>
##$BF1= 200.13
##$BF2= 200.13
##$BF3= 200.13
##$BF4= 200.13
##$BF5= 200.13
##$BF6= 200.13
##$BF7= 200.13
##$BF8= 200.13
##$BYTORDA= 1
##$CFDGTYP= 0
##$CFRGTYP= 5
##$CHEMSTR= <none>
##$CNST= (0..31)
1 1 145 1 1 1 1 1 1 1 1 1 1 1 1 1 1 1 1 1 1 1 1 1 1 1 1 1 1 1 1 1 
##$CPDPRG= <>
##$CPDPRG1= <>
##$CPDPRG2= <>
##$CPDPRG3= <>
##$CPDPRG4= <mlev>
##$CPDPRG5= <mlev>
##$CPDPRG6= <mlev>
##$CPDPRG7= <mlev>
##$CPDPRG8= <mlev>
##$CPDPRGB= <>
##$CPDPRGT= <>
##$D= (0..31)
0 0.7 0 0 0 0 0 0 0 0 0 0.03 0 0 0 0 0 0 0 0 0 0 0 0 0 0 0 0 0 0 0 0 
##$DATE= 1785221727
##$DBL= (0..7)
120 120 120 120 120 120 120 120 
##$DBP= (0..7)
150 150 150 150 150 150 150 150 
##$DBP07= 0
##$DBPNAM0= <>
##$DBPNAM1= <>
##$DBPNAM2= <>
##$DBPNAM3= <>
##$DBPNAM4= <>
##$DBPNAM5= <>
##$DBPNAM6= <>
##$DBPNAM7= <>
##$DBPOAL= (0..7)
0.5 0.5 0.5 0.5 0.5 0.5 0.5 0.5 
##$DBPOFFS= (0..7)
0 0 0 0 0 0 0 0 
##$DE= 6
##$DECBNUC= <off>
##$DECIM= 32
##$DECNUC= <off>
##$DECSTAT= 4
##$DIGMOD= 1
##$DIGTYP= 9
##$DL= (0..7)
0 120 120 120 120 120 120 120 
##$DP= (0..7)
$$ [...]
##$SUBNAM2= <"">
##$SUBNAM3= <"">
##$SUBNAM4= <"">
##$SUBNAM5= <"">
##$SUBNAM6= <"">
##$SUBNAM7= <"">
##$SUBNAM8= <"">
##$SUBNAM9= <"">
##$SW= 18.0517328524113
##$SWIBOX= (0..15)
0 0 2 0 0 0 0 0 0 0 0 0 0 0 0 0 
##$SW_h= 3612.71676300578
##$TD= 16384
##$TD0= 1
##$TE= 0
##$TE2= 300
##$TE3= 300
##$TEG= 300
##$TL= (0..7)
0 120 120 120 120 120 120 120 
##$TP= (0..7)
150 150 150 150 150 150 150 150 
##$TP07= 0
##$TPNAME0= <>
##$TPNAME1= <>
##$TPNAME2= <>
##$TPNAME3= <>
##$TPNAME4= <>
##$TPNAME5= <>
##$TPNAME6= <>
##$TPNAME7= <>
##$TPOAL= (0..7)
0.5 0.5 0.5 0.5 0.5 0.5 0.5 0.5 
##$TPOFFS= (0..7)
0 0 0 0 0 0 0 0 
##$TUNHIN= 0
##$TUNHOUT= 0
##$TUNXOUT= 0
##$USERA1= <user>
##$USERA2= <user>
##$USERA3= <user>
##$USERA4= <user>
##$USERA5= <user>
##$V9= 5
##$VALIST= <valist>
##$VCLIST= <CCCCCCCCCCCCCCC>
##$VD= 0
##$VDLIST= <DDDDDDDDDDDDDDD>
##$VPLIST= <PPPPPPPPPPPPPPP>
##$VTLIST= <TTTTTTTTTTTTTTT>
##$WBST= 1024
##$WBSW= 4
##$XGAIN= (0..3)
0 0 0 0 
##$XL= 0
##$YL= 0
##$YMAX_a= 191737
##$YMIN_a= -268363
##$ZGOPTNS= <>
##$ZL1= 120
##$ZL2= 120
##$ZL3= 120
##$ZL4= 120
##$ABSF1= 0
##$ABSF2= 0
##$ABSG= 0
##$ABSL= 0
##$ALPHA= 0
##$AQORDER= 0
##$ASSFAC= 0
##$ASSFACI= 0
##$ASSFACX= 0
##$ASSWID= 0
##$AUNMP= <proc_1d>
##$AZFE= 0.1
##$AZFW= 0.1
##$BCFW= 0
##$BC_mod= 2
##$BYTORDP= 0
##$COROFFS= 0
##$CY= -3
##$DATMOD= 1
##$DC= 0
##$DFILT= <>
##$DTYPP= 0
##$F1P= 0
##$F2P= 0
##$FCOR= 1
##$FTSIZE= 16384
##$FT_mod= 6
##$GAMMA= 0
##$GB= 0
##$INTBC= 1
##$INTSCL= 3.241238e-09
##$ISEN= 128
##$LB= 0.25
##$LEV0= 0
##$LPBIN= 0
##$MAXI= 10000
##$MC2= 0
##$MEAN= 0
##$ME_mod= 0
##$MI= 1.114404
##$NCOEF= 0
##$NC_proc= -8
##$NLEV= 6
##$NOISF1= 3.799351
##$NOISF2= 2.8
##$NSP= 0
##$NTH_PI= 0
##$NZP= 0
##$OFFSET= 15.5078
##$PC= 1
##$PHC0= -7253.183
##$PHC1= 2.82197
##$PH_mod= 1
##$PKNL= yes
##$PPARMOD= 0
##$PSCAL= 0
##$PSIGN= 0
##$REVERSE= no
##$SF= 200.130002781587
##$SI= 16384
##$SIGF1= 3
##$SIGF2= 2
##$SINO= 0.751879
##$SIOLD= 32768
##$SREGLST= <19F.Aceton>
##$SSB= 0
##$STSI= 16384
##$STSR= 0
##$SW_p= 3612.71676300578
##$SYMM= 0
##$S_DEV= 0
##$TDeff= 16384
##$TDoff= 0
##$TI= <>
##$TILT= no
##$TM1= 0
##$TM2= 0
##$TOPLEV= 0
##$USERP1= <user>
##$USERP2= <user>
##$USERP3= <user>
##$USERP4= <user>
##$USERP5= <user>
##$WDW= 1
##$XDIM= 16384
##$YMAX_p= 443188956
##$YMIN_p= -1974572
$$ End of Bruker specific parameters
$$ ---------------------------------
##NTUPLES= NMR SPECTRUM
##VAR_NAME=  FREQUENCY,     SPECTRUM/REAL,   SPECTRUM/IMAG
##SYMBOL=    X,             R,               I
##VAR_TYPE=  INDEPENDENT,   DEPENDENT,       DEPENDENT
##VAR_FORM=  AFFN,          ASDF,            ASDF
##VAR_DIM=   16384,         16384,           16384
##UNITS=     HZ,            ARBITRARY UNITS, ARBITRARY UNITS
##FACTOR=    0.220516191357247, 1,           1
##FIRST=     3103.57607759636, 0,            0
##LAST=      -509.140685409418, 0,           0
##MIN=       -509.140685409418, -1974572,    0
##MAX=       3103.57607759636, 443188956,    0
$$ Real data points
##PAGE= N=1
##DATA TABLE= (X++(R..R)), XYDATA
$$ [...]
8710 369191 286049 534537 480445 385696 410395 170771 161408 269029 246296 375712 383670
8699 383670 501874 732912 553940 445027 419784 426605 336861 478877 243737 330938 234361
8688 234361 262490 501447 652841 727186 424057 216484 448412 279230 383239 685503
8678 685503 738562 606954 239215 388165 492159 411013 566923 289017 344810 623482
8668 623482 658132 504336 355758 213411 134456 366121 455308 194428 86325 -14029
8658 -14029 430142 572724 71226 64327 107528 -31297 278468 421435 145418 42802
8648 42802 377806 526282 414814 398737 164127 369896 407448 508948 238085 232048 546641
8637 546641 555263 494066 253093 384142 385041 267914 116943 115271 147560 -7591 -105071
8626 -105071 26555 312460 190027 20262 827 281345 353988 292073 160212 367866
8616 367866 52729 31492 230655 270958 245597 300065 319195 409607 416489 346532 228404
8605 228404 148176 48189 130849 164565 429400 352919 348461 288466 160641 265124 357345
8594 357345 418881 104535 74646 333796 175980 134239 398321 511671 132751 222227
8584 222227 328164 441190 453858 480364 770664 578769 611130 312704 234912 -90719
8574 -90719 265741 353303 134289 100225 119560 -34770 23652 -43266 -127421 6533 75092
8563 75092 85884 110201 204265 278064 170320 214978 502489 492365 157903 40195 111167
8552 111167 313940 233266 36506 30041 455146 319714 319611 269267 201817 149979 106983
8541 106983 432974 316664 340474 577768 424659 395126 545396 333531 434769 454820
8531 454820 144495 432813 439256 277979 400482 326140 447780 472221 466777 360799 291493
8520 291493 111076 193949 455794 597182 605845 546351 447712 371654 255519 360148 288351
8509 288351 142926 25789 104584 243865 227427 151302 241340 129753 -54338 133756
8499 133756 294404 200002 117407 107459 353803 479896 381723 348531 93644 304822 155427
8488 155427 1684 278274 158373 93286 259194 237297 134324 234347 85392 -206077
8478 -206077 -178335 211087 241414 90798 -35832 104028 263619 87054 -43615 183927
8468 183927 167142 181547 206894 215913 361203 257304 194200 154830 304151 143882 303601
8457 303601 462808 242552 425251 610336 793149 786016 1112591 1189745 1470625 1713897
8447 1713897 1818440 1753381 1389987 1417118 1070859 952115 887011 858752 895311 402278
8437 402278 313621 640704 524837 80398 53325 398947 307386 130083 106135 -1779
8427 -1779 51689 104676 106065 272213 445297 499645 225225 204764 130842 162797 163015 319064
8415 319064 11405 190136 169417 206261 299768 120789 361726 410211 395433 331600 81920
8404 81920 -9932 201121 251969 11307 185618 154892 131020 107194 175387 150270 -98932
8393 -98932 231595 210688 -64110 -97057 -16332 -180212 28843 192731 168906 -50445 171556
8382 171556 293339 54231 88015 207976 62594 76121 369309 262731 24410 -39946
8372 -39946 16045 200656 45020 210894 243313 78837 -20114 87768 -84634 313637
8362 313637 345502 363420 499210 265245 163368 131907 280773 -55428 57165 117879
8352 117879 120621 231689 192256 2624 105210 177281 179958 375497 148298 58772 68238
8341 68238 -88497 -107587 47167 90917 347800 215574 -88993 -135153 -70159 168577 71430
8330 71430 19898 123263 188831 312855 247403 -35280 262964 125324 157597 261047 103200
8319 103200 -28153 81342 -81721 23791 -73291 -6909 187787 -145046 -218617 -65758
8309 -65758 452349 599822 383235 535376 203126 233162 361910 245063 138399 238404
8299 238404 519369 257108 392038 139441 352231 392874 287344 539078 323899 398348
8289 398348 409969 -40442 191259 231214 237561 -98286 -108594 245965 89522 -5606 332313
8278 332313 393373 305972 393778 316980 274712 247743 208103 294444 309723 235306 95848
8267 95848 -162 112811 51047 -21638 143992 523218 213690 334220 150243 -92256
8257 -92256 77136 -39060 337318 561121 293890 131430 200145 334100 -34119 15758
8247 15758 -78575 -74744 94065 193645 246750 -81363 -194103 -85642 -1051 56595 123895
8236 123895 303132 535014 124029 298008 268027 269800 412566 62543 -8359 227759
8226 227759 211384 380814 334898 239270 291744 393989 606637 428427 401106 341504 190941
8215 190941 168333 133527 -52361 149382 231964 234525 247077 -19890 -153204 -55047 -141312
8204 -141312 -131400 -290807 -206119 21225 -195221 -79397 64163 125426 335643 32414
8194 32414 297214 43978 817118 1164847 604922 836847 536835 315820 450017 484063
8184 484063 407004 897475 367273 -81891 97014 168075 416276 550777 280970 246789
8174 246789 195935 225091 177193 115687 38046 329028 204719 58654 193050 124156 -8092
8163 -8092 -33564 -29130 219613 629415 391983 34057 -13253 179685 314254 574979 568644
8152 568644 419775 586925 531820 204392 187990 275132 689763 767773 489395 496930 466993
8141 466993 485548 414341 229642 192761 202746 402662 226253 -16556 413814 458690 403632
8130 403632 483497 586325 560753 353688 417320 307465 -42684 4883 170466 290712
8120 290712 253155 390527 652098 593644 445836 294242 232418 181094 108702 178190 323642
8109 323642 387455 184262 -142302 -95660 175717 -39608 100450 478641 409597 339585
8099 339585 176356 178386 42858 222970 471623 405537 516963 579894 449564 495105 293663
8088 293663 -28214 196213 299676 78472 279731 242290 94366 409248 394737 365205
8078 365205 517012 444876 332987 224836 306409 335049 113351 111688 318552 142465 307307
8067 307307 225341 220913 74855 158577 192465 96939 74942 45084 211030 317879 637443
8056 637443 697967 575525 609941 497165 382673 430609 149234 360757 280128 113368
8046 113368 73872 121650 221478 296925 293027 24251 -8530 106879 -100467 158899 174043
8035 174043 173576 160441 242586 394366 286838 452364 538666 493499 532166 625651 270515
8024 270515 209102 245860 369882 293497 292085 643823 521709 468395 487260 443776 217059
8013 217059 286987 313874 -34671 132807 189414 191077 306155 214741 68948 182420 211180
8002 211180 96527 28742 -5720 168919 162641 249411 164852 223045 271233 353334 360397 329833
7990 329833 196100 77568 33918 -80125 -82183 259565 291222 347662 330768 295852 419089
7979 419089 308079 702908 688162 581886 384354 318386 330768 278022 270331 127217 90949
7968 90949 230174 163025 152087 305441 393279 380727 742975 388830 431745 403391 371391
7957 371391 428749 109397 285468 332240 221419 171752 267936 237469 479618 522187 414644
7946 414644 198328 65174 25165 104497 225443 262789 366644 437650 524480 403106 132862
7935 132862 127664 449858 750777 804127 526905 321256 219966 112772 140442 97839 345538
7924 345538 282853 327604 356249 392007 271540 164031 372549 469426 511009 502162 427469
7913 427469 590401 912181 583950 404882 242944 198238 233891 254536 572369 575738 408075
7902 408075 247588 241370 337492 481455 511158 388963 486826 204481 344476 371399 324481
7891 324481 91488 269546 332131 211214 383417 347812 450890 263047 362986 562242
7881 562242 491401 386122 287850 344780 358510 280260 310308 242322 225469 261657 341688
7870 341688 56633 58058 102920 205738 289235 345959 628084 735065 686821 489027 623130
7859 623130 799797 512480 536073 736262 284511 321494 614851 465914 253820 335149
7849 335149 320545 75686 454814 462925 362558 484973 300125 340582 548285 603790 357104
7838 357104 268615 324214 263251 484659 479691 581547 376321 347641 413096 440088 529536
7827 529536 492744 227459 312492 363745 522291 442930 409425 345796 378203 502872 556800
7816 556800 300636 320514 492520 429115 355546 391729 -71921 -177140 470270 248439
7806 248439 665710 562591 387422 122671 304491 524549 578480 502353 357908 489845
7796 489845 500890 446098 421423 411632 219577 367847 367551 474810 426415 297037 435370
7785 435370 333126 165225 271752 626791 689678 605365 590252 759663 582940 584711 584619
7774 584619 841958 491842 544136 782230 790724 878555 763045 774487 792269 787708 396417
7763 396417 133454 63931 120015 401589 568769 724688 668756 523523 617486 368412
7753 368412 332296 535423 676601 502557 637930 693444 601794 867331 811106 744765 744997
7742 744997 437084 299303 370271 558716 599785 546070 436566 346326 525895 413443
7732 413443 225596 80202 409600 623618 637371 390687 445186 607271 474075 382442
7722 382442 542503 661471 576509 654473 791937 799663 601638 733016 700430 636727 576008
7711 576008 649240 627320 621523 900822 836599 697129 762638 604189 671486 991593 647575
7700 647575 708988 928592 832254 1019537 1210390 1032184 1050272 703968 553565 569251
7690 569251 520111 845208 879809 1037194 1208645 1275983 818227 1017854 1194107 1013847
7680 1013847 754831 638041 684784 815313 881622 953566 756599 751408 934996 921714 647095
7669 647095 988497 788781 898197 1051928 657571 721538 955251 547620 455773 802124
7659 802124 911320 852808 895791 971291 1148212 1177004 1038770 977972 780231 662747 829617
7648 829617 735205 670906 971502 647922 341602 607611 628172 378591 893721 858871
7638 858871 756229 659374 585858 534902 831073 457025 700354 942741 836676 594231
7628 594231 672512 1029981 836267 1010604 928501 1113021 1137061 860397 878976 787601 907317
7617 907317 948037 787590 936838 1060132 745854 540661 715976 796747 948320 886414
7607 886414 943277 1191231 908935 749231 598336 396838 712592 910044 946245 797588
7597 797588 896811 1118673 1071596 771795 797866 1040268 1135086 799463 927532 1054233
7587 1054233 1009877 960760 977123 1120501 1034608 1084185 937053 1087278 1025857 1219005 1288001
7576 1288001 1405895 1162897 1150943 1261519 1055819 889822 919427 1227414 1308754 1262769
7566 1262769 1158365 990730 892068 957062 709334 682691 980363 839022 913655 951017
7556 951017 1081880 1019572 1470462 1288039 1032384 934657 953531 975051 1293755 1422124
7546 1422124 1106366 1110835 978784 932805 1130461 1400175 1081540 1092078 1080486 1185489
7536 1185489 1354843 1217089 1096485 1293772 1379368 1106205 1220475 1341319 1386194 1435433
7526 1435433 1316248 1312871 1225734 1500281 1225034 1065551 1062463 1330878 1334730 1256160 1322589
7515 1322589 1506127 1386950 1488677 1282047 1015094 1460217 1555343 1393130 1633824 1592530
7505 1592530 1329061 1306324 1694403 1583256 1532045 1629093 1469102 1405957 1622422 1634250
7495 1634250 1483844 1512391 1398688 1618843 1636842 1608185 1569013 1494750 1563773 1401799 1551106
7484 1551106 1578185 1696070 1625164 1646902 1635962 1706636 2109896 1968736 1807156 1682920
7474 1682920 1348310 1650510 1590848 1376964 1607549 1678169 1791847 1471457 1488115 1602348
7464 1602348 1888111 1739930 1712863 1915855 1916050 1837044 1989428 2008353 2208029 2064696 1854143
7453 1854143 1753839 1879970 1760056 1776145 1948523 1874105 2043035 2042713 2110443 2000595 2023901
7442 2023901 1935593 1728373 2201007 2124221 1914240 1983078 2207031 2501155 2374810 2147280
7432 2147280 2164132 2243947 2306857 2292770 2274300 2105520 1909668 2151583 2226890 2419499 2198502
7421 2198502 2470484 2705387 2498887 2442316 2445591 2294868 1972690 2074397 2324326 2220275
7411 2220275 2021822 2239763 2331781 2461693 2336969 2392531 2357919 2268088 2221924 2449709
7401 2449709 2383787 2315023 2403513 2539218 2558094 2504279 2589088 2656012 2410524 2559330 2853301
7390 2853301 2676649 2648495 2657594 2831539 2784577 2837882 3013335 3045298 2641653 2517780 2368889
7379 2368889 2564875 2720407 2731189 2653543 2717498 2747874 2846865 2951014 2940331 2987959 3195263
7368 3195263 3191762 3045227 3068159 2916184 2963107 3133672 2955667 3227907 3196170 3145275 3246858
7357 3246858 3335267 3342493 3083804 3105646 3200305 3270058 3527724 3568149 3437704 3355068 3223213
7346 3223213 3366244 3272975 3528976 3643016 3630781 3570724 3734797 3767099 3657503 3670269
7336 3670269 3851378 3973316 4055254 3922915 3784425 3924195 3719815 3832524 3950772 3743262
7326 3743262 3985683 4327504 4418517 4221895 4318054 4574693 4350607 4100697 4148099 4149519
7316 4149519 4106465 4015921 4114325 4320605 4535885 4779832 4815397 4861135 4851127 4952523 5150865
7305 5150865 5184451 4999068 5247168 5120333 5209486 5532869 5626820 5753161 5677594 5764431
7295 5764431 5987483 5914649 5776054 5586591 5549192 5770640 5835494 5924474 6006726 6026747 5933972
7284 5933972 6153368 6194367 6375139 6745811 6800998 6796535 6883594 6916590 6796076 6631674 7057787
7273 7057787 6876995 6949606 6934263 7069965 7210347 7254441 7434397 7510350 7806737 7898490
7263 7898490 7884180 7913616 8187506 7938766 7982327 8086706 8273627 8235273 8333529 8897922
7253 8897922 8996476 9024560 9262589 9514200 9490510 9599736 9946910 9947073 9855430 10357508 10538297
7242 10538297 10423290 10442531 10519588 10861160 11041454 11310753 11227959 11056496 11118686 11466656
7232 11466656 11648405 11728655 11981394 12251653 12583495 12749290 12672659 12982199 13262612 13243724
7222 13243724 13375581 13766120 14318731 14634683 15059468 15281721 15271840 15787990 16078807 16379951
7212 16379951 16185952 16419798 16925615 17496505 17446353 17770123 18391222 18776115 19109689 19506176
7202 19506176 19691599 19865530 20288929 20739981 21050381 21219956 21392101 21985307 22575520
7193 22575520 22775842 23199331 23836721 24552831 25054483 25511201 26197118 26492224 26947687
7184 26947687 27386076 27774144 28744816 29107295 29815109 30251248 30781425 31548386 32349677
7175 32349677 32746988 33568090 34502157 35153938 35826550 36535132 37315766 37958110 38663572
7166 38663572 39378270 40127603 41106982 41833201 42450178 43528289 44592921 45255389 46026306
7157 46026306 46839672 47600133 48346603 49588113 50209506 50937236 51708177 52794520 53322239
7148 53322239 54108346 54739375 55372283 55936845 56684809 57186718 57630840 58326968 58792655
7139 58792655 59487872 59793685 59864874 60022829 60244436 60393597 60667261 60743644 60581558 60451175
7129 60451175 60440416 60192173 59946150 59859922 59418911 59058421 58417213 57589908 57020768 56500420
7119 56500420 55957128 55244848 54465800 53548706 53064475 52448144 51812359 50838565 50297952
7110 50297952 49307611 48525391 47766336 46994911 45805477 44897320 43995570 43458198 42680448
7101 42680448 41911266 41226162 40263035 39584456 38922989 37888480 37099968 36222899 35298223
7092 35298223 34649201 34124332 33511666 32696214 32077153 31336574 30543120 29962668 29488581
7083 29488581 29056379 28612787 27935589 27422591 26955891 26337096 25865762 25563745 24836880
7074 24836880 24384120 24084414 23510297 22884071 22568220 22112632 21690914 21342516 20931528
7065 20931528 20589576 20180424 19584222 19415310 19113726 18831653 18500644 18169170 17621833
7056 17621833 17356989 17321822 16954095 16507484 16071560 15627738 15610050 15785807 15277159 14859986
7046 14859986 14471319 14301233 14242304 14021141 13571638 13453257 13238777 13068379 13266967 13085438
7036 13085438 12664763 12282321 12340068 12414068 11977400 11713352 11885912 11903230 11610266 11133586
7026 11133586 10563617 10462127 10591211 10515397 10455310 10514392 10345820 10239555 10086438 9845533
7016 9845533 9446941 9473963 9462601 9358642 9033252 8991856 9165701 9008842 8862386 8672614
7006 8672614 8790460 8806608 8815849 8751644 8640328 8496481 8502818 8620805 8570286 8265854 8063428
6995 8063428 7982043 7679525 7615267 7481789 7278522 7487401 7664888 7398909 7197808 7125616
6985 7125616 6974066 6609144 6497433 6641896 6817711 6724309 6723574 6869033 6478864 6421327
6975 6421327 6280082 6021918 5975268 5801835 5888389 6077938 5941056 5869672 5840382 5745014
6965 5745014 5476645 5626799 5585442 5579676 5162571 5412604 5226802 5213219 5026012 5128775
6955 5128775 5051514 4999185 5233149 5369722 5351560 5154790 4969427 4981466 4989827 5088553 4858748
6944 4858748 4719373 4475317 4403372 4592390 4366953 4379577 4328880 4391186 4368916 4268583
6934 4268583 4104712 4320893 4287535 4479660 4133545 4147997 3879706 4045351 4286200 4594861
6924 4594861 4116207 3846088 3914164 3914762 3719476 3574054 3622176 3550817 3951104 3834477 3575157
6913 3575157 3546766 3677366 3808659 3930900 3753286 3692512 3667116 3709659 3761911 3516803
6903 3516803 3709390 3567542 3531562 3537550 3660265 3487207 3334459 3482407 3495157 3381247
6893 3381247 3416469 3640729 3527073 3343680 3091818 3115081 2978675 3072241 3169357 2971852
6883 2971852 3105097 3110838 3080192 3024874 2983377 3171339 3228024 2988048 3003265 3177821 3110694
6872 3110694 3079225 3022713 2990553 3018887 3025955 2961611 2874589 2729466 2699719 2824642 2995599
6861 2995599 3074971 3054766 2983507 2891544 2809514 2672103 2662092 2728871 2692302 2866134 3019616
6850 3019616 2971262 2966373 3000916 2930605 2879313 2673478 2596681 2579974 2673869 2635222 2556877
6839 2556877 2608803 2436132 2507748 2499384 2705272 2575845 2397415 2246988 2446483 2792206
6829 2792206 2772634 2495996 2514969 2637636 2563269 2596935 2532038 2536389 2664728 2825508 2754226
6818 2754226 2532866 2637829 2880770 2718073 2938529 2658805 2817455 2630561 2716801 2778493
6808 2778493 2855004 2788798 2770140 2765506 2622416 2393157 2391465 2478015 2191653 2384247 2259397
6797 2259397 2254486 2390664 2454391 2767421 2903265 2436948 2397141 2747584 2672777 2600749 2684987
6786 2684987 2703277 2836290 2664416 2423152 2480223 2433572 2663493 2592717 2723454 2764343
6776 2764343 2681652 2434913 2161825 2409733 2300357 2375073 2346516 2217240 2151370 2195155
6766 2195155 2330462 2481330 2386677 2671401 2805390 2770756 2512485 2449568 2581683 2400793
6756 2400793 2291932 2746995 2724191 2581564 2512753 2567458 2100133 1990273 2223965 2386953
6746 2386953 2285224 1976829 2042605 1982554 2102771 2294869 2186230 1939339 2151735 2189321
6736 2189321 2096407 2271258 2094764 2225862 2036191 1919695 1926267 1944851 1955255 2019082 2205924
6725 2205924 2048192 2063793 2033193 2365839 2402157 2413336 2437396 2321143 2369649 2226399 1896099
6714 1896099 1986244 2148261 2120903 1899754 2047693 2123592 2291934 2167707 2430537 2173667
6704 2173667 2069984 2019549 2064016 2010601 1763210 1803421 1757688 1758903 2057649 2085367 1873760
6693 1873760 2051808 2012824 1981824 1878102 1918078 1845006 2060643 1929644 1950637 2204013
6683 2204013 2073497 2341604 1923508 2037406 2333295 2136366 2283338 2173480 2129565 2044605
6673 2044605 2008242 2290208 2409341 2343963 2220852 2372114 2392876 2426837 2336748 1828675
6663 1828675 1912326 2115302 2038796 1927703 1985188 1954125 2098986 1924807 1927775 2012675 2100353
6652 2100353 1961738 1990850 2270019 2279260 2270346 1973493 2170288 2189419 2100327 2339330 2223725
6641 2223725 2025838 1907345 2072941 2074050 2090702 2276600 1957181 1871760 2157129 2361381
6631 2361381 2317836 2182816 2293991 2339827 2431291 2228899 2088172 2049213 2174119 2201880
6621 2201880 2323017 2215842 2153268 2265120 2294019 2191470 2162652 2401616 2368875 2180272
6611 2180272 2208745 2163171 2509729 2462154 2556241 2342039 2427091 2842015 2555335 2546690 2273397
6600 2273397 2454684 2441326 2397723 2380338 2593371 2312385 2352356 2635918 2739790 2768326
6590 2768326 2613594 2634272 2617579 2656075 2590526 2416568 2518010 2554635 2624059 2461963 2579566
6579 2579566 2610428 2352914 2543192 2601293 2700058 2362974 2488107 2505956 2633147 2716999
6569 2716999 2865765 2869146 2700171 2606866 2969244 2859579 2831631 2969680 3046677 2750885
6559 2750885 2952564 2935887 2765500 2857144 2952146 3208620 2902851 2693587 2655993 2731650
6549 2731650 2854468 3386227 3356657 3051016 2862386 3003354 2973384 2925554 2877156 3273889
6539 3273889 3111393 3006690 3058986 3094444 3110488 3004173 2958491 2878990 3041423 3102805 2815243
6528 2815243 3175486 3461831 3233360 3035224 2989714 3267553 2905706 2983391 3081909 3043837
6518 3043837 3181453 3143377 3216392 2879214 2764704 2990106 3288554 2888360 2817496 3053051
6508 3053051 3237270 3431722 3113911 2995144 3042966 3179609 3104995 2799467 3368122 3245495
6498 3245495 2800554 3004414 3156189 3192045 3178064 3157709 3120486 2930157 3003407 3141298
6488 3141298 3212087 3042115 3359477 3020687 2596311 2640489 2891054 2978894 3121621 3068677
6478 3068677 3236500 3209720 3239525 3278796 2957335 3030927 3113111 3008060 2950634 3165663 3224173
6467 3224173 3192014 3206756 3483318 3211127 3220556 3121980 3071754 3045225 3090978 3072132 3084251
6456 3084251 3152006 3047813 2796182 3038528 3566949 3129319 3062415 3283796 3225730 3363385
6446 3363385 3430831 3448675 3274897 3489329 3494969 3394770 3582885 3733299 3574532 3504217
6436 3504217 3506765 3689786 3445090 3487707 3388837 3589043 3532856 3389788 3555978 3685627
6426 3685627 3637118 3658023 3752582 3833711 3570749 3647735 3658406 3935763 3981929 4020029 3886313
6415 3886313 3920484 4289474 4214951 4150079 4183739 4305425 4407322 4338903 4304565 3888583 4141240
6404 4141240 4067524 4105935 4459486 4375397 4276197 4325584 4149598 4234517 4201785 4114264 4271862
6393 4271862 4014220 3986951 4271378 4341607 4078953 4304416 4253539 4504553 4595883 4830557
6383 4830557 4773411 4640567 4529846 4579508 4774753 5006845 4854480 4759729 4909020 5217390
6373 5217390 5176804 5298156 5420092 5240388 5142672 5055475 4901536 5120831 5216945 5183865
6363 5183865 5462579 5576064 5758350 6085202 5992158 5680528 5904113 5905466 5845680 6097558
6353 6097558 5945288 6104948 6089404 6315205 6391509 6531661 6371626 6435493 6662785 6801137
6343 6801137 7044004 6852500 6633479 6957560 7093692 7433582 7205898 7144741 7317790 7273132
6333 7273132 7216525 7418379 7647091 7758447 8014777 7847931 7838230 7760716 7855711 8091261
6323 8091261 8409938 8651708 8700952 8943004 9237560 8989665 9094860 9194130 9162901 9452667
6313 9452667 9687984 10043554 9926899 9968412 10086334 10291651 10554002 10905947 11220762 11190067
6303 11190067 11456135 11628333 11657970 11802336 12352723 12593285 12274873 12632178 12959117 13066999
6293 13066999 13480221 14008889 14201208 14680772 14967359 15280484 15627267 15791605 16194305
6284 16194305 16685292 17022229 17551393 18187348 18655063 19186379 19651414 20287408 21118053
6275 21118053 21903224 22472915 23150231 23922548 24639348 25217544 26302637 27226441 28298144
6266 28298144 29142499 30227541 31360665 32585729 33834867 35070227 35912727 37157878
6258 37157878 38304879 39232396 40260729 41193021 42156059 43530358 44146691 44813330 45496549
6249 45496549 46194052 47180740 47857455 48210787 49117472 49964754 51232228 52228248 53105780
6240 53105780 54246396 55552932 57103776 58641121 60115053 61791442 63659967 65516372
6232 65516372 67732634 69645023 71841165 73790081 75516977 77410618 79254051 80752171
6224 80752171 82145984 83043256 83919587 84441460 84570142 84381450 84028157 83738283 83215568
6215 83215568 82626983 81768665 81020722 80581157 79805909 79268245 78888503 78494772 78381829
6206 78381829 78391696 78719862 79236879 79539280 79777099 80452126 81605693 82531757 83596622
6197 83596622 84539313 85392870 86079940 86492173 86755993 86854187 86969628 86372228 85445575 84479515
6187 84479515 83169492 81787943 80182005 78399325 76429026 74348632 72414851 70702732
6179 70702732 68431848 66546339 65005512 63403536 61667386 60200201 58872615 57622328
6171 57622328 56687429 55719977 54936909 54296133 53598409 52784849 52220066 51709655 51161439
6162 51161439 50271324 49485946 48873255 48116569 47112796 46239710 45425026 44371032 43120176
6153 43120176 42048241 41022096 39977893 38626462 37274540 36029682 34929743 34155831
6145 34155831 33161036 32159763 31315095 30258923 29075375 28355159 27593612 27239200 26500298
6136 26500298 25480993 24818502 24400088 23727045 23437514 22851237 21985291 21939519 21860274 21216570
6126 21216570 20828954 20549930 20188813 19756147 19262838 19345591 19210940 19177874 18787589 18319277
6116 18319277 18157206 17525968 17129737 16912223 16715459 16590329 16251461 16075785 16064340 15991063
6106 15991063 15838426 15543940 15467056 15354990 14944736 14679995 14900358 14587299 14356027 14161713
6096 14161713 14017480 14231956 14034499 14038535 13934762 13643457 13767707 13698121 13552133 13343329
6086 13343329 13359680 12991560 12865277 13007226 13185065 13027283 13181384 13354298 13287609 13262795
6076 13262795 13119275 13064393 13159581 13223365 12968443 13035776 12755872 12756797 12760522 12678827 12895305
6065 12895305 12988572 12743608 13042664 12940491 12825274 12764737 12837722 12931950 13154590 13087053
6055 13087053 13140962 13019502 13282553 13250139 13131061 13293920 13386092 13566849 13615615 13882548
6045 13882548 13691613 13477316 13632262 14071377 14062317 14060654 13932387 14221965 14301509 14333977
6035 14333977 14181302 14363158 14584288 14365027 14550373 14546258 14501530 14607538 14987884 15018453
6025 15018453 15274003 15279652 15511467 15776451 15857427 15770926 15993729 15917229 15895821 15878758 16147149
6014 16147149 16592745 16716572 16813839 16919728 17249045 17498087 17581917 17869779 17831387 18216775
6004 18216775 18653297 18657054 18772624 19109114 19511172 19637430 19809463 20003338 20276038 20745348
5994 20745348 20991621 21159882 21377276 21378540 21609114 21899817 22387689 22597359 22779465 23027913
5984 23027913 23558748 23929477 24226459 24454633 24935018 25267209 25690117 26053505 26461597
5975 26461597 26865544 27187920 27599698 28289530 28483009 28960139 29229347 29516587 30214854
5966 30214854 30585108 31117761 31604952 32408652 32820092 33207017 33805781 34117986 34813018
5957 34813018 35448200 35949009 36736082 37241035 37808423 38472240 39079820 39777945 40536764
5948 40536764 41214299 41831220 42504836 42990084 43514162 44009303 44598339 45265485 45921598
5939 45921598 46496504 47287125 47761039 48319907 49010716 49462588 49790137 50269685 50781529
5930 50781529 51085909 51497523 52156186 52597729 52928201 53117980 53442342 53672830 53817192
5921 53817192 54303982 54398832 54645544 54833105 55032746 55195166 55462769 54858732 54430192 54740771
5911 54740771 54439316 54534315 54610943 54110450 53727594 53257823 52636678 52391918 52145661 51718020
5901 51718020 51107156 50528156 50232853 49767453 49307845 48672375 47994231 47460770 46873038
5892 46873038 46327120 45623546 45062334 44538974 43758999 43155700 42394138 41653066 41375333
5883 41375333 40773245 40042063 39311023 38874229 38328806 37556647 36962893 36338302 35902470
5874 35902470 35713703 35462603 34624277 34102394 33628654 33175906 32221470 31358570 31017107
5865 31017107 30600369 30266837 29720840 29018610 28618199 28426875 27949343 27328655 27141901
5856 27141901 26565865 26238889 25707982 25357485 25003732 24810498 24542804 24144267 24005931
5847 24005931 23516036 22808884 22324869 21948251 22027448 21886351 21440763 21335999 20798171 20330607
5837 20330607 20144514 20115761 19591826 19106890 18856359 18882607 18429437 18064576 17961604 17793487
5827 17793487 17543296 17432621 17299281 17064696 16852636 16720966 16675181 16495114 16280044 16318772
5817 16318772 16039940 15705644 15308930 15117809 14936170 14707528 14605787 14557572 14380072 14241633
5807 14241633 14104062 13994568 14044943 13716777 13339613 13320122 13129874 13003183 13056339 12798602
5797 12798602 12832947 12790806 12598785 12524867 12459472 12414219 12297282 12229320 12018690 12048141 12249106
5786 12249106 12283370 11929374 12057440 11894389 11533825 11632700 11782942 11756999 11848088 11838965
5776 11838965 11601456 11301342 11121900 11190524 11045269 11051508 11013962 10883425 10702433 10618417
5766 10618417 10382306 10483924 10832850 11082163 11161997 10914542 10933412 10902764 10708963 10751463
5756 10751463 10790940 10801683 10642138 10737518 10923520 10962397 10927443 11113260 10925888 11224199
5746 11224199 11639981 11828142 11634426 11587869 11673098 11761204 11866858 12020890 12296139 12245419
5736 12245419 12364883 12850957 13058591 12910631 13418271 13593357 13631210 14219025 14630415 14794392
5726 14794392 14832792 15225817 15685645 16372635 16659253 16999689 17325155 17669866 18144666 18329026
5716 18329026 18655608 19169992 19340797 19747853 20487307 20497848 20496395 20842134 21179975 21306064
5706 21306064 21272449 21785550 22019327 22301514 22367881 22884738 23354842 23667561 24109823 24804988
5696 24804988 25801659 26204499 27018363 27865761 28832098 29625985 30149159 30922311 31732838
5687 31732838 32495749 32932977 33338370 33915089 33973205 34286923 34318536 34053344 34033090 33909162
5677 33909162 33594500 33209438 32724672 32358933 31647205 31752631 31686630 31428376 31432124 31239353
5667 31239353 31195536 31402027 31390386 31702319 31959798 32057491 32221122 32716655 33143898 33579168
5657 33579168 33931300 34070804 34259546 34376795 34545906 34274507 33935600 33735809 33192200
5648 33192200 32442026 31554048 30808088 29843643 28950522 28350292 27702335 26747507 25965558
5639 25965558 25319746 24627315 23932960 23362896 22862461 22644716 22297359 21893743 21530778
5630 21530778 21294645 21196262 21020502 20738824 20647462 20162317 19869039 19884062 19740184 19635732
5620 19635732 18995284 18532368 18106726 17620819 17270322 16742941 16298332 15888072 15111281
5611 15111281 14700277 14279645 13858011 13429298 12902892 12237925 11899333 11349242 10904986
5602 10904986 10782509 10701534 10488858 10189613 9972383 9773350 9471207 9236077 9093302 8709797
5592 8709797 8777138 8796242 8377210 8146401 7945814 7745651 7635951 7579109 7749819 7729550
5582 7729550 7354770 7114872 6908523 7017335 7004874 6896665 6725911 6584631 6606605 6824778
5572 6824778 6444513 6359277 6167322 5934719 5702021 5720657 5866032 6022941 5868605 5920121
5562 5920121 6070211 5848030 5650204 5645955 5597045 5517505 5274374 5397567 5456832 5578896
5552 5578896 5312262 5137612 5035155 5047672 5354421 5195368 5283571 5150070 5073007 5020474
5542 5020474 4929037 4921475 4790037 4588294 4426152 4422774 4696879 4539030 4606764 4577512 4533331
5531 4533331 4380523 4412597 4551326 4487769 4553122 4685780 4984292 5017480 4643663 4546929
5521 4546929 4425923 4392843 4763093 4814757 4704505 4644141 4495979 4549229 4695809 4660223
5511 4660223 4652214 4776360 4906298 4730612 4319962 4428351 4554182 4483245 4237932 4247199
5501 4247199 4612752 4514117 4421726 4387348 4428668 4522477 4381310 4622622 4478187 4313606
5491 4313606 4563194 4739716 4662832 4676219 4605522 4615694 4484764 4644540 4958381 4636489
5481 4636489 4626898 4894193 4761050 4731796 4820722 4830973 4709847 4836815 4731581 4823302 4970593
5470 4970593 4905079 5090214 5196163 4802752 5007072 5272326 5506061 5679767 5596552 5434989
5460 5434989 5645670 5877454 5859419 5710516 6068406 6019893 6086817 6323284 6380443 6581572
5450 6581572 6887189 7400792 7431458 7548519 7402190 7230572 7371289 7735174 7986510 8015137
5440 8015137 8121196 8078218 7692808 7554916 7533475 7659186 7387612 7331191 7060800 6925703
5430 6925703 6829681 6726002 6555700 6280611 6180274 6109227 5855710 5736256 5712657 5689340
5420 5689340 5588745 5497621 5519096 5376906 5265508 5148356 5023380 5045312 5132402 5114639
5410 5114639 4750866 4650478 4535543 4499459 4534757 4448457 4507940 4474241 4377197 4446811 4150196
5399 4150196 4500791 4448611 4240720 4001843 3779831 4041563 3979133 3942438 3896096 3919564
5389 3919564 3902174 3905014 3957094 3875295 3800914 3921854 4052021 4019639 3866443 3539195 3809559
5378 3809559 3970332 4007701 3991902 3662407 3688158 3564773 3454668 3405416 3644032 3889515
5368 3889515 3903142 3833764 3523374 3616623 3599922 3602007 3884966 3731886 3532660 3720806 3651365
5357 3651365 3470885 3408352 3451475 3673472 3509164 3540771 3634755 3785319 3543979 3678071
5347 3678071 3691027 3919818 3749321 3654075 3528604 3282489 3076005 3288651 3436451 3385719
5337 3385719 3588727 3361541 3336593 3498512 3429295 3432094 3597725 3449517 3444449 3686430 3677421
5326 3677421 3639816 3594185 3417862 3347483 3530762 3376709 3290800 3251696 3372516 3297138 3334782
5315 3334782 3561121 3481628 3105260 3058964 3594140 3225588 2851576 3152504 3451962 3444064
5305 3444064 3462562 3445860 3361750 3133341 3081181 3003050 3082657 3234117 3176004 3199409 3358102
5294 3358102 3404092 3511294 3382013 3226043 3210961 3412560 3414940 3584032 3422163 3423319 3150270
5283 3150270 3108477 3371040 3437020 3440781 3424105 3402683 3201329 3421538 3425974 3091505 3155328
5272 3155328 3106211 3175080 2965906 2995139 3028564 3112296 3197268 3048121 3191548 3172492 3247348
5261 3247348 3236775 3217101 3181618 3127311 3250913 3334816 3465528 3655811 3324245 3425445
5251 3425445 3654164 3476618 3339589 3397415 3384019 3569595 3583369 3236360 3323481 3716438
5241 3716438 3534227 3621695 3363472 3483020 3616747 3465308 3540091 3662024 3466241 3280731
5231 3280731 3298458 3156394 3169100 3429908 3495600 3599031 3503680 3358963 3320783 3360811 3413541
5220 3413541 3757365 3879070 3594874 3679753 3682875 3593326 3508372 3760748 3617639 3707979 3720377
5209 3720377 3641903 3747471 3490591 3386343 3532791 3321619 3289049 3515362 3332970 3274704
5199 3274704 3291415 3185998 3439688 3432985 3321551 3489904 3773124 3747360 3584102 3347910
5189 3347910 3460840 3521890 3671014 3557510 3739043 3828589 3597440 3781138 3812417 3758553
5179 3758553 3477593 4021721 4216902 4031943 3606948 3541759 3934810 3897577 3934984 3871565
5169 3871565 4023972 4146289 3956954 3680116 3634051 3607112 3715651 3817678 3595150 3611703
5159 3611703 3625995 3821608 3772520 3626621 3839370 3941400 3681372 3756088 3585055 3477735
5149 3477735 3647027 3902481 3827389 3880009 4137319 3771023 3676382 3907323 3997874 3994753 3940262
5138 3940262 3975641 3657704 3807499 3960101 3834047 3961795 3886816 3736242 3805293 3726282
5128 3726282 3959594 3790390 3742098 4245727 4078796 4116864 4145751 4151430 4118403 4214881 4116481
5117 4116481 4240878 4244629 4185922 4117478 4295217 4391016 4553451 4593249 4588713 4825185 4653174
5106 4653174 4342182 4380371 4316125 4587414 4725876 4707930 4579081 4307574 4471430 4657241
5096 4657241 4726505 4869809 4947485 5138886 5222423 4974763 4998723 5048091 4933084 4910657 5151256
5085 5151256 5277377 5168246 4937096 5211477 5428713 5443297 5335546 5347749 5220284 5345356
5075 5345356 5681272 5401602 5325415 5339109 5281138 5497199 5533779 5616662 5700721 5655233 5793412
5064 5793412 5905696 5840030 5517855 5337132 5563232 5743666 5641845 5734980 5723606 5881536
5054 5881536 5751723 5643701 5941368 5847778 5584692 5589378 5593632 5759046 5665678 5889975 5815026
5043 5815026 5525562 5457269 5284449 5555746 5715899 5750254 5810654 5634779 5475413 5687972
5033 5687972 5694888 5611234 5416341 5453586 5881082 5632916 5623745 5887703 5960262 5659379 5858588
5022 5858588 6068804 6009875 5969911 5813650 5735470 5868973 5895178 5664785 6178044 6273571
5012 6273571 6130774 5984075 6007107 6325253 6374442 6470859 6589528 6338587 6569191 6411194
5002 6411194 6479804 6569665 6335436 6500338 6713974 6617409 6787591 6700700 6626517 6834152
4992 6834152 6995140 6976648 6856561 6892937 6836784 6870426 6823197 6925978 7080275 6562895
4982 6562895 6436471 6933020 6979589 7048789 6805055 6810355 6964639 7000839 7044425 7036104 7226588
4971 7226588 7318835 7220178 7005228 7325439 7476944 7237429 7478694 7612768 7388411 7519683
4961 7519683 7677416 7468926 7151533 7190852 7060062 7005865 7299631 7408661 7471891 7337642
4951 7337642 7210974 7463646 7891377 8069559 7838181 7816806 7806191 7844432 7859227 8024856
4941 8024856 7857557 8077529 7862398 7891083 8019667 8073442 8392415 8164368 8315761 8385263
4931 8385263 8619880 9046997 9007853 8903979 8972835 9036736 9037056 9000322 9181235 9514312 9580814
4920 9580814 9377785 9184546 9208375 9289786 9257635 9297233 9475777 9476669 9387066 9633629 9806761
4909 9806761 10046319 9984323 10267000 10300842 10244521 10343402 10163026 10103991 10236169 10412393
4899 10412393 10644506 10927004 10836371 10582181 10930254 11200169 11440341 11406797 11429605 11459020
4889 11459020 11652360 11920088 11887012 12009649 12087252 12149840 12449119 12475839 12724809 12600007
4879 12600007 12802950 13082899 13329415 13610140 13810354 13778940 13826788 13986960 14212164 14478359
4869 14478359 15077802 15127068 15444172 15764402 15930566 16242312 16171892 16343277 16732489 17286115
4859 17286115 17393911 17580943 17696251 17812252 18137745 18447879 18952370 19526971 19831064
4850 19831064 20396889 20856688 21234369 21634757 21937077 22231636 23022034 23879897 24704278
4841 24704278 25119584 25632099 26506017 27450260 28071831 28721886 29887893 31086558 32054706
4832 32054706 32916733 33677927 35192220 36330162 37529759 38986403 40714853 42558804
4824 42558804 44059432 45557022 47120961 48961033 50945669 53129432 54878868 57027886
4816 57027886 59411647 61859454 64125621 66282364 68453019 70621207 72755333 74896000
4808 74896000 76978392 79331548 81527201 83603680 85398011 87631891 90125364 92242962
4800 92242962 94630615 96915653 99598204 102152179 104808922 107428788 110424676 113211294
4792 113211294 115890088 118472115 120892506 123733922 126138863 128105571 129715072 131411882
4784 131411882 132693372 133382875 133956177 133966669 134081307 133682138 132753384 131898723 130831432
4775 130831432 129440045 128044935 126502702 124960189 123363597 121479190 119844065 118451616
4767 118451616 116658696 115016756 113074765 110962978 109263678 107303351 105097641 103060482
4759 103060482 100656761 98582675 96407910 94218456 91788251 89305756 87227261 85465274
4751 85465274 83771319 81778057 80066009 78377923 76655389 75064739 73701651 72375730
4743 72375730 71172507 70308226 69396271 68631036 68171008 67974068 67762667 67620491 67479500
4734 67479500 67689347 68192510 68777994 69152006 69452156 69757403 70492637 71628526 72715348
4725 72715348 73643805 74713192 76174107 77565682 78894358 80345952 82508389 84037040
4717 84037040 85723780 87383780 89441439 91202735 92948919 94954815 96895813 98753310
4709 98753310 100468681 102412424 104157285 105654110 107391494 109335351 110896626 112556306
4701 112556306 114129003 115340239 116917008 118527797 119729029 121035567 121822586 122749720
4693 122749720 123465903 123950440 124384353 124772291 124899738 124530454 124264827 123357379 122380050
4684 122380050 121133440 120058016 118218269 116435384 114891763 112916992 111039084 109032378
4676 109032378 106908701 104793674 102605320 100764362 98375055 96281060 94578837 92743336
4668 92743336 90618984 88808743 86804542 84537644 82540999 80539484 78852243 77234903
4660 77234903 75056689 72890755 70845007 68675666 66727421 65023603 63138200 61653118
4652 61653118 59756926 57753859 55928512 54372033 52661348 51120726 49678316 47831671
4644 47831671 46555280 45185503 44046990 42753633 41616831 40657559 39942129 38685461
4636 38685461 37755487 37130513 36123596 35281769 34725234 33964173 32953775 32228028 31734316
4627 31734316 30988492 30350902 29701494 29336135 29098713 28564476 27752436 27231566 26686837
4618 26686837 26192389 25886565 25298241 24701807 24590283 24531783 24147517 23459932 23035670 22912976
4608 22912976 22669615 22281478 21986443 21717755 21602618 21279501 20965578 20789391 20329051
4599 20329051 20029907 19998405 19893787 19722200 19199341 18948039 18763014 18923058 18704220 18488656
4589 18488656 18463830 18535296 18106777 17834276 17732574 17736889 17482743 17290710 17103962 16975947
4579 16975947 17145052 16938834 16586912 16618491 16521742 16181243 16328213 16182813 16035234 15915598
4569 15915598 15962719 15838924 15721442 15628341 15615896 15561448 15363923 15303954 15303935 15257054 15133982
4558 15133982 15045225 15132698 15028216 14860442 14907110 14972891 14776993 14699030 14681705 14709437 14696942
4547 14696942 14752249 14796265 14893194 14818227 14793041 14869433 14897406 14902866 15065179 15016759 14966981
4536 14966981 14976391 14802887 14978059 14806781 14816343 14715087 14637231 14770996 14784136 15069203
4526 15069203 14985640 14892359 14680712 14824820 14956886 15017566 14935838 15124640 15269673 15220159
4516 15220159 15166176 15428739 15531340 15474302 15332667 15329780 15300460 15224336 15161140 15431192 15513873
4505 15513873 15543599 15511885 15125986 15157801 15272337 15622571 15834745 15632431 15629016 15523979
4495 15523979 15683238 15822854 15742163 15779177 15718053 15837526 15956657 16189075 15940587 15832841
4485 15832841 15572112 15269224 15148599 15256183 15497049 15653287 15580156 15180285 15501822 15745137
4475 15745137 15708728 15726778 15647532 15623580 15530722 15606102 15545042 15598887 15754415 15769515 15762102
4464 15762102 15867635 15996379 15975823 16000570 16014695 15671319 16062442 16268365 16081466 15752363
4454 15752363 15862802 16030240 16088412 16412395 16345964 16444412 16730965 16439349 15986672 16398611
4444 16398611 16405893 16236550 16224547 16307911 16483630 16558357 16579124 16716343 17049920 17174591
4434 17174591 16902317 17051513 16959190 17235214 17607654 17426599 17469044 17533454 17895275 17927074
4424 17927074 17784008 17915644 18142297 18264410 18228997 18368141 18363434 18418280 18659829 18807067
4414 18807067 18864120 18889886 18790953 18883820 18901790 19006754 19111647 19053497 19360668 19712690
4404 19712690 19438861 19394276 19598617 19593040 19938762 19936714 20094544 20135450 20455638 20404302 20621335
4393 20621335 20610416 20627924 20320782 20125853 20669766 20962670 20988849 21119168 21242059 21278189
4383 21278189 21468912 21735832 21713324 21600773 21713036 21926913 22212143 22198139 22078833 22184846
4373 22184846 22449046 22357149 22409383 22699243 22664087 22942553 23057719 23277824 23900694 24062923
4363 24062923 24861075 25621938 25950600 25939036 25921794 25876456 25544324 25389542 24965074 24570227
4353 24570227 24604842 24413023 24171058 23925258 23933380 23976589 24067414 24037459 24049838 24099509 23992638
4342 23992638 23840932 24074037 24239141 24491761 24740700 24788428 24699992 24518335 24467658 24459439
4332 24459439 24949002 25191149 24966962 25062755 25503736 25880349 25783712 25944572 26353920 26390335
4322 26390335 26493105 26391861 26541865 26796536 27160077 27225843 26968540 27270110 27507557 27754436
4312 27754436 27788758 27911073 28080469 28246474 28631445 28875277 28959450 29246359 29246535 29228159
4302 29228159 29527190 29989215 30035877 29950027 30136971 30540574 31003339 31317359 31687416 31922058
4292 31922058 32211240 32512232 32918587 33068844 33178700 33770586 34304355 34533271 34734270
4283 34734270 35418477 36062280 36477697 36864749 37352848 37762720 38110121 38633528 39327856
4274 39327856 40274436 40827155 41532808 42277087 43260839 43932805 44461279 45065972 46006646
4265 46006646 47077982 48214369 49416825 50917195 52038305 53147405 54528036 55978287
4257 55978287 57568466 59233638 61355556 63390509 65098438 66955730 69155551 71558704
4249 71558704 74094255 76609667 79439705 82441624 85920203 88844737 92180588 95837842
4241 95837842 99673679 103560709 107295909 111235546 115030584 119228186 123484922 127823593
4233 127823593 132364730 136715328 141365228 146003899 150303100 154630112 159117511 163317548
4225 163317548 167471294 171490124 175347084 179075476 182275017 185633404 188541841 191036057
4217 191036057 193025558 194943407 196847213 198187296 199008563 199556434 200012448 200093560 199719883
4208 199719883 198629204 197221681 195569598 193696477 191521240 189325119 186512441 183182886
4200 183182886 180135995 176740024 173053031 169110066 165274106 161012562 156664482 152616400
4192 152616400 148295069 144038187 139711582 135297019 131042318 126654935 122358066 118010878
4184 118010878 113830827 110035156 106339218 102634094 98769597 95477762 92407127 89188017
4176 89188017 86398026 83431622 80791480 77964473 75363353 73269038 71076486 68813755
4168 68813755 67104878 65265345 63137592 61294419 59724356 58323038 56764425 55431140
4160 55431140 54153309 52840604 51589819 50515013 49548656 48638275 47708711 46895458 46095532
4151 46095532 45009689 44377114 43772961 43341341 42762190 41748718 41259334 40619125 40032968
4142 40032968 39702987 39107030 38805417 38620097 38152755 37709134 37386719 36813831 36428510
4133 36428510 36494574 36290484 36156531 35396254 35120839 35045032 35117181 34683100 34299742 34204852
4123 34204852 34063085 33860598 33822861 33535634 33628091 33702967 33477018 33230448 33291999 33196012
4113 33196012 33018307 32809559 32805963 32836338 32775481 32620082 32226941 31909558 32057086 32457990
4103 32457990 32220195 32151943 31966460 31627341 31486347 31541398 31574895 31347284 31202706 31343709
4093 31343709 31064288 31026302 30816214 30690286 30565976 30430856 30401191 30383523 30458151 30247886
4083 30247886 30032169 30054605 30045425 30069247 29864280 29596561 29595728 29683776 29402565 29585320 29605025
4072 29605025 29683051 29682099 29570097 29391152 29377481 29579449 29748058 29531862 29853603 29809868
4062 29809868 29973979 30083237 29774724 29991384 30209626 30239693 30159877 30343542 30475495 30513720
4052 30513720 30582543 30596904 30889891 31255193 31279974 31475263 31655001 31949384 32248808 32577543
4042 32577543 32609068 32769509 32804430 33069690 33236855 33292444 33613077 33664452 34185809 34406445
4032 34406445 34295629 34492229 34857839 35168089 35531378 35846384 36095891 36304932 36526829
4023 36526829 36816965 37208246 37767324 37879725 38106551 38587641 39098304 39291604 39411608
4014 39411608 40155550 40777105 41144807 41531285 41812455 42362205 42809402 43848176 44132701
4005 44132701 44323866 45030940 45770808 46229133 47037361 47703768 48402289 48925557 49475415
3996 49475415 50365803 51465048 52482865 53412499 54437834 55497846 56511605 57311080 58468151
3987 58468151 59368226 60511958 61806359 62941049 64300818 65716240 66750480 67907615
3979 67907615 69319643 70908627 72402407 73908118 75526377 77070657 78468509 79978554
3971 79978554 81804758 83270670 84961585 86956017 88986797 91072152 92796614 95049555
3963 95049555 96944110 99085735 101196855 103632066 106086526 108977884 111765202 114494049
3955 114494049 117434327 121095767 124893593 128579585 132575434 136553533 140842396 145296171
3947 145296171 150250464 155100809 160438648 166126153 171468529 177000277 182649901 188586246
3939 188586246 195009455 201226949 207496278 214322064 221054115 227987487 235178951 242141127
3931 242141127 249441423 256621811 263933456 271068297 278517654 285829788 292688703 299472930
3923 299472930 306106849 312695855 319416438 325836546 331744051 337378335 343218244 348568129
3915 348568129 353728889 358544800 362908838 366387606 369399211 371973404 374306863 376045075
3907 376045075 377583079 378555507 379417271 380148207 380381652 380909898 381368825 381675706 381980622
3898 381980622 382611071 383521827 384539215 385343848 386815729 388766636 390832514 392917010
3890 392917010 395391370 397940996 400911661 403920644 406827054 409983039 413238417 416102951
3882 416102951 419325496 422237688 424620926 426616520 428491796 429722284 431141651 431956555
3874 431956555 432120658 432103201 431434705 430504738 429278150 427698015 425392699 422469652 419635881
3865 419635881 416437157 412670687 408460153 403893638 399682283 394952689 389955351 385061835
3857 385061835 380242523 375526455 370675343 366154736 361845530 357484410 353590744 350072948
3849 350072948 347249231 344882708 343026436 341589670 340794109 340818173 341257009 342211301 343854833
3840 343854833 346104863 348965132 352448707 356467923 360862405 365962843 370942780 376368542
3832 376368542 382188095 388281713 394301026 400416927 406544865 412028939 417613424 422752988
3824 422752988 427400615 431657804 435550460 438564387 440704574 442605297 443153431 443188956
3816 443188956 442255672 440632933 438476051 435452445 431994515 427536825 422506459 416518871
3808 416518871 409934084 403327442 395915303 387472494 378971885 370075146 361035099 351403635
3800 351403635 341390992 331557691 321142655 310868746 300778475 290389848 280242990
3793 280242990 270266471 260411318 250643448 240604136 231080512 221719737 212744622 204163438
3785 204163438 195863624 187620943 179522605 172276502 165177285 158275390 151822497 145954754
3777 145954754 140552479 135238497 130203568 125929872 121745652 117807616 114334302 111261321
3769 111261321 108503684 105894271 103404454 101723758 99732419 97749841 96252733 94858589
3761 94858589 93879496 92633330 91455569 90557133 89721288 88878888 88171656 87422238 86414785
3752 86414785 85808801 85433594 84522723 83938098 83299807 82142275 81050553 79839109 78886572
3743 78886572 77854543 76368996 75272203 74287106 72404150 70748016 69387839 67645104
3735 67645104 66190731 64953263 62926257 61542125 59974174 57990455 56386876 54900879
3727 54900879 53393729 52135057 50900732 49472588 47954147 46646636 45454218 44275472
3719 44275472 43114966 42167850 41131986 40138275 39493386 38487726 37544566 36893631 36089894
3710 36089894 35294140 34713429 34207279 33718315 33326271 32800790 32160561 31752207 31240865
3701 31240865 31175208 30601413 30264950 29789569 29267218 29142611 28918341 28336319 27702046 27265180
3691 27265180 27196521 27093359 26837600 26405898 26344892 25811980 25575483 25419085 25066452 24809471
3681 24809471 24724396 24841091 24413694 24113528 24043519 23657061 23711484 23784422 23351116 23291002
3671 23291002 22944732 22543380 22577606 22583973 22643468 22648404 21953028 21720503 21941963 21823508
3661 21823508 21927612 21765741 21764645 21885538 21785547 21599384 21700540 21720366 21515929 21446783
3651 21446783 21453442 21482397 21503038 21421276 21248164 21311230 21502457 21585199 21670975 21464467 21452718
3640 21452718 21588523 21412452 21563856 21620769 21716727 21885030 22144086 21827674 21965692 22346317
3630 22346317 22353245 22382248 22442923 22421803 22575713 22645137 22761380 22921818 23134965 23144030 23207091
3619 23207091 23328380 23365210 23659863 23921103 24071777 24211643 24367874 24877157 25022288 25294852
3609 25294852 25825980 25868978 26325739 26686084 26962885 27533263 27834327 28230195 28734230 28979575
3599 28979575 29564844 30120628 30658738 31126714 31813721 32615479 33278526 34236965 35089961
3590 35089961 35805045 36497696 37369636 38355014 39445944 40823297 42187726 43479468 44851839
3581 44851839 46356551 48023284 50118998 52550323 54614792 56945531 59787082 62812736
3573 62812736 65897469 69188816 72915191 76904940 81151142 85733744 90629215 95774408
3565 95774408 100878835 105941150 110942566 115250591 119349084 122769487 125662950 128519608
3557 128519608 130168147 131346932 132281364 132466098 132434168 132490927 132238444 132279822 132365598 132448226
3547 132448226 133349330 134475688 135850433 137622608 139972533 143093135 146450384 150913872
3539 150913872 155951486 161891389 168662164 176322820 184527263 193119371 202075479 209936464
3531 209936464 216149144 220525724 222692408 221832938 218682000 213671982 206761250 198770808
3523 198770808 190952596 182633046 174839318 167536067 160662359 154427528 149150058 144742459
3515 144742459 140799544 137690071 135325341 133197582 131470983 130410530 129710267 129406169
3507 129406169 129370556 129505496 129652565 129772986 130046846 130020846 129399577 128346343 126645657
3498 126645657 124439389 121430544 117771588 114018887 109767650 104895168 99911364 95317265
3490 95317265 90701644 86210551 81904238 77824598 74105893 70592848 67480772 64818964
3482 64818964 62463469 60212692 58070707 56451428 55232645 53814971 52543374 51596655
3474 51596655 50762181 50113765 49328736 48841016 48760608 48803409 49246915 49959048 50357963 51069464
3464 51069464 51985885 52800431 53934873 55062087 56862630 58698425 60642249 62404448
3456 62404448 64589264 66542560 68496751 70818626 72692707 74438653 76180657 77500080
3448 77500080 78160883 78679231 79199021 79155924 78716245 78133083 77291597 76721899 75743633 75000327
3438 75000327 74457362 74111824 73593095 72909157 73116858 73573236 74260230 75254840 76507979
3429 76507979 78328513 80385864 83109722 85802431 88783773 91874494 93949135 95256202
3421 95256202 95976042 95177845 93197603 90513072 87162155 83278650 79327777 75740236
3413 75740236 71896092 68344927 65564545 62946320 60327096 58035329 56258730 54903540
3405 54903540 53770238 52684707 51916228 51536915 50823377 50297488 50433711 50617701 50640259
3396 50640259 50689073 50643043 50451997 50237092 49704196 49158218 48302673 47026576 45734575
3387 45734575 43904711 42246355 40380253 38161562 35979347 33789156 31735747 29706143
3379 29706143 28114541 26605578 25228309 24197209 22826049 21758416 20791618 19623640
3371 19623640 18813322 17751354 17110430 16370204 15560832 15323592 14677362 13842867 13261798
3362 13261798 13097169 12790642 12406294 11954938 11814114 11675862 11229416 11013074 10828038
3353 10828038 10563897 9974017 9638498 9623557 9473037 9480065 9328151 9057567 8924536 8346715
3343 8346715 8061576 8159527 8219258 7762262 7721182 7915410 7726800 7208707 6890603 7015527
3333 7015527 6897701 6773795 6718162 6611860 6476613 6458779 6215529 6281225 5947493 5900759
3323 5900759 5986431 5810324 5766495 5813350 5645768 5538561 5181230 4870185 4818551 4734580
3313 4734580 4594724 5019079 5135084 5032496 4785870 4620631 4778047 4812257 4242238 4188490
3303 4188490 4146423 4265272 4623593 4549142 4433265 4153443 4112112 3982245 3983798 4015258 3881049
3292 3881049 4013445 4004525 3721134 3715690 3796311 4088113 3814756 3799213 3724507 3742708 3785367
3281 3785367 3634738 3647607 3639208 3778934 3835802 3776553 3648028 3575704 3642382 3584022 3501244
3270 3501244 3614139 3504880 3477258 3323415 3544653 3598009 3249763 3206358 3483023 3457960
3260 3457960 3413186 3470818 3292969 3292010 3209114 3426444 3373033 3254302 3296254 3427392 3307708
3249 3307708 3081108 3103503 3328139 2937108 3221544 3259823 3229519 3485928 3522948 3358626
3239 3358626 3179765 3124523 3081249 2904925 3157345 3244179 3222051 2936491 3014623 3027135 2788253
3228 2788253 2886064 2889753 2744840 2475106 2524661 2405382 2355825 2443812 2734603 2698774 2736378
3217 2736378 2644818 2613807 2731136 2484005 2692268 2607206 2645718 2452867 2787456 2904717
3207 2904717 2548667 2552295 2312544 2162409 2280867 2253249 1898876 2059516 2432484 2287990
3197 2287990 2344877 2100326 2157857 2135736 2080732 2170461 1989279 2089347 2075504 2095691 1877608
3186 1877608 2048320 1961608 1918762 1782819 2161560 2368942 2080456 1925466 1894015 1944627
3176 1944627 2014348 2084433 2316239 2240774 2080947 2050644 2043611 1900514 2003168 2057042 2156767
3165 2156767 2178378 2277283 2125804 1946597 1929609 1981265 2266845 2344516 2114923 2293743
3155 2293743 2378177 2165982 2421709 2568740 2652765 2818075 2685229 2911139 2684256 2609659
3145 2609659 3002531 3261303 3133456 3369267 3452818 3190435 3148919 3352944 3508175 3552815
3135 3552815 3620179 3597717 3972929 4082614 3924677 4007510 4177595 4240808 4569020 4636583
3125 4636583 4498941 4187320 4303358 4465497 4472570 4706250 4787608 4905741 4978776 4890558
3115 4890558 4843974 5040902 5198058 5317817 5446745 5330540 5414769 5700614 5747112 5804954
3105 5804954 5818313 6069675 5975426 5921925 5614564 5326945 5277556 4886748 4578767 4547856
3095 4547856 4539380 4387446 4518924 4213335 3877157 4142109 4475856 4301770 4162576 4297884
3085 4297884 4377086 4132410 3877638 4083563 4008502 3948137 4031668 4149054 4236375 4120803
3075 4120803 3896695 3633470 3659003 3479075 3630572 3591061 3333184 3198454 3087036 3320684
3065 3320684 3266617 2892280 2771990 2567173 2684691 2476297 2510665 2385362 2285592 2291789
3055 2291789 2264759 2330131 1944637 1882207 1720585 1611539 1681099 1911938 1786868 1515498
3045 1515498 1603550 1528108 1678737 1316723 1170786 1204306 1279871 1102151 1122263 1135261 1170653
3034 1170653 1229210 1067363 1085011 1070512 1056881 1263485 1019318 785522 718595 764349 810717
3023 810717 599723 588125 688948 739118 714031 832728 978791 742594 713490 659999 491030
3012 491030 484331 302581 411090 611323 480297 408269 658850 542105 584423 731717
3002 731717 498034 448890 523183 445912 414749 359865 599202 598523 655261 764408 677150
2991 677150 546309 616203 346700 504251 459832 360854 507112 414996 436422 718844 868351
2980 868351 297961 28097 171230 250607 382875 205617 382447 334514 278879 157846
2970 157846 385929 396064 333044 460395 306783 360004 209283 -11497 297501 311946
2960 311946 34311 178243 879 118094 217766 262910 107733 476855 687381 588722
2950 588722 429581 129549 97111 246565 321534 101459 265250 107532 -6055 -54018
2940 -54018 -177688 -108004 -301353 -155381 -324620 -152534 131220 14220 -68549 -71064 183186
2929 183186 356180 76203 214992 284231 77769 352563 363801 331362 -15143 127205
2919 127205 264287 464815 587095 400019 464400 79426 175805 116636 200990 234495 50077
2908 50077 269695 111296 45645 -43424 58499 -17831 312744 309415 -75700 82279 40465
2897 40465 55597 -88715 -41757 142959 55743 66369 -132391 -152830 112127 277288 91216
2886 91216 11713 232170 209119 284657 109951 13069 -45440 -49435 55647 -39046 -105276
2875 -105276 -200124 -177748 46157 53140 201780 166127 -137214 133779 162548 298607 91040
2864 91040 78272 13669 19443 -42369 -253101 -289020 -254031 -160352 -273629 179133 188310 -300467
2852 -300467 -305774 -320551 -382918 -434895 -266792 -285117 -317514 -55564 8817 -26783 142477
2841 142477 105427 -54017 -22923 -7662 -199100 -108022 -13878 -175221 -238604 -381066 -11598
2830 -11598 25008 -60211 119035 415688 115720 -65931 -114317 67943 118957 116081 29104
2819 29104 -35613 216584 -77332 -296076 -196485 -175498 -187535 -300226 -270951 -107758 -127102
2808 -127102 -21278 66428 -207754 63894 269895 91176 -32065 -231629 -136341 14492
2798 14492 171387 30631 -9367 143585 91700 -27510 27756 59028 71132 27768 4348
2787 4348 -16009 36918 -66112 -73417 79275 -28306 -187090 -509419 -495022 -364799 -192370
2776 -192370 -113813 44340 -145992 -37126 -38489 -70539 -155440 20618 -128992 -238955 -340049
2765 -340049 -518452 -428633 -288539 -141606 -77589 -304171 -365551 -190241 -290152 -436542
2755 -436542 -445873 -226121 -235691 -199145 -107239 -152012 -288239 -274374 -230879 -272941 -330701 -176987
2743 -176987 66298 176026 106007 -207053 -227408 -314016 -214021 -118534 -259569 -275391 -249362
2732 -249362 -375657 -442413 -136825 -346625 -547190 -372083 -248028 -269211 2438 -188307
2722 -188307 -158328 -255577 -120884 -52237 -24638 -135741 -187063 -3123 153450 67166 -169388
2711 -169388 -154453 -103365 -93800 20639 -170953 -176887 -56985 233231 120761 -82113 -349780
2700 -349780 -372629 -593454 -379947 -268115 -581521 -586789 -312888 -223866 -117630 176470
2690 176470 -188022 -312247 -348815 -229846 141054 43326 -216824 -177375 -111164 -64688 -150557
2679 -150557 -260500 -214214 -306064 -488794 -165278 -270171 -45909 -327674 -184884 -64939
2669 -64939 -102203 -68966 -136370 -295540 -417354 121267 16014 -132079 -99097 -360366 -151791
2658 -151791 -179615 -403661 -149802 -252435 -320153 -534667 -431130 -425492 -245658 -523168
2648 -523168 -376385 -527763 -331830 -54741 -163169 -385454 -451537 -244401 -159174 -83812
2638 -83812 -253766 139971 80302 114705 28879 138281 -55318 -9380 -241336 -226431 -285891
2627 -285891 -377931 -115765 -236114 -229414 -451395 -434384 -284497 -355797 -52422 42522 -91605
2616 -91605 -345167 -439856 -533980 -276673 -246617 -520475 -340505 -260909 -127266 -315172 -234500
2605 -234500 -187921 -13002 94671 -27378 -12854 3177 -110983 -234428 -138469 -127766 -13891
2594 -13891 -11728 -45219 148226 222093 108529 -624 -207002 -353396 -621774 -278882 -231116
2583 -231116 -411115 -218344 -151048 -264149 -169139 2923 -39977 143197 446640 195122
2573 195122 147504 349011 334014 209583 145809 272239 69722 -113405 -184893 -208291 -452608
2562 -452608 -334375 -8756 -93283 77933 -29099 -216141 -221887 108543 178928 -221833
2552 -221833 -195594 120586 137724 -7771 -50825 254760 122458 28348 -119987 -321561
2542 -321561 -169409 -333613 -220785 38869 -200811 -250961 -334272 -199587 -198175 -246707 -50508
2531 -50508 29209 -50005 24373 -34736 -158864 -352637 -435725 -160639 -122264 -97706 -116836
2520 -116836 -180799 -132161 2366 -48206 69142 -9768 -197010 -183209 -107952 -343730 -381367
2509 -381367 -159399 -4392 -79773 50507 -155430 -162706 -90068 10714 -53474 -151402 -75284
2498 -75284 -86251 -304356 -353991 -141292 179252 6876 -30788 129341 41558 -276931 -327039
2487 -327039 -173376 4935 -53819 -217474 100668 -113459 -25625 103325 -8633 -74991
2477 -74991 2779 118912 129293 121490 -160473 -83897 -259770 -148022 -85416 -233826 -198552
2466 -198552 -58126 175882 10166 -220092 -152410 -119584 104426 -106175 13763 141602
2456 141602 242887 234558 139688 -103880 -11933 -58427 -68642 -7801 165575 271584 218835
2445 218835 24929 -87170 328186 342253 142423 -107690 -54304 127855 230733 113990
2435 113990 131676 221364 198704 8908 174712 334450 336096 111651 181175 -10993 -112639
2424 -112639 31088 410740 524927 198935 452127 351045 270227 287866 365393 451587
2414 451587 432943 581164 687812 545959 476597 578975 464846 512350 635578 694905
2404 694905 588957 484435 774291 846186 637606 816428 830875 1019995 702420 563778
2394 563778 649278 723357 655301 426392 556355 832729 830351 1091189 1228423 1241096 1233167
2383 1233167 1081549 886257 1021465 1092360 1199878 1144691 1295535 1352953 1353043 1250141 1192409
2372 1192409 1337623 1592500 1516550 1522287 1556575 1587551 1753224 1619291 1680378 1989390 1775719
2361 1775719 1830687 2078423 2154938 2321288 2367399 2425791 2386738 2396054 2574409 2716651 2940668
2350 2940668 2928637 2997494 2953832 3165823 3361597 3309342 3572183 3608595 3825439 4038251
2340 4038251 4099685 4269842 4419510 4690095 4940719 5376127 5685178 6201354 6737637 6905897
2330 6905897 7750803 8766774 9788495 10844391 12130249 13876910 15546050 16698885
2322 16698885 17933708 19342935 20711953 22533829 24731420 26684763 29965387 34685292
2314 34685292 41864630 54344788 76562224 105903272 136535031 158599814 166390232
2307 166390232 163789585 154796275 136324073 114216376 94316994 76147045 61226030
2300 61226030 49007368 39361388 31295177 24990174 21300440 18696437 16830923 15408938
2292 15408938 14221896 13180924 11733431 10501218 9139821 8246271 7207597 6664385
2284 6664385 6004540 5559712 5380021 5092104 4753183 4568230 4273502 4105589 4116863 3973766
2274 3973766 3915644 3577668 3077195 3159933 3320690 3217530 2818205 2577722 2353317 2106039
2264 2106039 2009052 1785357 1699075 1561572 1693240 1717552 1462000 1617876 1563743 1524670
2254 1524670 1611990 1745911 1591245 1331283 1259606 1040711 1050291 1016410 1270248 1115490
2244 1115490 750857 698318 847872 662863 888832 853290 879265 972660 995632 1025527 802537
2233 802537 670463 595764 677167 665169 564426 587296 580419 234021 39209 172434 103719
2222 103719 156626 239924 329359 264114 -5304 189474 -116526 -257223 -41915 394589
2212 394589 325679 253498 319563 -53886 -61433 151622 -136774 -411873 -404931 -229925 100362
2201 100362 -45998 -201336 -186335 -269964 -375732 -312743 -366979 -348220 -125781 -154 -155773
2190 -155773 -384958 -467147 -456010 -217215 -354059 -125812 145928 -135690 -490434 -405628
2180 -405628 -455227 -406991 -296345 -432605 -226934 -367598 -422235 -82038 -269640 -238705
2170 -238705 -46180 -72527 -174501 -40837 -207385 -304380 -494712 -580032 -364716 -412873
2160 -412873 -617490 -588129 -469148 -346468 -244437 -264028 -223629 -218954 -269559 -423377 -506893
2149 -506893 -823720 -700491 -519588 -526107 -702647 -599306 -252710 -596536 -596265 -651147 -593936
2138 -593936 -374978 -181230 -273263 -414621 -466450 -755257 -1162492 -910606 -266237 -300727
2128 -300727 -314493 -427946 -589198 -475002 -523710 -729323 -702628 -402423 -430735 -417013 -549776
2117 -549776 -684042 -567777 -606702 -593401 -664020 -445700 -364439 -482178 -410055 -519993 -436335
2106 -436335 -393284 -567737 -458869 -349153 -320280 -183075 -426985 -621810 -498691 -595737
2096 -595737 -654646 -859134 -646563 -697009 -645177 -893876 -615947 -299878 -393421 -401817 -515824
2085 -515824 -426511 -400345 -476015 -561786 -559144 -584242 -321415 -402393 -735543 -666745 -438216
2074 -438216 -656042 -680352 -430876 -610909 -543751 -316135 -390043 -324909 -305188 -529120 -449649
2063 -449649 -491058 -481036 -633897 -424915 -243117 -399290 -229261 -156919 -173836 -299387
2053 -299387 -468039 -632585 -625405 -504537 -428504 -655401 -594922 -250804 -469803 -264030
2043 -264030 -93681 -86187 -175186 87809 201443 279225 471639 389346 195653 76686 -68711
2032 -68711 -310704 -514290 -460693 -594077 -737439 -531179 -447884 -302016 -201906 -388648
2022 -388648 -439106 -527543 -675030 -676562 -581320 -445325 -443970 -431120 -449009 -469297 -748518
2011 -748518 -751193 -549465 -743167 -927549 -745103 -802587 -792574 -768909 -499135 -697335 -519520
2000 -519520 -675365 -836105 -364466 -473546 -659080 -836598 -766780 -505490 -613736 -572942
1990 -572942 -491886 -714127 -598916 -819127 -419593 -445985 -459146 -144173 -458983 -704777
1980 -704777 -813632 -705809 -801687 -742402 -822595 -564059 -390572 -270571 -448847 -572483
1970 -572483 -624552 -770266 -661243 -602741 -879052 -457841 -401646 -431939 -495361 -562927 -407997
1959 -407997 -357595 -454259 -590033 -651911 -648553 -971386 -695052 -598084 -577062 -545187 -621933
1948 -621933 -519019 -820142 -755801 -554734 -214267 -508284 -672572 -733893 -698448 -516739
1938 -516739 -454742 -501202 -679924 -605916 -394595 -468345 -452245 -495408 -602366 -641536 -665881
1927 -665881 -855919 -744042 -972915 -881378 -839562 -829853 -707881 -941454 -873828 -767750 -699468
1916 -699468 -689974 -752387 -616706 -696384 -887208 -680395 -494837 -311560 -419595 -382471 -428913
1905 -428913 -545995 -592078 -711002 -769989 -687421 -457008 -400098 -612757 -813478 -847006 -494935
1894 -494935 -685551 -865951 -401064 -445864 -686917 -915099 -857844 -930422 -856110 -886619 -819785
1883 -819785 -853858 -707059 -671106 -356696 -432726 -332026 -549793 -589248 -429827 -693242
1873 -693242 -713165 -920725 -656398 -680910 -665141 -439243 -545689 -674603 -725093 -559450
1863 -559450 -600528 -843673 -965865 -935103 -634298 -493715 -539306 -596623 -546468 -751585 -703582
1852 -703582 -717788 -846811 -1008774 -807896 -841948 -575191 -555533 -727718 -568115 -671645
1842 -671645 -726348 -509940 -452898 -691624 -580120 -547877 -598797 -432935 -391232 -661304 -573561
1831 -573561 -611672 -526848 -801202 -755273 -499347 -346816 -407348 -478191 -521466 -686507 -578524
1820 -578524 -797713 -604659 -679223 -754727 -592687 -325927 -718784 -685948 -494651 -600701
1810 -600701 -716220 -502017 -370111 -452407 -558427 -684470 -567009 -550368 -696248 -913229
1800 -913229 -755169 -633068 -697210 -616845 -558778 -547800 -487599 -468136 -390826 -722136 -666562
1789 -666562 -595825 -525839 -711946 -996922 -987494 -994510 -573406 -780600 -814885 -631992 -904495
1778 -904495 -807678 -850984 -1108889 -834153 -729448 -686692 -382228 -554757 -834484 -803077
1768 -803077 -689259 -857399 -916564 -709994 -703420 -805870 -955892 -933765 -790206 -557878
1758 -557878 -594487 -733161 -781501 -810329 -761573 -756443 -735463 -591189 -535827 -420870 -471636
1747 -471636 -597342 -424647 -462338 -643674 -1043403 -1109216 -651705 -711187 -894417 -441212
1737 -441212 -387163 -294541 -318254 -360880 -489836 -576043 -711501 -695111 -866197 -477596 -297631
1726 -297631 -395756 -492304 -675486 -600988 -566758 -497356 -456036 -591722 -511143 -530245 -557846
1715 -557846 -832856 -926646 -629296 -499752 -558258 -940842 -799683 -666094 -547213 -836874
1705 -836874 -828373 -876847 -824787 -616485 -391016 -233718 -328873 -527496 -572032 -259457 -255871
1694 -255871 -345003 -79535 -255387 -642889 -568375 -384693 -601865 -486296 -535052 -671031
1684 -671031 -401687 -567239 -399751 -456531 -552705 -495328 -461412 -427714 -598192 -496951 -533314
1673 -533314 -188501 -438362 -568132 -444803 -543715 -350268 -388691 -474991 -559119 -602064 -544391
1662 -544391 -745400 -695589 -468805 -432753 -630129 -632440 -762408 -762228 -558770 -621673 -644374
1651 -644374 -714631 -870771 -973162 -1139844 -1025729 -959226 -839147 -556098 -498466 -542223
1641 -542223 -516948 -548538 -666470 -566770 -602750 -566971 -683664 -897962 -806556 -803207 -699101
1630 -699101 -471256 -611761 -556760 -888513 -537604 -389916 -663410 -826827 -985808 -655873
1620 -655873 -498674 -430848 -353164 -460264 -691011 -588516 -426153 -602508 -844766 -789758
1610 -789758 -699142 -892302 -867859 -820615 -1017637 -858834 -652230 -699140 -744324 -663954 -462171
1599 -462171 -622465 -805209 -572474 -630609 -516890 -477628 -604859 -796142 -843014 -1042734
1589 -1042734 -1175011 -867752 -705104 -907069 -929432 -788107 -936433 -797488 -988692 -1016572
1579 -1016572 -1044937 -865478 -729583 -744798 -685066 -476469 -658731 -730718 -589554 -378025
1569 -378025 -390814 -485523 -474655 -724154 -406368 -528889 -651371 -377028 -351842 -571861
1559 -571861 -657329 -676512 -794778 -757323 -666792 -735113 -724214 -801364 -760473 -720783 -779225
1548 -779225 -479131 -349237 -388478 -505222 -433427 -595458 -602783 -610275 -476763 -352379 -525977
1537 -525977 -595313 -482206 -415950 -547638 -551116 -576106 -552227 -610211 -757877 -665073 -805523
1526 -805523 -1000639 -734104 -985690 -1004507 -693241 -543371 -546162 -535527 -601149 -593324 -567085
1515 -567085 -505689 -698074 -861751 -840004 -777410 -774294 -769420 -883485 -977484 -695140 -523981
1504 -523981 -322938 -244703 -105274 169012 21404 -310405 -434295 -849544 -808369 -699087
1494 -699087 -638993 -190684 -316798 -480634 -764558 -815655 -609882 -600086 -460144 -333433
1484 -333433 -390243 -432712 -547135 -594603 -462234 -418933 -656933 -533006 -495612 -642989 -563514
1473 -563514 -659425 -622801 -447598 -498414 -872592 -780354 -534940 -656890 -738063 -811125 -990952
1462 -990952 -867290 -754786 -577575 -665197 -580709 -486961 -536187 -702108 -689943 -585726 -711593
1451 -711593 -472194 -470090 -839522 -902666 -693674 -643753 -621467 -777434 -732805 -971462 -671711
1440 -671711 -687478 -756368 -590042 -639047 -592653 -909610 -564090 -562027 -896540 -622354 -374343
1429 -374343 -333152 -525453 -668792 -639329 -773767 -740104 -667692 -781502 -669626 -526224
1419 -526224 -566933 -709037 -668630 -1022003 -1110130 -862419 -915649 -1052862 -1066930 -984758 -668580
1408 -668580 -744418 -606210 -535346 -599866 -496079 -712313 -702284 -811409 -666505 -568433 -673316
1397 -673316 -395512 -284708 -394444 -474010 -525060 -603299 -568280 -578339 -528301 -199517 -512728
1386 -512728 -501801 -602962 -400312 -580428 -317259 -440051 -373716 -351628 -586321 -642562
1376 -642562 -615161 -703638 -827094 -693944 -567557 -587161 -605742 -609366 -541266 -489834 -563912
1365 -563912 -442855 -472877 -539699 -591625 -601883 -789844 -452647 -699592 -722407 -669755 -504151
1354 -504151 -557444 -373907 -395448 -467688 -639651 -620140 -761246 -818198 -579227 -368591 -296292
1343 -296292 -891974 -885436 -619429 -407274 -373025 -485553 -433764 -514308 -368972 -292196 -354311
1332 -354311 -271917 -371078 -742642 -760333 -612083 -381987 -518652 -663461 -652777 -437504
1322 -437504 -347204 -572157 -774967 -697128 -609857 -876135 -715970 -856208 -832606 -454678
1312 -454678 -267387 -384658 -337231 -455087 -563737 -620427 -765454 -587089 -671176 -837289
1302 -837289 -532808 -424696 -666277 -1017878 -909043 -722085 -809276 -896505 -817730 -676163
1292 -676163 -723299 -632402 -715658 -771938 -628340 -859710 -1124211 -887812 -685504 -754577 -678280
1281 -678280 -615279 -423075 -450834 -356537 -613123 -716904 -817339 -834327 -593028 -612151 -898409
1270 -898409 -845481 -784522 -840986 -535421 -552306 -526440 -591142 -673216 -427369 -647524 -970313
1259 -970313 -1187846 -941691 -893618 -830022 -728210 -687925 -808560 -833639 -756108 -512290 -477488
1248 -477488 -556281 -672464 -810779 -408686 -446545 -426960 -607985 -814209 -522202 -429831
1238 -429831 -597347 -832663 -861718 -762958 -659913 -326985 -483708 -428969 -730291 -632808
1228 -632808 -586011 -498008 -497584 -612237 -665572 -588642 -557625 -485904 -631814 -558836 -680655
1217 -680655 -592709 -656634 -769553 -605179 -625429 -479889 -741926 -715406 -434390 -521170 -473824
1206 -473824 -414076 -459381 -725818 -729390 -479621 -582546 -569421 -628435 -722635 -763002 -736857
1195 -736857 -587219 -699812 -646784 -529610 -749726 -760149 -766979 -865525 -807057 -684150 -894958
1184 -894958 -579429 -595771 -699700 -851175 -913679 -855681 -726702 -600135 -566727 -674785
1174 -674785 -556948 -637757 -773493 -564361 -658065 -871307 -619540 -355827 -331823 -471841
1164 -471841 -806946 -795074 -707817 -381750 -288963 -589529 -500831 -479457 -846826 -921951 -723725
1153 -723725 -704360 -831712 -739381 -697966 -667685 -420575 -421926 -716779 -515028 -553135 -869613
1142 -869613 -966164 -853308 -1037756 -824138 -594345 -602978 -605801 -591167 -814536 -863222 -502283
1131 -502283 -480858 -321842 -593344 -825192 -636642 -661414 -625581 -412283 -466116 -600577
1121 -600577 -729440 -691231 -521865 -563630 -727424 -779964 -871708 -529034 -499525 -406808 -579428
1110 -579428 -622312 -624447 -496567 -614887 -695954 -541587 -387146 -628402 -857641 -807114 -756463
1099 -756463 -784678 -668691 -324035 -571100 -803356 -864358 -817513 -1149849 -900674 -1081282
1089 -1081282 -1127510 -902530 -968436 -641337 -847817 -1050488 -721667 -619096 -508095 -590764
1079 -590764 -458546 -536027 -408614 -352019 -481569 -686095 -856862 -830544 -1130206 -978759
1069 -978759 -803163 -857588 -946355 -811653 -643297 -435269 -469219 -491201 -519786 -669497 -464428
1058 -464428 -294581 -401718 -686601 -478793 -575757 -413534 -436717 -541621 -513948 -826428
1048 -826428 -719191 -615699 -517667 -628728 -591155 -432047 -373247 -469932 -856649 -852190 -797337
1037 -797337 -536220 -630330 -734781 -723181 -539292 -507978 -809448 -555832 -379111 -737080
1027 -737080 -629455 -280353 -576301 -462144 -358373 -132422 -604965 -816588 -873091 -608104
1017 -608104 -645330 -615995 -859184 -936194 -873349 -925393 -846791 -691325 -609659 -651480 -665474
1006 -665474 -603690 -391566 -460390 -384632 -528541 -477972 -477385 -360792 -577733 -588228 -745122
995 -745122 -840286 -712293 -992231 -606383 -716992 -769694 -608709 -903132 -538261 -541875 -472293
984 -472293 -539964 -436469 -405131 -807843 -912127 -850488 -778570 -630922 -466626 -547236 -686012
973 -686012 -611686 -784203 -695755 -633805 -937506 -653297 -630921 -782301 -911199 -847208 -930046
962 -930046 -1141750 -983511 -782195 -676963 -733942 -785901 -743885 -1002142 -1130102 -863322
952 -863322 -725706 -741948 -894398 -941523 -1032189 -940790 -965768 -825697 -664962 -478163 -697235
941 -697235 -828730 -305856 -187870 -400090 -549024 -729774 -664954 -565182 -436552 -665507
931 -665507 -779405 -766070 -818985 -984854 -827651 -770865 -679955 -575288 -571302 -486922 -146615
920 -146615 -301575 -398179 -291279 -623856 -624532 -573260 -610852 -733955 -1107037 -1033218 -927480
909 -927480 -909873 -674559 -557141 -397412 -591930 -739344 -927640 -1017337 -997764 -780557
899 -780557 -750077 -688292 -467152 -437173 -716300 -863394 -781383 -797695 -659195 -983834 -796918
888 -796918 -579167 -664298 -478635 -586557 -404810 -565599 -737425 -451696 -276511 -448628
878 -448628 -678964 -432226 -356178 -466730 -574033 -966849 -864392 -663233 -490695 -395837
868 -395837 -456119 -681234 -476191 -463190 -730239 -739282 -509413 -518938 -601801 -661627 -664481 -885680
856 -885680 -615917 -808370 -806703 -812797 -481129 -422398 -975505 -784779 -419594 -428551 -448613
845 -448613 -246827 -551300 -900916 -962482 -842997 -924175 -954549 -980399 -1119915 -910632 -872978
834 -872978 -727495 -841546 -657336 -483937 -634902 -340476 -334137 -373933 -413395 -873452 -408106
823 -408106 -548444 -605048 -310769 -529430 -191239 -54852 -148699 -414307 -530910 -555029
813 -555029 -773633 -841907 -757183 -844046 -827401 -508654 -590454 -789436 -916597 -839687 -653530
802 -653530 -789481 -565236 -716069 -811202 -824327 -870038 -869103 -719978 -634207 -597376 -828736
791 -828736 -606008 -675781 -639848 -628255 -586601 -697033 -799930 -802183 -668130 -679409 -751052
780 -751052 -815116 -637898 -482223 -524944 -643852 -646609 -707770 -872169 -1057349 -848818 -581578
769 -581578 -391109 -702386 -757334 -626250 -875607 -741104 -338108 -288725 -545998 -498670
759 -498670 -562955 -724403 -777813 -654981 -664596 -704288 -797994 -571552 -540649 -564626 -610190
748 -610190 -380548 -335162 -732372 -592771 -706390 -747538 -805611 -590218 -731436 -781909 -605732
737 -605732 -816101 -922860 -666580 -712853 -705692 -705200 -596488 -763113 -989304 -1139342 -861929
726 -861929 -520468 -886029 -807984 -789354 -688960 -807231 -1033711 -735512 -578200 -540556
716 -540556 -555400 -761764 -641856 -608418 -735861 -581519 -562386 -707258 -639266 -505582 -333892
705 -333892 -528090 -560515 -502768 -354952 -596256 -621428 -554367 -494255 -487988 -568272 -720199
694 -720199 -616029 -717219 -709332 -697696 -601432 -822595 -775021 -669738 -579898 -688161 -530131
683 -530131 -576576 -513189 -558044 -610349 -429308 -460949 -601829 -553171 -537509 -485163 -473763
672 -473763 -638255 -732684 -906424 -736389 -809927 -1167331 -1053387 -652394 -652211 -733543 -584181
661 -584181 -505138 -530810 -367668 -370022 -644371 -422860 -515827 -603687 -352994 -441237 -520127
650 -520127 -424901 -468533 -538035 -437726 -583760 -558366 -747035 -899834 -764896 -681749 -694096
639 -694096 -892472 -880835 -629129 -509834 -359969 -359793 -477391 -666057 -417970 -506824 -436370
628 -436370 -728253 -712056 -496351 -321422 -206529 -655302 -799909 -850456 -1012733 -747156
618 -747156 -632912 -1029198 -1260841 -713576 -494255 -582534 -627777 -622298 -465082 -397455 -624494
607 -624494 -885985 -553629 -518376 -446712 -261360 -552720 -676442 -977996 -887483 -687930
597 -687930 -754024 -656313 -518343 -554858 -462097 -426954 -453898 -330619 -430167 -433425 -610879
586 -610879 -713277 -471447 -608952 -790630 -698683 -536830 -491574 -540110 -728315 -772099 -563994
575 -563994 -638904 -802913 -649332 -621522 -536032 -428467 -681697 -763475 -764760 -711376 -607466
564 -607466 -493574 -683906 -401520 -547294 -809650 -552075 -683095 -903162 -948828 -584919
554 -584919 -302110 -679300 -872950 -891677 -524259 -547035 -695558 -535468 -607429 -599186 -523661
543 -523661 -422151 -491615 -653928 -658691 -777057 -992062 -935280 -590573 -469305 -381041 -379210
532 -379210 -707084 -844866 -934868 -1117325 -789894 -533671 -739546 -550218 -590419 -449392
522 -449392 -577187 -815667 -935553 -740649 -482065 -743035 -979994 -874186 -720367 -785064
512 -785064 -501140 -376392 -335749 -587746 -677910 -557533 -681905 -799209 -922831 -849974
502 -849974 -892938 -902385 -869306 -758508 -810578 -857115 -1123832 -1070499 -814946 -667817 -787802
491 -787802 -670569 -600420 -868545 -939208 -770704 -641322 -697806 -928781 -1118417 -557356
481 -557356 -509172 -646417 -705522 -783947 -632008 -452820 -430291 -368891 -652673 -922359 -609031
470 -609031 -730558 -1006160 -1065807 -679811 -585953 -679037 -540448 -698227 -453740 -634662
460 -634662 -757863 -717803 -603259 -521355 -595221 -994536 -887444 -662054 -777558 -899329
450 -899329 -947436 -1041419 -1109409 -1016033 -959590 -686840 -766069 -718465 -770312 -722009 -691212 -619976
438 -619976 -513245 -425062 -468973 -426565 -488365 -505330 -408302 -540254 -457382 -304680 -340860
427 -340860 -538499 -435157 -642219 -952776 -734643 -530133 -625670 -827722 -684460 -699574
417 -699574 -781918 -772424 -930334 -775603 -937122 -643470 -298934 -426466 -369840 -576812 -588208
406 -588208 -669319 -633872 -659601 -442363 -531173 -708369 -564250 -788228 -581293 -382800 -395740
395 -395740 -857264 -946669 -886769 -687336 -753068 -862931 -578563 -355387 -403905 -753240 -749639
384 -749639 -760675 -915000 -731123 -713040 -641691 -342536 -463169 -634995 -683124 -871512 -901459
373 -901459 -870581 -702690 -724497 -476125 -369634 -462865 -406886 -746800 -828221 -674306 -634781
362 -634781 -463304 -454644 -675568 -504482 -798493 -720732 -772369 -735241 -636398 -852444 -1071923
351 -1071923 -816617 -881430 -907684 -594748 -528613 -741449 -638723 -493373 -737485 -477706
341 -477706 -736410 -902385 -550450 -404703 -370946 -561467 -669250 -586160 -586189 -827217 -1075049
330 -1075049 -1002723 -874677 -527726 -565792 -629224 -640259 -780497 -808424 -717542 -521007 -503504
319 -503504 -686931 -701691 -700253 -680734 -616681 -562003 -572324 -449364 -438095 -749480 -827595
308 -827595 -841088 -594450 -617050 -794103 -656513 -567660 -804464 -801246 -564926 -627000 -662980
297 -662980 -400398 -507594 -531406 -328299 -493339 -552479 -713337 -525002 -435429 -529040 -543252
286 -543252 -435768 -396548 -594515 -807962 -690203 -766645 -869292 -574958 -725273 -884612
276 -884612 -899870 -763248 -809842 -725633 -657499 -619373 -714778 -623788 -913735 -854807 -731722
265 -731722 -663925 -639289 -699984 -914136 -843253 -685214 -678840 -322678 -365928 -467565 -743877
254 -743877 -738784 -798613 -619719 -488108 -418227 -399486 -555784 -667012 -693883 -643882 -566807
243 -566807 -781929 -927825 -722369 -229979 -444490 -655334 -578477 -763369 -830416 -562151
233 -562151 -412593 -941091 -758805 -604451 -632599 -805135 -801775 -713620 -618085 -593431 -374403
222 -374403 -324369 -577790 -522102 -674673 -662745 -694047 -900085 -950329 -648162 -491496 -552840
211 -552840 -735090 -852925 -925909 -613483 -615119 -497097 -630858 -873036 -725948 -574050
201 -574050 -695596 -613846 -778278 -843516 -802327 -938561 -730714 -799618 -936734 -883487 -1043959
190 -1043959 -862685 -779757 -886855 -793168 -927935 -840965 -861758 -499922 -397731 -686865
180 -686865 -724874 -627573 -843321 -791940 -820673 -865432 -795135 -605046 -805809 -743835 -594821
169 -594821 -797665 -875527 -942967 -805526 -705943 -788020 -768142 -686062 -640942 -445027 -636240
158 -636240 -689151 -780746 -631147 -718090 -1064124 -935035 -684567 -667293 -802098 -935191 -1044779
147 -1044779 -701849 -721231 -860632 -824267 -1033652 -871087 -864638 -901061 -840308 -673851 -1074873
136 -1074873 -956538 -1050409 -786192 -695473 -715267 -658716 -758893 -746480 -948898 -781404 -641244
125 -641244 -813095 -882879 -646206 -739762 -784064 -831583 -1088921 -1126580 -862866 -570179 -524213
114 -524213 -608634 -727199 -906304 -1019822 -997347 -924847 -789455 -718477 -616988 -786382 -790859
103 -790859 -579262 -827857 -889899 -695554 -744396 -1059265 -937034 -888822 -747859 -923908
93 -923908 -793437 -970447 -713345 -759053 -666424 -671660 -830110 -817205 -845845 -900650 -950388
82 -950388 -1036721 -1120629 -1002733 -1066047 -1043403 -891538 -825221 -1014247 -792618 -783553 -981766
71 -981766 -882616 -926445 -910320 -913833 -1000480 -915006 -922013 -1194460 -1170577 -1076566 -776666 -946701
59 -946701 -965146 -967430 -913030 -796758 -1072954 -1049205 -1051602 -1050873 -750417 -860953 -688953 -940534
47 -940534 -1009554 -895483 -1204817 -1355868 -1329133 -1058682 -932724 -915404 -978837 -959198 -998579
36 -998579 -896205 -910986 -986412 -908115 -846482 -1004149 -1152267 -1269692 -1113760 -1125435 -1089186
25 -1089186 -1143282 -906406 -947417 -924331 -971575 -909482 -1093813 -1029131 -1018224 -1042578 -967560
14 -967560 -1083267 -1209721 -1052546 -832948 -913514 -988596 -1172571 -1268374 -1259685 -1064165 -851148
3 -851148 -920976 -1000325 -754723
0 -754723
$$ Imaginary data points
##PAGE= N=2
##DATA TABLE= (X++(I..I)), XYDATA
16383 -4205997 -4093741 -3939159 -4047030 -3734373 -3587074 -3575456 -3566498 -3600598 -3570501 -3410915
16373 -3410915 -3263894 -3123156 -3104260 -3238055 -3063758 -2795978 -2921982 -2841878 -2626625 -2538937
16363 -2538937 -2700129 -2807460 -2702682 -2662800 -2422463 -2465273 -2452650 -2429211 -2480583 -2182411
16353 -2182411 -1703997 -1885768 -2049302 -1874694 -1832334 -1480425 -1542712 -1601066 -1340072 -1245820
16343 -1245820 -1332421 -1340864 -1364886 -1378455 -1295108 -1152728 -963421 -811377 -843443 -994099 -893275
16332 -893275 -953636 -755629 -384339 -341934 -318724 -396095 -316157 -478881 -349359 -316394 -328607
16321 -328607 -374105 -298811 -51718 -52694 -127974 145233 384528 454654 558405 498663 208282
16310 208282 254713 374519 532462 624648 810535 835328 706800 925685 950053 841733
16300 841733 1016446 1135154 1197586 1095480 912038 1178860 1370741 1406227 1436904 1412697
16290 1412697 1399895 1419610 1453268 1429874 1643996 1692685 1827718 1697430 1683101 1823660
16280 1823660 1814448 1771495 1897470 2058736 2016421 1990568 1964922 1943685 2187664 2240326 2331061
16269 2331061 2647004 2559011 2397915 2471183 2531484 2606091 2688294 2944998 2748928 2710765
16259 2710765 2926927 2908340 3183407 3088947 2946730 2866999 3033634 3031739 2870880 3149987
16249 3149987 3390877 3162912 3239833 3177383 3292128 3369181 3340113 3301198 3547665 3587937
16239 3587937 3581578 3669163 3724957 3640639 3707370 3746201 3877703 3768997 3712166 3795975 3930804
16228 3930804 3917385 3900163 4091339 4045959 4054230 3962415 3988538 3897588 4225596 3952808 3903380
16217 3903380 4220291 4167418 4095846 4143136 4268037 4148801 4141592 4178773 4315619 4240447 4414202
16206 4414202 4518282 4378384 4356987 4428140 4575774 4637366 4721885 5003732 4814313 4644698
16196 4644698 4709525 4599378 4715462 4872661 4910972 5143698 5016028 5056499 4977598 5047476
16186 5047476 4968983 5026171 5160537 5033401 4980843 4872350 4651071 4896579 5032385 4867266
16176 4867266 4930864 4890356 5085734 5204863 4951612 4906693 5273924 5268891 5008537 5158324
16166 5158324 5189553 5213667 5287492 5384216 5460584 5344012 5470332 5284977 5676930 5602412
16156 5602412 5488106 5455412 5339708 5311330 5321967 5571484 5658064 5653566 5676407 5532915 5521094
16145 5521094 5517128 5549628 5585475 5559516 5537884 5247109 5235683 5729953 5882454 5725375 5607950
16134 5607950 5740711 5548148 5585190 5954039 5973842 5569231 5510346 5742680 5525555 5688530
16124 5688530 5901308 5928883 5756555 5860812 6016187 6066789 5975575 5840414 5749314 5832499
16114 5832499 5931514 5846724 6024937 5886896 5581589 5796583 5954596 5898016 6240496 6022844
16104 6022844 5709118 5697599 5854088 5872171 6047734 6288463 6112262 5852486 5773100 5918715
16094 5918715 5631195 6022751 6063291 6063165 5783311 5943324 5852737 5845290 5827090 5486726 5752955
16083 5752955 5798514 6096062 5944116 5973235 5925968 5885618 6053628 6005921 6269210 5960928
16073 5960928 6219429 6124223 6068040 6071396 6056154 6277896 6044710 6130996 6248063 6650434
16063 6650434 6131447 6251701 6385213 6579190 6529477 6245433 6065239 6311156 6468936 6347878
16053 6347878 6013767 6101224 6162657 6492560 6198899 6236960 6240669 6029329 5980509 6158470
16043 6158470 6276063 6365346 6299772 6196393 5967723 5828050 6026871 5983855 6303124 6316329
16033 6316329 6393022 6137998 5851611 6010780 5885297 5880871 6088298 5980766 6159317 6321267
16023 6321267 6152814 6046458 6163898 5887174 6011821 6134478 6143765 5948158 5982857 5895142
16013 5895142 5896769 6098555 6160878 6124341 6040831 5960039 6070500 6024060 6115715 6332407 6302795
16002 6302795 6168167 6062113 6084553 6354491 6381713 6224919 6237553 6221704 6231298 6341199
15992 6341199 6263102 6334150 6261145 5952159 5881517 5939822 5943906 6001884 5962287 5919407 5987321
15981 5987321 6213079 6079994 5923332 5925964 5956583 5934573 6045794 5993591 6139193 5931397
15971 5931397 5778324 5866847 6006441 6061973 6157585 6236554 6380742 6383187 6430923 6072069 6106732
15960 6106732 6085261 5979963 6177285 6068719 6084409 6102793 6180618 6356800 6469524 6356559
15950 6356559 6092669 5947260 6145447 6049389 6081619 6095074 5960973 6068068 5978641 5953734
15940 5953734 5851382 5846550 5975605 6146527 5923024 6124159 6541570 6462941 6389153 6079979
15930 6079979 6117415 5958268 6006855 6213943 6142317 6049361 6284034 6355195 6211670 6117898
15920 6117898 6192888 6286962 6475745 6578665 6490546 6226623 5992404 5928916 6103707 6142574
15910 6142574 5869806 5698162 5910575 6343962 6200271 6013704 6286077 6401001 6664775
15901 6664775 6365721 6095471 6036290 6150830 5965825 6125054 6212942 6249093 6169414 6009204
15891 6009204 6076203 6184817 6274228 6350221 6393844 6387034 6079216 6200019 6132655 6011204 5921270
15880 5921270 6260410 6408548 6176249 6052959 6053184 6261535 6241309 6201575 6197095 6362661 6371134
15869 6371134 6162928 6111359 6143768 5900090 5959250 6049595 6298579 6147554 6251781 6385550
15859 6385550 6262093 6436306 6383734 6308278 6568668 6519062 6432925 6491475 6179581 6203742
15849 6203742 6364105 6283210 6375912 6243588 6116773 5902630 6141814 6360625 6201143 6426584
15839 6426584 6223504 6372181 6318014 6433828 6287630 6299241 6476241 6329274 6491693 6559347
15829 6559347 6427672 6285670 6099225 6099638 6167591 6271696 6227563 6169037 6146574 6404155 6504727
15818 6504727 6392707 6150253 5936378 6102874 6293040 6355232 6069031 6234212 6552575 6598847
15808 6598847 6432211 6151802 6147161 6106810 6045252 6336372 6188402 6016626 6025670 6204247
15798 6204247 6114542 6321353 6380905 6413750 6266929 6239260 6340273 6662041 6357257 6400006
15788 6400006 6232232 6164481 6025830 6190127 6285409 6160080 6104018 5979875 6291586 6173932
15778 6173932 6238923 6117379 6439816 6582315 6417693 6420437 6328098 6139536 6222317 6337833
15768 6337833 6222770 5983026 6018835 6119053 5889211 6095247 6282871 6365842 6430079 6532336
15758 6532336 6662721 6536593 6275342 6354496 6387125 6383188 6060194 6086066 5765369 6071720
15748 6071720 6415445 6559735 6656983 6581184 6548234 6265004 6154521 6312207 6556683 6253904
15738 6253904 6061687 6038418 6175446 6513911 6546118 6468364 6300523 6117600 6348138 6399800
15728 6399800 6316724 6167401 6321290 6379617 6283608 6201588 6121803 6271967 6278150 6362281 6673599
15717 6673599 6385734 6073704 6058242 6518664 6726932 6447058 6380905 6501960 6366949 6147254
15707 6147254 6374867 6380182 6321218 6270880 6211321 6086300 6251792 6548829 6541208 6613268 6603182
15696 6603182 6399531 6151821 6277149 5983535 5927192 6039028 6101482 5872694 6233619 6011050
15686 6011050 5923011 6112278 6270539 6135991 6195264 6317957 6444425 6453247 5830876 5793657
15676 5793657 5923778 6077765 6175759 6223171 6332302 6356134 6398670 6605735 6592542 6401440
15666 6401440 6454055 6367482 6308676 6195914 6187155 6256821 6326624 6294890 6299822 6189917 6136041
15655 6136041 6046510 6335898 6563559 6629579 6486898 6611418 6547918 6451672 6399408 6354843
15645 6354843 6174030 6153649 6210639 6227080 6122389 6334814 6303989 6334300 6420181 6139945
15635 6139945 6261218 6242772 6449403 6341216 6373870 6301319 6396757 6297865 6554719 6458178
15625 6458178 6530189 6650026 6376203 6377881 6158092 6451680 6578414 6364677 6436660 6179594
15615 6179594 6197553 6269842 6470510 6587281 6624137 6442556 6405239 6398596 6451451 6461528 6492313
15604 6492313 6379493 6430021 6381260 6610977 6500942 6272127 6057762 6346698 6215318 6179745
15594 6179745 6272051 6440691 6631017 6577740 6494550 6384106 6332778 6445733 6509944 6575264
15584 6575264 6404288 6420623 6471656 6292852 6495801 6520571 6369803 6524513 6864071 6684045
15574 6684045 6544515 6602589 6513335 6538144 6491012 6409359 6669754 6524268 6298555 6302644 6510668
15563 6510668 6690358 6887637 6698236 6701294 6688337 6428947 6407575 6463446 6570954 6731883
15553 6731883 6363907 6254639 6279884 6343306 6253036 6352058 6339458 6234021 6140242 6268346
15543 6268346 6185016 6062088 6168577 6501970 6389202 6176624 6496946 6397366 6392838 6330538
15533 6330538 6526732 6623591 6299857 6400705 6555867 6489380 6550230 6707070 6414775 6246213
15523 6246213 6432061 6305513 6233936 6330541 6319426 6348758 6277895 6135176 6199943 6337379
15513 6337379 6798961 6676479 6438261 6280909 6321709 6300810 6436954 6644329 6652388 6503945
15503 6503945 6582337 6729720 6661412 6691961 6729794 6624792 6668686 6633524 6692178 6596075 6497832
15492 6497832 6427504 6571603 6636582 6367728 6625337 6442666 6475419 6706267 6523687 6410965
15482 6410965 6758996 6686429 6364092 6288997 6404754 6413192 6352926 6245169 6446675 6416848
15472 6416848 6830142 6982950 6851656 6503844 6669891 6594148 6282210 6497199 6475625 6360410
15462 6360410 6306708 6514927 6706203 6657240 6823703 6742701 6630675 6779795 6817796 6713293
15452 6713293 6402041 6516125 6357044 6219532 6253339 6415866 6472252 6657234 6501628 6559448
15442 6559448 6716033 6653315 6916853 6744662 6522728 6693497 6580341 6504097 6382013 6627058
15432 6627058 6583530 6612327 6718372 6646678 6598285 6488823 6406655 6425574 6452666 6270054 6381559
15421 6381559 6452034 6582622 6516415 6541084 6414887 6308982 6444104 6548772 6674225 6581528
15411 6581528 6617292 6620290 6528338 6625026 6648020 6806882 6531035 6584503 6496379 6340763 6028979
15400 6028979 6149506 6452539 6260230 6345894 6348465 6438056 6432087 6412141 6482900 6572656 6714853
15389 6714853 6626671 6815283 6741820 6681968 6815830 6593665 6637288 6542559 6595365 6833756
15379 6833756 6742042 6669665 6385256 6235835 6592831 6725109 6575376 6460803 6540776 6550841
15369 6550841 6660350 6738687 6565004 6407881 6356361 6199352 6631458 6638136 6585578 6558229
15359 6558229 6374801 6653261 6593558 6449602 6274831 6311788 6765050 6659674 6520108 6769281
15349 6769281 7040245 6761363 6712142 6783633 6653930 6658156 6690388 6670566 6624503 6421515 6623305
15338 6623305 6683030 6738723 7022922 6929857 6741298 6515503 6536338 6663813 6797995 6792954
15328 6792954 6557847 6506377 6377363 6154474 6339733 6557928 6701093 6912438 6586458 6468244
15318 6468244 6808472 6867453 6671568 6662812 6644460 6620784 6628643 6499840 6388192 6682043 6916306
15307 6916306 6865407 6694060 6870769 6758122 6527414 6640781 6716294 6496093 6386766 6413242
15297 6413242 6373630 6345051 6412875 6441632 6659070 6831246 6753146 6881552 6700551 6713713
15287 6713713 6642083 6861595 6742237 6496570 6338515 6376595 6292616 6187645 6571186 6604391
15277 6604391 6612671 6629861 6551740 6620961 6724018 6827675 6737702 6426501 6478072 6857015 6720004
15266 6720004 6703292 6911134 6958993 6966682 6801282 6440581 6706447 6861872 6805444 6713018
15256 6713018 6595120 6566735 6379630 6312822 6703407 6587132 6487310 6429251 6571077 6677137
15246 6677137 6839590 6817730 6845118 6957253 6822873 6658477 6594068 6619340 6473440 6343825
15236 6343825 6546058 6626663 6586797 6555553 6770876 6762610 6744530 6764815 6921175 6873761 6659062
15225 6659062 6596692 6702171 6613242 6770782 6695333 6642366 6717427 6927864 7161517 6893586
15215 6893586 6943991 6684361 6697930 6885306 7022115 6640235 7013940 6889610 6880494 6741687
15205 6741687 6653187 6763343 6708552 6715426 6806892 6806457 6621579 6499763 6571468 6543891 6727887
15194 6727887 6900829 7021044 6957204 6882200 6845889 6686815 6679932 6703708 6653057 6566694 6613466
15183 6613466 6671320 6750007 6811178 6881620 6823221 6884331 6937391 6665078 6425672 6491146 6458452
15172 6458452 6626931 6773716 6764893 6886749 6864346 6915008 6730280 6792995 6896900 6838137
15162 6838137 6785568 6558384 6636684 6678371 6881587 7053065 6998278 6827461 6704361 6734527
15152 6734527 6623567 6802770 7101494 7011981 6778863 6890251 6719642 6221147 6551436 6679397
$$ [...]
##END NTUPLES=NMR SPECTRUM
##END=
