##TITLE=1H_DE-80H_X3
 200.13MHz, d2o
 8 sc
 
 19ns.26.2.2025
##JCAMPDX= 6.0         $$ Bruker NMR JCAMP-DX V2.0
##DATA TYPE= NMR SPECTRUM
##DATA CLASS= NTUPLES
##ORIGIN= UXNMR, Bruker Analytische Messtechnik GmbH
##OWNER= pz
$$ XWIN-NMR		Version 3.5
$$ Tue Jul 28 10:50:39 2026 Russian Standard Time (UT+4h)  Yarkov@DPX200
##.OBSERVE FREQUENCY= 200.1313
##.OBSERVE NUCLEUS= ^1H
##.ACQUISITION MODE= SIMULTANEOUS
##.ACQUISITION SCHEME= undefined
##.AVERAGES= 8
##.DIGITISER RES= 18
##SPECTROMETER/DATA SYSTEM= spect
##.PULSE SEQUENCE= zg30
##.SOLVENT NAME= CDCl3
##.SHIFT REFERENCE= (INTERNAL, CDCl3, 0, 15.5078)
##AUDIT TRAIL= $$ (NUMBER, WHEN, WHO, WHERE, WHAT)
$$ ##TITLE= Audit trail, XWIN-NMR		Version 3.5
$$ ##JCAMPDX= 5.01
$$ ##ORIGIN= Bruker BioSpin GmbH
$$ ##OWNER= Yarkov
$$ C:/Bruker/XWIN-NMR/data/yarkov2/nmr/H-C/1/pdata/1/auditp.txt
$$ ##AUDIT TRAIL=  $$ (NUMBER, WHEN, WHO, WHERE, WHAT)
(   1,<2026-07-28 10:49:53.46 +0400>,<Yarkov>,<DPX200>,
      <created by zg, POWCHK disabled, PULCHK disabled
       configuration hash MD5:
       00 E9 B6 7A A2 85 ED C7 34 08 36 98 17 FE 4E 26
       data hash MD5: 16K
       7C 6C 0C 19 66 D6 E0 A0 F4 4A 19 9B FC 29 58 D2>)
(   2,<2026-07-28 10:50:00.43 +0400>,<Yarkov>,<DPX200>,
      <Start of raw data processing
       efp BC_mod = 2 LB = 0.25 FT_mod = 6 PKNL = 1 PHC0 = -7253.183 PHC1 = 2.82197 SI = 16K 
       data hash MD5: 16K
       A6 A0 82 12 66 E2 F7 46 69 79 B1 D2 B4 9C BD FA>)
$$ ##END=
$$ 
$$ hash MD5
$$ 6F 84 37 96 00 B4 72 A2 97 C7 85 B4 DC F8 D8 48
##$RELAX= 
##$RELAX= 
##$RELAX= 
##$RELAX= 
##$RELAX= 
##$RELAX= 
$$ Bruker specific parameters
$$ --------------------------
##$DU= <C:/Bruker/XWIN-NMR>
##$EXPNO= 1
##$NAME= <H-C>
##$PROCNO= 1
##$TYPE= <nmr>
##$USER= <yarkov2>
##$AMP= (0..31)
100 100 100 100 100 100 100 100 100 100 100 100 100 100 100 100 100 100 
100 100 100 100 100 100 100 100 100 100 100 100 100 100 
##$AQSEQ= 0
##$AQ_mod= 1
##$AUNM= <au_zg>
##$AUTOPOS= <>
##$BF1= 200.13
##$BF2= 200.13
##$BF3= 200.13
##$BF4= 200.13
##$BF5= 200.13
##$BF6= 200.13
##$BF7= 200.13
##$BF8= 200.13
##$BYTORDA= 1
##$CFDGTYP= 0
##$CFRGTYP= 5
##$CHEMSTR= <none>
##$CNST= (0..31)
1 1 145 1 1 1 1 1 1 1 1 1 1 1 1 1 1 1 1 1 1 1 1 1 1 1 1 1 1 1 1 1 
##$CPDPRG= <>
##$CPDPRG1= <>
##$CPDPRG2= <>
##$CPDPRG3= <>
##$CPDPRG4= <mlev>
##$CPDPRG5= <mlev>
##$CPDPRG6= <mlev>
##$CPDPRG7= <mlev>
##$CPDPRG8= <mlev>
##$CPDPRGB= <>
##$CPDPRGT= <>
##$D= (0..31)
0 0.7 0 0 0 0 0 0 0 0 0 0.03 0 0 0 0 0 0 0 0 0 0 0 0 0 0 0 0 0 0 0 0 
##$DATE= 1785221393
##$DBL= (0..7)
120 120 120 120 120 120 120 120 
##$DBP= (0..7)
150 150 150 150 150 150 150 150 
##$DBP07= 0
##$DBPNAM0= <>
##$DBPNAM1= <>
##$DBPNAM2= <>
##$DBPNAM3= <>
##$DBPNAM4= <>
##$DBPNAM5= <>
##$DBPNAM6= <>
##$DBPNAM7= <>
##$DBPOAL= (0..7)
0.5 0.5 0.5 0.5 0.5 0.5 0.5 0.5 
##$DBPOFFS= (0..7)
0 0 0 0 0 0 0 0 
##$DE= 6
##$DECBNUC= <off>
##$DECIM= 32
##$DECNUC= <off>
##$DECSTAT= 4
##$DIGMOD= 1
##$DIGTYP= 9
##$DL= (0..7)
0 120 120 120 120 120 120 120 
##$DP= (0..7)
$$ [...]
##$SUBNAM2= <"">
##$SUBNAM3= <"">
##$SUBNAM4= <"">
##$SUBNAM5= <"">
##$SUBNAM6= <"">
##$SUBNAM7= <"">
##$SUBNAM8= <"">
##$SUBNAM9= <"">
##$SW= 18.0517328524113
##$SWIBOX= (0..15)
0 0 2 0 0 0 0 0 0 0 0 0 0 0 0 0 
##$SW_h= 3612.71676300578
##$TD= 16384
##$TD0= 1
##$TE= 0
##$TE2= 300
##$TE3= 300
##$TEG= 300
##$TL= (0..7)
0 120 120 120 120 120 120 120 
##$TP= (0..7)
150 150 150 150 150 150 150 150 
##$TP07= 0
##$TPNAME0= <>
##$TPNAME1= <>
##$TPNAME2= <>
##$TPNAME3= <>
##$TPNAME4= <>
##$TPNAME5= <>
##$TPNAME6= <>
##$TPNAME7= <>
##$TPOAL= (0..7)
0.5 0.5 0.5 0.5 0.5 0.5 0.5 0.5 
##$TPOFFS= (0..7)
0 0 0 0 0 0 0 0 
##$TUNHIN= 0
##$TUNHOUT= 0
##$TUNXOUT= 0
##$USERA1= <user>
##$USERA2= <user>
##$USERA3= <user>
##$USERA4= <user>
##$USERA5= <user>
##$V9= 5
##$VALIST= <valist>
##$VCLIST= <CCCCCCCCCCCCCCC>
##$VD= 0
##$VDLIST= <DDDDDDDDDDDDDDD>
##$VPLIST= <PPPPPPPPPPPPPPP>
##$VTLIST= <TTTTTTTTTTTTTTT>
##$WBST= 1024
##$WBSW= 4
##$XGAIN= (0..3)
0 0 0 0 
##$XL= 0
##$YL= 0
##$YMAX_a= 207217
##$YMIN_a= -273283
##$ZGOPTNS= <>
##$ZL1= 120
##$ZL2= 120
##$ZL3= 120
##$ZL4= 120
##$ABSF1= 0
##$ABSF2= 0
##$ABSG= 0
##$ABSL= 0
##$ALPHA= 0
##$AQORDER= 0
##$ASSFAC= 0
##$ASSFACI= 0
##$ASSFACX= 0
##$ASSWID= 0
##$AUNMP= <proc_1d>
##$AZFE= 0.1
##$AZFW= 0.1
##$BCFW= 0
##$BC_mod= 2
##$BYTORDP= 0
##$COROFFS= 0
##$CY= -3
##$DATMOD= 1
##$DC= 0
##$DFILT= <>
##$DTYPP= 0
##$F1P= 0
##$F2P= 0
##$FCOR= 1
##$FTSIZE= 16384
##$FT_mod= 6
##$GAMMA= 0
##$GB= 0
##$INTBC= 1
##$INTSCL= 3.241238e-09
##$ISEN= 128
##$LB= 0.25
##$LEV0= 0
##$LPBIN= 0
##$MAXI= 10000
##$MC2= 0
##$MEAN= 0
##$ME_mod= 0
##$MI= 1.114404
##$NCOEF= 0
##$NC_proc= -7
##$NLEV= 6
##$NOISF1= 3.799351
##$NOISF2= 2.8
##$NSP= 0
##$NTH_PI= 0
##$NZP= 0
##$OFFSET= 15.5078
##$PC= 1
##$PHC0= -7253.183
##$PHC1= 2.82197
##$PH_mod= 1
##$PKNL= yes
##$PPARMOD= 0
##$PSCAL= 0
##$PSIGN= 0
##$REVERSE= no
##$SF= 200.130002781624
##$SI= 16384
##$SIGF1= 3
##$SIGF2= 2
##$SINO= 0.751879
##$SIOLD= 32768
##$SREGLST= <19F.Aceton>
##$SSB= 0
##$STSI= 16384
##$STSR= 0
##$SW_p= 3612.71676300578
##$SYMM= 0
##$S_DEV= 0
##$TDeff= 16384
##$TDoff= 0
##$TI= <>
##$TILT= no
##$TM1= 0
##$TM2= 0
##$TOPLEV= 0
##$USERP1= <user>
##$USERP2= <user>
##$USERP3= <user>
##$USERP4= <user>
##$USERP5= <user>
##$WDW= 1
##$XDIM= 16384
##$YMAX_p= 310015703
##$YMIN_p= -1316651
$$ End of Bruker specific parameters
$$ ---------------------------------
##NTUPLES= NMR SPECTRUM
##VAR_NAME=  FREQUENCY,     SPECTRUM/REAL,   SPECTRUM/IMAG
##SYMBOL=    X,             R,               I
##VAR_TYPE=  INDEPENDENT,   DEPENDENT,       DEPENDENT
##VAR_FORM=  AFFN,          ASDF,            ASDF
##VAR_DIM=   16384,         16384,           16384
##UNITS=     HZ,            ARBITRARY UNITS, ARBITRARY UNITS
##FACTOR=    0.220516191357247, 1,           1
##FIRST=     3103.57607759694, 0,            0
##LAST=      -509.140685408844, 0,           0
##MIN=       -509.140685408844, -1316651,    0
##MAX=       3103.57607759694, 310015703,    0
$$ Real data points
##PAGE= N=1
##DATA TABLE= (X++(R..R)), XYDATA
$$ [...]
6704G88540l0547M384J21053j45824R912O4453r8714J7537n942j48450K08779
6693G85181J19797J09623j30150k33600J32763K1933R9723o1231o415o8684J54907
6682I23847p5455j06049J2752n7699R6752o5J83N384r910j23568r7395J9162J89036
6669G76975m0678q2785K1489m0850J1181o7256k2352P5926l5224P4861N6245K0902
6657G48434O1759Q552M6528o2517j23061m639j05178l3053R1262n2092J06720
6646F82715J5946q1630J25986L6327m0682P531J17459l3076n7488J12631l0191
6635H55528o8091n3788m1332L1323O0746k4840N7088K0620j16890j748O0183R1208
6623H70007r0726k08841M9471o6927J02724J58559n6148P1773k1119j03424m6120
$$ plain form
6704 788540 757993 762377 883430 737606 747518 811971 713257 730794 724852 576402 785181
6693 785181 904978 1014601 884451 650851 783614 805547 905270 844039 837624 768940 923847
6682 923847 848392 742343 755095 697396 794148 794083 794266 799650 789740 666172 568777 587939 776975
6669 776975 736297 653512 675001 634151 645332 578076 555724 631650 596426 671287 727532 748434
6657 748434 810193 818745 865273 802756 679695 675056 569878 536825 628087 575995 682715
6646 682715 698661 617031 743017 779344 738662 746193 863652 830576 773088 885719 855528
6635 855528 787437 733649 692317 723640 784386 759546 816634 837254 720364 718616 778799 870007
6623 870007 779281 570440 619911 552984 655708 814267 758119 829892 808773 705349 659229
6612F59229O9813o4978P0915N4361R1690j50489n0828K2554Q8200J90593Q123
6601I89183R2649j54532J24912n0120j15152N7294l3232J06351J223q2436M9858
6590I85998k3094o0598O697O6591l5137k1421M02r4736K07222j00387m3135M8800
6578I37202l9211M9179J11705q9016q521k0184L7452J3988n6329j767L5483J05907
6566A075888O695k1290j0713M5096Q7926N3124j8925n5290K02058l7689q8454
6555A238426R3207N9771J46879p6901o4412k299K0830j60776P1477N7223R2428
6544A475853J01878J61487M6793j3902Q5902Q5975P8925P1910M8967q9364J28827
6533B183251Q8948l0316q5718o7824J35810l8552p056j07963k3933p2547q9036
$$ plain form
6612 659229 729042 664064 734979 789340 881030 730541 679713 702267 790467 981060 989183
6601 989183 1081832 927300 1052212 1002092 886940 944234 911002 1017353 1018576 936140 985998
6590 985998 962904 902306 909003 975594 940457 919036 919438 824702 1031924 931537 888402 937202
6578 937202 897991 947170 1058875 969859 961338 941154 978606 992594 936265 934498 969981 1075888
6566 1075888 1082583 1061293 1050580 1095676 1183602 1236726 1217801 1162511 1364569 1326880 1238426
6555 1238426 1331633 1391404 1538283 1461382 1396970 1394671 1415501 1254725 1326202 1383425 1475853
6544 1475853 1577731 1739218 1786011 1772109 1858011 1943986 2022911 2094821 2143788 2054424 2183251
6533 2183251 2272199 2241883 2156165 2088341 2224151 2185599 2178543 2070580 2046647 1974100 1885064
6522A885064j74191M7796l2583r8479R3053j12114M385j5320n3123Q51M3810j98790
6510A390359n3557j8545o0739K7519K5657K0013J5336o725q2444p3271m8633O2265
6498A197235L423l309r8517L0601L3779Q8460j37122M2591m9899m4620M3435O9219
6486A175276J37386k26427j07563J52219J13675m7400L1549k9634j18334K8094
6476A108841R8114p2038p3372J82755j03956k2500l4009N412J85091M0608j30619
6465A184327K0374O511K4765m0346j38009l7732J07577J25069q7932K6660j87183
6454A004081R4157O5995l2611j13020J11224M5712k2103P8097j13696K1692J17213
6443A256741m5634p3378J30223j46603q0792N1437p147O0413P6365J09138k46317
$$ plain form
6522 1885064 1710873 1758669 1726086 1627607 1720660 1608546 1612931 1597611 1544488 1545339 1589149 1390359
6510 1390359 1336802 1318257 1257518 1285037 1310694 1330707 1346043 1339318 1256874 1183603 1134970 1197235
6498 1197235 1200658 1197349 1098832 1129433 1163212 1251672 1114550 1157141 1107242 1062622 1106057 1175276
6486 1175276 1312662 1086235 978672 1130891 1244566 1197166 1228715 1199081 1080747 1108841
6476 1108841 1206955 1134917 1061545 1244300 1140344 1117844 1083835 1089247 1274338 1314946 1184327
6465 1184327 1204701 1211212 1235977 1195631 1057622 1019890 1127467 1252536 1164604 1191264 1004081
6454 1004081 1098238 1164233 1131622 1018602 1129826 1175538 1153435 1231532 1117836 1139528 1256741
6443 1256741 1211107 1137729 1267952 1121349 1040557 1091994 1084847 1145260 1221625 1330763 1084446
6432A084446K04937o2308k156R3377l4207j19954J49561q9008m7426R2477K16153
6421A485892n1242j07452K15880q9889J8323o844J3389q4921K9767O0270M0681
6410A523854n6928J22539J07502o3516K4998J4331K5047N9215J54442Q1611j41724
6399A851371J6990p2686n531R4394J61501j5766J22552J65081n691M6785j73251
6388B185749K1399K05965R3291N2958J23826p0024R3199K2317j8610J34827k0051
6377B824846J3937m5432q9108J38190O1993j11311m9726K5133O7899k2985l4791
6366B778645R9697k0667l911J25960k0586k1994J6702R7838N9959P5522J5777
6355C202942k7777j405j1665l8424r1870j8824P6769R8917m8081J31014J74639
$$ plain form
6432 1084446 1289383 1227075 1224919 1318296 1284089 1164135 1313696 1224688 1177262 1269739 1485892
6421 1485892 1434650 1327198 1543078 1453189 1471512 1464668 1478057 1393136 1422903 1483173 1523854
6410 1523854 1466926 1589465 1696967 1633451 1658449 1672780 1697827 1757042 1911484 1993095 1851371
6399 1851371 1868361 1795675 1790144 1884538 2046039 2030273 2152825 2317906 2312215 2359000 2185749
6388 2185749 2207148 2413113 2506404 2559362 2683188 2613164 2706363 2728680 2710070 2844897 2824846
6377 2824846 2838783 2793351 2704243 2842433 2904426 2793115 2743389 2768522 2836421 2813436 2778645
6366 2778645 2878342 2857675 2853764 2979724 2959138 2937144 2953846 3051684 3111643 3187165 3202942
6355 3202942 3175165 3173760 3162095 3123671 3031801 3012977 3089746 3188663 3140582 3271596 3446235
6344C446235j28176m4942J9581j06543J18806j07149r6353L7675N3157P5618j03971
6333C163938l2109q1355J8555J09262L7603l7642J4463N3905K14757o0205l7201
6322C363971L588j7898J95056J06826J14037p4237j10966J26054N680K45190q5538
6311C871763n233L8331K1925M1619K22278R0079R582Q7310P0660L369J27069Q2881
6299D661633P0429Q4252Q9804J92992J85603O5186K1902R7815J37944Q2210M344
6288E694114K08143J35028J51732J21506K51825J87019O5430K71967N9746M3726
6278G190236J60509K83836K41311J23202L23387L69191M34609K72139L03062M82146
6268A0183628M71502M96695O46651O14417Q94878O89420Q61958R13259J188166
$$ plain form
6344 3446235 3318059 3273117 3292698 3186155 3304961 3197812 3101459 3139134 3192291 3267909 3163938
6333 3163938 3131829 3050474 3069029 3178291 3215894 3178252 3192715 3246620 3461377 3401172 3363971
6322 3363971 3367559 3349661 3544717 3651543 3765580 3691343 3580377 3706431 3712111 3957301 3871763
6311 3871763 3866530 3904861 3926786 3968405 4190683 4280762 4290344 4377654 4448314 4451683 4578752 4661633
6299 4661633 4732062 4816314 4906118 5099110 5284713 5349899 5371801 5469616 5607560 5689770 5694114
6288 5694114 5902257 6037285 6189017 6310523 6562348 6749367 6814797 7086764 7146510 7190236
6278 7190236 7350745 7634581 7875892 7999094 8322481 8691672 9126281 9398420 9701482 10183628
6268 10183628 10655130 11151825 11798476 12412893 13307771 13997191 14859149 15772408 16960574
6259A6960574J154867J265088J189113J098676J089299R49086O83040M53089L13201
6250B5156033K6476O0370q6731k51681l48942k43723p9172j50558m9628K6451
6240B4058895K46140K03861M24498P13830Q04955R41767R77526J311712J575154
6231C1258338J912547K040730K326637K628024K806327K968136L180081L102022
6223E2222842K714980K263966J697377J014266K61188p04064j201404j713547
6215E6555604k039123k035176k301652k192149k113095j892269j476453j515092
6207D0990595j134011n84642n16448k82819R1767M22615N57690P27755J191016
6198D1463518J453575J810205K111467K276329K475480K624746K571258K385928
$$ plain form
6259 16960574 18115441 19380529 20569642 21668318 22757617 23706703 24389743 24842832 25156033
6250 25156033 25182509 25242879 25156148 24904467 24555525 24311802 24232630 24082072 24032444 24058895
6240 24058895 24305035 24508896 24933394 25647224 26452179 27393946 28371472 29683184 31258338
6231 31258338 33170885 35211615 37538252 40166276 42972603 45940739 49120820 52222842
6223 52222842 54937822 57201788 58899165 59913431 60174619 59470555 58269151 56555604
6215 56555604 54516481 52481305 50179653 47987504 45874409 43982140 42505687 40990595
6207 40990595 39856584 39271942 38755494 38472675 38564442 38987057 39544747 40272502 41463518
6198 41463518 42917093 44727298 46838765 49115094 51590574 54215320 56786578 59172506
6190E9172506J882345J276849N16069l69490j044371j538330k238797k416913
6182E5239868k640285k789008k726459k616074k447655k394994k171435j729490
6174C5724468j628054j532523j269576r61587p09601m51521m73670l68481r9224
6165B8230231J6750J38395J62592L31443K56020L62517K25547K95892O0497j76632
6155B9903252l50570m41334p90940r12952j085452j017001j068839j138171j152475
6146B1945518j143213r99196q75303r26744r01110p28528p14251o77673n55942
6137A4423558o42388n56970l61832l93252m91237l31782k13741l68174k25946
6128A0838236l19348k69404k32683l54123j01846j62133j69155r2752k97956j33535
$$ plain form
6190 59172506 61054851 62331700 62847769 62478279 61433908 59895578 57656781 55239868
6182 55239868 52599583 49810575 47084116 44468042 42020387 39625393 37453958 35724468
6174 35724468 34096414 32563891 31294315 30332728 29623127 29171606 28697936 28329455 28230231
6165 28230231 28246981 28385376 28547968 28879411 29135431 29497948 29723495 30019387 30079884 29903252
6155 29903252 29552682 29111348 28320408 27407456 26322004 25305003 24236164 23097993 21945518
6146 21945518 20802305 19803109 18927806 18001062 17099952 16371424 15657173 14979500 14423558
6137 14423558 13781170 13224200 12862368 12469116 11977879 11646097 11432356 11064182 10838236
6128 10838236 10518888 10249484 10016801 9662678 9560832 9398699 9229544 9136792 8838836 8705301
6118H705301j72779r3730k65781j11815k00301l43915j52755j21396k7884r0068
6108G124877r9619j56348l8737j99765l03621o0151o4205j1746j8001j78220k28103
6097E766361q2299k4417p1470l6025q9799l5005L64j86237j83954j51658J19063
6086E024924P4452P246k16635k15825R525l3265n29r5244J0111l9558m9731m3880
6074D431591o1920j11120r31K2197j32840J55648R3393j07095k35467J59115M0814
6063D253385j14920J4414j8265q0526N1355J4848Q5185p8297j83580J33587L361
6052D080547M0971j4984o8846L6369M3466r6459K0649P07N7529l6710M4159k4304
6040D083094n8984Q8666q9524o7080L265R8547n6265N3344p9402k0884Q3503J50886
$$ plain form
6118 8705301 8532522 8438792 8173011 8061196 7860895 7516980 7364225 7242829 7214945 7124877
6108 7124877 7025258 6868910 6830173 6630408 6326787 6266636 6202431 6190685 6172684 5994464 5766361
6097 5766361 5684062 5659645 5588175 5552150 5462351 5427346 5427710 5241473 5057519 4905861 5024924
6086 5024924 5099376 5106622 4889987 4674162 4683687 4650422 4649893 4554649 4564760 4525202 4475471 4431591
6074 4431591 4369671 4258551 4257620 4279817 4146977 4302625 4396018 4288923 4053456 4212571 4253385
6063 4253385 4138465 4152879 4134614 4054088 4105443 4120291 4205476 4127179 3943599 4077186 4080547
6052 4080547 4121518 4106534 4037688 4074057 4117523 4021064 4041713 4042420 4099949 4063239 4107398 4083094
6040 4083094 4024110 4112776 4023252 3956172 3959437 4057984 4001719 4055063 3975661 3954777 4038280 4189166
6028D189166J19497L3997l435N522L9867Q8372k6119l4097N717K04440N9850L144
6016D685921j15509j49992J59607j08715J99146Q9320K0977j37969L6251P7123
6006D756160M9419L9963J45737J68399L3936J63803R6710K1425J74463Q4655l9430
5995E695240O4353J88032J09314N6401J03190J28333l57Q5632K13809J12646J40379
5984F896972K01842K04111K68517R6093J24849L42800K74735K77577Q2353K33510
5974I003359K46697K64474L06518J97417J69381J51253L02412L13724L94963J10692
5964A1460890K67357L03400J42077J50363J27589K00621J86218J09736J3724K70542
5954A3232517J87824N9525K06583O1323J64835K77613M21407L91350L46466K89394
$$ plain form
6028 4189166 4308663 4342660 4339225 4344747 4384614 4472986 4446867 4412770 4418487 4622927 4682777 4685921
6016 4685921 4570412 4420420 4580027 4471312 4670458 4759778 4780755 4642786 4679037 4756160
6006 4756160 4805579 4845542 4991279 5159678 5193614 5357417 5454127 5475552 5650015 5734670 5695240
5995 5695240 5759593 5947625 6056939 6113340 6216530 6344863 6344506 6430138 6643947 6756593 6896972
5984 6896972 7098814 7302925 7571442 7667535 7792384 8135184 8409919 8687496 8769849 9003359
5974 9003359 9250056 9514530 9821048 10018465 10187846 10339099 10641511 10955235 11350198 11460890
5964 11460890 11728247 12031647 12173724 12324087 12451676 12652297 12838515 12948251 12961975 13232517
5954 13232517 13420341 13479866 13686449 13747772 13912607 14190220 14611627 15002977 15349443 15638837
5944A5638837M36284L28814N20821O79647M30716M59447Q51408Q88538N58798
5935B0793310Q06216Q13408R16210Q93215J070794J308430J257731J172195J656975
5926C0688484J718347J593977J885611K052337K045988K186845K361158K639570
5918D7172317K614886K860474K933467K833184K838844K817706K766199K364755
5910F9201832K340207J943294J732765J158554N89644L2124n15912j011678j443840
5901G4026990j758843k120875k360647k503013k542678k845146k906483k704712
5893E4284593k705108k746363k663236k501299k060891k246909k217860j881026
5885C5261901j589196j668450j543030j477730j296447j415702j364052j070124
$$ plain form
5944 15638837 16075121 16403935 16924756 17604403 18035119 18494566 19345974 20234512 20793310
5935 20793310 21599526 22412934 23329144 24222359 25293153 26601583 27859314 29031509 30688484
5926 30688484 32406831 34000808 35886419 37938756 39984744 42171589 44532747 47172317
5918 47172317 49787203 52647677 55581144 58414328 61253172 64070878 66837077 69201832
5910 69201832 71542039 73485333 75218098 76376652 76966296 76998420 76482508 75470830 74026990
5901 74026990 72268147 70147272 67786625 65283612 62740934 59895788 56989305 54284593
5893 54284593 51579485 48833122 46169886 43668587 41607696 39360787 37142927 35261901
5885 35261901 33672705 32004255 30461225 28983495 27687048 26271346 24907294 23837170
5877B3837170j035702r94275q98829p24274q56844p73662o87260o97836p76287
5868A6392201m19405m42286o05449n22502n92730k61747m86083n05803k84029
5859A2272167m01315k96995l55554l08478k07048m35543l07853j90106k47900
5850I521375k82081j90464k34232k21106k48114l06014k64053k45097j0493k8074
5840G491647k01473l30425l60574j60647J66177r2291k54460k54750q1868j97382
5830E723954j38175o3675j30797j94800r0839m8745q1862N297o7580k04392j03781
5819D604605j6865n5131m5354q1268o0107k5811r1967k6921j08155p4737j47475
5808C870814k7896J05082m5511l0229j46818L3280j2975j61765O636j8124j28653
$$ plain form
5877 23837170 22801468 21807193 20908364 20184090 19327246 18553584 17866324 17168488 16392201
5868 16392201 15972796 15530510 14925061 14402559 13809829 13548082 13061999 12556196 12272167
5859 12272167 11870852 11573857 11218303 10909825 10702777 10267234 9959381 9769275 9521375
5850 9521375 9239294 9048830 8814598 8593492 8345378 8039364 7775311 7530214 7519721 7491647
5840 7491647 7290174 6959749 6599175 6438528 6604705 6512414 6257954 6003204 5921336 5723954
5830 5723954 5585779 5522104 5391307 5196507 5105668 5056923 4975061 4980358 4912778 4708386 4604605
5819 4604605 4587740 4532609 4487255 4405987 4345880 4320069 4228102 4201181 4093026 4018289 3870814
5808 3870814 3842918 3948000 3902489 3872260 3725442 3758722 3745747 3583982 3590618 3572494 3443841
5797C443841j24976q3914J14390n3576J9766j71352l5708p2124k921P5346j37562
5786B971210l2052M364j53000O3080r6885n8999N0183J7090p0035r4313J22408
5775B723051m7888j88887P2008N9804Q4371p143k87454O4591n4629m3362n446
5764B369016J07321R878r7044l3651M19m8527M9425l1584J33877p2429M7108k3947
5752B409862o8002l9486Q152q4630L0590J25221q107Q3004j94372k8423J02008
5741B335817n8614Q9072j7419J7095K0846k2894J63936k4819p9497K4058k5879
5730B421702M5461J24436N0111P6703m0619Q8021J02907J72988K48729J94744
5720C485183J75696L53528J99102R0420J34354J56733K51948J61748J01564j1511
$$ plain form
5797 3443841 3318865 3234951 3349341 3295765 3315531 3144179 3108471 3036347 3033426 3108772 2971210
5786 2971210 2939158 2943522 2790522 2853602 2756717 2697718 2747901 2764991 2694956 2600643 2723051
5775 2723051 2675163 2486276 2558284 2618088 2702459 2695316 2407862 2472453 2417824 2374462 2369016
5764 2369016 2476337 2486215 2389171 2355520 2355939 2307412 2356837 2325253 2459130 2386701 2433809 2409862
5752 2409862 2341860 2302374 2310526 2225896 2256486 2381707 2373600 2456604 2262232 2233809 2335817
5741 2335817 2277203 2366275 2348856 2365951 2386797 2363903 2527839 2503020 2423523 2447581 2421702
5730 2421702 2467163 2591599 2641710 2718413 2677794 2765815 2868722 3041710 3290439 3485183
5720 3485183 3660879 4014407 4213509 4303929 4438283 4595016 4846964 5008712 5110276 5098765
5710E098765j32065j20971q5622k45776j68051j5504q5187k48398k2913J03605
5700D077883J48698P9701o8744m7723J48092K6907K74989K19235J50067M75789
5690E484894L75647L59061N54317O37713N80967O06242M76660N02436L82025J35944
5680A0095906n6421j67077k08274k42636n71675n09114m22224l91324m30197l09825
5670F787139l70697k45070l88787o2184j59189l1526j24771r7429J38322L73180
5660E818988J98999K54545L66746K75683P30020N13284N34622N74676M89102M08594
5650A0165259L04342Q5648n4730m51041n32064n72999n06229n56430n86400m28467
5640F866889m45565m94868m46691m00730j80601k43014j35672p0924k65784l9142
$$ plain form
5710 5098765 4966700 4845729 4760107 4514331 4346280 4330776 4245589 3997191 3974278 4077883
5700 4077883 4226581 4306282 4237538 4189815 4337907 4364814 4639803 4859038 5009105 5484894
5690 5484894 5860541 6219602 6773919 7411632 7992599 8598841 9075501 9577937 9959962 10095906
5680 10095906 10039485 9872408 9664134 9421498 8849823 8340709 7918485 7527161 7096964 6787139
5670 6787139 6416442 6171372 5782585 5720401 5561212 5529686 5404915 5307486 5445808 5818988
5660 5818988 6017987 6272532 6639278 6914961 7644981 8158265 8692887 9267563 9756665 10165259
5650 10165259 10469601 10555249 10500519 10049478 9517414 8944415 8438186 7881756 7295356 6866889
5640 6866889 6421324 5926456 5479765 5079035 4898434 4655420 4519748 4448824 4183040 4143898
5630D143898J9657j25950j05040O1637K13681K11415J06286J29959J67807K10025
5620E033375J08208Q2856j22482r6976n1541k32750p6924k98284l74023k45144
5610C726315l2599o769j41636k01008j72549k43364j96716j61254m0346J5534
5600B545608k1769j78443n1212n4271k145j73660M9029J18213r0022j6916m6479
5589B077933q3111r1944J17491j17727p7621K2108r60q7541n965l4156m2536M3951
5577A719922L0991O205j24902N6445m8305m7365L4232k28407J8342J00758j14361
5566A403555J27804o1543K8j06759r3361M9167O9406n1410l9766J10250j69425
5555A237946J1039Q0763k4594M2341k480o3439m384m0649L1025j95707l2800M0328
$$ plain form
5630 4143898 4163555 4037605 3932565 3994202 4207883 4419298 4525584 4655543 4823350 5033375
5620 5033375 5141583 5224439 5101957 5004981 4953440 4720690 4643766 4345482 3971459 3726315
5610 3726315 3693716 3686947 3545311 3344303 3171754 2928390 2731674 2570420 2530074 2545608
5600 2545608 2523839 2345396 2294184 2239913 2237768 2064108 2113137 2231350 2141328 2124412 2077933
5589 2077933 1994822 1902878 2020369 1902642 1825021 1847129 1846169 1758628 1752663 1718507 1675971 1719922
5577 1719922 1750913 1757118 1632216 1688661 1640356 1592991 1627223 1398816 1417158 1517916 1403555
5566 1403555 1531359 1469816 1469844 1363085 1269724 1318891 1388297 1336887 1297121 1407371 1237946
5555 1237946 1248985 1329748 1305154 1347495 1345015 1281576 1277192 1236543 1267568 1071861 1039061 1079389
5543A079389O0315k681Q1673n1744j53910m463J49679j8357r375K4873L3250m311
5531A184338m9054J83555o7439j88443M1533J72038J1011j53070K2496Q4581n6754
5520A184792l838j8261l1403o891O6929p9453L3171j3450l9523N0058n9192m2317
5508A040622p066J88564j26089n7067j0478l4867L4042j33971N6912P4665J7060
5497A042327j19661l9010J91501O052j6731j7412n642n1348j3851k5866N3211
5486A003570J73421m6203l8520J5462k0874j04154j01223j5550K8016J00708O8040
5475A062693j1260L4003m2148N3771O6727Q4938N1000q9533j11376l0657L8571
5464A106729L9800j16923l2978M8743P9791m4815L2016N353j50909K3063p3176
$$ plain form
5543 1079389 1139704 1137023 1218696 1166952 1013042 1008579 1158258 1139901 1130526 1155399 1188649 1184338
5531 1184338 1135284 1318839 1251400 1062957 1104490 1276528 1287539 1134469 1156965 1241546 1184792
5520 1184792 1180954 1162693 1131290 1124399 1191328 1111875 1145046 1131596 1092073 1142131 1082939 1040622
5508 1040622 1033556 1222120 1096031 1038964 1028486 993619 1027661 893690 950602 1025267 1042327
5497 1042327 922666 883656 1075157 1081209 1064478 1047066 1041424 990076 976225 950359 1003570
5486 1003570 1176991 1130788 1092268 1107730 1086856 982702 881479 865929 893945 994653 1062693
5475 1062693 1051433 1085436 1043288 1097059 1163786 1248724 1299724 1210191 1098815 1068158 1106729
5464 1106729 1146529 1029606 996628 1045371 1125162 1080347 1112363 1117716 966807 989870 916694
5453I16694r1794K8603J87458J5128j18923Q1541P1413r2628R37O5518r7285j63813
5441H02849P6624Q7761L2901o7515L2629O0495l6538J4349K6869R3142j33328
5430I90238J02519K4229N859k9685O3122r6986j33017n5670R3051P7580o9388
5419I71852K9755q48Q994N9068P0022N6554j51550j30649j7459J6731N5497K2689
5407I90656O9942J1402J8330K7758l7616M8792M3853l8108J03666J7286j03114
5396A152847j69763O3678J7960L5524k1535j29568n5040j4414O3327K8280M629
5385I75925j0073l8125Q6277j1503o0751j09366J4680N1737p1815M3542J72832
5374A043360m6776j13811M6952P3641m6247j7196M0848J85014j32245l9304k2913
$$ plain form
5453 916694 824900 853503 1040961 1056089 937166 1018707 1090120 997492 998429 1063947 966662 802849
5441 802849 879473 967234 1000135 932620 965249 1025744 989206 1003555 1030424 1123566 990238
5430 990238 1092757 1116986 1122845 1093160 1156282 1059296 926279 870609 963660 1041240 971852
5419 971852 1001607 1000759 1009753 1068821 1138843 1195397 1043847 913198 895739 912470 967967 990656
5407 990656 1060598 1072000 1090330 1118088 1080472 1129264 1173117 1135009 1238675 1255961 1152847
5396 1152847 983084 1046762 1064722 1100246 1078711 949143 894103 879689 943016 971296 975925
5385 975925 965852 927727 1014004 1002501 941750 832384 847064 898801 826986 870528 1043360
5374 1043360 996584 882773 929725 1003366 957119 939923 980771 1165785 1033540 994236 971323
5363I71323M6863R0517p6624j19317M6505J8016p3399J26310q6463m3248J47899
5352A048382M1556J7860p3856j31061L9244q1859K8211j6324J22542Q4207k8217
5341A050685o0256j9469M5249j2275J4902N0875m6266K3896p1901l098j06156
5330H66186l5161o698K6480J41252l8759O598J5032K2195j02139j04862K1062
5319H11186O348M4880M8663l7629Q0525J15861l5705j2410O8306j14448Q1379
5308A056956n7172r0935J02294k0453J39388L0959j84680n8715k3920l3594J04207
5297I64335J19689m4840k1980n1346o0787J762J0760l5698j2709r2934J21288
5286H97540M6311j89176M3816L7120k5996k0137l2680J81928j17488o7930J50211
$$ plain form
5363 971323 1018186 1108703 1032079 912762 959267 977283 903884 1030194 943731 900483 1048382
5352 1048382 1089938 1107798 1033942 902881 942125 860266 888477 872153 994695 1078902 1050685
5341 1050685 990429 970960 1016209 1003934 1018836 1069711 1023445 1047341 975440 972342 866186
5330 866186 831025 824327 850807 992059 953300 959898 974930 997125 894986 790124 811186
5319 811186 817534 862414 911077 873448 953973 1069834 1034129 1021719 1090025 975577 1056956
5308 1056956 999784 908849 1011143 990690 1130078 1161037 976357 917642 893722 860128 964335
5297 964335 1084024 1039184 1017204 965858 905071 906833 917593 881895 869186 776252 897540
5286 897540 943851 754675 798491 835611 809615 789478 756798 938726 821238 753308 903519
5275I03519O8564P3399j1401j8175k1248P4416o583r3107J9553K7900N5350J8173
5263A090360J3933j48201o3971N3563Q1688J09914p7036q3222O0013O1554j48048
5252I50547k7546J6910O5555j2556n2844L818R4093m1117Q5692p2219N6979J19916
5240A187228j41707l3508q1235j04452K8292L2188J8417P682J683l1870J25628
5229A008346L2410l2720o7249M1682R27k3671L97J06571j33230J24625l8774n0713
5217I68601k2710N2513J00735j4977p53j05255K3868q2300L3903M0019p349O1345
5205A047640L9665J2082k4047O2861m3312p6187N8120j05020J49103P3433r7389
5194A096949m8883k3921p990J09525r431J669R768Q9410Q5830o8516r8559j8916
$$ plain form
5275 903519 972083 1045482 1034081 1015906 994658 1069074 1062491 969384 988937 1016837 1072187 1090360
5263 1090360 1104293 956092 892121 945684 1027372 1137286 1060250 977028 1037041 1098595 950547
5252 950547 923001 939911 1005466 992910 940066 943884 1037977 996860 1082552 1010333 1067312 1187228
5240 1187228 1045521 1012013 930778 826326 854618 886806 905223 912905 914588 882718 1008346
5229 1008346 1040756 1008036 940787 982469 983396 959725 960122 1066693 933463 1058088 1019314 968601
5217 968601 945891 998404 1099139 1084162 1083409 978154 1002022 919722 953625 993644 986295 1047640
5205 1047640 1087305 1099387 1075340 1138201 1094889 1018702 1076822 971802 1120905 1194338 1096949
5194 1096949 1048066 1024145 1016155 1125680 1116249 1117918 1127686 1217096 1302926 1234410 1135851 1116935
5182A116935j00624N9239k6775R1203n8611R9158O433o0711L4757n6815j52049
5171I52140o0655J35543K1724M2370L9129l0716k8118O4533j937m1879M9013J45474
5159A286621P6392o6603k00067l4675N0576K7178J8002R2249k0619r2660J45805
5148A282199k9845p9612k95k2993m6964M5361j6974K04317J38321k48940j7908
5137A206667j1597L4558J33223J57006q8400k83505j37262J30767L31764k3220
5127A450001r3285q9002J8633K4779O5478j68352J44898J1915j850L2114r4116
5116A301213Q0580q5615L8335J55252j833j88564J3776J02171Q0443n3187K0319
5105A462890J7297m5324M9328J49573N4151k8468j51004M468J43686l1707o8228
$$ plain form
5182 1116935 1016311 1075550 1048775 1139978 1081367 1180525 1186958 1126247 1161004 1104189 952140
5171 952140 891485 1027028 1048752 1091122 1130251 1099535 1071417 1135950 1134013 1092134 1141147 1286621
5159 1286621 1363013 1296410 1096343 1061668 1112244 1139422 1157424 1249673 1229054 1136394 1282199
5148 1282199 1252354 1172742 1172447 1149454 1102490 1147851 1130877 1335194 1473515 1224575 1206667
5137 1206667 1195070 1229628 1362851 1519857 1431457 1147952 1010690 1141457 1473221 1450001
5127 1450001 1356716 1267714 1286347 1311126 1376604 1208252 1353150 1365065 1363215 1395329 1301213
5116 1301213 1381793 1296178 1334513 1489765 1487932 1299368 1313144 1415315 1495758 1442571 1462890
5105 1462890 1480187 1434863 1484191 1633764 1687915 1659447 1508443 1512911 1656597 1624890 1556662
5094A556662O6513l838J95449N8594J6123k1929k39621j22955J8740Q6633J16857
5083A727228R5916L3011j5924k695j9522k30450K4787R1419j4025K52284K8501
5072A970530j06234k4059k7160R0715N9770n3948J0636m0123j16784M1611J98452
5061B003406j03885p7172M087P9799p7639n944N5072O2237K1533j00205l5011
5050A826278k324j0477N2414N5687J7263Q36l6745Q0602p804p5896K1129j79426
5038A741537j45J58176J17033L3510K1247j4701L8246j20863k6584J37189j5867
5027B068778k3924l7452R2491q6070O3164J33847J2272l3760n0397m9193p770
5016B081986K1110J371J8439J5938j6364R1487l4142l0048O5187P4707j6481J24360
$$ plain form
5094 1556662 1623175 1619337 1814786 1873380 1889503 1867574 1627953 1504998 1523738 1610371 1727228
5083 1727228 1823144 1856155 1840231 1837536 1818014 1587564 1612351 1703770 1689745 1942029 1970530
5072 1970530 1864296 1840237 1813077 1903792 1963562 1909614 1920250 1880127 1763343 1804954 2003406
5061 2003406 1899521 1822349 1826436 1906235 1828596 1822652 1877724 1939961 1961494 1861289 1826278
5050 1826278 1823954 1813477 1865891 1921578 1938841 1939677 1902932 1983534 1975730 1899834 1920963 1741537
5038 1741537 1741392 1899568 2016601 2050111 2071358 2056657 2094903 1974040 1947456 2084645 2068778
5027 2068778 2044854 2007402 2099893 2013823 2076987 2210834 2223106 2189346 2138949 2089756 2081986
5016 2081986 2103096 2104467 2122906 2138844 2122480 2213967 2179825 2149777 2214964 2289671 2273190 2397550
5004B397550J03397M4400R4964K3165J11863L13102L90662K63614K28692J05469
4994D076878q9242j13220j00249q8877M7442o2766k76480l51567j29870K4793
4984B936842J70366m5861j79763k9984j04346l5428M2249J4079O644K0919j29062
4973B666655q3615p430K01337J0447j12507o1488P1248M6883J12525n188l7620
4962B801247L7058J06615O550j38929j336Q4798M3799p2549o0889r626O6916L1754
4950B895408J5402J3689j07435j240k873p5963J70110q721P7176K45106k7281
4939C193378o0748P7279R1152R1913j64239P9099K51679Q7453J33114K26053K80823
4928D286956K30411J94143J82960K07654N9714j62830j04473j82812j45189j04131
$$ plain form
5004 2397550 2500947 2545347 2640311 2663476 2775339 3088441 3479103 3742717 3971409 4076878
4994 4076878 3987636 3874416 3774167 3685290 3732732 3669966 3393486 3041919 2912049 2936842
4984 2936842 3107208 3061347 2881584 2851600 2747254 2711826 2754075 2768154 2774798 2795717 2666655
4973 2666655 2583040 2575610 2776947 2787394 2674887 2613399 2684647 2731530 2844055 2838867 2801247
4962 2801247 2838305 2944920 2951470 2812541 2811205 2896003 2939802 2867253 2806364 2796738 2863654 2895408
4950 2895408 2910810 2924499 2817064 2815824 2812951 2736988 2907098 2898377 2975553 3220659 3193378
4939 3193378 3132630 3209909 3301061 3392974 3228735 3307834 3559513 3646966 3780080 4006133 4286956
4928 4286956 4517367 4711510 4894470 5102124 5161838 4999008 4894535 4711723 4566534 4462403
4918D462403q2028k7236j88314j08735l3024n4507L2390o8726m5056J33686o5105
4907C955748l8232j00293N9391Q0401J49948J55995j7034K4580k0688M8427J09205
4896D407448M3856L8435k5451L1538J36703K13016J35727L250q0487J55569P149
4885E066753J67892P4537l8943N7142N2981J7707J43336M11L9130K06645J48541
4874E936132R1618P2543J58431l018M0856Q8460K79562O3330J30645J12609J03532
4863G074700J17915K25697J31472J28279Q9475K96585J72127J02742N2038P6189
4853H467219K88574L37003J26194J05900L26536K73226J65712K19130L10034K35955
4843A0855483K40299K38522K99014L40448L22975K67999K71837M01624N25223
$$ plain form
4918 4462403 4380375 4353139 4164825 4056090 4023066 3968559 4000949 3932223 3887167 4020853 3955748
4907 3955748 3917516 3817223 3876614 3957015 4106963 4262958 4245924 4270504 4249816 4298243 4407448
4896 4407448 4451304 4489739 4464288 4495826 4632529 4845545 4981272 4984522 4904035 5059604 5066753
4885 5066753 5234645 5309182 5270239 5327381 5380362 5398069 5541405 5541816 5580946 5787591 5936132
4874 5936132 6027750 6100293 6258724 6255706 6296562 6385022 6664584 6727914 6858559 6971168 7074700
4863 7074700 7192615 7418312 7549784 7678063 7767538 8064123 8236250 8338992 8391030 8467219
4853 8467219 8755793 9092796 9218990 9324890 9651426 9924652 10090364 10309494 10619528 10855483
4843 10855483 11095782 11334304 11633318 11973766 12296741 12564740 12836577 13238201 13763424
4834A3763424N16381M11436N35514N46882M76445N23843P33040P16695Q79867
4825A9103527R58037Q13527R22355J012971J045348J187321J109841J272306J101225
4816B8526458J236414J393985J332979J364750J135290J360972J249439J079024
4808C8679311J095178J163610J016223J066153J056912J025741J192818J262820
4800D7558766J177576J303069J318497J410979J775242J735968J607958J777934
4792E9665989J891233J846367J960731K044323J703398J632482J634162J397015
4784G3775700J280782Q19896P16361M26508K31475l37765l41721n12967p76333
4775G5281936o52374q08703j141913j164115r60753j166484j006969j034583q90690
$$ plain form
4834 13763424 14279805 14691241 15226755 15773637 16250082 16773925 17506965 18223660 19103527
4825 19103527 20061564 20875091 21797446 22810417 23855765 25043086 26152927 27425233 28526458
4816 28526458 29762872 31156857 32489836 33854586 34989876 36350848 37600287 38679311
4808 38679311 39774489 40938099 41954322 43020475 44077387 45103128 46295946 47558766
4800 47558766 48736342 50039411 51357908 52768887 54544129 56280097 57888055 59665989
4792 59665989 61557222 63403589 65364320 67408643 69112041 70744523 72378685 73775700
4784 73775700 75056482 75876378 76592739 77019247 77250722 76912957 76571236 76058269 75281936
4775 75281936 74629562 73820859 72678946 71514831 70554078 69387594 68380625 67346042 66455352
4766F6455352q83019r15412j007055q75304j057062j100844j153663j250440j181923
4757E7030630j243456j554968j501512j256103j397708j445156j429138j438726
4749D5763863j497141j279903j028946j200045j090458q59787q16377p31266o89076
4740C6570864p49032n80921m56033k20493k90142l15273o7170J08773j48770K16001
4730C4067804K36916K35694L81539N89065N77196M93606O12694R01233P86388
4721C8882135Q05865J024063J108830J140007J081409J237672J323477J307657
4713D7911115J168025J319589J255049J358446J296209J326027J145029J206609
4705E7986098J087997J078014J152994J078918J096101J195288J169489J099461
$$ plain form
4766 66455352 65572333 64656921 63649866 62774562 61717500 60616656 59462993 58212553 57030630
4757 57030630 55787174 54232206 52730694 51474591 50076883 48631727 47202589 45763863
4749 45763863 44266722 42986819 41957873 40757828 39667370 38807583 37991206 37259940 36570864
4740 36570864 35821832 35240911 34784878 34564385 34274243 33958970 33891800 34000573 33851803 34067804
4730 34067804 34304720 34540414 34921953 35511018 36088214 36581820 37194514 38095747 38882135
4721 38882135 39688000 40712063 41820893 42960900 44042309 45279981 46603458 47911115
4713 47911115 49079140 50398729 51653778 53012224 54308433 55634460 56779489 57986098
4705 57986098 59074095 60152109 61305103 62384021 63480122 64675410 65844899 66944360
4697F6944360J192438J233672J244031J069457R70810Q84018O92776O60086O03086
4688G5494734L56458J07078j7430k87382m95241q72297q50897r69101j243122
4679G1222800j217648j440747j496875j500720j458744j576785j598837j452145
4671E9480299j405889j359351j412430j279820j266267j251838j281848j359463
4663D8863393j060668j131944j130172j105447j511124j293379j406369j296313
4655C8927977j321998j317510j212670j485250j386327j303969j294688j018541
4647B8587024j306973j266637j031186j061588r38240j069452q30686p86765q53896
4638A9441601p95372p46765n34570n34409p20581n05632n42492m52960m93239
$$ plain form
4697 66944360 68136798 69370470 70614501 71683958 72654768 73538786 74231562 74891648 75494734
4688 75494734 75851192 75958270 75940840 75653458 75158217 74285920 73435023 72465922 71222800
4679 71222800 70005152 68564405 67067530 65566810 64108066 62531281 60932444 59480299
4671 59480299 58074410 56715059 55302629 54022809 52756542 51504704 50222856 48863393
4663 48863393 47802725 46670781 45540609 44435162 42924038 41630659 40224290 38927977
4655 38927977 37605979 36288469 35075799 33590549 32204222 30900253 29605565 28587024
4647 28587024 27280051 26013414 24982228 23920640 22982400 21912948 21082262 20295497 19441601
4638 19441601 18646229 17899464 17364894 16830485 16109904 15604272 15061780 14608820 14115581
4629A4115581n12435n64805m88677j77271k75090k94742k90909k47355m08575
4620A0855722k60695l43937l48549j77545j90669k58650k28840P709j62715k77123
4610H614708j11549j56567l74619o1746K8294k04481k37630o2607j76380j66159
4600G091264p8479k38796q066m815j07887j13614j02892j79342n3609r2410o8319
4589F043035O8916j39992j2002p4911o9887q1876n830j25274j60608O2635m3547
4578E460659k9856j06813j05615r4745m3686p1902l6163n4123J7576L9386o8023
4567D906695j19042l1937j62220R556P8107j46274j7968J3957J9032j04051p4277
4556D371578p8756j07815L9435P5510j0703L6092m0745j26690R8241N0712n7505
$$ plain form
4629 14115581 13603146 13038341 12549664 12372393 12097303 11802561 11511652 11264297 10855722
4620 10855722 10595027 10251090 9902541 9724996 9534327 9275677 9046837 9054546 8891831 8614708
4610 8614708 8503159 8346592 7971973 7910227 7938521 7734040 7496410 7433803 7257423 7091264
4600 7091264 7012785 6773989 6765923 6761108 6653221 6539607 6436715 6257373 6203764 6111354 6043035
4589 6043035 6111951 5971959 5959957 5885046 5815159 5733283 5727453 5602179 5441571 5504206 5460659
4578 5460659 5430803 5323990 5218375 5123630 5079944 5008042 4971879 4917756 4935332 4974718 4906695
4567 4906695 4787653 4755716 4593496 4603052 4681159 4534885 4516917 4530874 4549906 4445855 4371578
4556 4371578 4292822 4185007 4224442 4299952 4289249 4325341 4284596 4157906 4256147 4306859 4249354
4545D249354J59014l2104k28691r9416M3362n8229J0142q650r3764R5484M9820
4534D086322r8842j4854n023o265J43669M1869m5382j54841k9953O4022l8911
4523C941811J36480j9067j11185M2754L3606Q7893P5477J6673j2659p050L0997
4512D215730j22388J16411l8431J2333K7496N9441N0678n5222n0107J12935k135
4501D326741l4419m0241n3455J51764O6497o7796p9257o9246r3998R7949Q6014
4490D290553j23144l4166J4244J02397J10195m8836m7751r4949R1086j16128J1484
4479D154985o3610j69326M7584L8577Q6016j40293J9629J02510p3514L7958q1771
4468C958745N8357o1051k2620K8394j10115L8927J0322l9916O2168r762l0417
$$ plain form
4545 4249354 4408368 4376264 4147573 4048157 4091519 4033290 4043432 4034782 3941018 4036502 4086322
4534 4086322 3987480 3972626 3967603 3961338 4105007 4146876 4101494 3946653 3916700 3980722 3941811
4523 3941811 4078291 4059224 3948039 3990793 4024399 4112292 4187769 4204442 4191783 4184733 4215730
4512 4215730 4093342 4209753 4171322 4183655 4211151 4270592 4321270 4266048 4215941 4328876 4326741
4501 4326741 4292322 4252081 4198626 4350390 4416887 4349091 4269834 4200588 4106590 4204539 4290553
4490 4290553 4167409 4133243 4147487 4249884 4360079 4311243 4263492 4168543 4259629 4143501 4154985
4479 4154985 4091375 3922049 3969633 4008210 4094226 3953933 3973562 4076072 4002558 4040516 3958745
4468 3958745 4017102 3956051 3933431 3961825 3851710 3890637 3900959 3861043 3923211 3913449 3883032
4457C883032L9814J4895J4163n0501N7499n9973m0931N301O0221J25400J1771
4446D060691n9201J11731O293j96533N9155J05077K5359Q1869J239j11561J20112
4435D204231R6826N2334p0503o1322P8037L9904K640K22619j0679Q8227j00126
4424D542188n6032R3229P0245J56174N5945J04883m0417J60002J75292q5693l3561
4413E142255L6341J34441L6008m2137M3585P8233J10350Q0279J62722O9249L330
4402E854656O4991m6700L6390J2079J00461m839R5605R0016L8528Q4337l8240
4391F287284k6080j25064N4228J28919J36579J8001k0277P4347J03832L2051N0672
4380F714492N4303K3513j79367J7906O5166N3498j11491k0572j1757J0438K10833
$$ plain form
4457 3883032 3922846 3937741 3951904 3901403 3958902 3898929 3857998 3863299 3923520 4048920 4060691
4446 4060691 4001490 4113221 4119514 3922981 3982136 4087213 4112572 4194441 4195680 4084119 4204231
4435 4204231 4301057 4353391 4282888 4221566 4299603 4339507 4342147 4564766 4554087 4642314 4542188
4424 4542188 4486156 4579385 4649630 4805804 4861749 4966632 4926215 5086217 5261509 5175816 5142255
4413 5142255 5178596 5313037 5349045 5306908 5350493 5428726 5539076 5619355 5782077 5851326 5854656
4402 5854656 5919647 5872947 5909337 5921416 6021877 6017038 6112643 6202659 6241187 6325524 6287284
4391 6287284 6261204 6136140 6190368 6319287 6455866 6473867 6453590 6527937 6631769 6663820 6714492
4380 6714492 6768795 6792308 6612941 6630847 6696013 6749511 6638020 6617448 6605691 6616129 6826962
4369F826962N2716m1994j8881Q0581J7522J19345K26150J52804Q5110j3455q7856
4358G399004J9154p2669L0438l6173k30593n267M3306k3890p5328K7529m6391
4347G029120m4218L1851J34628K8076j1641K1114N6448K17462J86698n0230q1331
4336G517977j6287m978O1018R2865J64493P1380K5920J62001N6388m3612J73359
4325H260524Q2217P0327J06923M0962m7584M3398j06223J9161K42125R3380k3715
4314H781495r1069K32620K38357J36635q3901L2177R9133J39911L4473J28245
4304I648076O7092K4909J56339K0297N7239K30376O18M4848J80982J51576N5486
4293A0637838n7664J76564j448K11361K59104R2629J16215J89556J88996L28056
$$ plain form
4369 6826962 6879678 6837684 6818803 6899384 6916906 7036251 7262401 7415205 7500315 7486860 7399004
4358 7399004 7418158 7345489 7375927 7339754 7109161 7103894 7147200 7123310 7047982 7075511 7029120
4347 7029120 6984902 7016753 7151381 7179457 7167816 7188930 7245378 7462840 7649538 7599308 7517977
4336 7517977 7501690 7496712 7557730 7650595 7815088 7886468 7912388 8074389 8130777 8087165 8260524
4325 8260524 8342741 8413068 8519991 8560953 8513369 8556767 8450544 8469705 8711830 8805210 8781495
4314 8781495 8690426 8923046 9161403 9298038 9214137 9246314 9345447 9485358 9519831 9648076
4304 9648076 9715168 9740077 9896416 9916713 9973952 10204328 10204946 10249794 10430776 10582352 10637838
4293 10637838 10580174 10756738 10755290 10966651 11225755 11318384 11434599 11624155 11813151 12141207
4283A2141207J21691J32898J92727J29667k5558J28945K72895K28762J81384K86322
4273A3790940K51570J07549J32587M12699L54144K07123L44645L50160M39491
4264A6390908M91325L13133L71336M60664N05136P93503N46236N94127O95657
4255B1162025Q62245R26524Q86982P73159R69026J057645J106993J268341J441982
4246C0454922J274108J566814J615980J690659J709244J852508K024959K031279
4238D4220473K203268K303914K359840K606624K487045K548417K671982K682396
4230F4083959K813749K584989K944293K817063K927925K795724K817782K707358
4222H6492842K831864K576036K468678K411350K457028K124067K038272J919581
$$ plain form
4283 12141207 12262898 12395796 12588523 12718190 12692632 12821577 13094472 13323234 13504618 13790940
4273 13790940 14042510 14150059 14282646 14695345 15049489 15256612 15601257 15951417 16390908
4264 16390908 16882233 17195366 17566702 18027366 18532502 19326005 19872241 20466368 21162025
4255 21162025 22024270 22950794 23837776 24610935 25579961 26637606 27744599 29012940 30454922
4246 30454922 31729030 33295844 34911824 36602483 38311727 40164235 42189194 44220473
4238 44220473 46423741 48727655 51087495 53694119 56181164 58729581 61401563 64083959
4230 64083959 66897708 69482697 72426990 75244053 78171978 80967702 83785484 86492842
4222 86492842 89324706 91900742 94369420 96780770 99237798 101361865 103400137 105319718
4214A05319718J641172J559087J435650J029593Q62601O03041L74914L09484j87334
4205A12947926k72040n24532r12295r58099j241311j395146j403116j714937j935370
4196A02591080k020110k155929k293755k433700k693154k627924k600828k768089
4188H2997591k920528k696625k755401k704219k894296k691897k524086k564776
4180F1245763k542690k347223k256280k280525k238124k211161j896182j756895
4172D3716683j885760j834565j545941j480119j343528j129246j169104j099714
4164C2228706j155932q95745q43001r60781p33559q15113p82591l41287n39690
4155B5161007m96738l93385m78316k81385l04645k18798m69329k79964o1672k47224
$$ plain form
4214 105319718 106960890 108519977 109955627 110985220 111847821 112450862 112825776 113135260 112947926
4205 112947926 112675886 112151354 111239059 110280960 109039649 107644503 106241387 104526450 102591080
4196 102591080 100570970 98415041 96121286 93687586 90994432 88366508 85765680 82997591
4188 82997591 80077063 77380438 74625037 71920818 69026522 66334625 63810539 61245763
4180 61245763 58703073 56355850 54099570 51819045 49580921 47369760 45473578 43716683
4172 43716683 41830923 39996358 38450417 36970298 35626770 34497524 33328420 32228706
4164 32228706 31072774 30177029 29334028 28373247 27639688 26824575 26041984 25700697 25161007
4155 25161007 24664269 24270884 23792568 23511183 23206538 22987740 22518411 22238447 22176775 21929551
4145B1929551k35379j97287k82374l03688l09433l00135j38880k94133j60108
4136A9708134j47317k07939k13235l7550j47400k21461j63489j9393o8877k09234
4126A8272239j13147k4387m3411j97992o2774l5663j22205p6987K0957n4066Q7480
4115A7650044J63765Q7294J3024Q294Q0221J0010P8402K36928J74303K23696Q4574
4104A8810555O2450Q0545J03711M4475O9118J41801l2347K2739J76187l1618l9260
4093A9408356M663O1730R1989j1652j28247J43909J40273j47918l2434n3103o729
4082A9470837r6349k92416q2817M0669N1125o3586n973J24816p8859k8426q6575
4071A8952446R3267Q9771k5728N7382j02846J09572K8855l9035R7472j64173L529
$$ plain form
4145 21929551 21694172 21496885 21214511 20910823 20601390 20301255 20162375 19868242 19708134
4136 19708134 19560817 19352878 19139643 19102093 18954693 18733232 18569743 18550350 18481473 18272239
4126 18272239 18159092 18134705 18091294 17893302 17830528 17794865 17672660 17595673 17616630 17562564 17650044
4115 17650044 17813809 17901103 17914127 17922421 18002642 18012652 18091054 18327982 18502285 18725981 18810555
4104 18810555 18873005 18953550 19057261 19101736 19170854 19312655 19280308 19303047 19479234 19447616 19408356
4093 19408356 19413019 19474749 19566738 19555086 19426839 19570748 19711021 19563103 19530669 19477566 19470837
4082 19470837 19374488 19082072 18999255 19039924 19091049 19027463 19021490 19146306 19067447 19039021 18952446
4071 18952446 19045713 19135484 19109756 19167138 19064292 19173864 19202719 19163684 19261156 19096983 19100512
4060A9100512J18112J2175M8080K02703Q5366m6476o8640Q7951k3216J8198m8839
4049A9485926J38953J67233j04877l7634k8100J7786J82753L7045N8385K47215
4039B0164685n6889M7646K62984J27088J19359J23236M9810K24424L4536K57758
4029B1354637J97906P3068K3848J80054K41499J60361J82474J21583J69300K07204
4019B2911934K14888K34095J16168K34829K39335P2404J794J72669L06185J80094
4009B4684395J32913J81531J98188J45651J07343J92670K52465L01056J58008
4000B6354220J99528K78407J80538L51632M01748L86645M16612M79859K49565
3991B9298754M26598M59160M86527N99028M05109M95415P76610Q87711Q52735
$$ plain form
4060 19100512 19218624 19230799 19278879 19481582 19566948 19520472 19451832 19539783 19516567 19534765 19485926
4049 19485926 19624879 19792112 19687235 19649601 19621501 19639287 19822040 19859085 19917470 20164685
4039 20164685 20107796 20155442 20418426 20545514 20664873 20788109 20837919 21062343 21096879 21354637
4029 21354637 21552543 21625611 21649459 21829513 22071012 22231373 22413847 22535430 22704730 22911934
4019 22911934 23126822 23360917 23477085 23711914 23951249 24023653 24025447 24198116 24504301 24684395
4009 24684395 24817308 24998839 25197027 25342678 25450021 25642691 25895156 26196212 26354220
4000 26354220 26553748 26832155 27012693 27364325 27766073 28152718 28569330 29049189 29298754
3991 29298754 29725352 30184512 30671039 31270067 31675176 32170591 32947201 33834912 34687647
3982C4687647Q31374P00298P17475P90543Q50325P43744Q04200R19533Q36572
3973D1881711P91118Q24306Q76192J013526R91781Q45554R73262J036611J037597
3964E0271658J014891J024187J169615J123406J202609J206931J404409J420857
3956E9838563J320568J544410J697054J807632J915112K045964J966235K234596
3948G4370134K312592K384127K686080K623804K771030K739909K792263K890313
3940I5570252K859005K863945K781905K908793L021084K997397L196483L434385
3932A19633249L414986L550890L687347L890607L667589L674323L544922L517962
3924A48581875L287394L284820L159967L093017L168124L219949K961943L019910
$$ plain form
3982 34687647 35519021 36219319 36936794 37727337 38577662 39321406 40125606 41045139 41881711
3973 41881711 42672829 43497135 44373327 45386853 46378634 47224188 48197450 49234061 50271658
3964 50271658 51286549 52310736 53480351 54603757 55806366 57013297 58417706 59838563
3956 59838563 61159131 62703541 64400595 66208227 68123339 70169303 72135538 74370134
3948 74370134 76682726 79066853 81752933 84376737 87147767 89887676 92679939 95570252
3940 95570252 98429257 101293202 104075107 106983900 110004984 113002381 116198864 119633249
3932 119633249 123048235 126599125 130286472 134177079 137844668 141518991 145063913 148581875
3924 148581875 151869269 155154089 158314056 161407073 164575197 167795146 170757089 173776999
3916A73776999K915024K607439K368853J914235J500327J080852N36038J86795
3908A86886562k51036m83515n49024q02240j014066j199334j064444j039584j181879
3899A79301440j063886r50923j089893r68166q37589m79501l23155j08206K94336
3890A73774457N73269J100505J563835J958610K499628L010494L550738M060728
3882A92092264M509092N105179N743271O149185O838401P101695P492238P801563
3874B42832888Q030732Q104840P903465P481164P081179O429670N648722M903659
3866B98416319L948725L161275K316027J464661P08696k086j123272j690239k407873
3857C04792233l433617m116489n226179n783958o555172p199770p572665q029992
$$ plain form
3916 173776999 176692023 179299462 181668315 183582550 185082877 186163729 186699767 186886562
3908 186886562 186635526 186152011 185602987 184800747 183786681 182587347 181522903 180483319 179301440
3899 179301440 178237554 177286631 176196738 175228572 174390983 173911482 173588327 173480121 173774457
3890 173774457 174347726 175448231 177012066 178970676 181470304 184480798 188031536 192092264
3882 192092264 196601356 201706535 207449806 213598991 220437392 227539087 235031325 242832888
3874 242832888 250863620 258968460 266871925 274353089 281434268 287863938 293512660 298416319
3866 298416319 302365044 305526319 307842346 309307007 310015703 310013617 308890345 307200106 304792233
3857 304792233 301358616 297242127 292015948 286231990 279676818 272477048 264904383 256874391
3849B56874391q258275q191545p841230p527473p097622o240377n612065m696083
3841B01409721l905968l136382k392227j602106q98501m43764J57232P12320J254775
3832A91155100J469383J724452K229599K480365K834623K940777K994768L034101
3824B10863168L010371K814571K572217K139935J722140J435039O81953K71910
3816B25511304l8379l66469n81281r40924j265615j697555j818735k014294k399295
3807B14388757k631495l080915l305074l670656l849842m326003m531867m730187
3799A84262718n184858n279769n341013n440114n612477n466660n573314n334411
3791A41030102n325115n306078n167642n050553m936264m912206m902504m936728
$$ plain form
3849 256874391 248616116 240424571 232583341 225055868 217958246 211717869 206105804 201409721
3841 201409721 197503753 194367371 191975144 190373038 189474537 189030773 189188005 189900325 191155100
3832 191155100 192624483 194348935 196578534 199058899 201893522 204834299 207829067 210863168
3824 210863168 213873539 216688110 219260327 221400262 223122402 224557441 225239394 225511304
3816 225511304 225472925 225106456 224525175 223584251 222318636 220621081 218802346 216788052 214388757
3807 214388757 211757262 208676347 205371273 201700617 197850775 193524772 188992905 184262718
3799 184262718 179077860 173798091 168457078 163016964 157404487 151937827 146364513 141030102
3791 141030102 135704987 130398909 125231267 120180714 115244450 110332244 105429740 100493012
3783A00493012m791695m664083m397609m312231l991063l814015l652652l484661
3775F7385003l158964k882584k558902k452063k094466j940218j737379j541496
3767D9018931j511497j230965r83935q44256p65559p00837m68750m60185m79264
3758D1573683n46408n89124m50133k74644k10258l55763l85138j02456k15487
3749C8444272k71896j36630k22967l50412l48977m67829o12789n85646p17062
3740C4730064q81677o37595p62516p46902r78400q89163o60939q38379r60241
3731B7374252p64901q02486p86551p80000j041219q20782q13185r35673p96972
3722A9832483n93613o40371p73949m42857m32375p14659n63039n71537m90918
$$ plain form
3783 100493012 95701317 91037234 86639625 82327394 78336331 74522316 70869664 67385003
3775 67385003 64226039 61343455 58784553 56332490 54238024 52297806 50560427 49018931
3767 49018931 47507434 46276469 45292534 44448278 43682719 42981882 42513132 42052947 41573683
3758 41573683 41027275 40438151 39988018 39713374 39503116 39147353 38762215 38659759 38444272
3749 38444272 38172376 38035746 37812779 37462367 37113390 36645561 36032772 35447126 34730064
3740 34730064 33848387 33210792 32448276 31701374 30722974 29833811 29172872 28334493 27374252
3731 27374252 26609351 25806865 25020314 24240314 23199095 22378313 21565128 20629455 19832483
3722 19832483 19238870 18598499 17824550 17381693 16949318 16234659 15671620 15100083 14609165
3713A4609165n73707l42263l45099l02584l34330k42133l12260l23853k20799
3704A1612137k42227l56492k54799j79069j37388k94925k31223k11902j80176
3695I523936n1984j70919j47848n2924j23350k10750k19113J1263j04873j50256
3685H303182r2806j58477k47387k01399j104q791n2472N8181K2349j79545L063
3674G444794N3549o4050K7981j80707j62853j4083R2956J00804n8912L1744k8127
3663G243096P8147p1300p0999j12596k1238m2201j49494J00544k674j3798o9162
3652F868325j66489n7330O2212l9010L4618j16255j39560Q9024N3312Q0119q394
3641F660572k0327J19323M3592r7367Q3812o8822Q7231J41200O9846J51459j17706
$$ plain form
3713 14609165 14035458 13693195 13348096 13045512 12711182 12469049 12156789 11832936 11612137
3704 11612137 11369910 11013418 10758619 10579550 10442162 10147237 9916014 9704112 9523936
3695 9523936 9471952 9301033 9153185 9100261 8976911 8766161 8547048 8558311 8453438 8303182
3685 8303182 8210376 8051899 7804512 7603113 7602009 7593218 7540746 7598927 7621276 7441731 7444794
3674 7444794 7498343 7434293 7462274 7281567 7118714 7104631 7197587 7298391 7239479 7271223 7243096
3663 7243096 7321243 7249943 7178944 7066348 7045110 7002909 6853415 6953959 6951285 6937487 6868325
3652 6868325 6701836 6644506 6706718 6667708 6702326 6586071 6446511 6535535 6588847 6668966 6660572
3641 6660572 6640245 6759568 6803160 6705793 6789605 6720783 6808014 6949214 7019060 7170519 7052813
3630G052813n6118K28065j3600J11773J70282N8529q1714M1701K29107R9002Q0887
3619G920727J47680K00699j8768R0106J14353Q9519J86234J84174j35593l63J98196
3608H976964L24086L41736O8269J46819J77922M3925K93321J87931L33414L58600
3598A1252987O7362J62327M74839L20806K47310M47210M74814M40966M55183N56209
3588A4900013N61376N05402M37186M68012N66994P02181O70807O32975P82255
3579B0227201R04352Q65479J119854R85005J408127J460131J760387J820735K197305
3570C2748576K557458K943653L463766L864514M417435M866126N218629N202911
3562F5283068M569973L700925K818701J524199L78804o89512j460008j863005
$$ plain form
3630 7052813 6996695 7224760 7211160 7322933 7493215 7551744 7470030 7511731 7740838 7839840 7920727
3619 7920727 8068407 8269106 8250338 8340444 8454797 8544316 8730550 8914724 8779131 8778768 8976964
3608 8976964 9301050 9642786 9711055 9857874 10035796 10079721 10373042 10560973 10894387 11252987
3598 11252987 11320349 11482676 11957515 12278321 12525631 12972841 13447655 13888621 14343804 14900013
3588 14900013 15461389 15966791 16403977 16871989 17438983 18141164 18811971 19444946 20227201
3579 20227201 21131553 21997032 23116886 24101891 25510018 26970149 28730536 30551271 32748576
3570 32748576 35306034 38249687 41713453 45577967 49995402 54861528 60080157 65283068
3562 65283068 69853041 73553966 76372667 77896866 78275670 77586158 76126150 74263145
3554G4263145k036976k429152k481536k223033j781114j360217j111696o58077
3546F0181344j65914J64323M06182O95216J228360J687618K014800K752308L699024
3537G2663261M390790N372545O771003Q263866R683933J0766872J0645735R147995
3529A37706000O089534K456120j376259m031222n978504p350343q059774q089696
3521A11365856p914595p523059o738596n865370m831797l980953l124243k650152
3513F8737091k263095j820121j488623j169568p87404l52569J63346O10383R84166
3504F2613606J468364J831591K266244K622029K802015K703126J659057P05128
3496G8671160l34790j662895k668841l238817l959779m420902m569236m368642
$$ plain form
3554 74263145 72226169 69797017 67315481 65092448 63311334 61951117 60839421 60181344
3546 60181344 60015430 60179753 60585935 61281151 62509511 64197129 66211929 68964237 72663261
3537 72663261 77054051 82426596 89197599 97461465 107145398 117912270 128558005 137706000
3529 137706000 143795534 146251654 144875395 140844173 134865669 127515326 119455552 111365856
3521 111365856 103451261 95928202 89189606 83324236 78492439 74511486 71387243 68737091
3513 68737091 66473996 64653875 63165252 61995684 61208280 60855711 61019057 61629440 62613606
3504 62613606 64081970 65913561 68179805 70801834 73603849 76306975 77966032 78671160
3496 78671160 78336370 76673475 74004634 70765817 66806038 62385136 57815900 53447258
3488E3447258m213864l727315l435064l154178k570855k289612k131290j820009
3480C0105071j612550j504782j310241j099018j024689q93143q96164p78966o01456
3471B0384062m63744n44779n84747k74080k81757l06115k38969n6017q976j03467
3461A7521411J7676J87265L15774L79157O48324R86188P80056P46957Q66688M38081
3451B2887577k5856j49016l45588n15317o99593o31262q81662p91801p06946o21648
3441A7518888p16816p81235m93168m51613l57915l81997l03164k9889k7274n534
3431A3970283K52988K25909M46332O59258Q56396J383226J785734J994668J988718
3422B3563512J669796Q44416O9882p07969j131905j411717j668590j756317j642036
$$ plain form
3488 53447258 49233394 45506079 42071015 38916837 36345982 34056370 31925080 30105071
3480 30105071 28492521 26987739 25677498 24578480 23553791 22660648 21764484 20985518 20384062
3471 20384062 19920318 19375539 18790792 18516712 18234955 17928840 17689871 17633854 17624878 17521411
3461 17521411 17539087 17726352 18042126 18421283 19069607 20055795 20835851 21582808 22449496 22887577
3451 22887577 22861721 22712705 22367117 21851800 21152207 20520945 19639283 18847482 18140536 17518888
3441 17518888 16802072 16020837 15527669 15076056 14718141 14336144 14032980 14003091 13975817 13970283
3431 13970283 14223271 14449180 14895512 15554770 16411166 17794392 19580126 21574794 23563512
3422 23563512 25233308 26077724 26147606 25439637 24307732 22896015 21227425 19471108 17829072
3413A7829072j622578j533271j274064j017056p24087p85827o68404o07386k69458
3404I326941k15556l62052j73166k53914q330J18013r1617M01949M05102L62654
3394I510024N42047O76211Q21023O02793L95702N5002k26545m08757n09876p79837
3384A0677787q11029r58698q42868o94061q43525o58792o12603l70714m92125
3375D393372l67485k36367k11553j45455k56130k87685k02688j16154j80318r6625
3365B292912j22514l152j5369j18061q1795L6662M5714j34359j13497j07133j40609
3354A538799p2258J3190N6188j30194j62214l1279L9586j03815J0454o9999j90934
3343H97524N969L1337k7095Q9441o8957j4214O0831J20417q5486j26941k0718
$$ plain form
3413 17829072 16206494 14673223 13399159 12382103 11658016 10872189 10203785 9596399 9326941
3404 9326941 9111385 8749333 8576167 8322253 8313923 8431936 8340319 8742268 9147370 9510024
3394 9510024 10052071 10728282 11549305 12152098 12547800 12602802 12376257 11967500 11457624 10677787
3384 10677787 9866758 8908060 8065192 7371131 6527606 5868814 5256211 4885497 4393372
3375 4393372 4025887 3789520 3577967 3432512 3176382 2888697 2686009 2569855 2389537 2292912
3365 2292912 2170398 2167246 2151877 2033816 1952021 1988683 2034397 1900038 1786541 1679408 1538799
3354 1538799 1466541 1479731 1535919 1405725 1243511 1212232 1251818 1148003 1158457 1088458 897524
3343 897524 903493 934830 907735 997176 928219 914005 974836 1095253 1009767 882826 862108
3332H62108j61853J5786j0056j1626L3613M4843p2477q9352Q9070k0210O8384
3321G48230J03448j98522j92398m7749R2636L1027q3612J6732M2276j48446J6161
3310C79783L466m3513j52808M4829J31130P268p4918q7128P3906J24938p9438
3299C27515L7754l8222O911l5680o2378Q90L6726L6322j22958l6802l1453l1564
3287H7061O8636r8078K9773l784k9724J33853Q4290o2881R067P5937p5103N8700
3275B77747M5852K7294j4802n882o4679K0931Q0460l1753m6158L0067Q0469j1719
3263C87827j64177J12031l3179j9933q0537j31031O0550K2142K7358k9740K8807
3252A80118j3829j384J15132L1572j7362J0208J16474j57785j8483J01310J86917
$$ plain form
3332 862108 700255 716041 705985 694359 727972 772815 700338 610986 700056 679846 748230
3321 748230 851678 653156 460758 413009 505645 536672 453060 469792 512068 363622 379783
3310 379783 383249 339736 186928 231757 362887 370155 295237 208109 282015 406953 327515
3299 327515 365269 327047 333958 298278 235900 236790 273516 309838 186880 150078 118625 87061
3287 87061 155697 57619 87392 83608 53884 187737 272027 209146 218213 294150 219047 277747
3275 277747 323599 350893 336091 330209 265530 286461 366921 335168 289010 319077 399546 387827
3263 387827 223650 335681 302502 282569 202032 71001 131551 153693 181051 151311 180118
3252 180118 166289 164905 280037 311609 294247 304455 420929 263144 244661 345971 532888
3241E32888Q6717M7000J5025j19145K0552p2106m1081J02775j37861n288K8955
3230D58431p4947p5265o456k0063o4175k8390L267k8060K2644J7806j0122k6592
3218A68078n0479m2911l1435K82422j48384j03937M0417M2875j3486r3600J53924
3207B03484J46308j68816l6747k1053j2062m5773l0599j6286J0636j1032L8381
3196E6441j17383o5832L6531P5808j02125K0311J78346j16291n8722n2166M3131
3185a01951O9275p9249R1007Q641m4222J08939K8836P3054j10293n8772K6153
3174A1418q8540j9750L3306j57614l9963K05479J9394O7865N9959q6325q7372
3163h2143j49536O9205K03429K4430l2713j9038O6996k7057p2696J32990k8360
$$ plain form
3241 532888 619605 666605 681630 562485 583037 510931 469850 572625 434764 429476 458431
3230 458431 383484 308219 301763 281700 217525 189135 192402 164342 186986 204792 194670 168078
3218 168078 117599 74688 43253 325675 177291 73354 113771 156646 143160 49560 203484
3207 203484 349792 180976 144229 123176 111114 65341 34742 18456 29092 18060 56441
3196 56441 -60942 -126774 -90243 -14435 -116560 -96249 82097 -34194 -92916 -145082 -101951
3185 -101951 -32676 -111925 -20918 -12277 -56499 52440 81276 154330 44037 -14735 11418
3174 11418 -77122 -96872 -63566 -221180 -261143 -55664 -36270 31595 91554 5229 -82143
3163 -82143 -231679 -162474 40955 65385 32672 13634 80630 53573 -19123 113867 85507
3152H5507m3284N1381J7711k48384J26191J59800M3225m8744M6729P9014M6977
3141C16123K4724q3516J8209J71961p7885O6426J35224p7180Q2866J05465j02789
3130E79628p2372p5699K0891J17391J01108J9141K346Q0492m9641Q5536J58653
3119I67474k3624j68617K7005n1214J16583J10597O4445R104Q3378j2116R3519
3108A216534K1076r2703O5032n4796n5456Q2564j01080j09917J05080j07547j29839
3097H38948J28855p807j39683K775p6887K7231j2660L5931Q3012J3957K4720M1294
3085I59686j1428n8880O5890J06143j426r4103l0446j90376L8850m4306j10472
3074F29132j68256N9034J51292k26885j09169J51105k1891j31967R5229M0645
$$ plain form
3152 85507 42223 93604 111315 -137069 -10878 148922 192147 143403 190132 269146 316123
3141 316123 340847 257331 275540 447501 369616 436042 571266 494086 576952 682417 579628
3130 579628 507256 431557 452448 569839 670947 690088 692434 772926 723285 808821 967474
3119 967474 943850 775233 802238 751024 867607 978204 1042649 1051753 1135131 1123015 1216534
3108 1216534 1237610 1144907 1209939 1155143 1099687 1182251 1081171 971254 1076334 968787 838948
3097 838948 967803 959996 820313 823088 746201 773432 760772 796703 879715 893672 918392 959686
3085 959686 948258 889378 955268 1061411 1059985 965882 935436 745060 783910 739604 629132
3074 629132 460876 519910 671202 444317 335148 486253 464362 332395 427624 468269
3064D68269j5810k20225k1204K9422k3721M4274r8792J8314N6558M0536l5657
3053B41964j79144j15304Q3022R3963j71355n74P4375J9767J16318j83598k04782
3042b25348m2616q5721O3865O9040L1768n9452O2944M6445Q4065j14119p2941
3031b42070m6839J5070o532n3874j04729j32622K13812m1406R6931l2162m6422
3020c80843k873k7013n796k891j05583J69578r4984O4741N6198o6795Q956j52105
3008e39410J6107P0078P3154m1519P1705J08615L3078j89357N154M4818m8002
2997c95579l9697O0697q4396L3904o1034l0558q1130J32110J63906j09505l9523
2986d50805n4648k3738j63233O7063l824M3952r2563r842J56712M6711J1982o7846
$$ plain form
3064 468269 452459 232234 211030 240452 216731 261005 162213 180527 237085 277621 241964
3053 241964 62820 -52484 30538 124501 -46854 -47428 26947 46714 163032 -20566 -225348
3042 -225348 -267964 -353685 -289820 -220780 -189012 -248464 -185520 -139075 -55010 -169129 -242070
3031 -242070 -288909 -273839 -280371 -334245 -438974 -571596 -357784 -399190 -302259 -334421 -380843
3020 -380843 -383716 -410729 -416525 -419416 -524999 -355421 -450405 -385664 -329466 -396261 -387305 -539410
3008 -539410 -523303 -453225 -380071 -421590 -349885 -241270 -208192 -397549 -392395 -347577 -395579
2997 -395579 -435276 -374579 -458975 -425071 -486105 -516663 -597793 -465683 -301777 -411282 -450805
2986 -450805 -505453 -529191 -692424 -625361 -629185 -585233 -677796 -687638 -530926 -484215 -472233 -540079
2974e40079j05203n2231K16770K6873j70372K7604J92081Q4173k43466J8452j0735
2963e56133k8575r461m2128M2565l4881J11311l0206j00898K1544o7626j08461
2952h02949O7957N7135O3700j2425j41722m3404K86516n477p661j5253L0120n9249
2940e82712K8581O1191p5087l5164L9193p5069j67766N3917J5108J37536p2466
2929f72738j21466J64692O9860k0532q6623M5827q5468q458R2842m3976j8941
2918f84981n4445J55840R7889j39705n5268J60055j77740J09322J62603l4168
2908d60598j7203p3042n9192R4687j57234J7677K27552r2636p6168k9318P0992
2897e54483j04355N3919K6123k8384o8294K4884j2877j1787o328K8853m0368j5449
$$ plain form
2974 -540079 -645282 -697513 -480743 -453870 -624242 -596638 -404557 -320384 -563850 -545398 -556133
2963 -556133 -584708 -594169 -636297 -593732 -628613 -517302 -547508 -648406 -626862 -694488 -802949
2952 -802949 -734992 -677857 -614157 -626582 -768304 -811708 -525192 -530669 -538330 -553583 -523463 -582712
2940 -582712 -554131 -492940 -568027 -603191 -563998 -639067 -806833 -752916 -737808 -600272 -672738
2929 -672738 -794204 -629512 -559652 -580184 -666807 -620980 -706448 -714906 -622064 -666040 -684981
2918 -684981 -739426 -583586 -485697 -625402 -680670 -520615 -698355 -589033 -426430 -460598
2908 -460598 -477801 -550843 -610035 -515348 -672582 -654905 -427353 -519989 -596157 -625475 -554483
2897 -554483 -658838 -604919 -578796 -607180 -675474 -650590 -663467 -675254 -681582 -652729 -693097 -708546
2885g08546L1226J17929j0830k09666P3234J444q5422M0378R1923P183O9830q751
2873e90068m9237M6393J44190m4036q8159j628M0240l0700P1212M369p5388J31413
2861d41399j0385j63598m0474j7614P6084O7991J16072o2924o3574j7500n7449
2850f14770Q7628J865L4521o6147k9539l5181j32649J15408J01094j30665O9337
2839e99098J2347j57248l953N0980J9377L9762J09146L7311k0550k2583j08445
2828f42954O5745J4592K201O5044k4516j51201K2341K2305q8946J59710m4496
2817f00175j00295P2306J35537L8884p7026o5960l71l5869L4367O525L3324j16229
2805f74982J6955J28788j9689P6534N141l3780k3142l8430J8521o6654L4296K148
$$ plain form
2885 -708546 -677320 -559391 -570221 -779887 -706653 -705209 -790631 -750253 -658330 -651147 -581317 -590068
2873 -590068 -639305 -592912 -448722 -492758 -580917 -582545 -542305 -573005 -501793 -497424 -572812 -441399
2861 -441399 -451784 -615382 -655856 -673470 -597386 -529395 -413323 -476247 -539821 -557321 -614770
2850 -614770 -527142 -525277 -490756 -556903 -586442 -621623 -754272 -638864 -537770 -668435 -599098
2839 -599098 -586751 -743999 -747952 -696972 -677595 -637833 -528687 -491376 -511926 -534509 -642954
2828 -642954 -577209 -562617 -560416 -495372 -519888 -671089 -648748 -626443 -715389 -555679 -600175
2817 -600175 -700470 -628164 -492627 -453743 -530769 -596729 -597100 -632969 -598602 -592077 -558753 -674982
2805 -674982 -658027 -529239 -548928 -472394 -467253 -501033 -524175 -562605 -544084 -610738 -576442 -574294
2793e74294L1854q3304K0149L6961q1039J7938q6125J32945J42985l8244k4144
2782e04318j00022j07468O5746o442N3091J8403L1722K02364P8154r8061j07507
2771d74338j37430j10946O7641K4975r7626p1997P0808O1998J6307O040P1238
2760e73330n4263j9579K7149K00416o4033o0404J44735j15446k4754o8064M268
2749f03305K3121j8140K6841N6451k8042j22188m5492J58214o1669o896j6286
2738f37391l1276J540J49748K8919l4593O4653r2846O6446J8352l2543K1527j614
2726d79078L3533j62283J19142L2857m7253l1133j04794J000L7272J02732Q3575
2715d14430J6525m1252j6502P6658r5653J142n7074k4380Q7001q0405O7756L575
$$ plain form
2793 -574294 -542440 -625744 -605595 -568634 -649673 -631735 -717860 -584915 -441930 -480174 -504318
2782 -504318 -604340 -711808 -646062 -652504 -599413 -581010 -549288 -346924 -268770 -366831 -474338
2771 -474338 -611768 -722714 -655073 -630098 -727724 -799721 -728913 -666915 -650608 -644568 -573330
2760 -573330 -627593 -647172 -620023 -419607 -483640 -544044 -399309 -514755 -539509 -607573 -603305
2749 -603305 -580184 -598324 -571483 -515032 -543074 -665262 -710754 -552540 -614209 -621105 -637391
2738 -637391 -668667 -667127 -517379 -488460 -523053 -458400 -551246 -484800 -466448 -498991 -477464 -479078
2726 -479078 -445545 -607828 -488686 -455829 -503082 -534215 -639009 -638009 -600737 -498005 -414430
2715 -414430 -397905 -439157 -455659 -379001 -474654 -473512 -530586 -554966 -467965 -548370 -480614 -477039
2703d77039r8067P506r633p0610j8519k7975o928P3409M6904J03785k0169j7273
2691e14609K2722q630j671j8631J3616J20064j27196o1864N3667m2090K904q619
2679e70337N225o7417O5709q0314m1359J4837p6390J06879N9088M7089J25471
2668d11519j9070k21827J6512O3843j03062j1923P1940M9641M52M5312n9176k356
2656e81233K9510J46281O0005q4472L8694k5714l9684R2806l6448n2535j56369
2645f09159K1576J7217N107L2337M5869j28540L8074O0112o6950p4910O2342P4647
2633e22278l8933m0170k9420M9215J4146l7249k6341J1402L9714P8198N0919J739
2621d49058K4570j5917J7182k362O35j19875k5606N2928l9413K0001p5168Q0956
$$ plain form
2703 -477039 -575106 -567600 -577233 -647843 -666362 -694337 -701265 -627856 -580952 -477167 -497336 -514609
2691 -514609 -491887 -500517 -502188 -520819 -507203 -387139 -514335 -576199 -522532 -564622 -561718 -570337
2679 -570337 -565112 -632529 -566820 -647134 -688493 -673656 -750046 -643167 -584079 -536990 -411519
2668 -411519 -430589 -652416 -635904 -572061 -675123 -687046 -615106 -565465 -565013 -519701 -578877 -581233
2656 -581233 -551723 -405442 -345437 -429909 -391215 -416929 -456613 -363807 -400255 -452790 -609159
2645 -609159 -587583 -570366 -565259 -532922 -487053 -615593 -577519 -517407 -584357 -659267 -596925 -522278
2633 -522278 -561211 -601381 -630801 -581586 -567440 -604689 -631030 -619628 -579914 -501716 -450797 -449058
2621 -449058 -424488 -440405 -423223 -425585 -424950 -544825 -570431 -517503 -556916 -536915 -612083 -531127
2609e31127Q5519j712m3689r4434J0401l9274Q88j13137J9238J8972n4693N2491
2597f90557R5494Q7138P9681L3582n2221o50N7566p0508n4613j05684J12232M1035
2585d67505n9849j9516M9233L8643J1535J00582r0985o13Q9241R5464m9142p083
2573c09995M8873K1677N0341k9560m2703K5076j16897K1690j94768L6312r382
2562d99336o0542J9258M1481j51426k6666J62517R160J6191q1235k0379L6537
2551e54440J14617k4605m9751J47445L6434j34933n7830J7738o6800O7387Q7990
2540d16748k40970R5733J12740J35078O8168k05178r944j27234O159j8971J30233
2529d70934N7697L2242p1315R919L192j2937q0459K4656J73356M6553j7975j27873
$$ plain form
2609 -531127 -445608 -447320 -491009 -585443 -575042 -614316 -613428 -726565 -707327 -688355 -743048 -690557
2597 -690557 -595063 -507925 -428244 -394662 -446883 -447533 -389967 -460475 -515088 -620772 -508540 -467505
2585 -467505 -527354 -546870 -497637 -458994 -447459 -346877 -437862 -438475 -349234 -253770 -302912 -309995
2573 -309995 -261122 -239445 -189104 -218664 -261367 -236291 -353188 -331498 -526266 -489954 -499336
2562 -499336 -559878 -540620 -499139 -650565 -677231 -514714 -505554 -489363 -570598 -590977 -554440
2551 -554440 -439823 -464428 -514179 -366734 -330300 -465233 -523063 -505325 -572125 -504738 -416748
2540 -416748 -657718 -561985 -449245 -314167 -245999 -451177 -461121 -588355 -582196 -601167 -470934
2529 -470934 -413237 -380995 -452310 -442391 -439199 -452136 -532595 -507939 -334583 -288030 -306005 -433878
2517d33878l2613J06290K6441j13618q6776l9868J06426J21564q808K2216o704
2506c39328j64633n5789J52106k4322n3331M2149K2789m135r1825p7301R8888
2495d94732M9025l2252R3259k4218J0154M4030m3985l0287k9353J11097J12539
2484b34723n9550r6493j4871n1676M4063P9624j1404J20532J4817N0280n064p7137
2472b41602m29p2277m7773J30080J12239j03879o6295l7485J12970j1014r4541
2461c20006J98061r8592n8545J64843j1839o4222j14722j17751J08452l3556N2433
2450b95444j4899j55073L8069M3229r6583N8668R2201M3311K3074O312p2051N856
2438c23330N9674O7224n6089R2571M0113l7653o737R8055j03095M8142R178K8834
$$ plain form
2517 -433878 -466491 -360201 -333760 -447378 -534154 -574022 -467596 -346032 -354840 -332624 -339328
2506 -339328 -503961 -559750 -407644 -431966 -485297 -443148 -420359 -424494 -516319 -593620 -494732
2495 -494732 -445707 -477959 -384700 -408918 -398764 -354734 -398719 -429006 -458359 -347262 -234723
2484 -234723 -294273 -390766 -405637 -457313 -413250 -333626 -345030 -224498 -209681 -159401 -164465 -241602
2472 -241602 -242031 -314308 -362081 -232001 -119762 -223641 -289936 -327421 -214451 -225465 -320006
2461 -320006 -121945 -220537 -279082 -114239 -126078 -190300 -305022 -422773 -314321 -347877 -295444
2450 -295444 -310343 -465416 -427347 -384118 -480701 -422033 -329832 -286521 -263447 -257135 -329186 -323330
2438 -323330 -263656 -196432 -252521 -159950 -119837 -157490 -164227 -66172 -169267 -121125 -111947 -83113
2426h3113L0491j34487n3088J37836R6182j77464L006J85492m5266n5117N6265
2415c9263n8484O9397O0753n5069l0957M095j23797P4739O8978N861p9800j9531
2403a23078m4612J2795J24592J22574n6177q130n3659o0929K0900j3445J10372
2392C1203N0193m8755J02618J4886O1539J048j07242J09608K3783q6404J15114
2381B67591P5601j71859J600J29524R6285N9827p4604n5621K4540p173k3052j7231
2369C05428j9208m6486J27122K3895O3754J31689j0399L4500N930j7730P3202
2358F71697j0047Q5791R4555n9249J16718J8108r974L3405M4159J50994J87123
2347A323280P7756J2207o7247M4415P3378R9216K51484J36759p1568P8271J09259
$$ plain form
2426 -83113 -52622 -187109 -240197 -102361 -6179 -183643 -180637 4855 -40411 -95528 -39263
2415 -39263 -97747 -28350 32403 -22666 -53623 -49528 -173325 -98586 -29608 -23747 -103547 -123078
2403 -123078 -167690 -154895 -30303 92271 36094 27964 -25695 -86624 -65724 -79169 31203
2392 31203 81396 32641 135259 150145 211684 212732 105490 215098 238881 152477 267591
2381 267591 343192 171333 172933 302457 398742 458569 383965 328344 352884 345711 322659 305428
2369 305428 286220 239734 366856 390751 454505 586194 575795 610295 616225 598495 671697
2358 671697 661650 747441 841996 782747 899465 917573 907599 941004 985163 1136157 1323280
2347 1323280 1401036 1413243 1345996 1390411 1463789 1563005 1814489 1951248 1879680 1957951 2067210
2336B067210R294L1504J35987J82205P1848K98203M18063L11533O23608P28911
2326D878366P76088P40105N48466M62974M81707O72857O81238R86212J254511
2317A1482524J617363K171476L187144N253966R297427J3453762J5279370J4203270
2309G5946302P269683j488933n410559p626702q742941q266420p896307p466400
2301C6317723p184783o099860m897883l783124k542624j314826j055873r39704
2293H499046r77541q28898q01215o49999l88128n62653m07160l77209m58201l21208
2283B726834j83472k16343j80443q3518k17358k11461j38177j20530p6196m5484
2273A253852n262j26110j36943o6575j28060r5419P648j7645n3394p9592R6681
$$ plain form
2336 2067210 2076504 2108008 2243995 2426200 2498048 2796251 3214314 3525847 4149455 4878366
2326 4878366 5654454 6394559 6943025 7405999 7887706 8560563 9241801 10228013 11482524
2317 11482524 13099887 15271363 18458507 23712473 33009900 46463662 61743032 75946302
2309 75946302 83215985 81727052 76316493 68689791 59946850 51680430 43784123 36317723
2301 36317723 29132940 23033080 18135197 14352073 11809449 10494623 9438750 8499046
2293 8499046 7521505 6692607 5891392 5241393 4853265 4290612 3883452 3506243 3048042 2726834
2283 2726834 2543362 2327019 2146576 2063058 1845700 1634239 1496062 1375532 1299336 1253852
2273 1253852 1248590 1122480 985537 918962 790902 695483 703131 685486 632092 552500 649181
2262F49181L6074j30632j93476o2764N267L8106K0494k65m5061j28841m0878o6249
2250H0956P0887N882J00835N261k38943N3096L1830k15171k4797Q6592j54906
2239a98478k1788J5750O4624l2232j16428p6457l4450J14863k6197M5210l174
2228b68757k3162J49712l9153l6509M6409K8628l8927J3980j12234l4762j14987
2217d29762O3017l1290P6509N1822O5022k03672R7341N6464j0025R1637r0616
2206b63553r8497p4050j12511n7231N0838J6860J20826p4636j9336M7200n0232
2195e14322r0042O1507J13290O7808p5403k7447k6981P0708q5949J50140n3516
2184d10207n4948l8670M7556P5386l2272l5726m7889m5876o3824p2068J2599J29248
$$ plain form
2262 649181 685255 554623 361147 298383 303650 341756 362250 361985 316924 188083 147205 80956
2250 80956 151843 157725 258560 263821 24878 77974 109804 -105367 -130164 -43572 -198478
2239 -198478 -220266 -204516 -139892 -172124 -288552 -365009 -399459 -284596 -310793 -265583 -268757
2228 -268757 -291919 -142207 -181360 -217869 -171460 -142832 -181759 -167779 -280013 -314775 -429762
2217 -429762 -366745 -398035 -321526 -269704 -204682 -408354 -311013 -254549 -264574 -172937 -263553
2206 -263553 -362050 -436100 -548611 -605842 -555004 -538144 -417318 -491954 -511290 -464090 -514322
2195 -514322 -604364 -542857 -429567 -361759 -437162 -464609 -491590 -420882 -506831 -356691 -410207
2184 -410207 -465155 -503825 -456269 -380883 -413155 -448881 -496770 -542646 -606470 -678538 -665939 -536691
2172e36691m59k5462J4410K1841p6509L1046J04625j72122j34725J86162n8062
2161f45946l6064j0076k5503P3291j245j2585j8629n3526M9319J2346J82598J44814
2149c41206k96616j76345J29597J0568o4529j9923R4493J13198l1526q4532l9312
2138g06133j3871J16861J69569j62695k05760J03263K02514p3810K378P6799r8159
2127e89044L5672K1729n7415l2946p998J0462M2932L3261j78105J48836Q177k5032
2115e89471j10165P3807J32708q0742J1329P5216o298N6l8979K7664j7356n4021
2103e76252k4209Q089Q1140R868k1703k3907j09752j94498J97484M9151k4723
2092f29312L4857Q0131m6857j82144J07956m9083p4403Q7058N4478j1041M5043
$$ plain form
2172 -536691 -537150 -562612 -548202 -526361 -602870 -571824 -467199 -639321 -774046 -587884 -645946
2161 -645946 -682010 -692086 -717589 -644298 -645543 -658128 -676757 -730283 -680964 -668618 -486020 -341206
2149 -341206 -637822 -814167 -684570 -674002 -738531 -758454 -663961 -550763 -582289 -666821 -706133
2138 -706133 -720004 -603143 -433574 -596269 -802029 -698766 -496252 -570062 -567684 -490885 -589044
2127 -589044 -553372 -531643 -589058 -622004 -630002 -619540 -576608 -543347 -721452 -572616 -564439 -589471
2115 -589471 -699636 -625829 -493121 -573863 -562534 -487318 -493616 -493560 -532539 -504875 -522231 -576252
2103 -576252 -600461 -592372 -511232 -501364 -523067 -546974 -656726 -851224 -653740 -604589 -629312
2092 -629312 -594455 -514324 -561181 -743325 -635369 -684452 -758855 -671797 -617319 -628360 -583317
2081e83317l1547j17484M7716R8308K2917p7178O0811J7416l7664O1813Q3720
2070d54489j51037j76272R5290K00147k8255j40291m7044J4433J49672J09123
2060d28723j4892M6085r3625Q8330l5976O0538j6999n4607P9947j03298n0739
2049e23959K62O3963j7794k3749M8341O8405L7669L7565J01219J18560N0887l0621
2037f9252r3717l8978j79593k0511L4248j04396n8570J04106l3169L3773k2298
2026d48357j35697k7744R1764Q7154l101j59666k744l2438o2685Q2280J23729
2015d87505o132o8378J30000n9462j21704p8947K4967K90888k37537p2476Q3981
2004f02305k8437K55591r8721k2192K0245q4684j21265L8036L0151m5997l5872
$$ plain form
2081 -583317 -614864 -732348 -684632 -586324 -563407 -640585 -579774 -562358 -600022 -538209 -454489
2070 -454489 -605526 -781798 -686508 -486361 -514616 -654907 -701951 -687518 -537846 -428723
2060 -428723 -443615 -397530 -491155 -402825 -438801 -378263 -395262 -449869 -369922 -473220 -523959
2049 -523959 -523697 -459734 -477528 -501277 -452936 -384531 -346862 -309297 -208078 -89518 -38631 -69252
2037 -69252 -162969 -201947 -381540 -402051 -367803 -472199 -530769 -426663 -459832 -426059 -448357
2026 -448357 -584054 -611798 -520034 -432880 -435981 -595647 -598391 -630829 -693514 -611234 -487505
2015 -487505 -493637 -562015 -432015 -491477 -613181 -692128 -667161 -376273 -613810 -686286 -602305
2004 -602305 -630742 -375151 -473872 -496064 -475819 -560503 -681768 -643732 -613581 -659578 -695450
1993f95450o3886M7483Q1572N8912J9802J8197K1871K4237m6209o1815J78703
1982d16583j63892q1355m8478Q6639j45492j9203p3304J18691J20241n5917J39209
1971e39444N2546j9003o0236q2507K2512K126M7228M3461p5255j66619J21399
1960f53792J12810J18639k8852r6680O5640p8160p7359k0999O1050O4240j887
1949e35350l71l5980K9636o6796j04128P4043p0550R5545n4694L9400l1668N2427
1937f08486J27247m317j81808k4669J09328L5688n2442l27J4933R303j78682J34085
1925f20147K3513j66947j1610J57615J64748Q2904o6522n3941M431r7087K6800
1914e56243Q2421o2694N6500j21308J54549l7039l2140l0729r680K426r189K0401
$$ plain form
1993 -695450 -759336 -711853 -630281 -571369 -551567 -533370 -511499 -487262 -533471 -595286 -416583
1982 -416583 -580475 -661830 -710308 -623669 -769161 -788364 -861668 -742977 -622736 -678653 -539444
1971 -539444 -486898 -505901 -566137 -648644 -626132 -624006 -576778 -533317 -608572 -775191 -653792
1960 -653792 -540982 -422343 -451195 -547875 -482235 -560395 -637754 -658753 -597703 -533463 -535350
1949 -535350 -535721 -571701 -542065 -608861 -712989 -638946 -709496 -613951 -668645 -629245 -660913 -608486
1937 -608486 -481239 -485556 -667364 -692033 -582705 -547017 -599459 -599786 -584853 -575550 -754232 -620147
1925 -620147 -596634 -763581 -775191 -617576 -452828 -369924 -436446 -490387 -485956 -583043 -556243
1914 -556243 -473822 -536516 -480016 -601324 -446775 -483814 -515954 -546683 -556363 -553937 -563126 -542725
1902e42725K2312O981j45132J04514N1064n6492k1074J32931o5659L5333j7819
1891d95766p9170L4422K4867K0689L0974j00485L881K4701k6880o7719K0013O3051
1879e47422j2652m6277R4894j00018j19987J73101J18323o9310o1556L3530L6890
1868e00484k9945j20885L9585R2426j34269n0901r399O2841J11422m7391j17153
1857g04153n2364J62070J02297o7478j16502K0519j5434L3999k6767J51023J04726
1846d08064j27451N6037l2140q2358l0217L5885j16651o2888J9511K373K71488
1835d74475K25732p3540k64157j02690L1719J88414j16475k1614J02096K7553
1825d77437j717n3545o3184l8864P8025j2240J21159M4572n3216J15806l1495
$$ plain form
1902 -542725 -520413 -513432 -658564 -554050 -502986 -559478 -580552 -447621 -513280 -477947 -495766
1891 -495766 -574936 -540514 -515647 -494958 -463984 -564469 -560588 -535887 -562767 -630486 -610473 -547422
1879 -547422 -560074 -606351 -511457 -611475 -731462 -558361 -440038 -509348 -570904 -537374 -500484
1868 -500484 -530429 -651314 -611729 -519303 -653572 -704473 -713872 -651031 -539609 -587000 -704153
1857 -704153 -756517 -594447 -492150 -559628 -676130 -655611 -671045 -637046 -663813 -512790 -408064
1846 -408064 -535515 -479478 -511618 -593976 -624193 -588308 -704959 -767847 -748336 -745963 -474475
1835 -474475 -248743 -322283 -586440 -689130 -657411 -468997 -585472 -607086 -504990 -477437
1825 -477437 -479154 -532699 -595883 -634747 -556722 -568962 -447803 -403231 -456447 -340641 -372136
1814c72136j95809J33732j59232Q5214K0333K9848n3657L4766P5118j27021o4931
1803e93775p297M2473J69778r0956m9175J1642J740q9510l0795J33571P2452j4134
1791d43986m4259j07291Q260m7878K3632J07142K0705N4149k8718L2199j48405
1780e74450k4116k6210O4735r831R5659J5655j26773L5969l2180Q0865J0846l5725
1768e25556m8268r0415J4297R8393J1343r8524l2039k3387K20387K4736R8654
1757c50379j39263K2613j8976j63346P517q7771M9501J11658N3364j9541L950
1746e30673m1264J1225j9551n2746l0162R0810J27005l2214l3823j42621l5139
1735f89153O3337O3825k4035J23935J32069k35867J09415k8636N5111q4352r0507
$$ plain form
1814 -372136 -567945 -434213 -593445 -508231 -487898 -458050 -511707 -476941 -401823 -528844 -593775
1803 -593775 -601072 -558599 -388821 -479777 -528952 -517310 -515570 -605080 -635875 -502304 -429852 -443986
1791 -443986 -488245 -595536 -587276 -635154 -611522 -504380 -483675 -429526 -458244 -426045 -574450
1780 -574450 -598566 -624776 -560041 -569872 -474213 -458558 -585331 -549362 -581542 -500677 -489831 -525556
1768 -525556 -573824 -664239 -649942 -551549 -540206 -638730 -670769 -694156 -473769 -449033 -350379
1757 -350379 -489642 -467029 -486005 -649351 -641834 -729605 -680104 -568446 -515082 -534623 -530673
1746 -530673 -571937 -560712 -580263 -633009 -663171 -572361 -445356 -477570 -511393 -654014 -689153
1735 -689153 -625816 -561991 -586026 -462091 -330022 -565889 -456474 -485110 -429999 -514351 -604858
1724f04858m5615M4517J4156r7619J16539K9636J07672J8464j70200R1167N0105
1713d46036j54141o5415K4373J4001J36409Q9392O2680q0698j62923P5425l9689
1702e46622J454M2268L109L74L128j0438O2822j58236O9607O9042r1505j41435
1690f96432J67177l997j428Q3621J5367n61j0369p5677n7811O9271L9777o5977
1678e37039J71779k49779j17441J16070P3020o512K2591M8006k9211K495l8058
1667e44079n7426Q4842P3619j33322q3962n784J23070j1470o7333m5338J816J24946
1655e40421P1054j14275p3152K4160j2148l3366P5693p738J69812q1048K2059
1644d99370q5558q3077K1286L1696Q9157K8051L4458l4639R4072j76123j7131
$$ plain form
1724 -604858 -650473 -605956 -591800 -689419 -572880 -543244 -435572 -417108 -587308 -496141 -446036
1713 -446036 -600177 -665592 -641219 -627218 -490809 -401417 -338737 -419435 -582358 -506933 -546622
1702 -546622 -545168 -502900 -499791 -499417 -496289 -506727 -443905 -602141 -532534 -463492 -554997 -696432
1690 -696432 -529255 -533252 -534680 -451059 -435692 -436253 -446622 -522299 -580110 -510839 -471062 -537039
1678 -537039 -365260 -615039 -732480 -616410 -543390 -549902 -527311 -479305 -508516 -506021 -544079
1667 -544079 -601505 -516663 -443044 -576366 -660328 -666112 -543042 -554512 -621845 -667183 -665367 -540421
1655 -540421 -469367 -583642 -656794 -632634 -644782 -678148 -602455 -610193 -440381 -521429 -499370
1644 -499370 -584928 -668005 -646719 -615023 -525866 -497815 -463357 -497996 -403924 -580047 -597178
1633e97178K0991j58980P6204N2955J3893k7360J4867m9356M7807N1287J22051
1622d32819o6649r4159J3648L5075J836M1755n908O6893o2567l8106o2020P0567
1610e32454r1326l4156l196L3207J03693r7121m8728L3692N4168r5942K1247Q8855
1598e68061P9312K0024l484j6535M2977N5124L5293q9598q6179J18324q0931J0625
1586d83109Q0461j23988o2023P5856J7199L7450O5268j58077k28k2367J1850J12569
1574d49139o0713k4094j04639p2473q235J09634M874M7172M7550L1894K7795J0067
1562d40307j39578P9591J6140j40889R258L6064P0955n8066K338O0199J06524
1551c97771o8560o7730L2094j05898j2151J57829k6385r8667j0260J36082q1960
$$ plain form
1633 -597178 -576187 -735167 -658963 -606008 -592115 -619475 -604608 -653964 -606157 -554870 -432819
1622 -432819 -499468 -593627 -579979 -544904 -543068 -501313 -507221 -440328 -502895 -541001 -603021 -532454
1610 -532454 -623780 -657936 -661132 -627925 -524232 -621353 -670081 -636389 -582221 -678163 -656916 -568061
1598 -568061 -488749 -468725 -472209 -488744 -445767 -390643 -355350 -444948 -531127 -412803 -493734 -483109
1586 -483109 -402648 -526636 -588659 -512803 -495604 -458154 -392886 -550963 -551191 -573558 -561708 -449139
1574 -449139 -509852 -533946 -638585 -711058 -719293 -609659 -604785 -557613 -510063 -478169 -450374 -440307
1562 -440307 -579885 -500294 -484154 -625043 -615785 -579721 -508766 -566832 -564494 -504295 -397771
1551 -397771 -466331 -534061 -501967 -607865 -620016 -462187 -488572 -587239 -597499 -461417 -543377
1540e43377k3089r8809J33256J31008o7586j0365j34965l0029P4586k401p0468
1529f42239J2519K16048m1011J1522k1493r6442l1331J9033P3884K434o7127j8232
1517e82435q6974n8113N0478m4309l0629J18489N2543k4149r364N6868o466j1169
1505e75230K2122K569j24557N3330M6848n4519P6169K2067O325q686L6750m3861
1493e40673q4977p4970J11001K14585n6760o2952j37405J86578L5734j14116j1198
1482e35153L6540P154P6619N8852j13579r1057k5707j27357J34206P9271K4320
1471d75891P9099j53264O6384J9276l6477J55779p9749j64385O2686r4405p6552
1460f97499Q7160P5805n3470L5963Q4686M4497m9069J3150j497q9484o5488J86564
$$ plain form
1540 -543377 -566466 -665275 -532019 -401011 -468597 -478962 -613927 -643956 -569370 -571771 -642239
1529 -642239 -629720 -413672 -454683 -443161 -464654 -561096 -592427 -573394 -499510 -497076 -564203 -582435
1517 -582435 -669409 -727522 -677044 -721353 -751982 -633493 -580950 -605099 -614463 -557595 -564061 -575230
1505 -575230 -553108 -550539 -675096 -621766 -574918 -629437 -553268 -531201 -524876 -533562 -496812 -540673
1493 -540673 -625650 -700620 -589619 -375034 -431794 -494746 -632151 -445573 -409839 -523955 -535153
1482 -535153 -498613 -491459 -414840 -355988 -469567 -560624 -586331 -713688 -579482 -500211 -475891
1471 -475891 -396792 -550056 -483672 -464396 -500873 -345094 -424843 -589228 -526542 -620947 -697499
1460 -697499 -610339 -534534 -588004 -552041 -467355 -422858 -471927 -458777 -460274 -549758 -615246 -428682
1448d28682n7714m1289k302L5880j9265l8794J62692o1443j81221l8242l1200
1437g01580O2772J59502K95L0947m0227o555Q3700K5743P5123j72716r202o0584
1425e52782Q9314m921j47826J33066L1776k02174J23243R6518J4374j76023l3381
1414f28816J4662K6696K1855j6042j30274L0379J29001p4996J31932P6431O513
1403d12659j37202o7983l1403J7336k6890J12386J14210j01994L789L5433l3293
1392e28270m3370k6663n7123M6607J46623N7008j41512N2085J889m0228j12978
1381f45932P6873J8485j01288M8885J5911N6797N5384Q0820p7439j0427J33134
1370c48797n3373j49858K2107L1917m625m8115j2347j0656L0761M1929q051J04191
$$ plain form
1448 -428682 -486396 -527685 -529987 -494107 -513372 -552166 -389474 -450917 -632138 -670380 -701580
1437 -701580 -638808 -479306 -479011 -448064 -488291 -494846 -411146 -385403 -310280 -482996 -492198 -552782
1425 -552782 -463468 -468389 -616215 -483149 -451373 -653547 -530304 -433786 -419412 -595435 -628816
1414 -628816 -614154 -587458 -565603 -581645 -711919 -681540 -552539 -627535 -495603 -419172 -412659
1403 -412659 -549861 -617844 -649247 -631911 -658801 -546415 -432205 -534199 -530410 -494977 -528270
1392 -528270 -571640 -598303 -655426 -608819 -462196 -405188 -546700 -494615 -492726 -532954 -645932
1381 -645932 -569059 -550574 -651862 -602977 -587066 -530269 -474885 -394065 -471504 -481931 -348797
1370 -348797 -402170 -552028 -529921 -498004 -502629 -550744 -563091 -573747 -542986 -501057 -509108 -404917
1358d04917j03066o8729J28199k0577k2716l9762J47481P9722r0894j21627L4808
1347d82078n3436j2000k1014M8458K5336J8619J24248L3886q3292k5784j42674
1336e69731k5639J2850j12120J3051q736P6302J71781j42281L4330R2690J45803
1325c11700j39082j61265l3617N5691p0130n8746J13465O5875O4795l5237o655
1314e16606L892n2036L7107M2205K9329j1481j09199m0471J54754N4157m4766
1303d53115O0544N8930k50934j91243O2046o0154J01003J14885L4584J6530k1475
1292e28399M1519K789l9978N885O7396k2844j23588L7428n107j4243p8971J19765
1280e38348J47298K3675m0637r0081n2012J3540j4065Q4998j29250j3841P2289
$$ plain form
1358 -404917 -507983 -576712 -448513 -469090 -491806 -531568 -384087 -304365 -395259 -516886 -482078
1347 -482078 -535514 -547514 -568528 -520070 -494734 -476115 -351867 -317981 -401273 -427057 -569731
1336 -569731 -595370 -582520 -694640 -681589 -690325 -614023 -442242 -584523 -550193 -457503 -311700
1325 -311700 -450782 -612047 -645664 -589973 -660103 -718849 -605384 -539509 -474714 -509951 -516606
1314 -516606 -512714 -564750 -527643 -485438 -456109 -467590 -576789 -617260 -462506 -408349 -453115
1303 -453115 -392571 -333641 -584575 -775818 -713772 -773926 -672923 -558038 -523454 -506924 -528399
1292 -528399 -486880 -484091 -524069 -518184 -450788 -473632 -597220 -559792 -564899 -579142 -658113 -538348
1280 -538348 -391050 -367375 -408012 -498093 -550105 -536565 -550630 -465632 -594882 -608723 -536434
1269e36434n5247J43618j7309k44896M2712J25002r519j67J70145n0620q2648
1258e15363M8593j0232m5018M8097O9692J00565L552l9879j59988J4405l6361
1247e21937l8809Q3713m5773o7146q125O1798p3273J28479J84414q8799n6602
1236d42060m8125j22821O5082m8826P6265J11602j3572j06120k9703J566j415
1225e58127K9858k2638o9242J79310J06248j06352j34953J9437K10182o6619j8510
1214d31406Q3116j10554q3632l6149J9252n8310p436P3911N4591r660L9312R0228
1202c76737R2374r4997m6593n5542r3645R2429J55378n5164j83853n6445K2410
1191f00385J27225m042r9344j22238K24264j0232o5354m264k5914Q0366m8426
$$ plain form
1269 -536434 -591681 -448063 -465372 -710268 -667556 -542554 -552073 -552240 -382095 -432715 -515363
1258 -515363 -466770 -477002 -522020 -473923 -404231 -303666 -300114 -339993 -499981 -485576 -521937
1247 -521937 -560746 -477033 -522806 -589952 -598077 -536279 -609552 -481073 -296659 -385458 -442060
1236 -442060 -490185 -613006 -547924 -596750 -520485 -408883 -422455 -528575 -558278 -556712 -558127
1225 -558127 -528269 -550907 -620149 -440839 -334591 -440943 -575896 -556459 -346277 -412896 -431406
1214 -431406 -348290 -458844 -542476 -578625 -559373 -617683 -625119 -551208 -496617 -506277 -466965 -376737
1202 -376737 -284363 -379360 -425953 -481495 -575140 -482711 -327333 -382497 -566350 -622795 -600385
1191 -600385 -473160 -477202 -576546 -698784 -474520 -484752 -550106 -554370 -580284 -499918 -548344
1180e48344j77092J98226R0489p3872l4819J91Q2252J8103L2587K1793r57J7664
1168c73779R17q5967p2770K688J1603O7056N1393m7388P6122n116q1920J1621
1156d45540J50832j16214q7233M9270j25455P6926J7210n5225o4672M439k4508
1145f20170J24879R9175j26247j12976J40043L2610j83434J39173L6838p2336
1135e42445O8354k7551J0520J11472r845j01798k4957J57854j56882j08814P9049
1124e45043K4656J6579j5269J5412P1334p2807k6947j6239l0264o6802L6517N9612
1112e49261Q4747k4554k7200m2575M4562m308r1445P5594J70026r6196P7314o7089
1100d50385j55241J472L74J1860p925l530L4712Q8559j6729j13156J10022J7799
$$ plain form
1180 -548344 -725436 -527210 -436721 -510593 -545412 -545221 -462969 -444866 -412279 -390486 -391443 -373779
1168 -373779 -372862 -458829 -531599 -528911 -517308 -450252 -398859 -446247 -370125 -375241 -457161 -445540
1156 -445540 -294708 -410922 -498155 -448885 -574340 -497414 -480204 -535429 -600101 -595662 -620170
1145 -620170 -495291 -396116 -522363 -635339 -495296 -462686 -646120 -506947 -470109 -542445
1135 -542445 -474091 -501642 -491122 -379650 -389495 -491293 -516250 -358396 -515278 -624092 -545043
1124 -545043 -520387 -503808 -519077 -503665 -432331 -505138 -532085 -548324 -578588 -645390 -608873 -549261
1112 -549261 -464514 -489068 -516268 -558843 -514281 -518589 -610034 -534440 -364414 -460610 -383296 -450385
1100 -450385 -605626 -604154 -603780 -591920 -599845 -603375 -568663 -480104 -496833 -609989 -499967 -482168
1088d82168J2110l2406j04154n4890J53911K32924j37237n2612j08249J03792
1078d68979M6049J2043l3280O8872K0128j9919J1444r2011n0610M0311J9652l5664
1066d81964j56117l3594M8060J72142p0459R0745q4764k26226L6963O5558j9748
1055f59404O7087J51531J6508K2217r36k3604l5740j00200j36693N9386M6093
1044e93755l4134r186J47015J6370o6938K9204M5839n0198q3735M8736N0153k3023
1032e23652j49454O0343R2644P2918M9096j06926O454R8613l7257m23j21709l19
1020e59672J31524l5546r1704m7640J69416Q762k3222j31197n2553M8416o0592
1009f44008k1603J66237r5338j11389J41095R1375M4915L9896j87232O5997j82705
$$ plain form
1088 -482168 -470058 -502464 -606618 -661508 -507597 -274673 -411910 -464522 -572771 -468979
1078 -468979 -422930 -410887 -444167 -375295 -355167 -375086 -363642 -455653 -506263 -465952 -446300 -481964
1066 -481964 -638081 -671675 -623615 -451473 -521932 -431187 -515951 -742177 -705214 -639656 -659404
1055 -659404 -592317 -440786 -424278 -402061 -402997 -426601 -462341 -562541 -699234 -639848 -593755
1044 -593755 -627889 -637075 -490060 -473690 -540628 -511424 -465585 -515783 -599518 -550782 -500629 -523652
1032 -523652 -673106 -612763 -520119 -447201 -398105 -505031 -498577 -399964 -437221 -437644 -559353 -559672
1020 -559672 -428148 -463694 -555398 -603038 -433622 -424860 -448082 -579279 -631832 -583416 -644008
1009 -644008 -665611 -499374 -594712 -706101 -565006 -473631 -428716 -388820 -576052 -510055 -692760
998f92760J26099J31748n4801r0021N4998M5459p7031j9784j9474L9525m2734
987e98776K0711q3341K06215l9932o3879n2404N3740K5348k5071l7812k791Q8315
975e09677J3051M9977j1545M3039J29418j35506j76854p7868J53927P5807J3832
964d32399N3260L7487n8650q4089k7706J8269J73994q9245j56495p9703L8761
953f06516P5614J38481j8978j32361O8440K5425j3852n7464R0856r0924J20682
942d00597N3373q4111J18913M3443J8849q8192j70839n210O1099n098j01259M1559
930e18070N2602L28n5891J7721N6446J1328K4811n2953j67632K8903J04912m1970
918e39465P7235n596N0985k5407J601N5823p0456Q0770j36631n1283J31984K3703
$$ plain form
998 -692760 -566661 -434913 -489714 -579735 -524737 -479278 -556309 -576093 -595567 -556042 -598776
987 -598776 -578065 -661406 -455191 -495123 -559002 -611406 -557666 -532318 -557389 -595201 -597992 -509677
975 -509677 -496626 -446649 -458194 -415155 -285737 -421243 -598097 -675965 -522038 -446231 -432399
964 -432399 -379139 -341652 -400302 -484391 -512097 -493828 -319834 -409079 -565574 -645277 -606516
953 -606516 -530902 -392421 -411399 -543760 -475320 -449895 -463747 -521211 -430355 -521279 -400597
942 -400597 -347224 -431335 -312422 -268979 -250130 -338322 -509161 -514371 -453272 -458370 -559629 -518070
930 -518070 -465468 -465140 -521031 -503310 -446864 -435536 -410725 -463678 -631310 -602407 -497495 -539465
918 -539465 -462230 -467826 -416841 -442248 -440647 -384824 -455280 -374510 -511141 -562424 -430440 -406737
906d06737N2631q5191l4784q2852r5972J62144P0381n1676l173o8302M4516k1344
894e20359J00380R6293j96719q6347Q8281M6740J29639j6907m9741O9511R10r7796
882d36115J5314m6855q8201k7668O3878P9884J41898n4174n2322j55466k4811
871e84638N6488j8995Q2026M1686j00m8262N6739j1889m4089J9043l1177M1871
859d41297J5395j09710N590K2166m9987R6692J7474m1318m365J58159j05204j30110
847e66515l6061L9907M9514K8893K6775j95464k1398j0317J31583P5372J3442
836d64269O8717q3956m9645J74619l6634K2414n4947l1040L0795k15826k8708
825f68480O4197N8399L8731o3845O6973o3072k7110J40798J68970j63120L17Q4180
$$ plain form
906 -406737 -354106 -439297 -474081 -556933 -652905 -490761 -420380 -472056 -475229 -543531 -499015 -520359
894 -520359 -419979 -323686 -520405 -606752 -518471 -471731 -342092 -358999 -408740 -339229 -338319 -436115
882 -436115 -420801 -467656 -555857 -583525 -519647 -439763 -297865 -352039 -404361 -559827 -584638
871 -584638 -528150 -547145 -465119 -423433 -423533 -471795 -415056 -426945 -471034 -451991 -483168 -441297
859 -441297 -425902 -535612 -530022 -507856 -557843 -461151 -443677 -484995 -489360 -331201 -436405 -566515
847 -566515 -602576 -562669 -513155 -484262 -457487 -652951 -674349 -684666 -553083 -477711 -464269
836 -464269 -395552 -479508 -529153 -354534 -391168 -368754 -423701 -454741 -423946 -639772 -668480
825 -668480 -604283 -545884 -507153 -570998 -504025 -567097 -594207 -453409 -284439 -447559 -447242 -363062
$$ [...]
##END NTUPLES=NMR SPECTRUM
##END=
