##TITLE=1H_DE-80H_X3
 200.13MHz, d2o
 8 sc
 
 19ns.26.2.2025
##JCAMPDX= 6.0         $$ Bruker NMR JCAMP-DX V2.0
##DATA TYPE= NMR SPECTRUM
##DATA CLASS= NTUPLES
##ORIGIN= UXNMR, Bruker Analytische Messtechnik GmbH
##OWNER= pz
$$ XWIN-NMR		Version 3.5
$$ Mon Jul 27 10:33:43 2026 Russian Standard Time (UT+4h)  Yarkov@DPX200
##.OBSERVE FREQUENCY= 200.1313
##.OBSERVE NUCLEUS= ^1H
##.ACQUISITION MODE= SIMULTANEOUS
##.ACQUISITION SCHEME= undefined
##.AVERAGES= 8
##.DIGITISER RES= 18
##SPECTROMETER/DATA SYSTEM= spect
##.PULSE SEQUENCE= zg30
##.SOLVENT NAME= DMSO
##.SHIFT REFERENCE= (INTERNAL, DMSO, 0, 15.5287)
##AUDIT TRAIL= $$ (NUMBER, WHEN, WHO, WHERE, WHAT)
$$ ##TITLE= Audit trail, XWIN-NMR		Version 3.5
$$ ##JCAMPDX= 5.01
$$ ##ORIGIN= Bruker BioSpin GmbH
$$ ##OWNER= Yarkov
$$ C:/Bruker/XWIN-NMR/data/yarkov2/nmr/H-C/1/pdata/1/auditp.txt
$$ ##AUDIT TRAIL=  $$ (NUMBER, WHEN, WHO, WHERE, WHAT)
(   1,<2026-07-27 10:32:28.01 +0400>,<Yarkov>,<DPX200>,
      <created by zg, POWCHK disabled, PULCHK disabled
       configuration hash MD5:
       00 E9 B6 7A A2 85 ED C7 34 08 36 98 17 FE 4E 26
       data hash MD5: 16K
       29 C5 8D 59 66 F7 58 80 D3 40 A7 DB 60 CA 3F 4F>)
(   2,<2026-07-27 10:32:49.06 +0400>,<Yarkov>,<DPX200>,
      <Start of raw data processing
       efp BC_mod = 2 LB = 0.25 FT_mod = 6 PKNL = 1 PHC0 = -7256.183 PHC1 = 2.82197 SI = 16K 
       data hash MD5: 16K
       86 DA A5 A0 2A 87 54 4B C2 76 A1 92 A2 AA 55 D1>)
(   3,<2026-07-27 10:33:18.15 +0400>,<Yarkov>,<DPX200>,
      <pk PHC0 = -1.6 PHC1 = 0 
       data hash MD5: 16K
       E7 B7 A1 1A D2 05 C4 E8 48 49 DF 27 96 15 85 87>)
$$ ##END=
$$ 
$$ hash MD5
$$ EA 3A FB 5C 31 BD C8 94 59 80 2E 2F 12 62 F0 B1
##$RELAX= 
##$RELAX= 
##$RELAX= 
##$RELAX= 
##$RELAX= 
##$RELAX= 
$$ Bruker specific parameters
$$ --------------------------
##$DU= <C:/Bruker/XWIN-NMR>
##$EXPNO= 1
##$NAME= <H-C>
##$PROCNO= 1
##$TYPE= <nmr>
##$USER= <yarkov2>
##$AMP= (0..31)
100 100 100 100 100 100 100 100 100 100 100 100 100 100 100 100 100 100 
100 100 100 100 100 100 100 100 100 100 100 100 100 100 
##$AQSEQ= 0
##$AQ_mod= 1
##$AUNM= <au_zg>
##$AUTOPOS= <>
##$BF1= 200.13
##$BF2= 200.13
##$BF3= 200.13
##$BF4= 200.13
##$BF5= 200.13
##$BF6= 200.13
##$BF7= 200.13
##$BF8= 200.13
##$BYTORDA= 1
##$CFDGTYP= 0
##$CFRGTYP= 5
##$CHEMSTR= <none>
##$CNST= (0..31)
1 1 145 1 1 1 1 1 1 1 1 1 1 1 1 1 1 1 1 1 1 1 1 1 1 1 1 1 1 1 1 1 
##$CPDPRG= <>
##$CPDPRG1= <>
##$CPDPRG2= <>
##$CPDPRG3= <>
##$CPDPRG4= <mlev>
##$CPDPRG5= <mlev>
##$CPDPRG6= <mlev>
##$CPDPRG7= <mlev>
##$CPDPRG8= <mlev>
##$CPDPRGB= <>
##$CPDPRGT= <>
##$D= (0..31)
0 0.7 0 0 0 0 0 0 0 0 0 0.03 0 0 0 0 0 0 0 0 0 0 0 0 0 0 0 0 0 0 0 0 
##$DATE= 1785133947
##$DBL= (0..7)
120 120 120 120 120 120 120 120 
##$DBP= (0..7)
150 150 150 150 150 150 150 150 
##$DBP07= 0
##$DBPNAM0= <>
##$DBPNAM1= <>
##$DBPNAM2= <>
##$DBPNAM3= <>
##$DBPNAM4= <>
##$DBPNAM5= <>
##$DBPNAM6= <>
##$DBPNAM7= <>
##$DBPOAL= (0..7)
0.5 0.5 0.5 0.5 0.5 0.5 0.5 0.5 
##$DBPOFFS= (0..7)
0 0 0 0 0 0 0 0 
$$ [...]
##$SUBNAM2= <"">
##$SUBNAM3= <"">
##$SUBNAM4= <"">
##$SUBNAM5= <"">
##$SUBNAM6= <"">
##$SUBNAM7= <"">
##$SUBNAM8= <"">
##$SUBNAM9= <"">
##$SW= 18.0517328524113
##$SWIBOX= (0..15)
0 0 2 0 0 0 0 0 0 0 0 0 0 0 0 0 
##$SW_h= 3612.71676300578
##$TD= 16384
##$TD0= 1
##$TE= 0
##$TE2= 300
##$TE3= 300
##$TEG= 300
##$TL= (0..7)
0 120 120 120 120 120 120 120 
##$TP= (0..7)
150 150 150 150 150 150 150 150 
##$TP07= 0
##$TPNAME0= <>
##$TPNAME1= <>
##$TPNAME2= <>
##$TPNAME3= <>
##$TPNAME4= <>
##$TPNAME5= <>
##$TPNAME6= <>
##$TPNAME7= <>
##$TPOAL= (0..7)
0.5 0.5 0.5 0.5 0.5 0.5 0.5 0.5 
##$TPOFFS= (0..7)
0 0 0 0 0 0 0 0 
##$TUNHIN= 0
##$TUNHOUT= 0
##$TUNXOUT= 0
##$USERA1= <user>
##$USERA2= <user>
##$USERA3= <user>
##$USERA4= <user>
##$USERA5= <user>
##$V9= 5
##$VALIST= <valist>
##$VCLIST= <CCCCCCCCCCCCCCC>
##$VD= 0
##$VDLIST= <DDDDDDDDDDDDDDD>
##$VPLIST= <PPPPPPPPPPPPPPP>
##$VTLIST= <TTTTTTTTTTTTTTT>
##$WBST= 1024
##$WBSW= 4
##$XGAIN= (0..3)
0 0 0 0 
##$XL= 0
##$YL= 0
##$YMAX_a= 160629
##$YMIN_a= -215735
##$ZGOPTNS= <>
##$ZL1= 120
##$ZL2= 120
##$ZL3= 120
##$ZL4= 120
##$ABSF1= 0
##$ABSF2= 0
##$ABSG= 0
##$ABSL= 0
##$ALPHA= 0
##$AQORDER= 0
##$ASSFAC= 0
##$ASSFACI= 0
##$ASSFACX= 0
##$ASSWID= 0
##$AUNMP= <proc_1d>
##$AZFE= 0.1
##$AZFW= 0.1
##$BCFW= 0
##$BC_mod= 2
##$BYTORDP= 0
##$COROFFS= 0
##$CY= -3
##$DATMOD= 1
##$DC= 0
##$DFILT= <>
##$DTYPP= 0
##$F1P= 0
##$F2P= 0
##$FCOR= 1
##$FTSIZE= 16384
##$FT_mod= 6
##$GAMMA= 0
##$GB= 0
##$INTBC= 1
##$INTSCL= 3.241238e-09
##$ISEN= 128
##$LB= 0.25
##$LEV0= 0
##$LPBIN= 0
##$MAXI= 10000
##$MC2= 0
##$MEAN= 0
##$ME_mod= 0
##$MI= 1.114404
##$NCOEF= 0
##$NC_proc= -8
##$NLEV= 6
##$NOISF1= 3.799351
##$NOISF2= 2.8
##$NSP= 0
##$NTH_PI= 0
##$NZP= 0
##$OFFSET= 15.52873
##$PC= 1
##$PHC0= -7257.783
##$PHC1= 2.82197
##$PH_mod= 1
##$PKNL= yes
##$PPARMOD= 0
##$PSCAL= 0
##$PSIGN= 0
##$REVERSE= no
##$SF= 200.12999859266
##$SI= 16384
##$SIGF1= 3
##$SIGF2= 2
##$SINO= 0.751879
##$SIOLD= 32768
##$SREGLST= <19F.Aceton>
##$SSB= 0
##$STSI= 16384
##$STSR= 0
##$SW_p= 3612.71676300578
##$SYMM= 0
##$S_DEV= 0
##$TDeff= 16384
##$TDoff= 0
##$TI= <>
##$TILT= no
##$TM1= 0
##$TM2= 0
##$TOPLEV= 0
##$USERP1= <user>
##$USERP2= <user>
##$USERP3= <user>
##$USERP4= <user>
##$USERP5= <user>
##$WDW= 1
##$XDIM= 16384
##$YMAX_p= 530122288
##$YMIN_p= -1068159
$$ End of Bruker specific parameters
$$ ---------------------------------
##NTUPLES= NMR SPECTRUM
##VAR_NAME=  FREQUENCY,     SPECTRUM/REAL,   SPECTRUM/IMAG
##SYMBOL=    X,             R,               I
##VAR_TYPE=  INDEPENDENT,   DEPENDENT,       DEPENDENT
##VAR_FORM=  AFFN,          ASDF,            ASDF
##VAR_DIM=   16384,         16384,           16384
##UNITS=     HZ,            ARBITRARY UNITS, ARBITRARY UNITS
##FACTOR=    0.220516191357247, 1,           1
##FIRST=     3107.76479158803, 0,            0
##LAST=      -504.951971417753, 0,           0
##MIN=       -504.951971417753, -1068159,    0
##MAX=       3107.76479158803, 530122288,    0
$$ Real data points
##PAGE= N=1
##DATA TABLE= (X++(R..R)), XYDATA
$$ [...]
12688 -528067 -402510 -338882 -322454 -476259 -389351 -342022 -240287 -367786 -398536 369
12678 369 14538 -214871 -130564 -11982 -307036 -158237 60020 -173116 -279945 -305078 -309373
12667 -309373 -155981 -193042 -326094 -513853 -366532 -416266 -319576 -348908 -352362 -431696 -552699
12656 -552699 -239770 -82362 -203560 -305546 -446984 -414237 -162403 -502374 -529325 -236880
12646 -236880 -49712 -326827 -360998 -282443 -289776 -446681 -383532 -261212 -206162 -112997 -80803
12635 -80803 -110225 29445 -245007 -211054 -267537 -414777 -234730 -213545 -280139 -140414 -111895
12624 -111895 -195205 -290672 -30576 53373 -209246 -320998 -172384 -288239 -292553 -242672 -608347
12613 -608347 -471774 -648420 -394314 -233092 -77384 -154085 -11232 127347 57937 -271313
12603 -271313 -438846 -178994 151003 169217 264108 309745 -30100 80406 32200 5493
12593 5493 155610 190991 48973 -360296 -350162 -316034 -105005 111785 173018 234840 170491
12582 170491 -20418 -104438 -19278 10859 30882 -187411 16539 73115 18818 17696 183143
12571 183143 247513 403697 398943 366568 482024 425214 526382 466750 479466 524218 460219
12560 460219 567838 559225 693255 691877 751466 563751 281100 324446 594610 750014 480948
12549 480948 390427 286971 317901 348749 405738 516532 584546 678491 947808 881517 861045
12538 861045 941428 890946 887555 952120 698397 764449 960552 1099158 1271727 1597606 1933121
12527 1933121 1709359 1424871 1253879 1380118 1411450 1449457 1759935 1709153 1674131 1971917
12517 1971917 2013817 2171830 2252153 2177207 2570875 2694109 3104014 3318026 3576274 3960253
12507 3960253 3929327 4201414 4467477 4871624 5553562 6363707 6958814 7718106 8678310 9630918
12497 9630918 10901336 12729397 14605244 16674197 19367979 22154732 25058913 28244210
12489 28244210 31299422 33535773 35180700 36013149 35743808 34531404 32804414 30319078
12481 30319078 27325716 24615602 22046616 19207964 16724826 15009363 13375797 12051327
12473 12051327 10743558 9793250 8805631 8124148 7285044 6816633 6408805 5487455 4994091
12464 4994091 5071159 4776369 4398317 3717377 3705321 3575640 3381702 3238514 2983288 2849203
12454 2849203 2879456 2737268 2588274 2422441 2427706 2379514 2143760 1939557 1967399 1935729
12444 1935729 1758696 1640395 1589289 1900386 1578801 1264967 1069336 1393846 1274177 1324859
12434 1324859 1330103 1273768 1186464 1200766 1153557 921808 1049273 1326608 1022010 815375
12424 815375 985084 1096732 1200542 1147957 740462 859278 1112952 979391 938724 869824
12414 869824 672638 762619 596537 420675 667205 678629 747739 727598 822447 824053 672335
12403 672335 593708 452013 534680 661498 362828 272998 364269 400429 545092 269355
12393 269355 182918 289249 102262 184494 311315 78118 64903 106066 120504 48741 28148
12382 28148 56725 14451 231186 168419 110873 565795 536976 587143 392950 121891 30158
12371 30158 132949 129003 -196505 -205192 155771 286948 220655 413131 279748 482657 609065
12360 609065 245130 67370 -34205 -77685 -180687 -244441 -317934 -196918 -89692 -80553
12350 -80553 -267200 -204233 -221506 -428152 -376877 -201636 -81804 -107451 -77807 -286576 -210045
12339 -210045 -64323 -169476 -180967 121351 45957 -197633 -110647 -153146 -386986 -379570 -268991
12328 -268991 -295030 -274834 -287728 -40905 -105497 39089 144828 2373 -103967 -383018
12318 -383018 -340083 -24484 -41699 -141283 -74296 -216327 -262333 -144395 -305329 -350356 -190310
12307 -190310 -344211 -137538 -57545 -109763 -373733 -256087 -133736 -189143 -292518 -148828
12297 -148828 -146217 -281700 -459686 -202051 -273543 -220004 -59441 167486 -100635 -102884 -331382
12286 -331382 -324814 -31818 -149433 -105137 -141076 -128183 -190044 -303269 -396077 -178358 172694
12275 172694 93825 -183066 -157587 -199330 -253372 -497463 -212144 26430 -114346 -90144
12265 -90144 -170581 -210161 -345061 -339623 -298556 -129320 -141874 -349109 -308127 -335257 -302966
12254 -302966 -573061 -499842 -691166 -480023 -522774 -498818 -343287 -162609 -67753 -423958
12244 -423958 -614592 -608654 -724310 -728224 -393870 -438654 -527750 -342240 -198981 -300924 -453640
12233 -453640 -407049 -222740 -347776 -325768 -255383 -320616 -179220 -298336 -413346 -243891
12223 -243891 -176585 -77846 -170187 -368107 -250911 -292505 -251787 -484130 -500676 -359584 -198742
12212 -198742 -63345 -98078 -206599 -351780 -423012 -542336 -561302 -248115 -481278 -538576
12202 -538576 -413674 -451146 -317393 -348524 -591604 -550528 -282121 -198181 -210873 -322072
12192 -322072 -432074 -469675 -371001 -423762 -607420 -629448 -353570 -270074 -328884 -323101 -450630
12181 -450630 -359781 -283129 -405543 -543019 -634384 -658197 -725852 -634056 -325613 -95911 -100149
12170 -100149 -344521 -369843 -336193 -321524 -312379 -247615 -355154 -389031 -531106 -423355 -269838
12159 -269838 -242824 -81093 -209139 -426392 -398763 -264185 48563 37298 -139835 -122906
12149 -122906 -263722 -230913 -292239 -358101 -67674 170645 -205206 -449307 -379050 -229542
12139 -229542 -229501 -58480 -338411 -100070 -224249 -330697 -440522 -423496 -374346 -180757 -319764
12128 -319764 -338002 -124449 -169469 -379575 -358546 -520131 -360922 -342435 -429056 -416816 -344138
12117 -344138 -250723 -474705 -426992 -245349 -237730 -245202 -49728 -23784 -150216 -374390 -414875
12106 -414875 -588620 -358835 -355254 -459370 -480958 -498287 -421603 -544165 -512204 -324809 -313898
12095 -313898 -207168 -143787 -67304 -337502 -110792 -92499 -313442 -633984 -659827 -414525
12085 -414525 -147627 -190328 -521749 -363177 -394164 -358293 -220325 -347964 -376017 -342280
12075 -342280 -293022 -406357 -230930 -301230 -255808 -417830 -486715 -355904 -574813 -549272
12065 -549272 -166382 -162082 -480784 -537862 -523037 -382083 -132533 -415325 -488460 -397867 -516688
12054 -516688 -572289 -558153 -690305 -361230 -271180 -460176 -644597 -318190 -56556 -120169
12044 -120169 -78380 -277613 -456489 -402324 -187895 -315618 -290288 -224681 -180752 -271467 -434355
12033 -434355 -514227 -323662 -361626 -386695 -429269 -149031 -226725 -583508 -795338 -533417
12023 -533417 -547165 -613283 -475120 -464874 -523782 -500947 -564848 -574596 -450291 -284716 -273340
12012 -273340 -113974 -471113 -421729 -347423 -417285 -454337 -377772 -195592 -84389 -144398 -337854
12001 -337854 -384588 -344571 -486598 -701337 -571102 -360145 -283771 -225004 -245794 -244885 -121690
11990 -121690 -279723 -304856 -319568 -175790 -133967 -271424 -436384 -606484 -766411 -487085
11980 -487085 -327253 -503980 -541859 -279141 -645905 -419274 -181212 -262731 -223701 -426718
11970 -426718 -342282 -284255 -314997 -500182 -491483 -335009 -376684 -651729 -679923 -488516 -582221
11959 -582221 -469375 -462502 -368889 -517645 -734185 -679388 -593857 -606217 -603532 -225740 -234963
11948 -234963 -192611 -196821 -448614 -518254 -626491 -335903 -218938 -375257 -320024 -238458 -505996
11937 -505996 -754641 -698548 -673967 -545795 -460581 -366237 -574940 -585653 -479787 -577363 -546305
11926 -546305 -618638 -627082 -766642 -442975 -263106 -299779 -396566 -546548 -175674 -322513
11916 -322513 -279787 -74022 -22025 -156994 -324100 -158015 -189443 -237750 -452188 -736415
11906 -736415 -336323 -384060 -511315 -223430 -222444 -582916 -331862 -107946 -223924 -313068
11896 -313068 -383197 -130180 -241814 -375891 -582010 -385117 -129666 -235607 -319423 -236226
11886 -236226 -455228 -83801 -187335 -263426 -295653 -321787 -279912 -373642 -407747 -545213 -658529
11875 -658529 -428974 -302872 -525499 -716813 -414734 -186331 -412764 -363504 -493453 -386260
11865 -386260 -532083 -374578 -266376 -223919 -57736 -219213 -348734 -450281 -309122 -416187
11855 -416187 -325396 -338078 -410077 -459264 -269655 -32767 -518066 -565085 -382926 -216023
11845 -216023 -356499 -332920 -357096 -441336 -481883 -48014 -117867 -445333 -369274 -328054 -372685
11834 -372685 -248755 -247566 -538161 -495809 -576983 -584585 -522531 -596425 -584110 -363258 -226303
11823 -226303 -290070 -342622 -416972 -181528 -157571 -148079 -207993 -282456 -304890 -482197 -650227
11812 -650227 -302970 -303148 -489316 -461928 -362580 -191684 -330144 -449049 -297250 -278672 -300771
11801 -300771 -316757 -408968 -591400 -466961 -221458 -385940 -412967 -236547 -75315 72947
11791 72947 -86177 -70710 -197348 -290733 -319748 -175109 -346560 -442455 -414921 -464644 -637797
11780 -637797 -653280 -271321 -367179 -17512 -262519 -306619 51577 -208459 -173548 -172243 -315287
11769 -315287 -94322 -258356 -74310 -470875 -432785 -330946 -340814 -174725 16785 -321911
11759 -321911 -377118 -262369 -122984 -20138 -295874 -301926 -504675 -328027 -151706 -320614
11749 -320614 -383334 -302421 -261607 -274737 -280454 -466206 -372204 -219277 -161353 -114041 -403883
11738 -403883 -422665 -637323 -827436 -621218 -209132 -111651 -247572 -451101 -509236 -655323
11728 -655323 -447570 -188060 -258002 -301869 -271574 -255050 -375683 -365409 -324925 -473549 -343329
11717 -343329 -344970 -468570 -301581 -287894 -335143 -356576 -226075 -453132 -514933 -403860 -266714
11706 -266714 -137031 -685692 -786858 -640734 -719479 -351921 -182716 -308552 -426473 -398919
11696 -398919 -319601 -446600 -270192 -248286 -455847 -409080 -124008 -252170 -509201 -432024
11686 -432024 -452546 -526738 -591318 -302080 -254464 -490451 -454096 -527197 -668909 -520788 -608575
11675 -608575 -515723 -568660 -277480 -470173 -371906 -378907 -373555 -435755 -423031 -555465 -710750
11664 -710750 -490887 -614493 -397440 -304108 -376142 -550041 -486981 -291164 -299527 -529167
11654 -529167 -770279 -850716 -508673 -622776 -319644 -523410 -610661 -670169 -668943 -648574 -675569
11643 -675569 -273970 -353920 -549985 -536252 -640001 -593071 -700397 -707844 -367578 -199947
11633 -199947 -296755 -541129 -582484 -453935 -363634 -238358 -251598 -118107 -29512 -213679
11623 -213679 -104705 -139249 -228225 -155653 -462601 -549946 -355164 -301130 -239550 -266426 -418142
11612 -418142 -518598 -452543 -232556 -139695 -305262 -377008 -498236 -333398 -231121 -285708
11602 -285708 -193353 -363944 -252972 -483173 -422143 -383493 -391125 -489114 -460791 -445572 -239094
11591 -239094 -169343 -455986 -188303 -93958 -178062 -411886 -446731 -388765 -410414 -313266 -251785
11580 -251785 -216167 -242398 -253455 -403300 -259996 -245925 -456146 -479635 -465518 -547821 -458508
11569 -458508 -198749 -265627 -236336 -121693 -29879 -311438 -440538 -272400 -318656 -397368
11559 -397368 -412821 -349676 -396198 -506634 -168682 -270747 -294534 -172110 -181840 -291281 -144733
11548 -144733 -310659 -422739 -380894 -453613 -528007 -527813 -516761 -415695 -787895 -789376 -553631
11537 -553631 -302171 -351117 -384760 -303877 -172021 -213348 -232471 -124250 -271034 -368078 -503162
11526 -503162 -607410 -277175 -308810 -237799 -255178 -277388 -63362 68782 -310703 -569395
11516 -569395 -284862 -401805 -532315 -569222 -359105 -387300 -351187 -524610 -391529 -175561
11506 -175561 -205029 -206384 -161873 -465028 -338639 -254802 -177542 -278787 -453310 -576448 -276556
11495 -276556 -72667 -313092 -335160 -435379 -470053 -471860 -470129 -454372 -571518 -412003 -600216
11484 -600216 -640741 -596674 -527471 -195318 -352887 -415298 -207011 -381278 -602052 -507938
11474 -507938 -297971 -455081 -541424 -313644 -54726 -309536 -397866 -401755 -240066 -179104
11464 -179104 -461019 -465826 -291673 -424730 -650501 -320538 -296802 -322531 -471758 -378941
11454 -378941 -346637 -466975 -556460 -433081 -303081 -293634 -296450 -384384 -415830 -156897 10434
11443 10434 -130872 -224087 -204841 -206271 -281004 -435105 -332035 -324985 -342841 -222266 -291854
11432 -291854 -197926 3951 -45296 -12941 -159918 -502715 -612883 -517962 -392755 -624673
11422 -624673 -318030 -302958 -375316 -556860 -515489 -416125 -548193 -410251 -287312 193672
11412 193672 166576 -89342 -78999 -179349 -319964 -297101 -145163 -74449 -182872 -169924
11402 -169924 -270581 -133177 -217373 -285665 -210998 -332927 -363845 -526169 -667706 -485674
11392 -485674 -350513 -490768 -175512 -5961 -539466 -469014 -354848 -317737 -212063 -149815
11382 -149815 -81943 -230978 -301433 -266729 1667 -197466 -232424 -105235 -179935 -356995
11372 -356995 -392543 -327808 -67909 -24495 -205251 -360665 -361186 -236945 -394931 -324242 -299068
11361 -299068 -250260 -438515 -630575 -665791 -604508 -530289 -734566 -666024 -313737 -312716 -201602
11350 -201602 -199171 -380783 -383765 -381014 -362131 -213511 -219652 -581465 -692967 -218544 -33612
11339 -33612 -347547 -472888 -439732 -412410 -356934 -503222 -751109 -797861 -652897 -492441
11329 -492441 -407530 -502399 -494852 -381449 -337609 -299934 -402781 -391422 -115940 -62286 -417981
11318 -417981 -419378 -46895 -191979 -457204 -416365 -244865 -196191 -544920 -510025 -431140 -424680
11307 -424680 -382189 -287332 -301371 -436305 -580529 -522854 -260554 -223666 -359874 -285891 -304973
11296 -304973 -287405 -200214 -374843 -159862 -7407 -139484 -297658 -456603 -351769 -370310
11286 -370310 -507957 -573407 -362804 -203071 -404402 -292152 -241821 -253031 -272970 -336114
11276 -336114 -213013 -211823 29074 -67326 -163341 -200112 -267034 -422855 -365646 -295088 -654121
11265 -654121 -411059 -266173 -270229 -382965 -491111 -418016 -293663 -329538 -421745 -467785 -498451
11254 -498451 -493171 -300836 -347617 -364386 -268814 -357854 -268903 -242845 -358146 -586256 -416094
11243 -416094 -231624 -235572 -565144 -431312 -333413 -377264 -263873 -417834 -408790 -305866 -216678
11232 -216678 92348 -206766 -426563 -614062 -607380 -588431 -398787 -134314 -221166 -282592
11222 -282592 -257927 -383110 -497236 -398481 -286755 -372273 -639569 -486586 -649262 -267271
11212 -267271 -229689 -329154 -185276 -142310 -181754 -78397 -332431 -443298 -423240 -338973 -443607
11201 -443607 -357752 -224186 -314566 -347684 -276254 -396473 -380235 -212358 -444536 -610386
11191 -610386 -502636 -311881 -135074 72115 54121 -51104 -149975 -258297 -320634 -410325
11181 -410325 -459059 -453733 -546717 -519415 -526884 -592523 -596544 -454763 -276657 -392006 -398903 -138045
11169 -138045 -143861 -231860 -272499 -275156 -325885 -443486 -316289 -522495 -384288 -347886 -318990
11158 -318990 -428341 -745409 -350666 -85858 -244036 -254571 -88502 -257847 -240129 -158297
11148 -158297 -106158 164134 119937 -411394 -660078 -338308 -240316 -397571 -248606 -272195
11138 -272195 -343660 -293934 -415102 -595042 -601901 -643962 -548569 -582392 -599622 -577221 -512847
11127 -512847 -551604 -526133 -383319 -302544 -175988 -42995 -32218 -29236 -280685 -118775 -514993
11116 -514993 -367145 -188907 -355525 -199439 -262237 -433771 -228092 -302130 -487409 -237673
11106 -237673 -395907 -330021 -296669 -332537 -88332 -82208 -133935 -365743 -260208 -218192 -398665
11095 -398665 -347118 -447104 -267988 -201797 -323408 -321896 -317267 -242950 -419675 -543392 -407511
11084 -407511 -451320 -571480 -745392 -760690 -654381 -457173 -459864 -268850 -2183 31996
11074 31996 -170785 -131792 -141662 -310321 -240859 -203361 -428664 -308047 -209252 -93409 -153802
11063 -153802 -17182 -126346 -300617 -385612 -366956 -400399 -422132 -527137 -471311 -290760
11053 -290760 -230374 -124616 -91900 -201700 -347373 -305862 -142543 -137992 -71221 -73772 -206136
11042 -206136 -377535 -415844 -175873 -405243 -535150 -200617 -143036 -165146 -76379 -112784
11032 -112784 -181333 -248743 -418971 -410406 -377256 -389288 36680 -14912 -9547 -162199 -109199
11021 -109199 -289869 -135958 148189 91540 -161356 -298364 -43464 -248644 -266315 -225395
11011 -225395 -254562 -457165 -411402 -494840 -546010 -404997 -437568 -217362 -253076 -355863 -226118
11000 -226118 -298964 -442033 -537240 -490608 -404127 -197523 -122155 -104482 -146229 -332278 -49573
10989 -49573 -167798 -550972 -413288 -174890 -170510 -233497 -137769 -272400 -278353 -356394 -466726
10978 -466726 -314385 -342181 -163697 -201000 -400829 -265758 -183276 32411 -183464 -569952
10968 -569952 -394385 -375738 -420129 -484356 -266945 -120239 -154540 -321026 -272368 -305612 -260927
10957 -260927 -367426 -690808 -764651 -632986 -400194 -487455 -581026 -428709 -178493 -248844
10947 -248844 -85054 -135635 -218747 -211057 -274049 -433626 -191787 145216 -11204 -150033
10937 -150033 -215407 -429435 -156068 -68019 43588 -35142 -113649 -27015 -308430 -141404
10927 -141404 -439026 -401168 -379697 -141480 -103222 34836 182196 -19370 -69361 88173
10917 88173 -146868 -277960 -286413 -185509 -9406 -151008 -87640 -425123 -313614 -151744
10907 -151744 -106276 147208 114059 2735 -75618 -237949 -192132 -251352 -126486 138305
10897 138305 34117 -353345 -338851 -192551 -384230 -267380 -179688 -202271 -30556 60597
10887 60597 94226 111743 251470 -27288 -39030 -149073 -247230 -256049 8685 2229 -111378
10876 -111378 -33844 -181455 -275772 -249511 -315843 -340449 -185039 -262706 -397559 -177699 102250
10865 102250 20338 94419 -239346 -366416 -357043 -481596 -545929 -490355 -298588 -131423 -275334
10854 -275334 -502132 -224967 -128965 -239013 -312430 -279267 -458587 -119750 526 -178680
10844 -178680 -100698 137696 -156998 -187233 45898 121075 167010 251497 180819 30074 68902
10833 68902 46045 140977 109910 422450 132429 55300 163687 260073 51653 65885 64493
10822 64493 155143 342554 502140 171026 -107925 -219754 -47706 78284 -49515 77147
10812 77147 264016 177404 309305 311444 272914 297094 467289 526118 434360 178394 182681
10801 182681 289911 291176 274711 283971 159467 112740 301257 524201 663421 391711 204687
10790 204687 275010 207107 188400 324533 292952 258743 524651 513464 140525 237208 132035
10779 132035 120963 457287 458913 -18900 175116 425361 431632 341202 581334 696250 588112
10768 588112 820703 905680 605024 641186 724527 608077 360676 405194 500676 504111 575768
10757 575768 440655 496334 760244 612399 878885 757331 685617 673183 965610 1095553
10747 1095553 846060 777015 1010321 1017187 1185925 1185015 1135294 807169 757314 1184150 1186834
10736 1186834 1302953 1344482 1423247 1552920 1464095 1237964 1403185 1483654 1587924 1719729
10726 1719729 1491926 1507134 1716579 1735896 1816180 1739043 1951845 2070515 2112555 2478623
10716 2478623 2295703 2315504 2457253 2412746 2240040 2303174 2496658 2370720 2669279 2765492
10706 2765492 2758834 2666778 2698706 2762866 2832357 3137029 2886517 3181721 3758334 3908366
10696 3908366 3928277 3653065 3859861 4112535 4162243 4328827 4718606 4917502 5117708 5259951
10686 5259951 5516859 5746708 5843682 6072128 6339991 6675649 6882838 6925047 7245859 7736063
10676 7736063 8147299 8405654 8789914 9164711 9789161 9991456 10037480 10187124 10823131 11309288
10666 11309288 11596528 11978639 12335784 12458409 12535736 12883266 13232092 13634079 14010906
10657 14010906 13967173 14341959 14633275 14832981 14773248 14984430 15356002 15591360 15928422 15944476
10647 15944476 16072493 16224517 16416229 16508660 16515726 16627290 16990189 17231597 16970188 16879690
10637 16879690 17041941 17038493 17209745 17564572 17752156 17634512 17635356 17542322 17603787 17658600 17393560
10626 17393560 17149963 17325722 17067007 17066381 17076170 16845436 16861957 17069739 17006425 16695451
10616 16695451 16372297 16126418 16082277 16072018 15886664 16110396 15978981 15669186 15418136 15108875
10606 15108875 14900543 14454636 14272372 13930274 13654894 13432510 12985727 12536430 12266977
10597 12266977 11887333 11332074 11050908 10783475 10206694 9797739 9425431 8960246 8407928
10588 8407928 8340414 8321643 8131881 7580171 7182076 7040233 6892434 6866701 6416362 6192166
10578 6192166 6256309 5939587 5471311 5437340 5199736 5026282 4765221 4707811 4666687 4505090
10568 4505090 4343425 3979454 4077053 4094888 4006296 3685638 3550732 3679500 3421453 3614109
10558 3614109 3656868 3312545 2958264 2885867 2891582 2768832 2879408 2842826 2584753 2467091
10548 2467091 2613897 2523038 2328830 2405295 2612180 2035005 1888055 2034274 1970569 1788175
10538 1788175 1945905 2334547 2186471 2035322 1812334 1709314 1493144 1411110 1274925 1425043
10528 1425043 1463367 1334244 1478860 1377437 1225643 1319937 1294485 1426342 1387683 1530713
10518 1530713 1245432 1197318 1002922 1075933 1168117 1183215 1150837 1189424 1130921 847668 1015867
10507 1015867 1123022 1104299 1064109 835523 918605 929304 868730 821229 589939 551247 482487
10496 482487 425654 538661 661945 462944 452979 365486 470078 489602 267925 204890 542693
10485 542693 629449 516709 582359 319740 495096 610087 301519 451810 678205 632852
10475 632852 502149 294269 194850 415917 611687 714377 429535 300640 230579 334252
10465 334252 403529 316615 236296 427985 185800 438971 447437 279024 512308 497698 238697
10454 238697 196992 227493 302140 514281 569444 306753 312747 435709 369287 325358 437330
10443 437330 292301 231412 279147 289009 223614 239984 31174 -18245 -37659 -47197 -8206
10432 -8206 -44504 -21251 26443 129746 167780 146481 59520 191379 98536 160275 153346 241551
10420 241551 192407 -113624 -183970 228711 414295 381767 298393 38641 308039 222198
10410 222198 -376608 -46519 178608 -130130 -181642 -161585 -254104 -236730 -253090 -243438 -244909
10399 -244909 -65864 -154597 -46373 208557 309532 314099 76558 243630 230704 -66761
10389 -66761 -173123 16943 -80353 -131955 -53147 75926 46287 -199883 -291216 -382556 -169056
10378 -169056 195039 -159347 -210842 -148192 -54953 43101 282625 335054 -103699 -130956 -69989
10367 -69989 130861 72215 -5556 -40009 -24794 42174 139993 -92212 -10705 -105184 -4946
10356 -4946 -99019 61091 393406 175303 92161 -5794 -127391 24336 16766 -143944 -78254
10345 -78254 93146 66327 117960 -29682 30171 295012 171159 -13697 -298334 -228827
10335 -228827 352130 287736 37431 11196 52158 143429 112303 57931 63472 112429 -31133
10324 -31133 -157894 34953 279173 198762 114610 150410 -28206 -194360 44129 65347
10314 65347 -798 126289 88348 26959 -178187 -54407 96183 -161337 -136096 74200
10304 74200 -112185 -71818 -198051 -153798 -271406 -535761 -532597 -533193 -285260 -172967 -8075
10293 -8075 96389 120236 67400 89244 92084 -30763 153817 43998 97816 188063 26610
10282 26610 221366 218694 -218030 -319561 -159608 -211751 -225271 -125371 -144981 103714 8506
10271 8506 -88516 -1805 -302458 -158364 -325616 -122745 -254434 -220275 -192674 -247539 -107424
10260 -107424 -178870 -375929 -214439 -75515 52685 -199262 -266650 -312333 -387606 -356269
10250 -356269 -492527 -313933 -124222 -76134 27505 -14678 -43841 -285877 -387862 -484639
10240 -484639 -154394 97127 -26215 -411985 -444046 -395212 -112395 -29460 -162038 -307534
10230 -307534 -306913 -45239 38853 -183689 -384324 -435496 -93488 97522 -115959 -37186 127723
10219 127723 33344 11186 164469 111732 217954 -35176 -47504 -97716 -349604 -392927 -465490
10208 -465490 -415992 -54479 -139412 24546 148725 152287 -252924 -9813 -49035 -143864 -120263
10197 -120263 -313287 -714252 -589878 -263803 -289117 -270117 -290863 -123759 -292064 -42176
10187 -42176 -229068 -332247 -127621 -315126 -399693 -367172 -239905 -554261 -405530 -459455
10177 -459455 -253074 143604 12514 -257421 -308721 -335497 -167798 -185147 -316614 -298490
10167 -298490 -225162 -140706 -126727 -41237 -44531 -336774 -271385 -277548 -27258 74862 -145733
10156 -145733 -206148 -313186 -476846 -382674 -126668 -75949 -217405 -562034 -177829 -422857
10146 -422857 -373813 -181091 -204035 -17447 -31767 -113408 -55298 -175555 -75023 -63675 174971
10135 174971 72705 -149259 17843 76893 -212354 -43710 -32307 -179361 -80407 -162491
10125 -162491 -60537 -9367 -89921 -203367 -340787 -265782 -98855 -110588 -261548 -254581 -66932
10114 -66932 -26734 3700 -279041 -312458 -228953 -14600 -210819 -441520 -394135 -146197 -274150
10103 -274150 -521970 -478583 -217533 -128051 -170254 -301894 -365540 -215390 -269544 -373420
10093 -373420 -267888 -258013 -272628 -107087 -149342 -176488 -108757 -204477 -459727 -456715 -104175
10082 -104175 -201450 -537206 -402645 -65850 -198605 -451338 -480648 -437120 -272785 -388565
10072 -388565 -261372 -375490 -112439 -14287 16938 -30749 -163290 -133300 -48467 -50293 -324297
10061 -324297 -304031 -406224 -437645 -349632 -164283 -252406 -100640 95763 -35603 125261
10051 125261 206384 154424 41565 221783 147802 69645 79122 -76108 8142 82727 2812
10040 2812 -289889 -218167 -177 -233476 -65617 50845 -24784 262690 373859 107701
10030 107701 12970 -86682 -96258 166366 -51160 -51750 -141730 -82219 -47107 35758 12681 -274621
10018 -274621 18741 26315 -18058 22909 -177499 -88249 147084 200409 254432 233113 -39289
10007 -39289 121801 208174 -59596 -42623 -100479 -38834 146954 40283 122771 328776 196301
9996 196301 -18923 20859 174150 77720 91243 366093 571051 738853 509351 181554
9986 181554 261879 291375 370391 181957 104974 262297 333834 386386 151032 242360 478761
9975 478761 289418 254607 396366 551891 527328 293229 30304 480584 557173 637504
9965 637504 428416 384098 560153 405169 500606 375701 328898 429202 738471 723770
9955 723770 871509 591604 621978 901051 1068627 935154 878476 1101686 1191785 974278
9945 974278 1045262 1381703 1741997 1529789 1352220 1531455 1959865 1953534 1905197 2140857
9935 2140857 2037352 1882965 1820470 2112827 2213276 2605215 2771084 2759887 3034746 3384495
9925 3384495 3816764 3897924 3743687 4262630 4472552 4954950 5490329 5822649 6414841 7148929
9915 7148929 7668925 8454827 9640446 10845741 12670067 14932872 17910088 21458520 25796551
9906 25796551 31135775 36422148 41373414 45379282 47769607 47819696 45233060 41521060
9898 41521060 36824380 31595801 26936872 22757430 19226385 16383998 14070221 12440260
9890 12440260 10792360 9372072 8518307 7683844 7284343 6921691 6440072 5970815 5291636
9881 5291636 4893595 4550031 4259750 4076726 3803712 3641049 3291415 3128125 3097897 2965708
9871 2965708 2775320 2623333 2418225 2488599 2591751 2564443 2373234 1957849 2024147 1975731
9861 1975731 2090089 2056839 1709782 1734315 1464131 1398845 1479846 1528116 1569160 1417036 1284573
9850 1284573 1415677 1364435 1296571 1367530 1199945 916626 1161540 1328146 1233572 1112433
9840 1112433 1245355 1173317 961065 980160 1070616 1138189 963535 1090011 1133722 921353
9830 921353 603580 699158 865222 588637 582932 625489 696595 852377 760616 813492 683857
9819 683857 772713 726650 1258770 1033787 722689 660335 474439 541278 555245 380583 311087
9808 311087 358343 443227 812653 720592 565302 579896 510202 485516 412661 504288 555665
9797 555665 872790 507387 278790 567531 421900 178175 215227 363304 224689 196509
9787 196509 -27000 2207 152963 358298 355147 600723 758669 335085 345246 546226
9777 546226 456473 321404 443107 650581 544962 426578 399646 407039 449250 219561 340359
9766 340359 392532 328512 240857 199683 340259 304843 109255 -18166 174457 594758 467468
9755 467468 239913 218047 190513 213848 10693 -177722 -218411 -109575 -314328 -284826 -254469
9744 -254469 197331 83296 76078 361499 446372 615880 323955 115467 171144 63553
9734 63553 114537 196509 126254 57932 176549 62794 168101 125955 311257 411224 238637
9723 238637 289091 280685 -193506 -142234 -67192 -98524 -48799 1318 -71903 -61198 252464
9712 252464 86119 -67485 240299 152506 32207 25926 164387 412794 390077 16068
9702 16068 272326 508588 594555 585700 786855 910767 666884 899534 702308 1073193
9692 1073193 514910 -168058 61465 304540 174156 152284 301053 68513 -309559 53622
9682 53622 449122 528863 511219 374143 237989 439132 818259 1123704 1600538 1712932
9672 1712932 1543573 1673191 1637817 1413643 1011276 965817 748641 545262 432460 324464
9662 324464 648953 730452 596732 343565 135294 259582 54001 13622 -84121 -125626
9652 -125626 -78005 -54934 -44309 -71694 -77653 -256422 -334193 -25271 184369 -130694 -121136
9641 -121136 2457 63401 9202 61598 216469 -16220 296197 471365 626085 412814
9631 412814 215984 189682 110171 -128244 -33668 23775 -149201 -88294 -11305 62961 -73230
9620 -73230 -82612 -198869 -49379 -10997 -43174 18743 -87832 -6378 -56654 8626 8845 -204855
9608 -204855 -345314 -18020 87062 183267 276720 107213 210902 3157 -35210 -174339
9598 -174339 88623 58885 -176827 118767 -16888 -36378 -236545 -188431 304947 152627
9588 152627 91001 139467 -113178 -135059 -151 -67818 -45610 106397 241063 102797 -108698
9577 -108698 -203259 -57265 -51979 187061 221155 -180982 -459145 -363443 -101433 -88830 1021
9566 1021 240709 23282 43249 -117926 -135580 67247 299699 283668 33414 -94488 -155381
9555 -155381 -255940 121483 252107 198290 20534 -136532 -23650 -45319 42994 155252
9545 155252 43165 -331689 -498812 -293199 -248946 -85762 -172368 -102019 -87455 178067
9535 178067 216701 -49255 92388 -148597 -101806 -153184 -185089 -199575 -226717 -155041 2030
9524 2030 -173245 -257870 -150498 -91134 -81503 232367 176634 -153433 -167583 -62379 77970
9513 77970 139402 327716 320261 521149 745627 788403 1085086 1206688 1170208 1112931 1222049
9502 1222049 1016821 599994 532656 633998 731746 532239 259168 357761 277664 387170
9492 387170 129294 -2751 30686 -115515 191576 358040 299527 194262 411439 163742
9482 163742 158290 30769 -321729 -355438 99116 130989 -37341 -134404 -265318 155085 200092
9471 200092 193688 244381 -11435 -130538 -59778 328265 390068 46891 107714 228845 377310
9460 377310 264361 442622 366767 106628 104437 461556 385670 126663 1191 135106
9450 135106 396766 214452 310478 376009 324334 105823 -9317 200179 353339 277084
9440 277084 -47171 177660 186700 76115 120976 -74013 -298176 -59609 -16633 72743 -86668
9429 -86668 41678 19117 67563 44374 -136873 -105343 -87908 135598 -164262 -117583 -69509
9418 -69509 146657 129927 18649 48053 -132669 -107130 84078 68247 -232999 -206492 -123703
9407 -123703 -62761 -102420 -291054 -221038 -248141 -367395 -390445 -341463 -409012 -417853 13351
9396 13351 128356 -106274 -149078 -266089 -86979 -140836 -238724 -135048 -202110 -345275 -390062
9385 -390062 -402211 -237287 -392449 -363083 -72483 -34439 -316061 -295730 -31066 -265040
9375 -265040 -242341 203492 47689 -294221 -294415 -214375 -97162 13618 122000 -87218 -101257
9364 -101257 -206117 -117101 -180409 -232297 -120810 51167 114532 -210416 -99263 97649
9354 97649 -100401 -331798 -70402 162714 145430 -253505 -496452 -389002 -198770 -23667
9344 -23667 71159 129705 -7374 -67576 31314 54169 236997 204222 125233 221860 -64844
9333 -64844 -216105 -67475 70901 17443 -175538 -297980 -42346 136612 1946 135824
9323 135824 -63216 -270248 -340168 -296770 -199212 -112210 -257792 -321191 -47232 -70109 -128453
9312 -128453 -20758 -160928 -111161 116001 124057 59778 -24807 -187566 -137798 109470 190568
9301 190568 102712 -270101 -140572 -90665 -419500 -398716 -428530 -369666 -123143 -48158 -267289
9290 -267289 -111600 80304 -125728 -14766 -128193 -483681 -399861 -182799 38202 -207955
9280 -207955 -268699 -31145 203375 -30118 -205468 -142944 -163252 -54013 -96755 41911
9270 41911 142112 68973 -115847 -34938 274797 229049 -38739 -169590 -99449 -226206 -1298
9259 -1298 113462 42842 -181910 -98895 108434 -218349 -225441 -175959 69168 36013 -106526
9248 -106526 -126359 -44445 116640 170187 143589 80533 -65369 -212359 41788 150872 62511
9237 62511 -13058 -145056 -446970 -456049 -97278 -69778 158435 177657 97352 363840 155569
9226 155569 -79897 -245188 -211591 34603 -182219 54197 -20796 109419 193822 42729
9216 42729 -281456 -320804 -439123 -400319 -375441 -36369 -257851 -331453 -154297 -99646 -25067
9205 -25067 18378 139949 -74223 -278615 -334527 -277500 -162099 143769 114309 192530 52247
9194 52247 35781 113951 74140 131409 24583 89076 279964 317402 352065 240500 111269
9183 111269 210377 149101 32249 80172 -164967 -162102 30822 -188448 -208145 -335879 -354646
9172 -354646 128636 311208 152691 -164862 -121476 -247473 -270620 -346018 43627 225629
9162 225629 210128 292687 222450 -112597 -229542 -49629 248952 334790 132918 766
9152 766 -291478 -101644 -52434 -63208 -104959 -277006 -149507 -58141 -234224 -187915 36879
9141 36879 -20827 -93738 57623 123254 68316 56884 -164121 -165620 54793 25497 137224
9130 137224 256275 131968 -55440 -104633 29864 -9076 -63972 -246807 -312336 -380325 -192670
9119 -192670 -125006 -266057 -55334 67789 -196352 -173286 -71565 -58113 -17365 57374 14545
9108 14545 14651 283800 223083 -168156 -162436 -113094 -177139 -297734 -193327 -77082 -159753
9097 -159753 -248417 -154943 -143641 -15994 171918 219859 -11036 -197491 -27016 3068 29402
9086 29402 -3631 -143820 -215303 -287168 -260498 -173118 -231319 -127435 -60938 85269 110635
9075 110635 175744 90262 -70603 -62518 -132573 50279 10415 -133842 123492 56218 235
9064 235 249399 332295 218209 295082 117688 236944 -13114 -414298 -296263 -103937 -252779
9053 -252779 -172409 -23431 -221643 -72856 82204 -9404 90907 14380 62710 83601 42637
9042 42637 171834 1731 -48672 -101179 118047 6826 -14072 -124813 -175507 -119939 -213313
9031 -213313 -1452 146273 277435 74830 -121292 -318051 -216394 -98882 71170 -78817
9021 -78817 -166899 31194 58373 135432 106718 157361 77762 -134672 -5759 -7819 -105622
9010 -105622 -47800 -65630 -179379 -114993 137529 218249 173703 136252 113200 -63854 -435
8999 -435 180427 259258 -131784 -181244 46559 8167 -78168 -264622 107069 199783 86093
8988 86093 108074 42067 69939 165267 -91561 -64281 6263 -51555 117797 219027 308501
8977 308501 111702 62330 -79880 296463 235813 137489 140687 -45207 202098 -30098 -73314
8966 -73314 6737 -18305 -153028 -76397 -155421 1881 42842 -18426 -1933 -161926 -138021
8955 -138021 -21015 161195 44266 131880 156088 77863 308845 290144 -96660 -219505
8945 -219505 -39162 -213192 -299006 -194161 -126481 19970 78023 238376 66834 566
8935 566 -128530 -175400 133381 164156 -81350 -28838 -327131 -78128 252936 276792 409071
8924 409071 312117 394623 181821 -145177 16900 204111 -56493 -80891 101055 398589
8914 398589 91892 -160334 -41828 -160326 -81988 109322 262617 281056 372077 185124
8904 185124 83148 124614 115205 205575 457682 256882 169957 234198 84429 202832 430986
8893 430986 774275 1020179 1521769 1739880 1634153 1572812 1364888 1029469 872375 730870
8883 730870 697985 541429 435787 178219 138771 137544 39857 165566 103232 67955 -39455
8872 -39455 146485 59070 -197137 39013 97185 171598 130806 118427 -82612 -55632 269323
8861 269323 256763 311511 301373 681930 394632 396708 408881 215976 55381 4194 249612
8850 249612 311473 270579 364477 311649 220401 -59014 -39519 176153 215912 119472 413488
8839 413488 397771 151369 158770 58053 46429 77939 68324 -46316 210174 297036 344206
8828 344206 107663 57851 65149 293505 87933 47923 -86104 -229820 -349211 -265149 126525
8817 126525 97628 17349 -241536 -68097 176549 -144170 -297803 -142978 -105004 -41282
8807 -41282 52316 -48610 -228752 -432635 -240342 125042 219966 176350 80597 -214479 -207770
8796 -207770 -244407 -11639 -30859 -11680 -333020 -259647 55659 -177114 -264208 -244016 -270361
8785 -270361 -166763 217968 32498 -18096 3512 106559 -43143 -81557 -276957 -440134
8775 -440134 -301382 -319637 -347538 -309459 -316435 -86071 -150422 -124080 -88847 -197378 -229360
8764 -229360 -236951 -148144 3599 -116725 58944 27160 41824 155588 -8755 -234024 -163515
8753 -163515 -37838 -164882 -125113 30232 179704 146737 -70557 -271678 -163651 -283475
8743 -283475 -295125 -31973 -122511 -71718 -109294 -338479 71473 13805 50352 -17220 -146629
8732 -146629 60059 -63578 -195756 -89387 -289649 -16711 137985 36998 -128858 -208246
8722 -208246 -76710 -278761 -193008 104359 -64414 -164366 -134440 -90576 -91354 92935 101483
8711 101483 9882 77750 107152 166222 270188 142523 16993 -136703 -47323 -47991 -113975
8700 -113975 37356 174109 286249 94792 -39201 -33844 168959 75659 -87574 -166109
8690 -166109 65553 217468 -111264 -414050 -470396 -448393 -203991 -43930 -156325 -1918
8680 -1918 -14737 228213 149889 -260337 -83301 -355200 -158234 -158984 -146816 -269933 -175017
8669 -175017 -206424 -68147 -56393 -146917 -270632 -110469 -85057 -170361 184536 -209229 -417109
8658 -417109 -229100 -237427 -73708 68786 -6563 204960 147428 310024 161035 -392455
8648 -392455 -256528 -31455 138673 169735 -42938 -117251 148965 272203 153753 211402
8638 211402 180808 -4166 -95228 -2574 -60558 -212807 -137646 4199 338728 202910 -89545
8627 -89545 -286756 -305803 -119096 -13154 -34124 55549 20036 -317973 -199964 -101615 -121593
8616 -121593 -36681 -89984 -218527 -270320 -261651 -106288 -58055 -130815 -195931 -9311 2615
8605 2615 -82579 97119 78751 -63441 101986 -47521 -1187 -191689 -45505 -144024 -85427
8594 -85427 -83624 -208118 7168 40455 46541 -153114 34577 46119 -94659 -48937 -230945
8583 -230945 -144330 -240369 -244298 -43525 -16530 -91503 380505 626461 -264841 -256027 -145991
8572 -145991 -294409 -214983 -95779 -40516 73055 -112380 -338946 -226585 77322 -86410
8562 -86410 -89077 143805 79974 60128 106237 17936 -217574 -567851 -374327 -80086 -176991
8551 -176991 -174493 -193602 -231853 -241115 -98560 124264 194139 103395 -12034 -142837 -36043
8540 -36043 -206485 -81371 -239033 -297044 -258689 66508 70317 281787 -65160 15322 112014
8529 112014 169915 212325 10454 124449 -24840 10530 -167592 -154749 -164558 -16161 84966
8518 84966 138681 108039 -61163 -65429 -10653 60511 165421 -56142 -371254 -338632 127563
8507 127563 35185 -278264 -293674 -295770 -300155 -183381 -221754 -201816 -60602 -194332 -123408
8496 -123408 55598 -35679 251724 308455 34665 -321580 -314118 -311611 -451499 -538206 -235247
8485 -235247 -179996 -257456 -357648 -171865 -92307 -186602 -541606 -530195 -359698 -212901 -180943
8474 -180943 -83575 238260 323467 269248 -34275 -216990 -375654 -100309 -128811 -279956
8464 -279956 -205529 -248528 -139406 -29534 318 -266040 -232669 -102173 -234780 -88700
8454 -88700 -26021 120571 75860 -222704 -280086 -111693 21476 -118552 -84414 -214195 -217551
8443 -217551 -420281 -560186 -568453 -74762 116415 -114171 -19999 50597 -89790 -512 260878
8432 260878 -62299 -128695 -214615 -450877 -478812 2188 106604 255348 99701 -125160
8422 -125160 -13143 38537 -177778 -185270 128042 142787 110013 259112 340429 -7185 -33856
8411 -33856 -48917 -154923 -164446 -161015 -135407 187344 79296 -267301 -109204 -503316 -255746
8400 -255746 -86735 -46202 -26290 -30889 -145727 -211680 -135023 -30544 -1623 -196286 -173919
8389 -173919 -96216 229590 182966 208786 112527 29926 159838 -38520 117744 61917 117185
8378 117185 137459 15949 -120629 103373 18639 70307 -134380 103301 171039 114867 117627
8367 117627 -121608 -153266 -310821 -216145 -199424 -328230 -408664 -523710 -446818 -173665 -269304
8356 -269304 36981 148674 106737 -108254 -18640 -20541 -231750 -351948 -323487 -150038 -299494
8345 -299494 -57538 -144938 -293788 32499 107967 -33709 -87109 47822 227992 183366
8335 183366 -61793 32996 116733 179123 -70146 -137687 -303761 -117401 198145 197340 202191
8324 202191 -64360 -115790 -81408 -114213 163446 -10413 59783 27667 108046 191026 209582
8313 209582 -90166 3021 232085 277563 177555 242809 96720 308295 392820 230859
8303 230859 88753 67108 166469 52250 125012 -214157 -15000 78341 330 157088 268788
8292 268788 102846 171423 -16137 6960 -154342 -39067 70118 379162 157435 102988
8282 102988 -85109 -255889 -15899 357372 382158 133146 -61491 -53172 162038 174603
8272 174603 276327 527164 329288 -156516 109102 273502 234536 -179659 -251056 70678
8262 70678 127396 72978 -134906 -440581 -296525 -145104 52303 -19834 94619 -162212
8252 -162212 -297476 -291801 -97181 39352 -165835 -164188 154688 -13249 -30066 -8786 -102215
8241 -102215 -47150 -60565 40129 17205 46552 -37137 -300711 -223284 -243684 -142501 -40925
8230 -40925 -204026 192277 52567 -315447 -36193 153700 43837 165833 -292359 -280927
8220 -280927 -236360 -26202 -39939 -71626 -4280 -21244 -11003 31162 -98665 -159895 -352799
8209 -352799 -299440 -219715 -93114 -48208 -105936 -184958 -283776 -195188 -34755 -379056 -264250
8198 -264250 -112534 -343250 -301447 -468372 -228740 -681013 1639638 1599326 349488 675476
8188 675476 650258 898314 535609 410383 267376 90808 -61165 -21138 -75427 -195304
8178 -195304 89409 284032 91500 350990 260218 -48 107510 77255 -121895 -305647
8168 -305647 -329442 -50230 119728 439069 355671 174525 28064 -1051 94660 -174014
8158 -174014 -48586 345219 304877 113735 107547 280899 87601 20922 21066 111151 -82376
8147 -82376 -91477 -231417 -311471 -17057 -7011 -15579 -152530 -134604 -224806 -277543 205596
8136 205596 317604 257855 113881 40648 -41658 112838 188862 198375 274059 62715 70578
8125 70578 43934 287879 103925 4558 -180206 -31009 -204782 -209754 -100078 76042 100814
8114 100814 17350 22239 -21103 -124666 -108767 118496 360141 356209 -79458 146624 139601
8103 139601 86835 -61776 67840 68850 90258 165800 170805 267418 343142 272462 12639
8092 12639 53622 125488 328290 490545 173928 97982 6508 -223233 -192953 159586 311222
8081 311222 268377 321671 130165 106919 21168 24067 -11655 22168 -175465 54213 279237
8070 279237 175910 169228 461720 486226 437776 353116 303123 359071 213927 366499 292730
8059 292730 84434 58020 32453 -95016 18251 -4667 27888 222958 182216 175773 93994
8048 93994 136122 70736 32183 104596 107837 232545 231475 107129 185261 173500 266442 -107636
8036 -107636 -28333 259608 305050 476093 245998 394772 365704 145825 243406 7373
8026 7373 2591 229438 188864 159430 -20015 -54106 223313 288525 178672 153331 230750
8015 230750 189998 322677 485057 147582 178736 575187 697691 527933 379195 285129
8005 285129 342192 342428 237624 188498 281420 328029 273538 476066 465588 80374 74111 130351
7993 130351 405072 258756 247923 37080 73798 42601 -53447 62310 -271154 -146561
7983 -146561 316955 331078 257665 269132 432691 417722 400895 264397 223170 501415 316803
7972 316803 533003 471476 264338 134855 340070 283882 -81716 125683 193369 263755
7962 263755 240943 188058 165760 147985 461974 326327 164158 117125 212098 92945 -32403
7951 -32403 259609 213510 290260 389754 270796 49564 148944 155994 11933 75871 340036
7940 340036 404305 259262 209188 336615 201760 86876 -101920 146776 147682 176434 128885
7929 128885 79858 -65306 -267856 151834 175720 156644 524212 758088 524070 371549
7919 371549 312199 -116473 39862 74650 201918 511650 418242 440697 400051 483224 341791
7908 341791 445443 444449 524203 585895 671349 180894 259539 505161 456340 236603 368865
7897 368865 417849 315123 433804 550963 152403 264715 609057 547894 433157 570994
7887 570994 660738 497859 508364 455356 380233 424181 379243 359226 403156 391413 326600
7876 326600 579982 592223 532750 433635 279184 424989 449640 843021 744930 669075 699632
7865 699632 783763 880012 844036 634469 500952 525598 488357 214767 -212235 230523 360283
7854 360283 383261 624331 711663 772266 735190 723704 564636 548652 794826 1022281 693658
7843 693658 803104 986054 792144 610877 639451 613893 840643 982270 690562 550214
7833 550214 593793 582763 715761 722859 634024 576946 666198 938951 880475 701563 985979
7822 985979 1189919 1105282 829575 790725 1013400 961909 872555 758603 745956 1118767 1322370
7811 1322370 1445749 1442199 1707208 830446 566897 1097175 868749 798757 609992 616085
7801 616085 823982 922436 552534 560513 921831 1392583 997127 753053 903615 946929
7791 946929 936581 1165971 1104526 986402 738736 689365 867818 462242 690843 858497
7781 858497 868724 846365 810747 548137 589338 755135 999207 844081 799396 1110643 1048851
7770 1048851 800032 804602 774255 1018175 1128616 835826 916249 959411 797047 878915 709393
7759 709393 638334 689333 1066259 1147916 1009019 1029974 901112 990501 1232165 1465729 1084306
7748 1084306 991210 1060096 1203954 1139951 1441570 1204487 1051075 956014 817803 939701
7738 939701 1104341 950588 825744 914924 1143793 1317067 1265173 1261496 1495829 1430207 1160313
7727 1160313 1109003 1071172 967771 796030 931665 1325139 1141984 1052070 1247181 1195556
7717 1195556 1195744 1102137 1150344 1284395 1365895 1133158 1166639 1223639 1223208 1404072 1430144 1279572
7705 1279572 1540381 1880592 1466095 1312066 1467458 1268366 1312432 1222286 1048968 1151771
7695 1151771 1358805 1363315 1257799 1310525 1586384 1646088 1708413 1636290 1475160 1450398 1508865
7684 1508865 1705448 1583872 1566287 1506265 1398373 1417569 1433384 1581175 1718595 1415182
7674 1415182 1311960 1427000 1382926 1437818 1306424 1526616 1361050 1298201 1413100 1362771
7664 1362771 1450608 1401377 1446398 1457307 1523256 1720047 2011368 1858918 1674718 1544927
7654 1544927 1881092 2084626 1874462 2033034 1898665 1835006 1707651 2179593 2132594 1864219
7644 1864219 2441903 2311738 2022017 1981752 2064486 2204824 2114696 1930592 1944002 2433266
7634 2433266 2419225 2395731 2318819 2290784 2391584 2423819 2628440 2744796 2863073 2924062 2941869
7623 2941869 2560491 2667781 2678160 2340261 2432812 2542434 2673296 2557502 2674880 3059079
7613 3059079 2949245 2735704 2856394 2868094 2805675 2912766 2883707 3029188 2855050 2930546
7603 2930546 3017871 3079905 3248442 3355372 3098965 2936725 2954888 3121010 3180165 3144778
7593 3144778 3347624 3334483 3283078 2999184 3260282 3415762 3397677 3545922 3614081 3453743
7583 3453743 3545492 3536468 3647860 3656273 3429583 3278684 3426550 3623539 3659308 4076987 4096872
7572 4096872 3843300 3761311 4029237 4226263 4380967 4180283 4405291 4562942 4333969 4156594
7562 4156594 4388385 4336251 4420575 4524515 4728097 4870553 4709435 4787155 4928015 5093151
7552 5093151 4956733 4760623 4973181 5067833 5302887 5342117 5397066 5712279 5687305 5897464
7542 5897464 6031643 5869603 6096040 6195407 6051062 6346151 6542628 6742480 6957267 7496064
7532 7496064 7678410 7797803 7729403 8035849 8251707 8626351 8853416 8798829 9185414 9424388
7522 9424388 9830579 10308941 10470861 10546161 10971137 11387295 11549653 12101499 12532664 13232162
7512 13232162 13777082 14278388 14752547 15092072 16055158 16958750 17705108 18579325 19463388
7503 19463388 20483049 21640086 23143765 24745586 26345402 28349157 30563901 33007161
7495 33007161 36109335 39479859 43447851 47384186 51765808 56251755 60575841 64996276
7487 64996276 67875552 69884587 70852701 70576135 68606962 65873565 62403897 58843068
7479 58843068 55008794 51157316 47833184 44414835 41392174 38646096 36237341 33945949
7471 33945949 31894255 29945173 28310735 26997100 26104942 25324120 24715259 23807981 23397325
7462 23397325 22886732 22253289 22100312 21830931 21589945 21414426 21261048 21249149 21367981 21323171
7452 21323171 21645112 21695940 21784225 22023017 22277415 22675666 23227141 23762217 23998476 24353758
7442 24353758 24811581 25484925 25835910 26379547 27192854 27760506 28264513 28940076 29754019
7433 29754019 30853192 31872154 32715724 33823698 34950096 36059801 37432814 38675514
7425 38675514 39823835 41313203 42890677 44580726 45854064 47532625 49308660 51667113
7417 51667113 53775258 55601179 57653565 59839185 62190001 64778002 67178982 69839485
7409 69839485 72808068 75949484 78867125 81955304 85233310 88995794 93197842 96975053
7401 96975053 100775500 105037416 109334422 114067442 118968355 123886910 128966075 134573181
7393 134573181 139991625 145477122 151333643 157517768 163917297 170479385 177509810 184808865
7385 184808865 192301174 200343615 208723289 217286858 226210627 235611164 245265805 255315615
7377 255315615 265876269 276954297 288451928 300125547 312210740 324296337 337023550
7370 337023550 350084371 363715757 377433900 391494836 405704554 419954658 433967743
7363 433967743 447596262 460556479 473575698 485863319 497141868 507200857 515801054
7356 515801054 522592777 527595471 529926379 530122288 528587422 525140054 520469728 514851730
7348 514851730 508099236 500978615 493980266 487408376 480773415 474363083 468342532 462551478
7340 462551478 456619602 450932529 445550235 440499708 435728637 431183046 426958506 422757306
7332 422757306 418865106 415311785 412143057 409044830 406226654 403172755 400364482 397535162
7324 397535162 394438484 391364178 388200599 385323471 382335104 379205649 376639707 374151063
7316 374151063 371965054 369828908 367923081 366732394 365790901 365382582 365087367 364336530 363628441
7307 363628441 362466604 361107598 359431200 357643104 355475608 353524709 351264704 349261755
7299 349261755 347766612 345849272 344273287 342712678 340840276 339519342 338247952 336539233
7291 336539233 335317185 333983591 332929911 331702656 330501399 329667481 329153369 328848494
7283 328848494 328631891 328506093 328270555 328084027 328278956 328215139 327907901 327811838 327656180 327087821
7273 327087821 326159160 325555796 325181374 324362575 323078749 321548748 320025645 318428212 316344740
7264 316344740 313357358 310208079 307338375 304257246 301369026 298787642 296079269 293577250
7256 293577250 291919735 290457989 288884019 287205075 286071754 285292494 284722158 284574353
7248 284574353 284284659 283984834 284662448 285068169 285836607 286890426 287463730 287779168 288451626
7239 288451626 288409521 288273760 287954848 287604225 287718821 287254052 287129046 287057887 287154256 286905282
7229 286905282 286921250 287090496 287594597 288413260 289090166 289865838 290863947 292179304 293790233
7220 293790233 295899051 297998323 300583966 303186753 305821774 309160241 312506227 315728643
7212 315728643 319442616 323774583 328132553 332298614 336789067 341289215 345024262 348406801
7204 348406801 350813729 351981943 351438923 349158942 345552844 340425642 333942823 326372717
7196 326372717 318242190 309273866 299655776 289958131 279879146 269361361 258633823 248555764
7188 248555764 238646010 228572492 218913924 209352658 200132895 190881947 182014953 173180025
7180 173180025 164592260 156430470 148510456 141080898 133717430 126786005 119955313 113341281
7172 113341281 107131796 100974725 95221851 89757187 84624273 79493902 74609998 70081060
7164 70081060 65400463 61157721 57325937 53549934 50140099 46993647 43840097 41231591
7156 41231591 38880266 36943545 35005591 32993997 31320361 29809680 28505383 27471897
7148 27471897 26514801 25436122 24315047 23576455 22899385 22219845 21272892 20530594 20183449
7139 20183449 19312618 18626400 18289208 17712117 17215030 16702189 16192938 15919019 15665565
7130 15665565 15171620 14676011 14583190 14419265 13973783 13831681 13518192 13349786 13151678 12528031
7120 12528031 12115508 11729065 11568987 11228701 10914988 10785105 10414566 10357365 10458024 10244477
7110 10244477 10330980 9843277 9274996 9080183 9351261 9120652 9006310 8914286 8730070 8632916
7100 8632916 8428109 8387942 8380248 8389712 7913614 7864104 7918944 7664395 7158429 7682611 7321133
7089 7321133 7009440 6955366 6817673 6713223 6449158 6338141 6488307 6693044 6311013 6082426
7079 6082426 6103019 5812400 5797061 5915288 5661304 5486714 5542179 5865440 5798201 5853219
7069 5853219 5709159 5536936 5717041 5457449 5208793 5209171 4981560 4973634 5223353 5349373
7059 5349373 5256231 4772358 4627165 4719703 4642498 4427982 4440051 4233927 4426356 4550962
7049 4550962 4490519 4446484 4370690 4265948 4108597 4094319 3877002 4009552 4134178 4065219
7039 4065219 4021138 3983607 3647323 3536459 3731278 4025884 4039435 4013738 3894702 3759382
7029 3759382 3493325 3593184 3429416 3370195 3473007 3584692 3553870 3710604 3665485 3556258
7019 3556258 3673024 3383352 3258769 3280035 3072153 2982743 3065159 2834872 2861278 3041129
7009 3041129 2977157 2867144 2893364 2847949 2928299 2962509 2810644 2683761 2453884 2710054
6999 2710054 2620822 2661455 2670409 2574756 2325971 2306522 2209998 2377292 2568532 2522008 2396091
6988 2396091 2274885 2415471 2525550 2788166 2596467 2330202 2391189 2414315 2188978 1988115
6978 1988115 2228391 2305699 2189747 2188352 2303960 2303129 2068878 2042625 1994766 2270785 2054642
6967 2054642 2091790 2131674 2098717 2112514 1791693 1914453 2013617 2104983 1662904 1783713 1958824
6956 1958824 1845957 1870214 1946805 2122717 1798160 1808279 1557498 1632489 1789595 1854950
6946 1854950 1648806 1717309 1812963 1841527 1706973 1594801 1598522 1342731 1606587 1848397
6936 1848397 1583727 1594343 1658779 2007450 1970514 1922221 1681126 1781365 1504452 1487937
6926 1487937 1582756 1482296 1349050 1263178 1442270 1270118 1376579 1315884 1415424 1597603
6916 1597603 1431099 1193294 1168682 1290481 1610779 1688880 1632893 1455535 1489214 1663470
6906 1663470 1195011 1208553 1209866 989635 1429528 1538255 1757522 1700303 1476327 1698447
6896 1698447 1523461 1314839 1203259 1241593 1377300 1366946 1417326 1252573 1104299 1073340
6886 1073340 1298422 1484211 1539369 1098927 1053583 1370478 1285148 1364568 1440963 1231609
6876 1231609 1141160 916221 1057282 1029364 944814 1143823 1326652 1653788 1521147 1194069
6866 1194069 1162388 1211769 1182231 1063600 1041796 986270 1016153 870556 995724 1244517 1490039
6855 1490039 1231971 1167486 1151737 1026593 963291 1015497 967317 939886 1031762 1144687 1042755
6844 1042755 950480 1107199 1072247 784370 878293 830658 230166 617036 939223 774664
6834 774664 712541 847003 941018 1215234 993740 693357 603233 669661 679941 770765 817683
6823 817683 969290 1097570 983439 997962 1239865 842412 815773 931239 860358 753179
6813 753179 967396 1088133 1219691 1093635 934353 992370 972562 936933 687499 559546
6803 559546 484803 873741 998878 1038732 827972 558783 478379 778545 699621 788611 815309
6792 815309 649955 876486 1124275 495592 779047 795458 561447 557000 692699 783273
6782 783273 1032616 1005858 774353 1028139 686248 830629 917300 876782 671918 680609 787992
6771 787992 678768 732499 635437 626845 829574 577766 564718 665908 541719 838135 1263719
6760 1263719 1219791 1122560 958141 602618 462359 420861 725065 917949 920276 711067
6750 711067 596353 901718 1029603 703893 416044 585056 513212 470717 296459 350735
6740 350735 618669 697116 444943 721210 679434 880051 678531 619460 572471 395976
6730 395976 422951 397758 405034 681432 793966 626164 699306 848427 1018543 926789 723430
6719 723430 474792 769276 792034 725701 758525 691623 437034 214785 352183 606888
6709 606888 392062 264071 258043 254134 465717 598798 735637 805160 546065 559141 451328
6698 451328 533117 474941 446633 551645 453950 376040 215517 681455 648313 470273 597239
6687 597239 379300 308877 281209 153563 265910 401792 322579 378585 585848 422102
6677 422102 370377 680015 581354 549996 824389 988912 770331 856025 670947 499538
6667 499538 537468 472508 473283 549292 381172 340119 748316 930390 889809 627181 438981
6656 438981 445508 456374 674004 683152 278203 183959 484992 725505 740897 443078 304612
6645 304612 394067 249371 311507 350130 164599 379541 691069 648581 513945 363047
6635 363047 351029 623302 559197 702145 579265 557651 714537 520237 404560 333767
6625 333767 563686 811733 868933 917339 708765 434023 462531 510890 470552 736659 658362
6614 658362 487256 417979 540316 759375 591792 535701 434928 438389 606950 642095 547879
6603 547879 485775 162249 19579 359250 538943 412214 384360 530074 610765 579465
6593 579465 701243 594942 918568 816936 570452 459639 253865 120529 161816 282058
6583 282058 210724 347417 475603 600873 809879 611946 431131 426329 592067 494154
6573 494154 628704 756565 519947 552302 376514 319012 618713 542745 439777 372775
6563 372775 350941 419565 503063 759413 629472 457893 483892 532085 376092 456364 610982
6552 610982 569016 681100 796522 643470 391035 357110 364031 397769 549376 482248 488435
6541 488435 768989 871654 652739 669014 609622 612638 577912 447350 508694 553737 807478
6530 807478 466166 432131 555195 757793 783411 783839 651648 423907 382009 460152 336195
6519 336195 558607 609780 387366 819631 797988 740106 637683 690379 891276 845933 611154
6508 611154 850398 810534 564384 725623 816629 774547 719610 663944 686542 554023 488329
6497 488329 690344 598687 628581 680368 550606 660971 390836 182517 243423 189150 436415
6486 436415 608083 692553 731127 539616 535593 599545 571502 471829 665017 675951 488242
6475 488242 337086 393255 323921 332068 436684 600404 617936 799076 886996 738507 422027
6464 422027 586087 508891 621401 910639 649362 374502 503283 352304 484584 491673
6454 491673 290376 326668 450116 535147 541769 787540 930575 877366 852119 862994 855070
6443 855070 839818 749600 1064117 813542 597337 794284 968901 676344 592459 641928
6433 641928 500977 558905 338381 451882 420525 573703 557064 421059 674149 612156
6423 612156 635565 485306 429170 385999 645639 606028 398207 242476 322551 410716 567785
6412 567785 571062 480964 281010 341810 468481 338414 354285 504707 358708 285807 337219
6401 337219 322412 222714 320778 323975 297968 343337 491348 687502 548848 408111 664129
6390 664129 576947 269916 172294 656375 804943 683414 548538 480612 512764 508547 633192
6379 633192 459483 554086 722374 714927 437338 509706 659197 622446 658956 821982 543896
6368 543896 387544 291685 136668 328711 434390 499700 378919 371684 645377 752908
6358 752908 718617 659237 420641 704847 810036 847209 797206 623001 596818 780485 648791
6347 648791 674231 781903 554320 1050844 906531 672704 864257 1042225 830771 788363
6337 788363 606317 395835 818641 579495 316685 438770 474320 755694 760153 437595
6327 437595 354327 661187 787715 535700 505911 515918 587740 711684 746193 831811 733931
6316 733931 780904 892792 982638 1067465 954636 793783 934824 706338 710642 884640 833040
6305 833040 723409 748742 942000 912387 943503 735836 653461 688464 845933 518531 584001
6294 584001 894142 993622 1009649 787807 966847 748738 804145 876128 966379 1116171 1090001
6283 1090001 1332271 1282956 1003598 1309698 1321954 1246636 1280859 1424576 1430149 1323312 1101308
6272 1101308 1132976 1038526 1141176 1329161 1228191 1246744 1328006 1446961 1528729 1522977 1556659
6261 1556659 1577729 1603577 1792423 1877430 1643988 1770897 1977376 1930981 2050698 2028644
6251 2028644 1882707 1505220 1864126 2302371 1924527 1752616 1901549 1892511 2113724 2169927
6241 2169927 2499191 2559010 2203721 2326188 2562222 2782464 2784545 2916655 2926992 3021335
6231 3021335 2910598 3011765 3114517 3090743 3144046 3641686 3724902 3819736 4096034 4006188
6221 4006188 4229076 4528725 4599666 4395414 4490881 4655539 4868640 5187921 5206436 5377715
6211 5377715 5629699 5607328 6205364 6719135 7384824 7583561 7805620 8145168 8792183 9267451
6201 9267451 9559856 10193082 10908218 11471135 12068834 12887115 13847341 14447093 15148545 15842678
6191 15842678 16635986 17338730 17631361 17887103 18560573 19072520 19111836 19459967 19882515 20174870
6181 20174870 20342658 20602370 20874738 20858315 20875923 21098458 21494720 21508824 21556559 22037710
6171 22037710 22266587 22179728 22484808 22614285 22522779 22536984 22739772 22779408 22843220 22756903
6161 22756903 23031172 23280570 23110500 23058337 22899296 22650200 22797544 22953837 22638335 22439022
6151 22439022 22230076 22100361 21819640 21531744 21295946 21145380 21019207 20910085 20424300
6142 20424300 20384075 20164873 19703832 19588433 19369690 18790429 18557177 18614465 18344895 17928616
6132 17928616 17588633 16944185 16175663 15580688 14893346 14283859 13663713 13136609 12537353
6123 12537353 12136424 11350969 10352722 10057101 9714655 9490577 8839867 8487978 8149465
6114 8149465 7619661 7602130 7150735 6864723 6778280 6402344 6079719 5639566 5311406 5241897
6104 5241897 4965054 4967981 4876817 4654740 4531386 4135457 3734942 3478246 3711656 3592099
6094 3592099 3239781 3228249 3214839 3173254 2976797 2943438 2974569 2786527 2876210 2857173 2689153
6083 2689153 2701610 2440009 2504049 2659551 2327556 2197582 2211458 2103942 2073100 1973545
6073 1973545 1943106 1771444 1687591 1839536 1793585 1832354 1664606 1819109 1442787 1275521
6063 1275521 1031014 1233225 1456575 1415261 1454383 1776631 1656844 1360660 1385274 1441751
6053 1441751 1442096 1438619 1455940 1302171 1568215 1931033 1659296 1321081 1178096 1173619 1321371
6042 1321371 1298385 1270467 1263198 1205184 1263305 1323074 1018091 943981 726627 781441 703808
6031 703808 691896 1043033 1127502 840950 796732 1005185 975911 921848 769103 697660 634841
6020 634841 945745 1066437 933551 705646 730994 845709 919764 986805 1108135 1030516
6010 1030516 624520 630313 981411 954214 687334 669937 628045 777725 763785 983342 968014
5999 968014 1232226 1045809 759946 674692 1040348 948585 931387 669593 820279 882723
5989 882723 931333 968502 948610 965886 886185 802336 713821 680740 755184 597326 699195
5978 699195 789149 801765 924951 708498 829066 856145 624489 650884 835754 779281 853626
5967 853626 478323 398911 521657 692401 827618 764810 849433 1092927 1207691 1244341
5957 1244341 1273895 1269476 1200786 976518 997147 1220450 1068164 953641 1061307 818284
5947 818284 1000482 635916 699198 892073 846141 1124738 1109789 1232507 1294671 1169724
5937 1169724 1172950 1225019 1579781 1646365 1279653 1576014 1656576 1423367 1400067 1370897 1551833
5926 1551833 1601849 1414002 1462027 1160486 1108468 1209174 1380183 1603639 1626746 1240038
5916 1240038 1142759 1143602 1008541 957847 1162101 1352610 1283859 1147140 1242031 1086615 1093721
5905 1093721 1186905 1268372 1363683 1485345 1281466 1416674 1273849 1289706 1179834 1233306
5895 1233306 1340666 1287538 1028125 958712 1071129 1269301 1390817 1476137 1639599 1291484
5885 1291484 1139720 1527643 1518368 1253633 1156311 1476434 1533783 1618874 1682746 1646952 1683867
5874 1683867 1841752 2006947 1809756 1583025 1635222 1726834 1491983 1770250 1860608 1803614
5864 1803614 1838464 1719719 2230129 2611400 2235468 2115698 2117606 2210392 2358037 2320612
5854 2320612 2092107 2552801 2566274 2513904 2739727 2941845 3208754 3253005 2971323 2924750
5844 2924750 3060842 3328140 3232649 3432899 3560350 3433158 3498159 3841142 3931751 4021774
5834 4021774 4115372 3954683 3970700 4233173 4686032 5062378 5033343 5306004 5903442 6228250
5824 6228250 6729256 7536878 8647015 9944113 11109666 12369434 13149023 13657421 13578506
5815 13578506 12890707 12237923 11499027 10945247 10704439 10504213 10188896 10451738 10703341
5806 10703341 10882273 11268817 11552091 12195505 12821682 13736311 14591777 15509433 16605016
5797 16605016 17881546 19424852 21038312 23299097 25543348 28237163 31977140 36358846
5789 36358846 41746322 49051280 58076331 69207504 83007196 98702338 114954851 129314959
5781 129314959 139331237 144047683 143313947 136479848 123696982 107789538 92080861 77443617
5773 77443617 65057690 55563326 47774571 41625956 36559284 32127762 28552371 25756643
5765 25756643 23431042 21296335 19758316 18450274 16929980 16079040 14973413 13940994
5757 13940994 13117989 12687234 12009928 11224949 10516383 9923979 9899997 9279150 8939644 8607870
5747 8607870 8269224 8114738 7794755 7346396 7163125 6957640 6692988 6608096 6422180 6087717
5737 6087717 5914696 5733909 5394366 5233239 5246787 5225095 4943089 4864116 4912301 4761684
5727 4761684 4615381 4493242 4420347 4580470 4125280 3955929 4005521 3870541 3704719 3568105
5717 3568105 3699477 3689178 3537563 3434217 3272876 3253743 3085039 3026528 3127075 3083297
5707 3083297 2921895 2920224 2936612 3102467 3000956 3033723 2927522 2439584 2453266 2499345 2621048
5696 2621048 2638838 2299583 2283318 2073694 1853980 1981206 1948922 1901513 1809056 1537010
5686 1537010 1607877 1693557 1939798 2083528 1766758 1790305 1834221 1951538 1787588 1806440
5676 1806440 1941400 1769208 1796762 1750939 1927324 1898737 1681682 1648590 1411252 1343091
5666 1343091 1430224 1565043 1518429 1579639 1143184 1066968 1296647 1284431 947731 940743 798319
5655 798319 790767 738223 788520 682927 790848 694833 898143 1061531 1059912 1077033 988465
5644 988465 982656 847562 744206 789180 800840 797530 732116 925490 1111463 669111 799758
5633 799758 857594 1099676 1071206 783732 853432 890775 985428 1424512 1009694 828102 913034
5622 913034 883172 824814 784107 653098 836331 974828 955330 884337 746537 786542 812910
5611 812910 967787 786159 665815 670652 656244 644876 717841 656230 600353 778371 514821
5600 514821 194253 376336 448331 412284 403797 481274 584986 505790 558250 482183 410697
5589 410697 621379 762804 765540 489131 -41298 139733 529044 649090 695600 463304
5579 463304 472789 446537 556278 812222 484408 282227 412935 306227 180363 383789
5569 383789 255027 476052 452894 473471 375663 257379 333010 208678 292178 354208 61888
5558 61888 -120019 115441 226526 -52645 21682 178666 564112 742861 600784 416690
5548 416690 365081 173636 395425 520965 294473 181740 409677 598071 289894 163516
5538 163516 206440 38782 21647 253166 150752 163405 64686 335029 417171 313205 99626
5527 99626 168013 221660 181031 208903 315764 330291 343933 359970 392067 386623 329840 310259
5515 310259 264154 206817 545011 391276 207348 157762 82802 227568 640444 246242
5505 246242 252818 280081 268450 182527 61123 137194 177489 203998 329797 291193 456677
5494 456677 488156 338554 680898 425440 328044 171616 187070 107199 -15339 431858
5484 431858 431708 330855 197887 376075 462579 194260 -56855 71561 58400 252900 341464
5473 341464 254138 306181 25403 338273 364989 381668 191713 324135 447515 432246 485772
5462 485772 484609 420223 427750 441125 331036 456511 450521 193733 51635 285879 325977
5451 325977 192853 283946 505862 609050 774034 682458 875990 1160954 1109188 1039931
5441 1039931 955026 948418 822462 719845 760730 669817 426654 371141 411568 278729 222608
5430 222608 508934 415933 361631 496610 473514 199302 168635 247395 359327 418939 350832
5419 350832 337845 296472 324599 512205 323669 297512 304478 416966 164032 192674 119125
5408 119125 278068 229175 351044 358653 463096 434351 280133 391802 418968 457009 483825
5397 483825 387888 276686 280677 172239 286473 136468 224050 496207 598221 358230
5387 358230 295064 236886 164627 380497 424026 261184 242498 323523 21154 34924 195471
5376 195471 300693 163325 257416 255411 332233 248708 34354 63383 213224 296515 124016
5365 124016 217961 236500 379965 176167 204376 236698 443407 341801 250488 321720 279372
5354 279372 161953 217874 157969 127868 69156 14785 -31307 245108 345201 368440 543000
5343 543000 296619 178844 456797 357501 282488 217675 299514 415600 739159 542429
5333 542429 622287 469608 353511 80301 195888 217983 -9777 -43706 109536 395375
5323 395375 501603 605707 435259 426844 205083 277589 569589 509088 300052 137314
5313 137314 177001 396142 450239 519991 303266 413050 643777 607971 493237 336378
5303 336378 47031 8601 -20680 119571 -101316 124109 452732 571823 369595 328430
5293 328430 179851 217015 416770 506381 503444 441490 481975 688393 564432 296218 469949
5282 469949 431599 275003 352352 424678 346289 336648 275848 288285 428454 361541 96369
5271 96369 253788 402153 302924 241738 296630 323100 502169 470864 397658 379780 341389
5260 341389 321377 313082 460416 732783 798004 698785 688240 509557 306087 473024 407599
5249 407599 608105 443130 408270 549262 288918 485182 501017 331598 358478 407411
5239 407411 706760 675336 581833 403408 405904 385689 293686 510779 356726 431179 207117
5228 207117 491928 823583 787338 596552 514458 502735 517333 624460 505000 413180 376562
5217 376562 273193 413814 522230 657388 499011 321303 369040 276586 632259 674930
5207 674930 351901 601167 497286 301555 539175 588844 694484 797614 849983 919516
5197 919516 850464 349953 422033 412962 462479 464420 474559 627884 495204 684577 701017
5186 701017 512141 343971 393805 492721 859025 687323 744057 909532 755720 514325
5176 514325 478128 615044 707738 561883 720618 927174 948377 850509 672911 536044
5166 536044 556718 692780 747243 924612 593976 659514 747393 517981 420987 432509 368087
5155 368087 468209 818615 648016 609077 703869 547633 459186 388266 541669 633901 751993
5144 751993 858013 562644 538671 666751 685320 764827 746326 513194 540582 434803 489918
5133 489918 810872 606411 441179 255315 617129 527539 234995 258572 387413 279300
5123 279300 554497 853628 570678 409049 545410 528106 365606 395839 581112 597034
5113 597034 793813 527179 457097 568429 420193 558976 943969 888454 698243 699301
5103 699301 661382 741261 841800 622839 641848 751000 830900 799245 511165 874514 888818
5092 888818 875979 564062 539092 799559 823045 577141 789351 875705 754382 556877
5082 556877 686180 748389 856305 891953 696144 563265 647767 963921 809229 780143
5072 780143 699287 349897 472702 544839 584626 456620 425857 742276 700976 702271 634904
5061 634904 749503 753513 818085 732187 590531 496699 586600 543302 640105 567457 831167
5050 831167 944918 1019173 992422 829692 766613 768299 982465 831164 1104833 1127717 875204
5039 875204 603067 671310 838799 769611 728939 922131 967843 1045618 793838 687221 1043758
5028 1043758 1078789 887351 861303 537401 644844 714750 792002 893830 746097 886436
5018 886436 558551 537684 833107 884238 915459 1014700 918561 959723 932033 967086 888916
5007 888916 936228 798973 741897 555341 1000939 1007756 980107 941097 817805 965105 792483
4996 792483 1005900 1089851 886202 871467 988958 838752 1134331 1109731 793881 618030
4986 618030 1119186 1116262 843728 948936 983720 1099104 907629 1250261 1145012 1184437
4976 1184437 1267082 1046939 965615 968773 1070653 1113467 1378364 1065809 750997 1138385
4966 1138385 1220490 1273499 1383446 1107893 1102730 999173 1144556 1105816 1433250 1558491
4956 1558491 1453946 1336450 1420923 1589961 1450437 1570625 1474222 1588235 1723301 1536629
4946 1536629 1507668 1752588 1916556 1813668 1896530 2149765 2486552 2803882 3014327 3543413
4936 3543413 4462815 5200752 6068839 6249152 6394734 6180459 5615034 4806222 4226835 3426584
4926 3426584 2896287 2508794 2182590 2121120 2250300 2002779 1828821 1453107 1339333 1390339
4916 1390339 1313416 1416158 1348642 1543743 1497264 1503801 1472744 1629435 1706295 1687140 1598830
4905 1598830 1684471 1666194 1783108 1742620 1733954 1766862 1742879 1788392 2005481 1859896 1474263
4894 1474263 1355304 1529549 1685083 1691753 1818466 1598045 1323919 1718367 1790504 1996573
4884 1996573 1804092 1854455 1762829 1907645 2051016 2005250 1885359 1942868 1693830 1707989
4874 1707989 1808163 1639412 1517955 1682161 1724600 1613211 1528548 1922062 1884947 1730309
4864 1730309 1854479 1769558 2056453 1954335 1597160 1676802 1738808 1645563 2088531 1902683
4854 1902683 1942409 1945422 2052967 2094097 1999404 2121782 2150690 2123426 1925773 1953313 1869191
4843 1869191 2152735 2455162 2413584 2354407 2127490 2177869 2333327 2194293 2526676 2664899
4833 2664899 2806804 2904900 2635142 2902109 2976051 2936463 3125541 3256475 3378037 3363070
4823 3363070 3103260 3256064 3457081 3608979 3733348 4008050 4329257 4249399 4705679 5375497
4813 5375497 5813038 6751400 7384673 8200068 8923631 9167708 9312236 9322452 8771055 8229345
4803 8229345 7978735 7650584 7215832 7149426 7375381 7437222 7892474 8421948 8754467 9522430
4793 9522430 10299994 11113721 12064994 13003260 14023523 14695842 15077780 15385590 15374080 15374280
4783 15374280 15524979 15370487 15375428 15500892 15512537 15692843 15832898 16612624 16856604 17228140
4773 17228140 17795947 18433724 18859261 19372586 20141167 20560640 20883229 21543753 22333036
4764 22333036 23033221 23675657 24379372 25168032 26109254 27282095 27668844 28633370 29285186
4755 29285186 29981702 30445597 30601588 31102319 31462042 31932635 32153510 32080208 32026744 31758701
4745 31758701 31555527 31309589 30903622 30413905 29954913 29813964 29139958 28698518 28174695
4736 28174695 27551127 27289711 26671774 26087714 25642813 25226609 24778594 24077605 23494129
4727 23494129 22837939 22131787 21407233 20964689 20749954 20261315 19534352 18929994 18344717
4718 18344717 17718350 17483891 16978096 16470651 15807030 15420455 15110869 14870525 14445228
4709 14445228 14037606 13793033 13515351 13297419 13030795 12956808 12906136 13060614 13098811 13031850
4699 13031850 12929197 12878482 12794224 12994765 13168987 13461288 13527125 13692516 14140822 14286901
4689 14286901 14579900 14842843 15316909 15799309 16273581 16587128 16953677 17429920 17973040
4680 17973040 18566840 19402100 20234604 20670299 21474956 22072404 22605071 23163432 23933338
4671 23933338 24382392 25094141 25746977 26215760 26803807 27499692 27832776 28427164 29127113
4662 29127113 29524167 30491494 30916626 31643182 32279120 32869684 33177116 33797824 34266035
4653 34266035 34708628 35035539 35222162 34821408 34832509 34956575 34555096 34404901 34100394 33402674
4643 33402674 33042331 32626063 32271119 31885377 31232802 30857058 30278747 29770673 29375028
4634 29375028 29365944 29321036 29542113 30052782 30604324 31378651 32866822 35557955 39223807
4625 39223807 43887099 47866952 50625455 51953811 52426525 51657683 49103848 45249390
4617 45249390 40963900 37242043 34219391 32482531 31545900 31362840 31953311 32930271 34663747
4608 34663747 36551441 39212050 42039584 44713278 47685764 50361346 53469668 56664471
4600 56664471 60457125 64579513 68555419 72434133 75820555 78841320 81546275 83820942
4592 83820942 86387023 88713561 91195189 93259636 94278055 94526633 94139021 92670656
4584 92670656 90541332 87976851 85144770 82212389 79393350 76140087 73166224 69637733
4576 69637733 65577781 61248492 56819857 52595662 48778957 45151452 41916906 38560250
4568 38560250 34897375 30957236 27439977 24264659 21618152 19364008 17320260 15604212
4560 15604212 14349719 13559114 12550031 11732282 10948630 10513322 10065033 9472399 9021428
4551 9021428 8358966 8207577 7963852 7680359 7456657 6963949 6771319 6971487 6955214 6655715
4541 6655715 6409772 5852302 6049310 5825333 5523622 5383029 5186964 4782540 4903038 4913822
4531 4913822 4807114 4542014 4212952 4371844 4581061 4394030 4507520 4414525 4091700 4171044
4521 4171044 4155240 4052470 3843200 3921291 4043997 3983896 3767859 3703436 3659468 3114788
4511 3114788 3225106 3361872 3439144 3340679 2980240 2983720 2826618 2918443 2967765 2621153 2353948
4500 2353948 2341910 2572861 2591568 2460113 2540149 2454875 2384851 2443342 2272612 2278090 2096435
4489 2096435 2246078 2336258 2174490 2238755 2037226 2112725 2295193 2235243 2242325 2298390 2188302
4478 2188302 2326876 2478916 2337299 2239382 2242310 2082766 2042834 2055931 1773604 1879040
4468 1879040 2056998 1978116 1819728 1801460 2100678 2142537 2031734 1836988 1495117 1427960
4458 1427960 1485226 1614970 1941530 1997999 1859927 2073224 1977102 1947008 1780272 1618796
4448 1618796 1790867 1736101 1757541 1895524 1756447 1734047 1653309 1722518 1918112 1786074
4438 1786074 1500551 1443456 1572685 1540828 1431411 1368613 1492451 1627113 1536088 1648991
4428 1648991 1847039 1751463 1624109 1792490 1882240 2105734 2074430 1901976 1720876 1855431
4418 1855431 2142410 2248571 2214136 2057247 1980932 1873175 2019227 1803748 1724360 1650164
4408 1650164 2066047 2080169 2136683 2114170 2243478 1943911 1836620 1726563 1801384 1885408
4398 1885408 2021655 2068043 2297647 2143628 2041918 2183608 2151996 2240102 1948127 2031676
4388 2031676 2248830 2461297 2582561 2895840 2937173 2800589 2834588 2557072 2499795 2511905
4378 2511905 2449559 2691978 3056850 3042835 2873828 2751290 2753572 2640769 2835303 3026008
4368 3026008 2769448 2863197 2909620 2920203 3032728 2882329 2882487 3104465 2788368 2707832 2930090
4357 2930090 3066936 2895493 2762626 2804238 2996364 3025867 3092792 2769452 3000550 3200063
4347 3200063 3463727 3425294 3045752 2977626 2828453 3077743 3309072 3249238 2959279 3184702
4337 3184702 3471290 3526557 3489434 3274623 3410711 3733928 4016045 4062057 3889226 3991946
4327 3991946 4164168 4076202 4331357 4492819 4528502 4762861 4968641 4921114 5064469 4929003
4317 4929003 4987669 5330502 5464995 5698759 5772070 5842757 5854198 6321471 6861048 6864403 7168704
4306 7168704 7218982 7186602 7544679 7913612 8266204 8629001 9014677 9388412 10001688 10366175
4296 10366175 10771522 11490241 11848712 12436944 13107621 13961719 15082468 15935664 16486474
4287 16486474 17371084 18720589 19624312 20414678 21791482 22911191 24050505 25179123 26618262
4278 26618262 27819660 29021696 30396923 31854042 33091424 34617822 35984759 37260545
4270 37260545 38636548 39963349 41332088 42459641 43413241 44369240 45605579 46794924
4262 46794924 47790742 48444081 49289190 49715524 50262742 50860828 51360492 51645924 51840661
4253 51840661 51491649 51151221 51054695 50731456 50181718 49477358 48828050 48416268 47584277 46817428
4243 46817428 45887038 44935080 43743354 42561903 41209157 40103762 38764692 37224036
4235 37224036 35789843 34396466 33217899 32325750 31065215 29837878 28635929 27268441
4227 27268441 25971700 25224701 24215500 23199385 22180162 21112932 20471608 19585170 18760791
4218 18760791 17882031 17139387 16483882 15934998 15277979 14738947 14425412 14193370 13997675
4209 13997675 13308042 12903727 12980588 12826114 12774149 12577273 12759701 12964081 13291625 14136316
4199 14136316 15136885 16728583 19383368 23266596 27830350 32071575 35218132 36962831
4191 36962831 38143952 36403255 31919566 27119935 22818767 18986111 16140308 14463299
4183 14463299 13202423 12331357 11660052 11205100 10724745 10346546 10160973 9772467 9505241
4174 9505241 9610982 9659512 9362421 9205706 9110166 8883117 8815505 8781635 8504963 8666126
4164 8666126 8768115 8917879 9005958 9032629 9139280 9162355 9099639 9045748 9476974 9568318 9311222
4153 9311222 9420259 9657832 9720885 10117182 10144706 9969295 10428129 10810627 10800647 10851809
4143 10851809 10821660 11118548 11703896 11719777 12007526 12307159 12451146 12779909 12939960 13257349
4133 13257349 13701710 14305359 14630291 14915050 15382859 15767132 16204866 16691423 17608404
4124 17608404 18366514 18887460 19678576 20352836 20855455 22108635 23175260 24297063 25545622
4115 25545622 26432803 27929664 29424359 30663502 32490211 34411819 36438731 38768160
4107 38768160 41066257 43854724 47013694 50422715 53970020 58151154 62693200 67259505
4099 67259505 72067513 76889245 82289978 87867683 93579483 98486192 103345699 108092188
4091 108092188 111943175 115163172 117985702 120003543 121253368 122359413 122733216 122609165
4083 122609165 122158534 121258039 119870633 118553033 116567676 114111969 111122551 107769987
4075 107769987 104151990 99583294 94859127 89931226 85030695 79851319 75031327 70063103
4067 70063103 65454076 61139644 56905575 53173303 49573497 46470083 43315165 40671097
4059 40671097 38112540 36062364 33761177 32241288 30730115 29158628 27878586 26686163
4051 26686163 25509681 24549477 23818723 23195244 22481529 21671827 20857899 20316661 20046574
4042 20046574 19919132 19528883 19518030 19939428 20543907 21499769 23426925 25995486 28834615
4033 28834615 31394463 32731550 33707578 33304430 31115530 28015570 24734649 22010385
4025 22010385 19601993 17679664 16432887 15846691 15402518 14588221 13972283 13633035 13336344
4016 13336344 12431680 12237251 12098317 12012873 11652231 11448383 11284455 10957417 10753538 10595867
4006 10595867 10250104 9788797 9485427 9163017 8718198 8337092 8241362 8096587 8094625 8071540
3996 8071540 8096038 7765225 7440694 7382037 7459594 7349675 7258976 7235812 7541516 7543538 7294414
3985 7294414 7230210 6929633 7090540 7257525 6911752 6644839 6958783 7035011 7270537 7316484
3975 7316484 6950827 6879392 6691995 6771863 6941216 6796069 6929756 7016961 7190135 7255992
3965 7255992 7074479 7009358 7196851 7193487 6907314 6984041 7390499 7396297 7431323 7638780 7737210
3954 7737210 7892054 7853503 7882503 7945017 7994133 8048130 8218131 8455372 8415092 8854134 8950876
3943 8950876 9043183 9287972 9377064 9606198 9753523 10225345 10127810 10494556 10848305 10905318
3933 10905318 11145713 11456627 11958543 12231197 12292707 12504799 13132210 13312039 13541625 13727461
3923 13727461 13883970 14027714 14290617 14705165 14947047 15328437 15795374 16268251 16623759
3914 16623759 17215233 17863179 18254000 18731998 19935203 20624920 20932686 21650055 22750720
3905 22750720 23732167 24524463 25624413 26892565 28045705 29139025 30493765 31985319
3897 31985319 33273514 34663048 36091367 37335804 38616150 40201268 41401062 42695040
3889 42695040 44537495 46222975 47700243 48911105 50518092 52354285 54148169 55745446
3881 55745446 57383684 58509352 59663889 60826094 62175987 63274421 64482705 65922856
3873 65922856 66920286 68115212 69170147 70222684 70895140 71671779 72309810 72497287 72040636
3864 72040636 71690444 71377778 70935672 70081515 69002966 68021149 67065718 66379846 65364224
3855 65364224 64410050 63811552 63092517 62443574 61564618 60865290 60383250 59850275 59540070
3846 59540070 59370562 59017672 58594657 58540329 58563674 59174612 59587861 60300250 61227562 61996016
3836 61996016 62952032 64079983 65652610 67076180 68355450 69833296 71489384 73182291
3828 73182291 74778618 76692421 78465378 80145224 81886803 83626812 85573409 87485714
3820 87485714 89304242 91210347 92764296 94143243 95359978 96022661 96648668 97172681 97280265
3811 97280265 97352840 97190108 96668919 96390464 95791194 94672043 93846981 93013583 91373370
3802 91373370 89520724 87678792 85787356 83863114 81568367 79324241 76728636 74152820
3794 74152820 71514618 68939081 66472841 63783891 61272884 58620281 56423885 54011476
3786 54011476 51595704 49083562 46614944 44258735 42049987 40080434 37785491 35351798
3778 35351798 33538783 31882724 30200342 28752426 27237819 25963866 24993690 24150700
3770 24150700 23212914 22247782 21383924 20529421 19886806 19431587 19527733 18896273 18222907 17993041
3760 17993041 17642654 17535973 17222315 17025482 16922633 16665145 16365863 16249292 16013603
3751 16013603 15877278 15623489 15417502 15208631 15176627 15140792 14816102 14588997 14191166 13929558
3741 13929558 13927862 13642332 13194465 12924994 12803314 12587100 12014773 11731593 11470842 10739786
3731 10739786 10405398 9922946 9514308 9291380 9124327 8594150 8308184 7936453 7685784
3722 7685784 7299920 7033652 6817561 6288660 6125791 5724355 5803704 5747459 5575708 5435691
3712 5435691 5027925 4999099 4845075 4766839 4625848 4608374 4383007 4077632 4054510 4065333
3702 4065333 4150963 4201130 4345091 4114014 3960948 3619433 3627510 3743883 3565002 3312753
3692 3312753 3105418 3023911 2848287 2898061 2853380 2723885 2835763 2797271 2801483 2649262 2651140
3681 2651140 2591116 2380733 2389971 2267839 2385977 2209751 2095090 2203618 1974707 2213134
3671 2213134 2043427 1804486 1832015 1811349 1989630 1976143 1658832 1628259 1576125 1300441
3661 1300441 1166736 1541507 1491860 1322164 1477551 1574511 1624754 1458569 1346341 1543018
3651 1543018 1540504 1391624 1685487 1323836 1247046 1347947 1103173 1226534 1227574 1155354 1137267
3640 1137267 1107748 1199708 1250737 1213951 1158794 1256140 1126804 882308 1072984 1153729 911555
3629 911555 1039993 1178747 1372119 903589 791823 974635 851961 828701 926958 841833
3619 841833 852114 914116 1071332 1128425 852334 718324 943155 837826 871574 732145
3609 732145 509538 516699 642338 880175 723166 673065 538032 654014 732262 849426
3599 849426 814873 877338 827791 556086 621865 857899 938367 686292 843286 1015508 1000156
3588 1000156 1120920 1108424 956479 683082 886049 776801 876133 880631 517627 554998
3578 554998 778202 569117 583072 750139 619795 699788 634994 784028 493927 499342 566804
3567 566804 678820 720448 553453 758940 591245 681132 695627 622737 420889 569857
3557 569857 701367 808809 888202 1008311 892048 930560 1091286 866935 952459 1284401
3547 1284401 1104824 1200822 1167804 1317456 1409975 1220001 1275500 1302886 1327297 1227385 1382001
3536 1382001 1275760 1001643 946683 964972 1033144 1061353 1055832 901967 943902 942341 942480 899538
3524 899538 1007725 928243 957731 1039498 924599 1207147 1185597 1070117 1017210 1168899 1184357
3513 1184357 1445225 1571381 1560008 1665479 1610278 1790171 1903100 1576241 1287669 1227563
3503 1227563 1324967 1231364 1058911 1084915 1099292 1072645 796342 647329 924551 787228
3493 787228 723486 757979 826076 759196 658682 766882 819696 769703 662611 660031 659778 730599
3481 730599 1030565 874797 1091266 1053761 846729 1009181 1064592 1000802 948879 796121
3471 796121 998197 1053751 1114074 1090631 796709 888162 1034316 902512 895866 810182 643878
3460 643878 589960 525445 640070 905817 833419 953789 695278 632500 731330 582968 838601
3449 838601 1037722 867027 930903 923480 1001223 1267081 947840 1251823 1320600 1332424 1532630
3438 1532630 1340517 1189082 1284792 1499389 1488643 1370307 1516240 1789695 1899624 2221767
3428 2221767 2312175 2141118 2358617 2407871 2504735 2513852 2799092 3107367 3398566 3314002 3571843
3417 3571843 3781029 3902375 3869014 3942526 3858924 3863790 3625254 3315878 2955867 2498336
3407 2498336 2231868 2012985 1836340 1943651 1745627 1569237 1534790 1477358 1511015 1432570
3397 1432570 1416238 1047864 947764 953325 860601 776323 748331 591085 871469 935159 832598
3386 832598 847985 593547 384793 546091 744117 920026 579291 448886 341555 403026
3376 403026 448293 233082 19792 240786 289969 392113 456891 339051 365422 344796 466128
3365 466128 126051 259179 449099 349608 495788 624067 587040 358241 654199 835328
3355 835328 719279 671525 677533 622839 348546 151490 294987 479278 386297 218793 237664
3344 237664 450242 496114 104858 -133586 277339 205143 203753 303607 198856 -107412 -94055
3333 -94055 -188624 -103706 -174673 -26283 32135 78231 -54339 25343 -76631 -127708 -176142
3322 -176142 -134414 10407 -45344 8965 -94861 -63626 -49281 -48221 57537 -137205 27095
3311 27095 -62979 -87995 -162028 -263502 -217321 -326597 -84989 -39756 24293 -45460 159692
3300 159692 111177 254766 19706 -8708 -60042 317527 143530 195424 82234 83206 22217
3289 22217 160212 183130 303981 190120 169029 345574 146631 214034 36346 153252
3279 153252 35178 71734 -147267 -100744 -246972 -226269 241272 459141 68245 106276
3269 106276 116149 196615 406202 477832 363788 264514 210601 139399 260408 81649 209334
3258 209334 31404 138961 141796 -33710 64737 335405 372683 439549 183997 134875 62256
3247 62256 -137707 -211946 -176201 -70342 -100317 -5335 35159 -19473 12038 141891 187756
3236 187756 -52201 -82975 135780 -86914 125043 242660 225463 40937 -129369 -259637
3226 -259637 -231780 -25811 -104125 -183795 -214441 -108615 -78966 -127839 -300758 -454505 -359906
3215 -359906 -169507 -205590 -165834 10486 -294207 -217935 -317750 -566769 -375725 -240095
3205 -240095 -361508 -267702 -247057 -117702 -122700 -92751 162087 -61343 -79752 -83927 -98101
3194 -98101 -208486 -305636 -394538 -218952 -44396 -153040 -227870 -20816 120998 5341
3184 5341 25096 -58499 5249 32552 150277 31964 -38553 6319 -216292 -142970 -168068
3173 -168068 -103617 80495 -217015 -475302 -170877 -80060 -61312 86082 -70418 -172432
3163 -172432 -211473 -166974 -85594 22620 -83414 -112904 -296927 -179677 -272125 -207185 -124179
3152 -124179 -263815 -405967 -371074 -63855 -133360 -161523 -86003 1662 -102818 -25265 126007
3141 126007 -151269 -119619 -47141 -143999 -144714 -157817 -307255 -160335 -26887 -171839 -492456
3130 -492456 -241308 -62746 -284762 -326801 117292 359291 489528 331757 250400 273340
3120 273340 104986 27264 -116884 -133305 234493 331661 232730 92704 -155667 -112473 -228795
3109 -228795 72534 224077 128653 -12413 110172 139264 219190 339941 152077 155996 262146
3098 262146 86265 461236 420635 435411 313042 588444 509159 116100 -153307 -36391
3088 -36391 78821 57881 301117 362977 463460 322527 226438 231979 214856 327297 251883
3077 251883 484641 645242 716808 953848 1051404 653492 717968 822902 717402 441873
3067 441873 305553 435069 630791 689291 316972 391565 376874 397092 247558 228600 402343
3056 402343 221693 -99142 33470 185004 348980 307764 78931 127832 402355 366721
3046 366721 327510 200218 220904 290629 349171 482193 420209 418744 392267 246955 39235
3035 39235 23606 267440 -113417 158056 346295 248097 434650 354786 294737 74921 220484
3024 220484 305549 289192 401475 348105 267941 305274 42008 -9514 -20456 -65042 -4430
3013 -4430 -114963 -15778 -4373 123397 190275 -22626 -93314 -307572 -243985 -59757 -92103
3002 -92103 -247667 -344317 -368434 -210232 -256567 -117458 -110278 -232316 -126054 -104660 -235373
2991 -235373 -298191 -156389 -197742 -171948 -294178 -354754 -432504 -153474 116160 -26306 -125930
2980 -125930 -81201 -200013 -241860 -218693 3707 -313512 -324089 -223658 -119326 -240346
2970 -240346 -189535 -230886 -439328 -400409 -191968 -345090 -388694 -106989 -273039 -67976
2960 -67976 -203379 -183642 -51667 -484040 -596565 -329974 -478978 -576150 -284839 -267535
2950 -267535 -157140 -137088 -175852 -221708 -410279 -79620 -317867 -374617 -177484 -262529 -349239
2939 -349239 -239469 -319311 -228091 -74162 -84512 -68135 -155196 -481694 -594714 -379986 -223053
2928 -223053 -41636 -126426 -168248 -148680 -53175 11803 -155777 -487746 -685395 -466037 -475702
2917 -475702 -405631 -409449 -233770 -291049 -137272 -130209 -306734 -220641 -296057 -432026 -456550
2906 -456550 -289405 -396750 -436415 -58458 -65848 -240140 -207880 -270978 -161410 -286806 -83033
2895 -83033 -178709 -158247 -33887 -43305 -201770 -400864 -431123 -524026 -216591 -128428 -281287
2884 -281287 -382491 -612099 -377076 -301072 -298752 -292090 -346803 -275790 -659701 -710424 -502588
2873 -502588 -307243 -277639 -311883 -400698 -601004 -568700 -383145 -505303 -380602 -441921 -627377
2862 -627377 -227754 -469586 -313941 -372473 -220926 -100969 -96831 -156069 -251700 -98560 -75396
2851 -75396 -39910 -420745 -622645 -537352 -277910 -105710 -213516 -272059 -299164 -363909 -103898
2840 -103898 -319789 -219675 -438089 -612718 -321306 -199944 -222909 -112175 -299534 -287479
2830 -287479 -255913 -338432 -342393 -313266 -317652 -376615 -66154 108568 6355 -128586 -85568
2819 -85568 -240885 -628329 -254354 -61567 -217168 -180923 -295818 -339784 -197281 -449883
2809 -449883 -553916 -364104 -191777 -218965 -363279 -97623 -42505 -227125 -447670 -162595
2799 -162595 -49111 -79047 -133917 -78994 -297686 -98070 -79225 -167173 -181466 -365707 -456934
2788 -456934 -317868 -189251 -264642 -260542 -402563 -376292 -45638 -58753 -175212 -323219 -440945
2777 -440945 -477792 -523730 -379673 -395102 -406412 -217687 -224199 -106938 -93179 -237654 -198924
2766 -198924 -167480 -66093 -198556 -265127 -252185 -87732 -86624 -135270 -186935 -309815 -221875
2755 -221875 -140503 -121477 -281142 -266819 -415628 -586737 -417041 -399292 -348314 35239 126089
2744 126089 -272087 -497262 -229929 -307701 -421661 -172735 -184895 -335904 -533578 -339744
2734 -339744 -277519 -552852 -559420 -52015 14980 -259381 -468289 -409901 -454371 -405436 -258132
2723 -258132 -265575 -278175 -456631 -687259 -566954 -510214 -429259 -251090 -415494 -288425 -238572
2712 -238572 -243891 -218831 -92714 -281954 -491253 -464632 -264217 -271346 -302674 -384004 -447341
2701 -447341 -330566 -159087 -335729 -580172 -50969 -205789 -321750 -230186 -62968 -353690
2691 -353690 -448943 -482233 -444824 -344396 -279474 -153570 -345177 -363068 -354563 -247457 -89562
2680 -89562 -90579 -395306 -356041 -254949 -4157 140318 45496 -164197 -402832 -486056 -106996
2669 -106996 -122073 237007 119521 -153650 -198722 -266603 -283402 -536023 -318681 -316352 -505598
2658 -505598 -480226 -112130 -114524 111674 289726 -179054 -363183 -278613 -88621 -329948
2648 -329948 -467613 -120944 -313032 -226199 -177643 115826 -128082 -255193 -416922 -453105
2638 -453105 -191160 -335351 -250112 -289107 -564048 -634401 -466129 -586346 -722494 -663948
2628 -663948 -412547 -431302 -398205 -581113 -684629 -570117 -526630 -852101 -795054 -561586
2618 -561586 -216626 -416070 -716544 -562584 -239402 -29580 -461687 -611593 -405337 -203780
2608 -203780 24448 13451 -299782 -178935 192 -261776 -480600 -594127 -424503 -318065
2598 -318065 -434992 -324314 -360617 -503562 -382304 -253519 -401355 -460027 -489061 -374233
2588 -374233 -229234 -249295 -343667 -281314 -281997 -236888 -262148 -284683 -288500 -92090 -227619 -149821
2576 -149821 -127063 -284943 -168455 -301280 -304885 -523496 -544421 -362914 -344341 -499312 -224615
2565 -224615 -85441 -307087 -377096 -408365 -321076 -314557 -256769 -421813 -234774 -132245 -9255
2554 -9255 -3387 -285318 -322176 -289466 -170157 -440769 -630568 -424877 -360650 -695814 -712291
2543 -712291 -520874 -425469 -469994 -174206 -271047 -207670 -174992 -205035 -178020 -176310 -172642 -146876
2531 -146876 21887 -34323 -15062 -3740 -312800 -387557 -466967 -339287 -127665 -324998 -504412
2520 -504412 -483129 -331408 -219383 19021 -210918 -238251 -314799 -476014 -258150 -215289
2510 -215289 -156568 -283087 -398785 -245248 -207692 -311159 -469940 -262274 -105099 -295529
2500 -295529 -333415 -328876 -507971 -361314 -312250 -249903 -350081 -264682 -180618 -23663 -53270
2489 -53270 -177868 -383145 -389474 -294033 -351765 -396449 -437981 -359445 -292302 -450733 -497110
2478 -497110 -351420 -308099 -563191 -686252 -508906 -523694 -448460 -454367 -144383 -191919 -187295
2467 -187295 -57445 -58273 -310662 -264441 -281125 -268627 -199473 -501452 -450515 -428182 -134528
2456 -134528 -77874 -271945 -453409 -229688 -217443 -225545 -359422 -589105 -348641 -453589
2446 -453589 -371156 -189761 -379398 -187407 -379524 -416707 -327284 -87269 -174478 -313049
2436 -313049 -142328 -474044 -404708 -268192 -159858 -121708 -84917 -432797 -331627 -283064
2426 -283064 -141802 35871 -12261 71706 -326618 -452359 -232140 -148668 -41569 -361859
2416 -361859 -366073 -345814 -449531 -62725 -234407 -394265 135176 -140499 -414331 -259565
2406 -259565 -347352 -512335 -204086 3891 60400 61845 30429 -6366 -205365 -334785 -353257
2395 -353257 -216171 -375917 -136596 -103153 -288561 -140901 -137760 -205217 -98636 -17734 -281203
2384 -281203 -84252 -180148 -121280 72144 -107127 -113965 -27419 23547 -100835 10274 130942
2373 130942 293724 291178 96576 -8993 -245014 -350042 -408528 -457160 -197606 -66288
2363 -66288 -218576 -75583 14720 62404 -53077 -1294 -36231 24186 -190834 -155893 -77435
2352 -77435 -2502 105318 59465 -60661 -225776 -321067 23306 335905 180429 225196 143642
2341 143642 165184 -140950 -21561 20359 151658 86001 165669 328891 518956 449103 338540
2330 338540 43762 218914 129419 92614 91664 233400 77445 430362 825751 588224 429868
2319 429868 98434 101236 323650 174033 315716 575907 420297 636713 873640 1227938
2309 1227938 1237502 1350341 1626749 1717629 1835742 1944899 2190803 2165596 2522860 2730141
2299 2730141 3193808 4230548 5084014 6709469 9099449 12265385 15280271 17743384 18935255
2290 18935255 19825416 19023907 16203009 12823222 10017921 7610231 5437408 4286139
2282 4286139 3376482 2968353 2254818 1857003 2080983 1994398 1871253 1631326 1372280 966457
2272 966457 1059899 1058383 911056 903832 582093 436870 277519 406866 227578 448964 358763
2261 358763 147804 142268 305811 295188 325090 361571 124505 91141 -86095 125767 420807
2250 420807 324463 -53856 27598 -88159 -100973 -119523 -89452 -187610 -8503 104126 -38208
2239 -38208 165428 28347 -57168 -96399 -318132 -159973 -261580 -238680 3431 -203972
2229 -203972 -273649 52950 43289 -48595 -61111 -75940 -197801 -148486 -210730 -163234 -161793 -180706
2217 -180706 -44734 -279738 -171345 -33716 197063 92836 -235204 -297675 -431488 -362780
$$ [...]
##END NTUPLES=NMR SPECTRUM
##END=
