##TITLE=1H_DE-80H_X3
 200.13MHz, d2o
 8 sc
 
 19ns.26.2.2025
##JCAMPDX= 6.0         $$ Bruker NMR JCAMP-DX V2.0
##DATA TYPE= NMR SPECTRUM
##DATA CLASS= NTUPLES
##ORIGIN= UXNMR, Bruker Analytische Messtechnik GmbH
##OWNER= pz
$$ XWIN-NMR		Version 3.5
$$ Fri Jul 24 13:20:12 2026 Russian Standard Time (UT+4h)  Yarkov@DPX200
##.OBSERVE FREQUENCY= 200.1313
##.OBSERVE NUCLEUS= ^1H
##.ACQUISITION MODE= SIMULTANEOUS
##.ACQUISITION SCHEME= undefined
##.AVERAGES= 8
##.DIGITISER RES= 18
##SPECTROMETER/DATA SYSTEM= spect
##.PULSE SEQUENCE= zg30
##.SOLVENT NAME= DMSO
##.SHIFT REFERENCE= (INTERNAL, DMSO, 0, 15.5089)
##AUDIT TRAIL= $$ (NUMBER, WHEN, WHO, WHERE, WHAT)
$$ ##TITLE= Audit trail, XWIN-NMR		Version 3.5
$$ ##JCAMPDX= 5.01
$$ ##ORIGIN= Bruker BioSpin GmbH
$$ ##OWNER= Yarkov
$$ C:/Bruker/XWIN-NMR/data/yarkov2/nmr/H-C/1/pdata/1/auditp.txt
$$ ##AUDIT TRAIL=  $$ (NUMBER, WHEN, WHO, WHERE, WHAT)
(   1,<2026-07-24 13:19:29.20 +0400>,<Yarkov>,<DPX200>,
      <created by zg, POWCHK disabled, PULCHK disabled
       configuration hash MD5:
       00 E9 B6 7A A2 85 ED C7 34 08 36 98 17 FE 4E 26
       data hash MD5: 16K
       A1 12 3C 3D 6B 69 49 7C 7E 14 82 B2 5D E6 C7 8E>)
(   2,<2026-07-24 13:19:36.26 +0400>,<Yarkov>,<DPX200>,
      <Start of raw data processing
       efp BC_mod = 2 LB = 0.25 FT_mod = 6 PKNL = 1 PHC0 = -7256.183 PHC1 = 2.82197 SI = 16K 
       data hash MD5: 16K
       2A A5 8B 5C 7E 2E 83 BA 3E 0A 16 D3 57 A2 44 38>)
$$ ##END=
$$ 
$$ hash MD5
$$ 1E CB BC B9 D7 1B 32 C2 64 B1 7B A8 53 5E D4 E9
##$RELAX= 
##$RELAX= 
##$RELAX= 
##$RELAX= 
##$RELAX= 
##$RELAX= 
$$ Bruker specific parameters
$$ --------------------------
##$DU= <C:/Bruker/XWIN-NMR>
##$EXPNO= 1
##$NAME= <H-C>
##$PROCNO= 1
##$TYPE= <nmr>
##$USER= <yarkov2>
##$AMP= (0..31)
100 100 100 100 100 100 100 100 100 100 100 100 100 100 100 100 100 100 
100 100 100 100 100 100 100 100 100 100 100 100 100 100 
##$AQSEQ= 0
##$AQ_mod= 1
##$AUNM= <au_zg>
##$AUTOPOS= <>
##$BF1= 200.13
##$BF2= 200.13
##$BF3= 200.13
##$BF4= 200.13
##$BF5= 200.13
##$BF6= 200.13
##$BF7= 200.13
##$BF8= 200.13
##$BYTORDA= 1
##$CFDGTYP= 0
##$CFRGTYP= 5
##$CHEMSTR= <none>
##$CNST= (0..31)
1 1 145 1 1 1 1 1 1 1 1 1 1 1 1 1 1 1 1 1 1 1 1 1 1 1 1 1 1 1 1 1 
##$CPDPRG= <>
##$CPDPRG1= <>
##$CPDPRG2= <>
##$CPDPRG3= <>
##$CPDPRG4= <mlev>
##$CPDPRG5= <mlev>
##$CPDPRG6= <mlev>
##$CPDPRG7= <mlev>
##$CPDPRG8= <mlev>
##$CPDPRGB= <>
##$CPDPRGT= <>
##$D= (0..31)
0 0.7 0 0 0 0 0 0 0 0 0 0.03 0 0 0 0 0 0 0 0 0 0 0 0 0 0 0 0 0 0 0 0 
##$DATE= 1784884768
##$DBL= (0..7)
120 120 120 120 120 120 120 120 
##$DBP= (0..7)
150 150 150 150 150 150 150 150 
##$DBP07= 0
##$DBPNAM0= <>
##$DBPNAM1= <>
##$DBPNAM2= <>
##$DBPNAM3= <>
##$DBPNAM4= <>
##$DBPNAM5= <>
##$DBPNAM6= <>
##$DBPNAM7= <>
##$DBPOAL= (0..7)
0.5 0.5 0.5 0.5 0.5 0.5 0.5 0.5 
##$DBPOFFS= (0..7)
0 0 0 0 0 0 0 0 
##$DE= 6
##$DECBNUC= <off>
##$DECIM= 32
##$DECNUC= <off>
##$DECSTAT= 4
##$DIGMOD= 1
##$DIGTYP= 9
##$DL= (0..7)
0 120 120 120 120 120 120 120 
##$DP= (0..7)
$$ [...]
##$SUBNAM2= <"">
##$SUBNAM3= <"">
##$SUBNAM4= <"">
##$SUBNAM5= <"">
##$SUBNAM6= <"">
##$SUBNAM7= <"">
##$SUBNAM8= <"">
##$SUBNAM9= <"">
##$SW= 18.0517328524113
##$SWIBOX= (0..15)
0 0 2 0 0 0 0 0 0 0 0 0 0 0 0 0 
##$SW_h= 3612.71676300578
##$TD= 16384
##$TD0= 1
##$TE= 0
##$TE2= 300
##$TE3= 300
##$TEG= 300
##$TL= (0..7)
0 120 120 120 120 120 120 120 
##$TP= (0..7)
150 150 150 150 150 150 150 150 
##$TP07= 0
##$TPNAME0= <>
##$TPNAME1= <>
##$TPNAME2= <>
##$TPNAME3= <>
##$TPNAME4= <>
##$TPNAME5= <>
##$TPNAME6= <>
##$TPNAME7= <>
##$TPOAL= (0..7)
0.5 0.5 0.5 0.5 0.5 0.5 0.5 0.5 
##$TPOFFS= (0..7)
0 0 0 0 0 0 0 0 
##$TUNHIN= 0
##$TUNHOUT= 0
##$TUNXOUT= 0
##$USERA1= <user>
##$USERA2= <user>
##$USERA3= <user>
##$USERA4= <user>
##$USERA5= <user>
##$V9= 5
##$VALIST= <valist>
##$VCLIST= <CCCCCCCCCCCCCCC>
##$VD= 0
##$VDLIST= <DDDDDDDDDDDDDDD>
##$VPLIST= <PPPPPPPPPPPPPPP>
##$VTLIST= <TTTTTTTTTTTTTTT>
##$WBST= 1024
##$WBSW= 4
##$XGAIN= (0..3)
0 0 0 0 
##$XL= 0
##$YL= 0
##$YMAX_a= 113198
##$YMIN_a= -164443
##$ZGOPTNS= <>
##$ZL1= 120
##$ZL2= 120
##$ZL3= 120
##$ZL4= 120
##$ABSF1= 0
##$ABSF2= 0
##$ABSG= 0
##$ABSL= 0
##$ALPHA= 0
##$AQORDER= 0
##$ASSFAC= 0
##$ASSFACI= 0
##$ASSFACX= 0
##$ASSWID= 0
##$AUNMP= <proc_1d>
##$AZFE= 0.1
##$AZFW= 0.1
##$BCFW= 0
##$BC_mod= 2
##$BYTORDP= 0
##$COROFFS= 0
##$CY= -3
##$DATMOD= 1
##$DC= 0
##$DFILT= <>
##$DTYPP= 0
##$F1P= 0
##$F2P= 0
##$FCOR= 1
##$FTSIZE= 16384
##$FT_mod= 6
##$GAMMA= 0
##$GB= 0
##$INTBC= 1
##$INTSCL= 3.241238e-09
##$ISEN= 128
##$LB= 0.25
##$LEV0= 0
##$LPBIN= 0
##$MAXI= 10000
##$MC2= 0
##$MEAN= 0
##$ME_mod= 0
##$MI= 1.114404
##$NCOEF= 0
##$NC_proc= -7
##$NLEV= 6
##$NOISF1= 3.799351
##$NOISF2= 2.8
##$NSP= 0
##$NTH_PI= 0
##$NZP= 0
##$OFFSET= 15.5089
##$PC= 1
##$PHC0= -7256.183
##$PHC1= 2.82197
##$PH_mod= 1
##$PKNL= yes
##$PPARMOD= 0
##$PSCAL= 0
##$PSIGN= 0
##$REVERSE= no
##$SF= 200.130002562032
##$SI= 16384
##$SIGF1= 3
##$SIGF2= 2
##$SINO= 0.751879
##$SIOLD= 32768
##$SREGLST= <19F.Aceton>
##$SSB= 0
##$STSI= 16384
##$STSR= 0
##$SW_p= 3612.71676300578
##$SYMM= 0
##$S_DEV= 0
##$TDeff= 16384
##$TDoff= 0
##$TI= <>
##$TILT= no
##$TM1= 0
##$TM2= 0
##$TOPLEV= 0
##$USERP1= <user>
##$USERP2= <user>
##$USERP3= <user>
##$USERP4= <user>
##$USERP5= <user>
##$WDW= 1
##$XDIM= 16384
##$YMAX_p= 476838964
##$YMIN_p= -632593
$$ End of Bruker specific parameters
$$ ---------------------------------
##NTUPLES= NMR SPECTRUM
##VAR_NAME=  FREQUENCY,     SPECTRUM/REAL,   SPECTRUM/IMAG
##SYMBOL=    X,             R,               I
##VAR_TYPE=  INDEPENDENT,   DEPENDENT,       DEPENDENT
##VAR_FORM=  AFFN,          ASDF,            ASDF
##VAR_DIM=   16384,         16384,           16384
##UNITS=     HZ,            ARBITRARY UNITS, ARBITRARY UNITS
##FACTOR=    0.220516191357247, 1,           1
##FIRST=     3103.79613443797, 0,            0
##LAST=      -508.920628567809, 0,           0
##MIN=       -508.920628567809, -632593,     0
##MAX=       3103.79613443797, 476838964,    0
$$ Real data points
##PAGE= N=1
##DATA TABLE= (X++(R..R)), XYDATA
$$ [...]
8852B31986j18256o8333m8981R4547n6924j16250L4584J03557L7172n778N0723
$$ 231986 113730 45397 -3584 90963 34039 -82211 -47627 55930 93102 87324 138047
8841A38047M4407k4379j7212M0574p041J25879L6858k9144n9698L6261n625n527
$$ 138047 182454 158075 140863 181437 174396 300275 337133 307989 248291 284552 278927 273400
8829B73400o8051Q2669l7274j01761N1070O0661r2783O8573m4575J38513j20919
$$ 273400 205349 288018 250744 148983 200053 260714 167931 236504 191929 330442 209523
8818B09523q0933J3822R0978q6935j47916m2658K6895L4281J60527q7481r5435
$$ 209523 128590 142412 233390 146455 -1461 -44119 -17224 17057 177584 90103 -5332
8807e332L0266P1556Q0643j8601N9290O2641m0066k65447n2495Q5311J34941n4793
$$ -5332 24934 96490 177133 158532 217822 280463 240397 -25050 -77545 7766 142707 87914
8795H7914Q9065p1590l5063l2396n7671m3487N6297Q5746J15055M0610J6410n654
$$ 87914 176979 105389 70326 37930 -19741 -63228 -6931 78815 193870 234480 250890 245236
8783B45236j59397J1623O1664m128q9496K5263L3147p4474R4927J46129j13099
$$ 245236 85839 97462 159126 154998 65502 90765 123912 49438 144365 290494 177395
8772A77395j14996O7064J3150R6478Q8098O3160n1330m5432r2996j28322j0273
$$ 177395 62399 129463 142613 239091 327189 390349 339019 293587 200591 72269 61996
8761F1996n0578p7897J41313j5253o2010J49272O9099J48216j93895r022J31801
$$ 61996 11418 -66479 74834 59581 -2429 146843 215942 364158 170263 161241 293042
8750B93042j1819r9934p9570R6848p2600p9376J81264N9870j28357n3768K4051
$$ 293042 281223 181289 101719 198567 125967 46591 227855 287725 159368 105600 129651
8739A29651j55380j25353l6830J24885p2636J24033N0754k4556M0873N8195J53161
$$ 129651 -25729 -151082 -187912 -63027 -135663 -11630 39124 14568 55441 113636 266797
8728B66797L9667O77m79j55604k61041J17895r2425K4766L6642o4003M9020K05367
$$ 266797 306464 307141 306662 151058 -109983 7912 -84513 -59747 -23105 -87108 -38088 167279
8716A67279P1226J00075p0199J0524j96492m1317j43J85340R3691q1286k0981
$$ 167279 238505 338580 268381 278905 82413 41096 40953 226293 319984 238698 217717
8705B17717P6323O9536j69651J8816M5262O3900N559j37744m8433N6275k2958
$$ 217717 294040 363576 193925 212741 258003 321903 327462 189718 141285 197560 174602
8694A74602j3518k9883L1369k0105n151n4156K09115J28415j32187l43273J25722
$$ 174602 161084 131201 162570 142465 137314 83158 292273 420688 288501 -54772 70950
8683G0950M2272j22820M5609J1446K1370k4945M0683J02540j1952j5526r7233
$$ 70950 113222 -9598 36011 47457 68827 43882 84565 187105 175153 159627 62394
8672F2394P8018J08847q1675j71460q1318J19226O5144P382o4122J07481J3604
$$ 62394 140412 249259 167584 -3876 -85194 34032 99176 106558 42436 149917 163521
8661A63521j0650m2996R7216j14624k4535J06973l5057k1051m6580j38500J28589
$$ 163521 152871 109875 207091 92467 67932 174905 139848 118797 72217 -66283 62306
8650F2306q3136L354P334l7512J01862K57439K2452k02310k6441J0174r7590k6997
$$ 62306 -20830 -17476 -10142 -47654 54208 311647 334099 131789 105348 115522 17932 -9065
8638i065J25226J7221m9772J10439j74912J00494Q9791j91379J46010L7983Q8065
$$ -9065 116161 133382 83610 194049 19137 119631 209422 18043 164053 202036 290101
8627B90101o8273m0210o6793l4519o103P6133q9598J39646r1099r6200N7666R265
$$ 290101 221828 181618 114825 80306 74203 150336 60738 200384 109285 13085 70751 80016
8615H0016J61289r9978j37550q3660k7235J71620J02199M0410o1073k8726Q880
$$ 80016 241305 141327 3777 -79883 -107118 64502 166701 207111 146038 117312 126192
8604A26192l8754M7601L7193Q466j40580m4685r9907l2336O1880J45274J61774
$$ 126192 87438 135039 172232 180698 40118 -4567 -104474 -136810 -74930 70344 232118
8593B32118m3533J79722j5005m4396q9574k1052l5346r4521k944N6788R5281L52234
$$ 232118 188585 368307 353302 308906 219332 198280 162934 68413 65469 122257 217538 569772
8581E69772j75690j51253K8876L0493N6931k8913j05755j49011J54271N2764k59711
$$ 569772 394082 242829 271705 302198 359129 330216 224461 75450 229721 282485 22774
8570B2774j03523j7598K1234L321M3845J38507m7694j3075J0169J41394J69119
$$ 22774 -80749 -98347 -77113 -73792 -29947 108560 60866 47791 57960 199354 368473
8559C68473k68416l285J50128Q139k22190j2026q3095p5705J58286J24393m4453
$$ 368473 100057 96772 246900 255039 32849 20823 -62272 -137977 20309 144702 100249
8548A00249L8206N5705k4924j6509N6525Q1820k0482L3229o6109L2330r5646Q3455
$$ 100249 138455 194160 169236 152727 209252 291072 270590 303819 237710 270040 174394 257849
8536B57849j30102J59328j02822J9883L9408Q434j38951L7554Q516r8641q2679
$$ 257849 127747 287075 184253 204136 243544 251978 113027 150581 159097 60456 -22223
8525b2223O6035J77148K02453n3110m4252j53451j91613L3385K09015j70486q9931
$$ -22223 43812 220960 423413 370303 326051 172600 -19013 14372 223387 52901 -37030
8514c7030M4444j42996N6696K28273J10645j14752j1391K9090N1749p5240L2278
$$ -37030 7414 -135582 -78886 149387 260032 145280 133889 162979 214728 139488 171766
8503A71766M2190j31821m1124o4k4693J8899R7156J64277k409J2150l0810j61562
$$ 171766 213956 82135 41011 40947 16254 35153 132309 296586 294177 306327 275517 113955
8491A13955l6080M1585r32J36370j08594j90783M7032M0964p5168J465P7704N4034
$$ 113955 77875 119460 118528 254898 146304 -44479 2553 43517 -31651 -30186 47518 101552
8479A01552n3852K8584n9111m3468O3104J3779O4074j7705J23273q3477o2432
$$ 101552 47700 76284 17173 -26295 36809 50588 114662 96957 220230 136753 74321
8468G4321n8329M2988J1685j10091J63191l9932r9651l0427j5410M0229p0220
$$ 74321 15992 58980 70665 -39426 123765 83833 -15818 -46245 -61655 -21426 -91646
8457i1646R7962J97866J42026j39232j29038R0383J33539j09778j93411k3548
$$ -91646 6316 204182 346208 206976 77938 168321 301860 192082 -1329 -24877
8447b4877j01658J00109j2977K09540j0519m8466L1922K8997O1568J74426o6053
$$ -24877 -126535 -26426 -39403 170137 159618 111152 143074 172071 233639 408065 342012
8436C42012o4507j08075P2021K8156j89161r1829J15244K6229N0853q0295J83407
$$ 342012 277505 169430 241451 269607 80446 -11383 103861 130090 180943 100648 284055
8425B84055l4900M2473j02634j3980J32410j33441L5344j7669j47845j20295J08065
$$ 284055 249155 291628 188994 175014 307424 173983 209327 191658 43813 -76482 31583
8414C1583m2182N4872j23024K8977J05327J33693m9251J902M6366r2608r8409
$$ 31583 -10599 44273 -78751 -49774 55553 189246 139995 141897 188263 95655 -2754
8403b754J17078K458j275Q6784L5942R257o5307j51155n8185L2283m3237J62585
$$ -2754 114324 116782 115507 202291 238233 247490 182183 31028 -27157 5126 -38111 124474
8391A24474Q3476l3604l5039j1883J85162o9061J30231k4870K7747k5750k31993
$$ 124474 207950 174346 139307 127424 312586 243525 373756 348886 376633 350883 118890
8380A18890J31435j69608j97315M2950R9374j46801M8963O8415O4245k1486Q9774
$$ 118890 250325 80717 -116598 -73648 25726 -121075 -72112 -3697 60548 39062 128836
8369A28836O6024Q023o1468o0289k8760q8215k9439Q0510R990k9112o6299J30492
$$ 128836 194860 202883 141415 81126 52366 -35849 -65288 15222 25212 -3900 -70199 60293
8357F0293R1797J07257O3473L3245p207k13935p6911n3882P6882j32073M8969
$$ 60293 152090 259347 322820 356065 348858 134923 58012 4130 81012 -51061 -2092
8346b092m3307J35262m8302J67641L8621J03258k2907p5543K2092p2784j27426
$$ -2092 -45399 89863 41561 209202 247823 351081 328174 252631 274723 201939 74513
8335G4513m3683J58580Q5483l7482N0506J2755q1742m7399p467j9609J15126K0480
$$ 74513 30830 189410 274893 237411 287917 300672 218930 171531 164064 144455 259581 280061
8323B80061q2695o4612J3380j15808m3373O6538O665M1198P2021j3451n5021l8333
$$ 280061 197366 132754 146134 30326 -13047 53491 60156 101354 173375 159924 104903 66570
8311F6570q3268O2983q0708J14818j6923N7925j39424J27216P9533N8462J25368
$$ 66570 -16698 46285 -34423 80395 63472 121397 -18027 109189 188722 247184 372552
8300C72552j25238j6665K1295j1259o8867m3597O3384q5595M9654n8856k3252
$$ 372552 247314 230649 251944 240685 171818 128221 191605 106010 155664 96808 73556
8289G3556J13684k7718M2705P7301n5008j58215n8350Q8439n4123j47770R0437
$$ 73556 187240 159522 202227 279528 224520 66305 7955 96394 42271 -105499 -15062
8278a5062N2619Q0621K6666O1165N9400R8974K5142o8405j26310J3834q0279K2573
$$ -15062 37557 118178 144844 206009 265409 364383 389525 321120 194810 208644 128365 150938
8266A50938p8152m9251j5038J61036J29932P1226o2792J0660l9046j58896m8442
$$ 150938 72786 23535 8497 169533 299465 370691 307899 318559 279513 120617 72175
8255G2175q9170J37660R8307J28397N9775j30578j59820P9199m6769P8756j02959
$$ 72175 -16995 120665 218972 347369 407144 276566 116746 195945 149176 227932 124973
8244A24973P9336O9304k0158k71734K1465R6967j85668j3748K09324M5516r1787
$$ 124973 204309 273613 253455 -18279 3186 100153 -85515 -99263 110061 155577 63790
8233F3790P8222P787K0945j541j55961J10036N2438j8372j4503p6074l301R1899
$$ 63790 142012 149799 170744 169203 13242 123278 175716 157344 142841 66767 63466 155365
8221A55365m5654p6023J19933J31926o3830r9832L856J62439N7690j83062k3649
$$ 155365 109711 33688 153621 285547 221717 121885 125741 288180 345870 162808 139159
8210A39159R7705l9474N414K3375J1511J45719j17897L3430o619q7543l1886P0250
$$ 139159 236864 197390 202804 226179 237690 383409 265512 298942 292323 204780 172894 243144
8198B43144K3286j2768k66848l00919J33610J15475n67573M74702K53245J18600
$$ 243144 266430 253662 -13186 -314105 -180495 -65020 -632593 -157891 95354 213954
8188B13954R7667j38753P998L3308r9269j6534J0189m3583J87439k05118Q77J29897
$$ 213954 311621 172868 180866 214174 114905 98371 108560 64977 252416 47298 48175 178072
8176A78072M2050j52348J14119O8061R068J0928j35984j91993O0990k1188J11380
$$ 178072 220122 67774 181893 249954 259022 269950 133966 -58027 2963 -18225 93155
8165I3155m9629K48229N5185q7583q4942J7803L3600l5436o5943m5166R5856j5555
$$ 93155 43526 291755 346940 259357 174415 192218 225818 190382 124439 79273 175129 159574
8153A59574l3501l9775O4629P900Q6892Q0423o7767n0153q8430j17247j69149
$$ 159574 126073 86298 150927 158827 245719 326142 258375 208222 119792 2545 -166604
8142a66604J17355J17693j35813J51141J3096J60414m3408k0035r530k9321k7147
$$ -166604 -49249 68444 -67369 83772 96868 257282 213874 193839 184309 154988 127841
8131A27841N9594O5404l9258L9364r6302j30719R7239J2439Q3959J48363N5598
$$ 127841 187435 252839 213581 252945 156643 25924 123163 135602 219561 367924 423522
8120D23522j08438m6111n9844k5887K017k59230r594J40817N3054k8867P6972
$$ 423522 315084 268973 209129 183242 185259 -73971 -83565 57252 110306 81439 158411
8109A58411j0619P663o5915o4641p406P2312P0758j11727o5526J13208J12258
$$ 158411 147792 155455 89540 24899 17493 89805 160563 48836 -16690 96518 208776
8098B08776j0066j97624J1187J01843O2350k6547Q4553L3756j33664j14325N9748
$$ 208776 198710 1086 12273 114116 176466 149919 234472 268228 134564 20239 79987
8087G9987l8687O0774J15395j10713L7265p1230N744J67432R4700j25396j22684
$$ 79987 41300 102074 217469 106756 144021 72791 78535 245967 340667 215271 92587
8076I2587m4577L5349j5290R4269m4457Q2360l5047R8869M5344q8497M2750k7796
$$ 92587 48010 83359 68069 162338 117881 200241 165194 264063 309407 220910 263660 235864
8064B35864j13613l0117J48124J40542j14182p857o3726o2902j5900l9237n5924
$$ 235864 122251 92134 240258 380800 266618 258761 195035 132133 116233 76996 21072
8053B1072J44839J25211J8329l8671n1850J03648q4242r4710l4733O2637j45343
$$ 21072 165911 291122 309451 270780 218930 322578 238336 143626 108893 171530 26187
8042B6187J4934J13097J8448P2207J80936j66406J0994j15967J315J6985M7792
$$ 26187 41121 154218 172666 244873 425809 259403 270397 154430 155745 172730 220522
8031B20522l5404N2777P3830j03895j6002L6103r5193J2832K8762j16069J54123
$$ 220522 185118 237895 311725 207830 191828 227931 132738 145570 174332 58263 212386
8020B12386j1487K101J84233o1839j64110o8307r0078J92236P8325n5859j8813
$$ 212386 200899 203000 387233 325394 161284 92977 2899 195135 273460 217601 198788
8009A98788l5230p9502M7219N8556n8813j03125R0829L4183k8947L9994J26913
$$ 198788 163558 84056 131275 189831 131018 27893 118722 152905 123958 163952 290865
7998B90865N3637O0708j59437n4765R2774J86050l83956k9036J97869L7928q311
$$ 290865 344502 405210 245773 191008 283782 469832 85876 56840 254709 292637 284326
7987B84326m2906j13820j3253n8617N3360J8425n5586J66196k6323M9596p6449
$$ 284326 241420 127600 114347 55730 109090 127515 71929 238125 211802 261398 184949
7976A84949m5406j09266K9243o0989K22945J23918N5382j23731j3170o4573k0198
$$ 184949 139543 30277 59520 -1469 221476 345394 400776 277045 263875 199302 179104
7965A79104j20917o4194r8755J97361j13127K579l1895m9073K4575Q3360J49526
$$ 179104 58187 -6007 -104762 92599 -20528 -17949 -49844 -98917 -74342 9018 158544
7954A58544o1979l0253R2832J39868j28689j78562J04058m882j07926J39245J28162
$$ 158544 96565 66312 159144 299012 170323 -8239 95819 90937 -16989 122256 250418
7943B50418J07568j27783J46401j86397J21086J74056o0003j19577p3020M4138
$$ 250418 357986 230203 376604 190207 311293 485349 425346 305769 232749 276887
7933B76887j48337q9710J81134O0306Q2384L3052l7453m0182M4228o3760q4108
$$ 276887 128550 38840 219974 280280 362664 395716 358263 318081 362309 298549 214441
7922B14441j23717O7108j00816M11J9322J98027j8597p6979J51507j4766M1475
$$ 214441 90724 157832 57016 57427 76749 274776 256179 179200 330707 315941 357416
7911C57416r6160K9035j9373P8746k14534N3689k6745j02951l0302J69939l0807
$$ 357416 261256 290291 270918 349664 135130 188819 162074 59123 28821 198760 167953
7900A67953K2870J04867J9943j68970J50897k7617k2138j0447J65600j02720o1603
$$ 167953 190823 295690 315633 146663 297560 269943 247805 237358 402958 300238 238635
7889B38635M0158j15079K1582M2583J1323O3588P0989j07053n4048J14162J3133
$$ 238635 278793 163714 185296 227879 239202 302790 373779 266726 212678 326840 339973
7878C39973j56243K3347r4746K27988j2320M8689j43267M8963j47183K6675J31294
$$ 339973 183730 207077 112331 340319 327999 376688 233421 282384 135201 161876 293170
7867B93170P4495M0766q8270j66838J57139m9417j323r0865J72141n2310K7784
$$ 293170 367665 408431 320161 153323 310462 261045 259722 168857 340998 288688 316472
7856C16472j27950M0020N4768O2960M4507N3100M8581j53263J1253K2522L9851
$$ 316472 188522 228542 283310 346270 390777 443877 492458 339195 350448 372970 412821
7845D12821m949R451j17143l2841M6923J76414j78943P575P412L5911k40470J55495
$$ 412821 407872 417323 300180 267339 314262 490676 311733 319308 326720 362631 122161 277656
7833B77656o1520Q5849j9375J20458R6737L8002j86229K5220o027K0314j14006
$$ 277656 216136 301985 282610 403068 499805 537807 351578 376798 370771 391085 277079
7822B77079P8305k0853p615J42348n9306m5183M9376K22901j12662j18187l8234
$$ 277079 355384 334531 326916 469264 409958 364775 414151 637052 524390 406203 367969
7811C67969j3590j45365k2897j6126J32611N8684k7006J43385J92034o51404Q5353
$$ 367969 354379 209014 186117 169991 302602 361286 334280 477665 669699 18295 103648
7800A03648O7362K31406n5714J3269r1312J50278j42502j62177J7321n6288J23975
$$ 103648 171010 402416 346702 359971 268659 418937 276435 114258 131579 75291 199266
7789A99266m803K4509N6015J11992k02976k376p5746j4562Q8071J46283q9042
$$ 199266 194463 218972 274987 386979 184003 181627 105881 91319 179390 325673 236631
7778B36631O7453q848m8227m4847N7770l826J08099j60006O9563K6882Q2817n4324
$$ 236631 304084 295236 247009 202162 259932 256106 364205 204199 273762 300644 383461 329137
7766C29137j2180m2749J5654q3536m0950j2128J66837q7024j20778J02809o094
$$ 329137 316957 274208 289862 206326 165376 153248 320085 233061 112283 215092 208998
7755B08998q1363M4787J19069M9611M6984n5191k9537j341k9769l2162M8895K8254
$$ 208998 127635 172422 291491 341102 388086 332895 303358 302017 272248 240086 288981 317235
7743C17235J00011j95471p9441l8443P6613q3984P9187J23077O9057N5937k9479
$$ 317235 417246 221775 142334 103891 180504 96520 175707 298784 367841 423778 394299
7732C94299q4683J4196j5595p1137k8993J36861j02108P5437N2928p7152m1132
$$ 394299 309616 323812 308217 237080 208087 344948 242840 318277 371205 294053 252921
7721B52921r1600M0265Q8987J33508o0369M870M2134J08968j13636j59218k9401
$$ 252921 161321 201586 290573 424081 363712 368582 410716 519684 406048 246830 217429
7710B17429P8754l8292o1087q1327P2513N1736N7480L1945J10598M5612J15151
$$ 217429 296183 257891 196804 115477 187990 239726 297206 329151 439749 485361 600512
7699F00512j40830P6519O521j35081j17368K0789l8457j688k214N4648n8382m6708
$$ 600512 459682 536201 542722 407641 290273 311062 272605 270917 268703 323351 264969 218261
7687B18261L4277j5139J30745m3193j0380K2628o6129l010Q1192q5188P2369r7717
$$ 218261 252538 237399 368144 324951 314571 337199 271070 268060 349252 264064 336433 238716
7675B38716J40617K0613j0002n1374J09210j02751L0028j05204M7367l1452J56098
$$ 238716 379333 399946 389944 338570 447780 345029 375057 269853 317220 285768 441866
7664D41866k03060J20603P2L6084O8261j36326k7618M1686O4195L5813r2675r1095
$$ 441866 238806 359409 359481 395565 463826 327500 299882 341568 405763 441576 348901 257806
7652B57806J59125O7201O6342j59791J04552J23105L7045j04795m4335M660j3292
$$ 257806 416931 484132 550474 390683 495235 618340 655385 550590 506255 510915 497623
7641D97623n590O5317Q5469N6014j39576l2048j72614K086j679J42190J02533
$$ 497623 492033 557350 642819 698833 559257 527209 354595 356681 355002 497192 599725
7630E99725r8355q6178R9714J37876J7978j28387M0697o6339J29466k7523j0320
$$ 599725 501370 415192 514906 652782 670760 542373 583070 516731 646197 618674 608354
7619F08354k0966P4086M0570k6081L1881j9617J25300j03475K2669l2564Q5191
$$ 608354 587388 661474 702044 675963 707844 688227 813527 710052 732721 700157 785348
7608G85348m9167N502j7133P2478K2732j45381J21663N4240j84300J12973k8080
$$ 785348 736181 741683 724550 797028 819760 674379 796042 850282 665982 778955 750875
7597G50875k4901j7843R2531l2865m9857M0258Q7570J0462r4612J30055J42479
$$ 750875 725974 708131 800662 767797 717940 758198 845768 856230 761618 891673 1034152
7586A034152n0434j33280R790J13328p1982P4741Q0535l6618p408o4002Q9723
$$ 1034152 983718 850438 860228 973556 901574 976315 1056850 1020232 1012824 948822 1038545
7575A038545r8275N5601k0811P6913M0328P2890P154L186J11345J0006j6462K3327
$$ 1038545 940270 995871 975060 1051973 1092301 1165191 1172345 1175531 1286876 1296882 1280420 1303747
7563A303747r7158Q3987P3527k1929j10873P4824J46726p3586l998M2042Q3652
$$ 1303747 1206589 1290576 1364103 1342174 1231301 1306125 1452851 1379265 1375267 1417309 1500961
7552A500961J14930p6218M0155J15544P2098J29037R3612J98803m6361O2652J13337
$$ 1500961 1615891 1539673 1579828 1695372 1767470 1896507 1990119 2188922 2142561 2205213 2318550
7541B318550q916m2881O4713J4527K10832K7941p1801K04223J10506O7099J72043
$$ 2318550 2309634 2266753 2331466 2345993 2556825 2584766 2512965 2717188 2827694 2894793 3066836
7530C066836K03458J49164J95931K46997P7043K26658M04977O5877K43033K94171
$$ 3066836 3270294 3419458 3615389 3862386 3939429 4166087 4571064 4636941 4879974 5174145
7520E174145M37925L22437K96112M83661O53950P60104O71492N77342Q48362Q14473
$$ 5174145 5612070 5934507 6230619 6714280 7368230 8128334 8799826 9377168 10225530 11040003
7510A1040003J081420J270916J398837J677985J920530K013650K321270K303242
$$ 11040003 12121423 13392339 14791176 16469161 18389691 20403341 22724611 25027853
7502B5027853K134410K130219J761708J188390Q42897J37433p25485j129603j688784
$$ 25027853 27162263 29292482 31054190 32242580 33085477 33222910 32497425 31367822 29679038
7493B9679038j948539k139729k233906k089475j932110j834206j695555j732508
$$ 29679038 27730499 25590770 23356864 21267389 19335279 17501073 15805518 14073010
7485A4073010j228990j178446q02932r90798p87877o97345p08016m88169m23435
$$ 14073010 12844020 11665574 10862642 9871844 9083967 8386622 7678606 7190437 6767002
7476F767002n19492n62613k49853j94577k90906l30354k83068j95539j47804m2899
$$ 6767002 6247510 5684897 5435044 5240467 4949561 4619207 4336139 4140600 3992796 3949897
7466C949897k82788j46635j25310j77222j13273j46302j30023k29330R7264K1125
$$ 3949897 3667109 3520474 3395164 3217942 3104669 2958367 2828344 2599014 2696278 2717403
7456B717403j29365j07222O096j20145j63681j93119n309J28078L1831p759n4832
$$ 2717403 2588038 2480816 2486912 2366767 2203086 2009967 2004658 2132736 2164567 2156808 2101976
7445B101976j92915l3020M1309m3682l01491M6515J80684j71847o8959m0435q5994
$$ 2101976 1909061 1876041 1917350 1873668 1572177 1618692 1799376 1627529 1558570 1518135 1432141
7434A432141j73703k9622M5674O1602J5057o9972K4438r338j33154m8116k8718
$$ 1432141 1258438 1228816 1274490 1336092 1351149 1281177 1305615 1296277 1163123 1115007 1086289
7423A086289L3762K213J9768j00798m3469j08355p229j8085o7064R2594P0010
$$ 1086289 1120051 1122264 1142032 1041234 997765 889410 882181 864096 797032 889626 959636
7412I59636j40825O9166L1092O5404m0885k3349M8198j73616O3248O181L8950
$$ 959636 818811 887977 919069 984473 943588 920239 968437 794821 858069 864250 903200
7401I03200j4662P6059j1666O535k09002j46132R5638K03945K005m2019j02330
$$ 903200 888538 964597 952931 959466 750464 604332 699970 903915 905920 863901 761571
7390G61571o029J45497l1711o0226j0271j48962j4075l72P4063j76546J2880N012
$$ 761571 755542 901039 869328 809102 798831 649869 635794 635422 709485 532939 545819 550831
7378E50831J30769M5542O5669j7972M2660Q731j17816l7799j81915N767j11263
$$ 550831 681600 727142 792811 774839 817499 826230 708414 670615 488700 494467 383204
7367C83204R4643r4489N4165q3402K0698R3744J71590k19616j5397J20108k2271
$$ 383204 477847 383358 437523 354121 374819 468563 640153 420537 405140 525248 502977
7356E02977o1991L03938m6254K3609K3326j32746L5257n8086k13337J58024J16952
$$ 502977 440986 744924 698670 722279 745605 612859 648116 590030 376693 534717 651669
7345F51669k00332Q0004J16429P025k22948j7611P1832N9209p4268P2824m7475
$$ 651669 451337 531341 647770 654795 431847 414236 486068 545277 471009 543833 496358
7334D96358J72894j32643j25457j30474N596J19702M1476o7095o1981J141N9454
$$ 496358 669252 536609 411152 280678 286274 405976 447452 380357 318376 319517 378971
7323C78971N8088m168m5258n1780n608o8083k9788K05921Q5507m6556p707L2693
$$ 378971 437059 432891 387633 335853 330245 262162 232374 438295 523802 477246 469539 502232
7311E02232j36933q6069j7404K063N1110j29373Q229J04792Q2267p8409M9364
$$ 502232 365299 279230 261826 263889 314999 185626 193855 298647 380914 302505 351869
7300C51869Q7137l916L6819n9635N854j11081r8586J35509j10618j4649j53998
$$ 351869 439006 435090 471909 412274 418128 307047 208461 343970 233352 218703 64705
7289F4705P2641J63273J38381r5370j48446p6435J46934n990J9569L796N2606
$$ 64705 137346 300619 439000 343630 195184 118749 265683 259693 279262 283058 335664
7278C35664J66462p1721k4333P6584J0074j57254O4707m7657k4094J2100q4942
$$ 335664 502126 430405 406072 482656 492730 335476 400183 352526 328432 340532 255590
7267B55590n4208M3490L5045l5491M9632J94589j47875J58285j99834n0641J36197
$$ 255590 201382 244872 279917 244426 294058 488647 340772 499057 299223 248582 384779
7256C84779m2647j18917J3531J05650k5288r4709J22897M9065n5294j4577R6019
$$ 384779 342132 223215 236746 342396 317108 222399 345296 394361 339067 324490 420509
7245D20509M8856K8536q9670j54056J07161P3681n4498l2508J48346o8631O5011
$$ 420509 469365 497901 408231 254175 361336 435017 380519 348011 496357 427726 492737
7234D92737n1964J801l2352j04211K0662Q9071r7105l1836Q0245j47344r4125
$$ 492737 440773 442574 410222 306011 326673 415744 318639 286803 367048 219704 125579
7223A25579J08371J04296J86355q3924o3538j06238L1194k2428R5894K7771L1473
$$ 125579 233950 338246 524601 440677 377139 270901 302095 279667 375561 403332 434805
7212D34805p6952M7181l3745l4391n3965m9516J90783J42316j54558j62931P9523
$$ 434805 357853 405034 371289 336898 282933 233417 424200 566516 411958 249027 328550
7201C28550J30277Q3176j77972J38794K3847j80145l6313Q9195n5296j29005k7526
$$ 328550 458827 542003 364031 502825 526672 346527 310214 399409 344113 215108 187582
7190A87582K28640O3492j09414q5724J88853L803M5083o3471Q4681J01512j42089
$$ 187582 416222 479714 370300 284576 473429 477232 522315 458844 543525 645037 502948
7179E02948j44377q9817N2068o3474Q0417K0097J68074J5963n6481q7571R1161
$$ 502948 358571 268754 320822 257348 337765 357862 525936 541899 485418 397847 489008
7168D89008L4774n4771K5232O8533J1830O118K8550p3853j9463n517L1748k2255
$$ 489008 523782 469011 494243 562776 574606 580724 609274 535421 515958 510441 542189 519934
7156E19934K4606k3813R961j84870j17140P3205p5712J83137N4321O9843j80349
$$ 519934 544540 520727 530688 345818 228678 301883 226171 409308 463629 533472 353123
7145C53123j10481L802j36046J24930J15351L9352j03315l0669m1185p753N536
$$ 353123 242642 246444 110398 235328 350679 390031 286716 256047 214862 207109 212645
7134B12645J88093O6286n5194j09180K04887o3731j75966j048J94075N7815n4046
$$ 212645 400738 467024 411830 302650 507537 443806 267840 266792 460867 518682 464636
7123D64636j33044Q1617J12567j21129n215J23138o5230o2829m8806L9767j62559
$$ 464636 331592 413209 525776 404647 399432 522570 457340 394511 345705 385472 222913
7112B22913O2218m809J19688J07466p6293J20395J046M3593j23879R7343m2456
$$ 222913 285131 280322 400010 507476 431183 551578 552624 596217 472338 569681 527225
7101E27225j38552l0949j32357p0208J17439j1338J03106m2673J06143o5361P3719
$$ 527225 388673 357724 225367 155159 272598 261260 364366 321693 427836 362475 436194
7090D36194j779k3489j74818J84963m2382k14208j12540J24224J76271j00445
$$ 436194 434415 410926 236108 421071 378689 164481 51941 176165 352436 251991
7080B51991q8487K23506R0610o7479m8133j5011J5848K4451R0777r4112O631M4690
$$ 251991 163504 387010 477620 410141 362008 346997 362845 387296 478073 383961 390592 435282
7068D35282M8181N3857r6778j41478J30962J5189J5946k62828J3345J36152L7247
$$ 435282 483463 537320 440542 299064 430026 445215 461161 198333 211678 347830 385077
7057C85077N4481J07867o6895J7085p6938J36887L5677m0838l770n4488j71065
$$ 385077 439558 547425 480530 497615 420677 557564 593241 552403 548633 494145 323080
7046C23080L8915n637l7905l5977p1861M6779k8291r326n0313P1503J15567J62976
$$ 323080 361995 356358 318453 282476 210615 257394 229103 219777 169464 240967 356534 519510
7034E19510j59227r3258N5381O3885L4566O472j79136Q4603N7156R3235R9492
$$ 519510 360283 267025 322406 386291 420857 427329 248193 332796 389952 483187 582679
7023E82679P6261j80810o3250N8742r2427n4540N1115o6637J38938J24270j51295
$$ 582679 658940 478130 414880 473622 381195 326655 377770 311133 450071 574341 423046
7012D23046q9580J859p594J00154J278q4354J01241q6281m8959o432n0153P9145
$$ 423046 333466 335325 327731 427885 429163 344809 446050 359769 310810 304378 254225 333370
7000C33370L6672J38833O800k27681q0007Q005J94791n0490L2010j14747n0654
$$ 333370 370042 508875 515675 287994 207987 215992 410783 360293 392303 277556 226902
6989B26902J53277J3761L2589P6401j7453Q8348n2883n5574j06221O7998j4190
$$ 226902 380179 393940 426529 502930 485477 573825 520942 465368 359147 427145 412955
6978D12955r9966p8056J18291R8506j58531Q4831Q2743L8937L1372j26316O8979
$$ 412955 312989 234933 353224 451730 293199 378030 460773 499710 531082 404766 473745
6967D73745Q1325j83010O5942j21778j6269K3339m2484K700k77r1105R6153O770
$$ 473745 555070 372060 438002 316224 299955 323294 280810 283510 283233 192128 288281 295051
6955B95051M9987J82867J39623r2500j68717J20724l4960n8488q0878r4798p2677
$$ 295051 345038 527905 667528 575028 406311 527035 492075 433587 352709 257911 185234
6944A85234J50183L5997n1316J15447N1272j7763q0302j0829P3404j28377l8259
$$ 185234 335417 371414 320098 435545 486817 469054 388752 377923 451327 322950 284691
6933B84691p5827J61696J00574j849n0037n2818M8402J35033m0827M1694r2682
$$ 284691 208864 370560 471134 469285 419248 366430 414832 549865 509038 550732 458050
6922D58050j34629q093L1697k0154J63479l3498j90700j28786N8465J93922K8107
$$ 458050 323421 315328 347025 326871 490350 456852 266152 137366 195831 389753 417860
6911D17860J79423j53145p2348j02525o6077j08949J10910j29786L7829J55379
$$ 417860 597283 444138 371790 269265 203188 94239 205149 75363 113192 268571
6901B68571j2726J67697M2000M1290N7240o6812k2959J27344N3232m41904l8850
$$ 268571 255845 423542 465542 506832 564072 497260 474301 601645 654877 212973 174123
6890A74123r4264R1839J17907L4960J06108Q7216M0298j47427k245M3690k8424
$$ 174123 79859 171698 289605 324565 430673 517889 558187 410760 408515 452205 423781
6879D23781n9704j7459Q1864L9241m6097k02964R9419N1725m5554J54976m5073
$$ 423781 364077 346618 428482 467723 421626 218662 318081 369806 324252 479228 434155
6868D34155J05186j69493P189K7485n9636o4509L048Q2063N1530J61983p9834
$$ 434155 539341 369848 377037 404522 344886 280377 283425 365488 417018 579001 499167
6857D99167j87805J39613O5116j69718M3596J30240j70253J28585j20622j99374
$$ 499167 311362 450975 516091 346373 389969 520209 349956 478541 357919 158545
6847A58545K6984Q1972K08967o1627J01540J12079n4851k8446k4667k9689j31730
$$ 158545 185529 267501 476468 414841 516381 628460 573609 545163 520496 490807 359077
6836C59077o4002l5356n7660J95159j57501q487J98200N3085l5945j4921q7762
$$ 359077 295075 259719 202059 397218 239717 231230 429430 482515 446570 431649 343887
6825C43887L2951r8034J2292J33603n2600q8618j1373O8196m2136J27168M2402
$$ 343887 376838 278804 291096 424699 372099 283481 272108 340304 298168 425336 467738
6814D67738J36472j59027j69175L1797L2402J17245n2300n2781l6952L0541N4484
$$ 467738 604210 445183 276008 307805 340207 457452 405152 352371 315419 345960 400444
6803D00444n1675j8495J07000J31449j14581j02976r8350M6273L5768Q4386j12041
$$ 400444 348769 330274 437274 568723 454142 351166 252816 299089 334857 419243 307202
6792C07202J2667R2355J63827m5618Q382O378q2560n4417p3213P7584n3750j64481
$$ 307202 319869 412224 576051 530433 538815 545193 462633 408216 335003 412587 358837 194356
6780A94356M8064K67857J8624j00436l8798Q429Q6224N6488Q4718j07057j12510
$$ 194356 242420 510277 528901 428465 389667 398096 484320 540808 625526 518469 405959
6769D05959r3211j43347J05103R5001Q2604r8092L9942M4250J22048j2829q5493
$$ 405959 312748 169401 274504 369505 452109 354017 393959 438209 560257 547428 461935
6758D61935l9668N7876K6333J215O6805p4566j38265j97289L1893J95334J50978
$$ 461935 422267 480143 506476 507691 574496 499930 361665 164376 196269 391603 542581
6747E42581M9316j10978P9068R7077j46286R8216k9638j0393j15651m1270q4867
$$ 542581 591897 480919 559987 657064 510778 608994 579356 568963 453312 412042 327175
6736C27175M3637q4589R9680R6959n967N0651l6943J1697j0931r4420j13098j6202
$$ 327175 370812 286223 385903 482862 476895 527546 490603 502300 491369 396949 283851 267649
6724B67649N7633J39362N6294N5823o6680R4817j2046K4437n6652k46960n9259
$$ 267649 325282 464644 520938 576761 510081 604898 592852 617289 560637 313677 254418
6713B54418P795r5833J90127n334J51818q0247Q214J76896O0526j28972k3390
$$ 254418 262213 166380 356507 351173 502991 422744 430958 607854 668380 539408 516018
6702E16018j4145j02357J36122j85374m9843n1071n7525J67501K70242L5914r5331
$$ 516018 501873 399516 535638 350264 300421 249350 191825 359326 629568 665482 570151
6691E70151M3619q7134M3422O0976r1823l0601o9751p4975l1129J33827P4044
$$ 570151 613770 526636 570058 631034 539211 508610 438859 363884 332755 466582 540626
6680E40626n1048N2830P1250J71314j21673l2001m2781n7383j68j09110J04595
$$ 540626 489578 542408 613658 784972 663299 631298 588517 531134 530966 421856 526451
6669E26451N2498r1211n5037J9578K01879q1043j08443k75J31294j46281k04774
$$ 526451 578949 487738 432701 452279 654158 573115 464672 464397 595691 449410 244636
6658B44636L6432Q5517K23423k0848j54084J36807J00928p444J6034L3420j35480
$$ 244636 281068 366585 590008 569160 415076 551883 652811 645367 661401 694821 559341
6647E59341j42726P21R3717J7184J1422n4240p1061J47511j44525L5183J34381
$$ 559341 416615 417336 511053 528237 539659 485419 414358 561869 417344 452527 586908
6636E86908J15006j71584j58867J31525O1695j07364q1213Q2906r0448P9275Q9035
$$ 586908 701914 530330 371463 502988 564683 457319 376106 459012 368564 447839 536874
6625E36874J88425j5746J1965N3257j26943k0996N8845j24184j7886j8771r4119
$$ 536874 725299 709553 721518 774775 647832 626836 685681 561497 543611 524840 430721
6614D30721J25232n470n1105j91982K31509J32278o0727M4346j5853m0827j7808
$$ 430721 555953 550483 499378 307396 538905 671183 610456 654802 638949 598122 580314
6603E80314N4084O2492l8070m8183q5430J13658n5893J44185k0233l2589Q51J00772
$$ 580314 634398 696890 658820 610637 525207 638865 582972 727157 706924 674335 675186 775958
6591G75958j9303j80778q1254J20792j20642L8961J30150o2082k6224J29607p6582
$$ 775958 756655 575877 494623 615415 494773 533734 663884 601802 575578 705185 628603
6580F28603l0202J06353R238l6571j15693j24709J6892q3311J11739M5942J57881
$$ 628603 598401 704754 713992 677421 561728 437019 453911 370600 482339 528281 686162
6569F86162J27286j6064j72217j22514M8678K427K63585j27236j73443j06583
$$ 686162 813448 797384 625167 502653 551331 553758 817343 690107 516664 410081
6559D10081O3654n600J00422N9293K33941M8757r1776K1463p3291j14122k08812
$$ 410081 473735 468135 568557 627850 861791 910548 818772 840235 766944 652822 444010
6548D44010k3889J71485m7475j39573o61R4102N1470N3996m2727p5339K25429
$$ 444010 420121 591606 544131 404558 403897 497999 549469 603465 560738 485399 710828
6537G10828L8391j70732M2172R87r5615j24292N6830L9705J07829k2619p7112
$$ 710828 749219 578487 620659 621646 526031 401739 458569 498274 606103 583484 506372
6526E06372M6791J46967M9190p8327L0634L7694j7187Q3623j61048l5620N3449
$$ 506372 553163 700130 749320 670993 701627 739321 722134 805757 644709 609089 662538
6515F62538n6745r454J08503j1319j40446l7281M9942J63399L6919p1144l6847
$$ 662538 605793 596339 704842 693523 553077 515796 565738 729137 766056 694912 658065
6504F58065j80878P029N5617K67066N3805K829j30121j03431J03527P5649j42081
$$ 658065 477187 484216 539833 806899 860704 863533 733412 629981 733508 809157 667076
6493F67076p8119K6762J31372n7651j19429J33693Q3461q131j98714J14100J38522
$$ 667076 588957 615719 747091 689440 570011 703704 787165 779034 580320 694420 832942
6482H32942j02034N3662J837p4062o9024n2384J66529J27334R6378j75231p124
$$ 832942 730908 784570 786407 712345 643321 590937 757466 884800 981178 805947 798823
6471G98823K3576J4980l7313m1313M622J625N9419j14246q3463n0216L3978J43262
$$ 798823 822399 837379 800066 758753 763375 765000 824419 710173 626710 576494 610472 753734
6459G53734O0744R1724l6406N0336O1808L8676n1046j06753j97291j9870R3872
$$ 753734 814478 906202 869796 920132 981940 1020616 969570 862817 665526 645656 739528
6448G39528K9873J06285p3185q746O5311O9788p0404j71276m7162Q4181K6264
$$ 739528 769401 875686 802501 793755 859066 928854 858450 687174 640012 724193 750457
6437G50457O6374M2792m2569K9635r8136N3343o185R3198p73o1784j04903M3199
$$ 750457 816831 859623 817054 846689 748553 801896 795711 888909 888136 826352 721449 764648
6425G64648j3700m2048J12522P6923p8878J01022j66738j20929K30752J8175k9401
$$ 764648 750948 708900 821422 898345 819467 920489 753751 632822 863574 881749 852348
6414H52348m0869j9651p106j48828m0213J27264r2639n351l1802J28528R7301
$$ 852348 811479 791828 784722 635894 595681 722945 630306 624955 593153 721681 818982
6403H18982M5244q3108J9058J09567K6805J21539j2610R473j85793k21714M3147
$$ 818982 864226 781118 800176 909743 936548 1058087 1045477 1054950 869157 647443 690590
6392F90590J25801j32353N9338J12891m7426O0534L3354J51384o7336N8492j41960
$$ 690590 816391 684038 743376 856267 808841 869375 902729 1054113 986777 1045269 903309
6381I03309p2943k3646j16147K4618K13824J44520j32413L722R4889J76744n7201
$$ 903309 830366 806720 690573 715191 929015 1073535 941122 944844 1039733 1216477 1159276
6370A159276j41225M3005L7168j02120j15450m3310P9641R7574M8985O2006q4461
$$ 1159276 1018051 1061056 1098224 996104 880654 837344 916985 1014559 1063544 1125550 1041089
6359A041089P828k0299j64640M9295K235j33835J36592j08566J60058J2380p5738
$$ 1041089 1048917 1028618 863978 913273 915508 781673 918265 809699 969757 982137 906399
6348I06399J23679r5862J15352J18797Q7778p7052j27746o9218K1758K374O3518
$$ 906399 1030078 934216 1049568 1168365 1256143 1179091 1051345 982127 1003885 1006259 1069777
6337A069777n7517j6621m9349M4437R2639J1190N0988n2389k2735N1101n7655
$$ 1069777 1012260 995639 946290 990727 1083366 1094556 1145544 1093155 1070420 1121521 1063866
6326A063866R8285o4933l2171J05539Q6052j19703n1919Q1089P8220Q4634m9835
$$ 1063866 1162151 1097218 1065047 1170586 1256638 1136935 1085016 1166105 1244325 1328959 1279124
6315A279124m8814p7281J5430j41783J22446P1288L8235K267r3169L4392J95407
$$ 1279124 1230310 1153029 1168459 1026676 1149122 1220410 1258645 1260912 1167743 1202135 1397542
6304A397542q4050r5856J35596R8573l5917n9126k7809j39787q0330O3433K47722
$$ 1397542 1313492 1217636 1353232 1451805 1415888 1356762 1328953 1189166 1108836 1172269 1419991
6293A419991J9879R6878p709n1691M0598j21088l3803J3185K1111Q6763o1326
$$ 1419991 1439870 1536748 1529039 1477348 1517946 1396858 1363055 1376240 1397351 1484114 1422788
6282A422788K531J69822r0573j28302J14998L5781J3940J13975J7479p3974J0110
$$ 1422788 1425319 1595141 1504568 1376266 1491264 1527045 1540985 1654960 1672439 1598465 1608575
6271A608575J20386Q2861j06785j8315J6813J61013N5979j52408j00239P2692
$$ 1608575 1728961 1811822 1705037 1686722 1703535 1864548 1920527 1768119 1667880 1740572
6261A740572R3537q1852q4417M2004p2775J11341J98185m7254l089q7697R9332
$$ 1740572 1834109 1752257 1667840 1709844 1637069 1748410 1946595 1899341 1896252 1808555 1907887
6250A907887J98504J572j07239l9340m1923m0635J21447J7681N9876J15415L675
$$ 1907887 2106391 2107963 2000724 1961384 1919461 1878826 2000273 2017954 2077830 2193245 2196920
6239B196920R1389q6617J00666j21419J23651M3758J73050N2721j9188r3899j15269
$$ 2196920 2288309 2201692 2302358 2180939 2304590 2348348 2521398 2574119 2554931 2461032 2345763
6228B345763L2521M290J54915R1798L7325O1714J15679p4639j1443J40233J39713
$$ 2345763 2378284 2382574 2537489 2629287 2666612 2728326 2844005 2769366 2757923 2898156 3037869
6217C037869P5950k8883L4743J39682R8612J91360K9173L7081Q0822L07147K62803
$$ 3037869 3113819 3084936 3119679 3259361 3357973 3549333 3578506 3615587 3696409 4003556 4266359
6206D266359R4266O8686J97830J36365J72688L34422R6092K44484K52222K76179
$$ 4266359 4360625 4429311 4627141 4763506 4936194 5270616 5366708 5611192 5863414 6139593
6196F139593L09861K83351L33482J27869L45055L63444M58087L21585L33477K63057
$$ 6139593 6449454 6732805 7066287 7194156 7539211 7902655 8360742 8682327 9015804 9278861
6186I278861J77374N32636K36742L85155L76785J28953J74980K68487J05975Q4534
$$ 9278861 9456235 9988871 10225613 10610768 10987553 11116506 11291486 11559973 11665948 11750482
6176A1750482Q7563p2426K8863K27001R5786K07709J66044L21852L6305j14204
$$ 11750482 11838045 11765619 11794482 12021483 12117269 12324978 12491022 12812874 12849179 12734975
6166A2734975J72521P9590l5122J27383K2058j11138K26933O13K1721J06946O3410
$$ 12734975 12907496 12987086 12951964 13079347 13101405 12990267 13217200 13217813 13239534 13346480 13409890
6155A3409890k9278l0951L0759K11037K3949j01304j29571j3745k81063j70643
$$ 13409890 13380612 13349661 13380420 13591457 13615406 13514102 13384531 13370786 13089723 12919080
6145A2919080j54921j56220j82538k28687n7105P8762r9743j53553j85011l7490
$$ 12919080 12764159 12607939 12425401 12196714 12139609 12218371 12118628 11965075 11780064 11742574
6135A1742574k2187r8172l29271j62853j2806l10850k79261j53807o8155k48561
$$ 11742574 11720387 11622215 11292944 11130091 11117285 10806435 10527174 10373367 10305212 10056651
6125A0056651l43486k28012k90451l92745j79468l71075m29483m20341l19842
$$ 10056651 9713165 9485153 9194702 8801957 8622489 8251414 7821931 7401590 7081748
6116G081748k16537k53619l17702k27518k52985k98068k46941q9011k2732j58558
$$ 7081748 6865211 6611592 6293890 6066372 5813387 5515319 5268378 5179367 5156635 4998077
6106D998077k74900k10278j49479j16387k9937M5804j01134j44696m3335o0786
$$ 4998077 4723177 4512899 4363420 4247033 4217096 4262900 4161766 4017070 3973735 3912949
6096C912949J44110j95411k24688j03990n9682m3356r2364m1642j2572p1650m0316
$$ 3912949 4057059 3861648 3636960 3532970 3473288 3429932 3337568 3295926 3283354 3211704 3171388
6085C171388R4886Q8069p0510k9059j28312O8184p3915k11360j7767K5046P8260
$$ 3171388 3266274 3354343 3283833 3254774 3126462 3194646 3120731 2909371 2891604 2916650 2994910
6074B994910L4943k4929j33531L0801L0966n4312j20718K6233q2510J4849J15127
$$ 2994910 3029853 3004924 2871393 2902194 2933160 2878848 2758130 2784363 2701853 2716702 2831829
6063B831829J4010n8337J31154K0762n9370j04273K14637m5006l8740q02j59537
$$ 2831829 2845839 2787502 2918656 2939418 2880048 2775775 2990412 2945406 2906666 2905864 2746327
6052B746327o2248L2423j10494j8304K35084J24776k102o7322j3706R8115J08876
$$ 2746327 2684079 2716502 2606008 2587704 2822788 2947564 2945462 2878140 2864434 2962549 3071425
6041C071425n8262q8736p4123j77906K21340L7578p8977k7729m969M2920l1751
$$ 3071425 3013163 2924427 2850304 2672398 2893738 2931316 2852339 2824610 2819641 2862561 2830810
6030B830810L7357r7191j2827p7667J64479p8733K41872n5826j19408K18430K8715
$$ 2830810 2868167 2770976 2758149 2680482 2844961 2766228 3008100 2952274 2832866 3051296 3080011
6019C080011k7406P2270j3332j8442j3767N2034R8670O3668j01936p0182K63711
$$ 3080011 3052605 3124875 3111543 3093101 3079334 3131368 3230038 3293706 3191770 3121588 3385299
6008C385299j68941j39261m9919q3076j677J84290J1366J06375k5487m4044J34125
$$ 3385299 3216358 3077097 3027178 2944102 2942425 3126715 3138081 3244456 3218969 3174925 3309050
5997C309050J01205j61342o3439J01769j06545Q8227J07798r1372P2020O4252
$$ 3309050 3410255 3248913 3185474 3287243 3180698 3268925 3376723 3285351 3357371 3421623
5987C421623M6726O1513N0907m8088j2985Q473Q9686O6783o8996J06776l4255
$$ 3421623 3468349 3529862 3580769 3532681 3519696 3528169 3617855 3684638 3615642 3722418 3688163
5976C688163j36479J08181J35656j43225L4053J10558J03917J59944O0902r8299
$$ 3688163 3551684 3659865 3795521 3652296 3686349 3796907 3900824 4060768 4121670 4023371
5966D023371J29253N2958k8514R3405L6979q5776n4807J73517K01980N4673j13791
$$ 4023371 4152624 4205582 4177068 4270473 4307452 4221676 4166869 4340386 4542366 4597039 4483248
5955D483248j09479N8976K832R1033l4376J24286R7721k1909P5848L3652K2109
$$ 4483248 4373769 4432745 4435577 4526610 4492234 4616520 4714241 4692332 4768180 4801832 4823941
5944D823941K04925J43371l2514j29575j28962k6915L0066L11190M6026j52873
$$ 4823941 5028866 5172237 5139723 5010148 4881186 4854271 4884337 5195527 5241553 5088680
5934E088680L0349K58963R480L7447J33862n10j14648R9437P8874o1907k4903
$$ 5088680 5119029 5377992 5387472 5424919 5558781 5558271 5443623 5543060 5621934 5560027 5535124
5923E535124p752J08589O5971m0091J43725J49643n5560O6040Q8778N9162o739
$$ 5535124 5527372 5635961 5701932 5661841 5805566 5955209 5899649 5965689 6054467 6113629 6106890
5912F106890L6810K1593J54863m6756l9729N338J69743J49888J89192N9946O7197
$$ 6106890 6143700 6165293 6320156 6273400 6233671 6239009 6408752 6558640 6747832 6807778 6874975
5901F874975o1396J9356Q2478J98395l6616J42937O3847J31683J4022j4667J79680
$$ 6874975 6813579 6832935 6915413 7113808 7077192 7220129 7283976 7415659 7429681 7415014 7594694
5890G594694R807J50211n0196J8129K47126M1445O1696J60858K44420q1031O5066
$$ 7594694 7604501 7754712 7704516 7722645 7969771 8011216 8072912 8233770 8478190 8397159 8462225
5879H462225K58947J05727J46943N9719K02364M620l8743K2730J86909K5263J27541
$$ 8462225 8721172 8826899 8973842 9033561 9235925 9240545 9201802 9224532 9411441 9436704 9564245
5868I564245Q6753L11550J55411J51633J06228J36962Q1603K9936Q4622K48792
$$ 9564245 9650998 9962548 10117959 10269592 10375820 10512782 10594385 10624321 10708943 10957735
5858A0957735J27585K24814J45519J21112K36335K82845J32214K47717J85591
$$ 10957735 11085320 11310134 11455653 11576765 11813100 12095945 12228159 12475876 12661467
5849A2661467K03205K75140J57952J55433K39375N10738L56427J59350M56284
$$ 12661467 12864672 13139812 13297764 13453197 13692572 14203310 14559737 14719087 15175371
5840A5175371N85781P24498R69165P51435O76366N90877N04483J7286p0607m3612
$$ 15175371 15761152 16485650 17454815 18206250 18882616 19473493 19977976 19995262 19924655 19881043
5830A9881043j49214q095P6485J5227O4131L38941M43247K64133M23602M92020
$$ 19881043 19731829 19723734 19800219 19815446 19879577 20218518 20661765 20925898 21349500 21841520
5820B1841520L69565M13390L34773N32404M77221N12085M60969P28538P12557
$$ 21841520 22211085 22624475 22959248 23491652 23968873 24480958 24941927 25670465 26383022
5811B6383022Q22856Q33533Q55301R27170J132839J128911J261044J562152J639811
$$ 26383022 27205878 28039411 28894712 29821882 30954721 32083632 33344676 34906828 36546639
5802C6546639K052285K395751K869249L345938M038847M986308N947035P168302
$$ 36546639 38598924 40994675 43863924 47209862 51248709 56235017 62182052 69350354
5794F9350354Q268350R009632Q217713O076985L341144K83356k774724n373366
$$ 69350354 77618704 86628336 94846049 100923034 104264178 104547534 101772810 96399444
5786I6399444o519710o784046o172620n501852m361683l489224k354028j890415
$$ 96399444 89879734 83095688 76923068 71421216 67059533 63570309 61216281 59325866
5778E9325866j313224q97762o99285l12909O9155L71294Q05040O68633O12010
$$ 59325866 58012642 57114880 56415595 56102686 56171841 56543135 57348175 58016808 58628818
5769E8628818R46345J340211J345079J391946J423191J636635J701420J873765
$$ 58628818 59575163 60915374 62260453 63652399 65075590 66712225 68413645 70287410
5761G0287410K092418K175736K455020K409613K652881K825897K956424L193951
$$ 70287410 72379828 74555564 77010584 79420197 82073078 84898975 87855399 91049350
5753I1049350L616402L640713L959768M215440M490538M724954N228921N462564
$$ 91049350 94665752 98306465 102266233 106481673 110972211 115697165 120926086 126388650
5745A26388650O100959O357399O793890P292387Q080390Q698489R130971R792196
$$ 126388650 132489609 138847008 145640898 152933285 161013675 169712164 178843135 188635331
5737A88635331J0657486J1438723J2229393J3227199J4199821J5103685J5885573
$$ 188635331 199292817 210731540 222960933 236188132 250387953 265491638 281377211
5730B81377211J6779855J7730255J8332467J8591063J8863322J8724693J8007728
$$ 281377211 298157066 315887321 334219788 352810851 371674173 390398866 408406594
5723D08406594J6797767J5320795J3079467J0516897P600102M423035O94307k759648
$$ 408406594 425204361 440525156 453604623 464121520 471721622 476144657 476838964 474079316
5715D74079316o383560r308265j2031313j4471903j6102462j7433913j8560819
$$ 474079316 467695756 458387491 446356178 431884275 415781813 398347900 379787081
5708C79787081j8887873j8701578j8526521j8024950j7273160j6482327j5407780
$$ 379787081 360899208 342197630 323671109 305646159 288372999 271890672 256482892
5701B56482892j4639258j3696511j2877319j1961632j1072194j0225727r601696
$$ 256482892 241843634 228147123 215269804 203308172 192235978 182010251 172408555
5694A72408555r043262q333106p728992p042953o682449o397443n865075n284596
$$ 172408555 163365293 155032187 147303195 140260242 133577793 127180350 121315275 116030679
5686A16030679n038538m777328m417566m047254l920281l764755l587202l143323
$$ 116030679 110992141 106214813 101797247 97749993 93829712 90064957 86477755 83334432
5678H3334432l137320k896247k807004k536232k478125k337819k164646k028417
$$ 83334432 80197112 77300865 74493861 71957629 69479504 67141685 64977039 62948622
5670F2948622k028962k096022j869759j760789j777285j552025j416237j519246
$$ 62948622 60919660 58823638 56953879 55193090 53415805 51863780 50447543 48928297
5662D8928297j450118j432117j299563j261446j246346r37370j223305j259440
$$ 48928297 47478179 46046062 44746499 43485053 42238707 41301337 40078032 38818592
5654C8818592j043107j038387r84604j008567r40452r91933p80738p81098o13937
$$ 38818592 37775485 36737098 35752494 34743927 33803475 32811542 32030804 31249706 30635769
5645C0635769n94947p82657q08018o07468p24169o10114o69017p65650n34328
$$ 30635769 30040822 29258165 28450147 27842679 27118510 26508396 25839379 25073729 24539401
5636B4539401m88818n64183n36116o74311o89308l56050l92255m61146n06428
$$ 24539401 24050583 23486400 22950284 22275973 21586665 21230615 20838360 20377214 19870786
5627A9870786l33995l23453n29043l80248m22560m67527l53226l95215k97889
$$ 19870786 19536791 19213338 18684295 18304047 17881487 17413960 17060734 16665519 16367630
5618A6367630l17570l13486m13914l60218k04648k87579l35939j18225k87187
$$ 16367630 16050060 15736574 15322660 14962442 14757794 14470215 14134276 14016051 13728864
5609A3728864k69398k34965j9672k50797l64860k79150l38738j48526k21382j58502
$$ 13728864 13459466 13224501 13204829 12954032 12589172 12310022 11971284 11822758 11601376 11442874
5599A1442874j29658o6337j53574j72157j08880k45249k42766j74387j45398j9064
$$ 11442874 11313216 11246879 11093305 10921148 10812268 10567019 10324253 10149866 10004468 9985404
5589I985404j22647j12973k02951k26107k00273j93242j71679k15294j25174j88411
$$ 9985404 9862757 9749784 9546833 9320726 9120453 8927211 8755532 8540238 8415064 8226653
5579H226653k37426r0349k50856K7715r9194j87677j94804j18552j59736j42555
$$ 8226653 7989227 7898878 7648022 7675737 7576543 7388866 7194062 7075510 6915774 6773219
5569F773219o8495l612k62959k15144m3699p3602J9006k14936j31321j42361N8268
$$ 6773219 6704724 6701112 6438153 6223009 6179310 6105708 6124714 5909778 5778457 5636096 5694364
5558E694364p0673p5409r0857j84928l39640j13717q6146J713k8377l918n5568
$$ 5694364 5623691 5548282 5457425 5272497 4932857 4819140 4732994 4734707 4706330 4702412 4646844
5547D646844m598j06554o6183n1817N211j39357l99522j40609n1929Q7662j218
$$ 4646844 4642246 4535692 4469509 4417692 4422903 4283546 3884024 3743415 3691486 3779148 3777930
5536C777930j5395j9085j33190j07118K2653k877j04673Q552j88652j16675l9364
$$ 3777930 3762535 3743450 3610260 3503142 3525795 3522918 3418245 3426797 3238145 3121470 3082106
5525C082106K8008j00351o9472L0738m7078l5291j10362J93575l8005r7775p8276
$$ 3082106 3110114 3009763 2940291 2971029 2923951 2888660 2778298 2971873 2933868 2836093 2757817
5514B757817K6170n4382j13377O3322k1031j38577K8908q5137K0493k06678M3664
$$ 2757817 2783987 2729605 2616228 2679550 2658519 2519942 2548850 2463713 2484206 2277528 2321192
5503B321192l6271j01856o8404j39865K9862k12109O3173J30194r6864P4006J26142
$$ 2321192 2284921 2183065 2114661 1974796 2004658 1792549 1855722 1985916 1889052 1963058 2089200
5492B089200J68729j00353j88788J5552j48451q0550l2170j6829l0150p8333o7345
$$ 2089200 2257929 2157576 1968788 1984340 1835889 1755339 1723169 1706340 1676190 1597857 1530512
5481A530512J49009K0706r2019M6122P6827n7665J06231j72892K1524J4854j25404
$$ 1530512 1679521 1700227 1608208 1654330 1731157 1673492 1779723 1606831 1628355 1643209 1517805
5470A517805n7748J7996J8301N1425O3139k6605j00879p0395J77103N5716J20187
$$ 1517805 1460057 1478053 1496354 1547779 1610918 1584313 1483434 1413039 1590142 1645858 1766045
5459A766045j29430L5708J3334l0426j56897J14694o8727R9360O9672j86956L3953
$$ 1766045 1636615 1672323 1685657 1655231 1498334 1613028 1544301 1643661 1713333 1526377 1560330
5448A560330n5259j54765j58714P3219N0089j51262m7350L707m5421l2358K4314
$$ 1560330 1505071 1350306 1191592 1264811 1314900 1163638 1116288 1119995 1074574 1042216 1066530
5437A066530q3499l0532l7721N3743O6099k07338L6002P6976N6495Q079m591k6364
$$ 1066530 983031 952499 914778 968521 1034620 827282 863284 940260 996755 1004834 1000243 973879
5425I73879q3984q4514J07421k7066P5816J00668p616j43522j07642N8999P3599
$$ 973879 889895 805381 912802 885736 961552 1062220 1054604 911082 803440 862439 936038
5414I36038j76673P4946o9738J11329K617P7652p4j80173N0317j31638l7655m723
$$ 936038 759365 834311 764573 875902 878519 956171 956097 775924 826241 694603 656948 652225
5402F52225N9963J32919r8542n6142j6221q5373m4724P3364J17323J27088r78
$$ 652225 712188 845107 746565 690423 674202 588829 544105 617469 734792 861880 860902
5391H60902k22954M0683m3508j04209J3554L3398m6164J38893M087p3559k5012
$$ 860902 637948 678631 635123 530914 544468 577866 531702 670595 674682 601123 576111
5380E76111P2480p2645J4692R3304n200q3115K11043Q1398L1878q4215j06103
$$ 576111 648591 575946 590638 683942 678742 595627 806670 888068 919946 835731 729628
5369G29628m5885j07155p3167K0307K3071R5103o3066j0211J26985P7740K0812
$$ 729628 683743 576588 503421 523728 546799 641902 578836 568625 695610 773350 794162
5358G94162l8610j67753k01236N3465K2771R1204N517J70304j9111o6573j07911
$$ 794162 755552 587799 386563 440028 462799 554003 559520 729824 710713 644140 536229
5347E36229k0055j3132m1115j76310J15148J76486J3239o8488J82637O1496k29123
$$ 536229 516174 503042 461927 285617 400765 577251 590490 522002 704639 766135 537012
5336E37012o1827Q8225J7869n7467j22356L3870j13490K8160J59428j53188K1401
$$ 537012 475185 563410 581279 523812 401456 435326 321836 349996 509424 356236 377637
5325C77637R9384K4270P4374L5562o3002p7215L8338O3478K5392J8051j84132
$$ 377637 477021 501291 575665 611227 548225 471010 509348 572826 598218 616269 432137
5314D32137p523n9481J1315r453P602J6723k4296N2191J57671j44214j60303m091
$$ 432137 424614 365133 376448 366995 374597 391320 367024 419215 576886 432672 272369 268278
5302B68278K45446M9482o3361m3752j64161l1855Q2952J16637m6439o8576R6511
$$ 268278 513724 563206 499845 456093 291932 260077 343029 459666 413227 344651 441162
5291D41162j61035J25119r667p7398j1363j4286J65867R419l9049o1043q4337
$$ 441162 280127 405246 395579 318181 306818 292532 458399 467818 428769 367726 283389
5280B83389n6860J59608j8605j49474J3250J9207N654Q2917J1989k7906p5580
$$ 283389 226529 386137 367532 218058 231308 250515 256169 339086 351075 323169 247589
5269B47589P6202j2642P6491j3222J52349r5421q1556P1329l6233P9516n7105
$$ 247589 323791 311149 387640 374418 526767 431346 349790 421119 384886 464402 407297
5258D07297j35506L3353j16504N1930J42856j4730J93692K07114p1082k39364
$$ 407297 271791 305144 188640 240570 383426 368696 562388 769502 698420 459056
5248D59056q0980j2165k4556q6557N3890J16525o6425j1075J22915M1171q2021
$$ 459056 378076 365911 341355 254798 308688 425213 358788 347713 470628 511799 429778
5237D29778p7430j76785P5108J82236N408m4264j33532L91O8978R6012o9950L6382
$$ 429778 352348 175563 250671 432907 438315 394051 260519 260910 329888 425900 355950 392332
5225C92332J43564J7056o9632j42230p7697Q6836j9822k3451j9038m1352J11350
$$ 392332 535896 552952 483320 341090 263393 350229 330407 306956 287918 246566 357916
5214C57916j27583M1534J00883j7856j21725M4057o9630p6623J31514J40312K7003
$$ 357916 230333 271867 372750 354894 233169 277226 207596 130973 262487 402799 429802
5203D29802N8683N9923m5202j1947p3280o6946K8410p132Q547j55876j83205J37101
$$ 429802 488485 548408 503206 491259 417979 351033 379443 372311 380858 224982 41777 178878
5191A78878j5175J05935j59264O7008N6357N0183J01899M612l1172n6202l4518
$$ 178878 163703 269638 110374 177382 233739 283922 385821 390433 359261 303059 268541
5180B68541Q8822j05648O7683n4993M142n2458P3863P3476p6132L1360o4214j9480
$$ 268541 357363 251715 319398 264405 268547 216089 289952 363428 287296 318656 254442 234962
5168B34962k972o6291J17007R1920j32157j2529j16924j0385L1086Q5316P5434
$$ 234962 231990 165699 282706 374626 242469 229940 113016 102631 133717 219033 294467
5157B94467L5579J9544N3896k42165m8304J86956L7787j85763P44J46742N0289
$$ 294467 330046 349590 403486 161321 113017 299973 337760 151997 152741 299483 349772
5146C49772Q6215r8061j18477J40674j461j04692K7683j1760j78471J66448L3909
$$ 349772 435987 337926 219449 360123 358662 253970 281653 269893 91422 257870 291779
5135B91779N6069K7746q4272K3457j8357L0763n47N4055j32589j7166O6850R4589
$$ 291779 347848 375594 291322 314779 296422 327185 326638 380693 248104 230938 297788 392377
5123C92377m5629o9386L3476M2866J07204L3617j24271J56559J10832o0892J31037
$$ 392377 346748 277362 310838 353704 460908 494525 370254 526813 637645 576753 707790
5112G07790k02314k41437Q4609N6667L6869j71487N0383J87098n5199o270j001
$$ 707790 505476 264039 348648 405315 442184 270697 321080 508178 452979 446709 445708
5101D45708J8311r4901k12728N8924L32381o2201j29715j5008Q7550L8416q6995
$$ 445708 464019 369118 156390 215314 547695 485494 355779 340771 428321 466737 379742
5090C79742m7456P4001l7728R0323r1718K9982M1268J3154P5935j18417k241k3259
$$ 379742 332286 406287 368559 458882 367164 397146 438414 451568 527503 409086 406845 383586
5078C83586P4826J30584j96144j58715J24479O1335P4177k1216j648J03396m1475
$$ 383586 458412 588996 392852 234137 358616 419951 494128 472912 471264 574660 533185
5067E33185J4580m4366k8583N4876j48643l2431K5894N8706L9085J78754o3620
$$ 533185 547765 503399 474816 529692 381049 348618 374512 433218 472303 651057 587437
5056E87437l1274k378J24043R0688j74386O978o2432L9040m7985J6263N4588k5318
$$ 587437 556163 553785 677828 768516 594130 601108 538676 577716 529731 545994 600582 575264
5044E75264n0529r5977K035q6314m5742P3369M2413K4309j8885R6277o5270J80105
$$ 575264 524735 428758 430793 344479 298737 372106 414519 438828 419943 516220 450950 631055
5032F31055J04801j08395r5815P6323m3826k45913J04887K50884l8118o6285j43849
$$ 631055 735856 627461 531646 607969 564143 318230 423117 674001 635883 569598 425749
5021D25749M4573J76055l1171J35539j4517j43892j91473l6583J38433n9052p6307
$$ 425749 470322 646377 615206 750745 736228 592336 400863 364280 502713 443661 367354
5010C67354J81024q1127n6982R1947R0185r1113J27726Q6314j13935O1202l3364
$$ 367354 548378 467251 410269 502216 592401 501288 629014 715328 601393 662595 629231
4999F29231j30346R6215o7923n7758J2976J62806j7884m4983P8779J13875L011
$$ 629231 498885 595100 527177 469419 482395 645201 627317 582334 661113 774988 777999
4988G77999p3020R4523K4371m9774r3234J3138R935j1592n5719j3675J1867J03300
$$ 777999 704979 799502 823873 774099 680865 694003 703938 692346 636627 622952 634819 738119
4976G38119Q398p1626J54187K1549j59767N98l2575L6032j580J18522J15798l41369
$$ 738119 746517 674891 829078 850627 690860 691458 658883 694915 693335 811857 927655 586286
4964E86286J9752J98996j14399o1503J05850j7589k944M699m4831J82357J32924
$$ 586286 606038 805034 690635 629132 734982 717393 714449 719148 674317 856674 989598
4953I89598k0003K391J21904K09359Q294J08470L78011M00022L71435M58274J23140
$$ 989598 969595 971986 1093890 1303249 1311543 1420013 1798024 2198046 2569481 3027755 3150895
4942C150895J56172j43823j50601m46803m67418j76086k51247p2734j12742l77586
$$ 3150895 3307067 3163244 3012643 2565840 2098422 1922336 1671089 1598355 1485613 1108027
4932A108027j27946J36503r7728m6063J6702N3213J4734o1877n6998P4637q9735
$$ 1108027 980081 1116584 1018856 972793 989495 1042708 1057442 995565 938567 1013204 923469
4921I23469P4454p7831q636r4347O1826M3962N9135k4139j18084r4843J13880
$$ 923469 997923 920092 911456 817109 878935 922897 982032 957893 839809 744966 858846
4910H58846J08352q5028j64481J78573M7872J1992m7527m6501J05333P2642R2936
$$ 858846 967198 882170 717689 896262 944134 956126 908599 862098 967431 1040073 1133009
4899A133009L9808p1663J01265j55400J1505J35545j58520l6483O1852J55593
$$ 1133009 1172817 1101154 1202419 1047019 1058524 1194069 1035549 999066 1060918 1216511
4889A216511j88301j76949J52496N1684k6650K9876k0295k6389j14943k188J01606
$$ 1216511 1028210 851261 1003757 1055441 1028791 1058667 1038372 1011983 897040 894852 996458
4878I96458J90228L6024K0507n2042l8208k79208J27425r20o1813n1872J36282
$$ 996458 1186686 1222710 1243217 1191175 1152967 873759 1001184 1000264 938451 886579 1022861
4867A022861Q8577l0524m0074o0941l7722J43912K00382k4165M8443p3041j2398
$$ 1022861 1111438 1080914 1040840 979899 942177 1086089 1286471 1262306 1310749 1237708 1225310
4856A225310O3689O5407J50555k8462j07974R5753K4862j51867o7983P5781n3496
$$ 1225310 1288999 1354406 1504961 1476499 1368525 1464278 1489140 1337273 1269290 1345071 1291575
4845A291575L415j2221J32043j26706J12848K08126K11029m9975J24842k5536
$$ 1291575 1294990 1282769 1414812 1288106 1400954 1609080 1820109 1770134 1894976 1869440
4835A869440N7527J33197J61895J37743J31368J98956L31747N69580K64632L60613
$$ 1869440 1926967 2060164 2222059 2359802 2491170 2690126 3021873 3591453 3856085 4216698
4825D216698M02782j34434l57912j96543j19043k04439k71519j90370m821m0854
$$ 4216698 4619480 4485046 4127134 3930591 3811548 3607109 3335590 3145220 3140399 3099545
4815C099545r3773Q6790q604m3888p7941K47873P004K10431K58509N3307J60113
$$ 3099545 3005772 3092562 3083958 3040070 2962129 3210002 3217006 3427437 3685946 3739253 3899366
4804C899366L33031N4907M54525L87257M07203M28248M44915M70330N23426M57484
$$ 3899366 4232397 4287304 4741829 5129086 5536289 5964537 6409452 6879782 7403208 7860692
4794G860692J92925N0426O8278K3007J7171M1838k14003J27973J31222J25226
$$ 7860692 8053617 8104043 8172321 8195328 8212499 8254337 8040334 8168307 8299529 8424755
4784H424755K08634J66610K12919K68806K52289L78038J20154L38249K56332J62974
$$ 8424755 8633389 8799999 9012918 9281724 9534013 9912051 10032205 10370454 10626786 10789760
4774A0789760L20941N35114L49376L87994M56216L85623L23037N07864L92626
$$ 10789760 11110701 11645815 11995191 12383185 12839401 13225024 13548061 14055925 14448551
4765A4448551K11722N08552N91733L32235N1812J75897J76362Q4875J86669K02646
$$ 14448551 14660273 15168825 15760558 16092793 16144605 16320502 16496864 16581739 16768408 16971054
4755A6971054j05414p0395j57647n7663k18365k71150k96572j69658k18357m9372
$$ 16971054 16865640 16795245 16637598 16579935 16361570 16090420 15793848 15624190 15405833 15356461
4745A5356461k06373k32430l88329m14817k24197k23009m22323k17495l05366
$$ 15356461 15150088 14917658 14529329 14114512 13890315 13667306 13244983 13027488 12722122
4736A2722122k01331k87328k71199k60101l70112l80194l21062k32123k72679
$$ 12722122 12520791 12233463 11962264 11702163 11332051 10951857 10630795 10398672 10125993
4727A0125993m02499l18394j17067k21478k32787l63798j56547k28776j14832
$$ 10125993 9723494 9405100 9288033 9066555 8833768 8469970 8313423 8084647 7969815
4718G969815j76315j17359l50952q5320k12483M8482k696N6737l8350k6068M5686
$$ 7969815 7793500 7676141 7325189 7239869 7027386 7075868 7073172 7129909 7091559 7065491 7111177
4707G111177l5325j40186J69104K8941J46557J94129M5784J38443J33033J83550
$$ 7111177 7075852 6935666 7104770 7133711 7280268 7474397 7520181 7658624 7791657 7975207
4697G975207J42573K62848M04698J42531K10938M33864K31400K45955L80039L77260
$$ 7975207 8117780 8380628 8785326 8927857 9138795 9572659 9804059 10050014 10430053 10807313
4687A0807313K65604L79926K47125M74010L84793J79189J50451M70719L81441
$$ 10807313 11072917 11452843 11699968 12173978 12558771 12737960 12888411 13359130 13740571
4678A3740571K13258K71510L41830K81018M20165J32784L02452L49946K50474
$$ 13740571 13953829 14225339 14567169 14848187 15268352 15401136 15703588 16053534 16304008
4669A6304008L67791K63541J9077K72352L01233K38071J69162N6592j01175o8372
$$ 16304008 16671799 16935340 16954417 17226769 17528002 17766073 17935235 17991827 17890652 17822280
4659A7822280n4597k34724n6613k67902l53085j34337m26875l78097k31642k78842
$$ 17822280 17767683 17532959 17476346 17208444 16855359 16721022 16294147 15916050 15684408 15405566
4649A5405566k90787l78713k37553k42786k08032l78523k17332j73119k93195
$$ 15405566 15114779 14736066 14498513 14255727 14047695 13669172 13451840 13278721 12985526
4640A2985526m04823l6770k2340j95179j03029J38416Q644J70953Q2025M40231
$$ 12985526 12580703 12543933 12521593 12326414 12223385 12361801 12370445 12541398 12623423 13063654
4630A3063654M94726O50482J012425J558723K116053K178770J850201J134146
$$ 13063654 13558380 14208862 15221287 16780010 18896063 21074833 22925034 24059180
4622B4059180O26183m76073j427660j840681j883248j908714j473328j116661
$$ 24059180 24685363 24209290 22781630 20940949 19057701 17148987 15675659 14558998
4614A4558998n69282l29750R8675M13427O69317Q07756J192575J600548J671935
$$ 14558998 13989716 13659966 13758641 14172068 14841385 15649141 16841716 18442264 20114199
4605B0114199J566294J473052J534856J523195J541526J907083K164758K494387
$$ 20114199 21680493 23153545 24688401 26211596 27753122 29660205 31824963 34319350
4597C4319350K187276J804623J559510J120428J076456J121987J458505J512657
$$ 34319350 36506626 38311249 39870759 40991187 42067643 43189630 44648135 46160792
4589D6160792J239308R55540M78680n58599j036395j423829j558372j311959j045468
$$ 46160792 47400100 48355640 48834320 48275721 47239326 45815497 44257125 42945166 41899698
4580D1899698j208388j280643j807213j944062k332211k422142k397465k019939
$$ 41899698 40691310 39410667 37603454 35659392 33327181 30905039 28507574 26487635
4572B6487635j845165j738575j639433j759460j962633j848546j747665j562142
$$ 26487635 24642470 22903895 21264462 19505002 17542369 15693823 13946158 12384016
4564A2384016j412631j261541j090839q00890n43272o47568m57896m90566l25484
$$ 12384016 10971385 9709844 8619005 7818115 7274843 6627275 6169379 5678813 5353329
4555E353329l96933j66247k49750j22885k74206K9566j83093j40760l09865n0246
$$ 5353329 4956396 4790149 4540399 4417514 4143308 4172874 3989781 3849021 3539156 3488910
4545C488910J4015p8456k02542j00400j95240j13485l6763l5988k1207q9279j35159
$$ 3488910 3502925 3424469 3221927 3121527 2926287 2812802 2776039 2740051 2718844 2629565 2494406
4534B494406o7056k5862m2465k4055j8798j53147p3144O3884n7586r9095q4822
$$ 2494406 2427350 2401488 2359023 2334968 2316170 2163023 2089879 2153763 2096177 1997082 1912260
4523A912260j17243r489m3901j58400M7168m3785R2350M300P8260j84421N11j79751
$$ 1912260 1795017 1785528 1741627 1583227 1630395 1586610 1678960 1683260 1761520 1577099 1577610 1397859
4511A397859L9523j0063j40853q0610R2965J5634l8930N4567p0077j52647l7571
$$ 1397859 1437382 1427319 1286466 1205856 1298821 1314455 1275525 1330092 1260015 1107368 1069797
4500A069797R2469J6656j24342J1390m0026J29658K6171O4470l9747r7325M209
$$ 1069797 1162266 1178922 1054580 1065970 1025944 1155602 1181773 1246243 1206496 1109171 1113380
4489A113380K6663J05689j00356j11323J0942J09475l6377Q462o1965r5757j10390
$$ 1113380 1140043 1245732 1145376 1034053 1044995 1154470 1118093 1126555 1064590 968833 858443
4478H58443J25152K2125O5657o4798J1520P984J41863n0101L9078n8231j1441
$$ 858443 983595 1005720 1071377 1006579 1018099 1026083 1167946 1117845 1156923 1098692 1087251
4467A087251J1542N1933n1150n8743K8444k4576k4o3244J6000J27226j2305j33089
$$ 1087251 1098793 1150726 1099576 1040833 1069277 1044701 1044677 981433 997433 1124659 1112354 979265
4455I79265Q7236K068m44R526n2154k7537k7873q1193j8486J36735J31379j75078
$$ 979265 1066501 1068569 1068125 1077651 1025497 997960 970087 888894 870408 1007143 1138522 963444
4443I63444R9960n8988O037P1932l0637j12657Q3391n2159l639r7082O4996J116
$$ 963444 1063404 1004416 1010453 1082385 1051748 939091 1022482 970323 966684 869602 934598 935714
4431I35714Q6361J073j01473J76559j09965j00262J40695J25126l3670P6634m4780
$$ 935714 1022075 1023148 921675 1098234 988269 888007 1028702 1153828 1120158 1196792 1152012
4420A152012j27079N7307J46289q2251r598L1772O7372J1247J4349j7829K6600
$$ 1152012 1024933 1082240 1228529 1146278 1136680 1168452 1235824 1247071 1261420 1243591 1270191
4409A270191k1959J06082q356K3651k03035O8028K6226j23591N4576N8536M8230
$$ 1270191 1248232 1354314 1345958 1369609 1166574 1234602 1260828 1137237 1191813 1250349 1298579
4398A298579N2886K1453K0099M4957r6458K23431P920k09560o3494J6018M4188
$$ 1298579 1351465 1372918 1393017 1437974 1341516 1564947 1572867 1363307 1299813 1315831 1360019
4387A360019L2887j88615j14L1658K1096n2283J40834j52306L1481Q0348J97935
$$ 1360019 1392906 1204291 1204177 1235835 1256931 1204648 1345482 1193176 1224657 1305005 1502940
4376A502940j0477j77351N9638P6115j03909q641K4206N3617j40105M4932M3525
$$ 1502940 1492463 1315112 1374750 1450865 1346956 1338315 1362521 1416138 1276033 1320965 1364490
4365A364490P8742N6000m0726l7608M1080J14058K61J31597l3888J29718j20153
$$ 1364490 1443232 1499232 1458506 1420898 1461978 1576036 1576297 1707894 1674006 1803724 1683571
4354A683571n6321o2096O6940O3083O7719j15375n2652N0232K84927j47096Q0315
$$ 1683571 1627250 1565154 1632094 1695177 1762896 1647521 1594869 1645101 1930028 1782932 1863247
4343A863247J01542r5095N443K00241J46511q2437O5325j15295o9818J70889O5055
$$ 1863247 1964789 1869694 1875137 2075378 2221889 2139452 2204777 2089482 2019664 2190553 2255608
4332B255608L87M5518M514N1056l5479O7146J87876M3505p702K29528P5375J0471
$$ 2255608 2255995 2301513 2306027 2357083 2321604 2388750 2576626 2620131 2612429 2841957 2917332 2927803
4320B927803r5787O2628L30118P7547r9818Q6022J79413K13013R1424O3965J29254
$$ 2927803 2832016 2894644 3224762 3302309 3202491 3288513 3467926 3680939 3772363 3836328 3965582
4309C965582J77187K91373J54628J57224J78484K40514K27269K97737L90886K81370
$$ 3965582 4142769 4434142 4588770 4745994 4924478 5164992 5392261 5689998 6080884 6362254
4299F362254L42065L15844M17389L08016L06946N80048L93918N52727N14218O25858
$$ 6362254 6704319 7020163 7437552 7745568 8052514 8632562 9026480 9579207 10093425 10719283
4289A0719283O31734N48930O14085P49774O55691O47495O66700Q35106O12099
$$ 10719283 11351017 11899947 12514032 13263806 13919497 14566992 15233692 16068798 16680897
4280A6680897P49338P92917P00822P24252O72601O58773P24282N10584O50010
$$ 16680897 17430235 18223152 18923974 19648226 20320827 20979600 21703882 22214466 22864476
4271B2864476O21651M69159M62227N11321L91475K86372L63567K73428M33936
$$ 22864476 23486127 23955286 24417513 24928834 25320309 25606681 25970248 26243676 26677612
4262B6677612K31527L6364L9103K1076O935j89442j66697k15750n28189l47106
$$ 26677612 26909139 26945503 26984606 27005682 27012617 26823175 26656478 26440728 25912539 25565433
4252B5565433n58708k57898m48432m99753o68182m86141n44109o79824o80125
$$ 25565433 25006725 24748827 24300395 23800642 23132460 22646319 22102210 21422386 20742261
4243B0742261m36116p08356p45998p10477p39823o25472m94811o58386o83014
$$ 20742261 20306145 19597789 18851791 18141314 17401491 16776019 16281208 15622822 14939808
4234A4939808n81260o93867n47215l22221m36474o34491m60690l56420m95174
$$ 14939808 14358548 13664681 13117466 12795245 12358771 11724280 11263590 10907170 10411996
4225A0411996m39190j77903k35579l47798l75434p4413j79830k04347p839P9872
$$ 10411996 9972806 9794903 9559324 9211526 8836092 8761679 8581849 8377502 8369663 8449535
4215H449535J86555J68287K46852O65870P45512J568998K177996K582576K055925
$$ 8449535 8636090 8804377 9051229 9717099 10462611 12031609 14209605 16792181 18848106
4206A8848106J201251N32997m72698j675415j982230k078692k085861j891955
$$ 18848106 20049357 20582354 20109656 18434241 16452011 14373319 12287458 10395503
4198A0395503j501576q56082n34037o35237m34985k35891k60989k21766l38448
$$ 10395503 8893927 8037845 7503808 6868571 6433586 6197695 5936706 5714940 5376492
4189E376492O9059m503J00997n9768k3462q6317J6472j35761o5278K5626J64272
$$ 5376492 5445551 5441048 5542045 5482277 5458815 5372498 5388970 5253209 5187931 5213557 5377829
4178E377829j83364p0834r6149L8309R0424L6027l6595R7393K3726Q6679J97018
$$ 5377829 5194465 5123631 5027482 5065791 5156215 5192242 5155647 5253040 5276766 5363445 5560463
4167E560463J91692N5868L2793m865K6075L44945N2897J15766Q8473J09327O6036
$$ 5560463 5752155 5808023 5840816 5835951 5862026 6206971 6259868 6375634 6464107 6573434 6639470
4156F639470K60283J37169P9185P1811J44272J66345K23181K91565K02141J38526
$$ 6639470 6899753 7036922 7116107 7187918 7332190 7498535 7721716 8013281 8215422 8353948
4146H353948K45665K28916L81132L77614L64643K93146N20860L19582M39170M67660
$$ 8353948 8599613 8828529 9209661 9587275 9951918 10245064 10765924 11085506 11524676 11992336
4136A1992336N17930O85395P07438P86413R41811Q00004Q66331J110282J122984
$$ 11992336 12510266 13195661 13903099 14689512 15631323 16431327 17297658 18407940 19530924
4127A9530924J136427J423278J602968J584539J699126J884195K253180K321569
$$ 19530924 20667351 22090629 23693597 25278136 26977262 28861457 31114637 33436206
4119C3436206K488583K594907K659831K836272K707672K750576K669762K373693
$$ 33436206 35924789 38519696 41179527 44015799 46723471 49474047 52143809 54517502
4111E4517502K259809J950929J699670J369957J024343N20364K20760K83658o3482
$$ 54517502 56777311 58728240 60427910 61797867 62822210 63342574 63563334 63846992 63783510
4102F3783510k94680n91093q66966j021552r74492j253815j672871k040719j957213
$$ 63783510 63488830 62897737 62030771 61009219 60034727 58780912 57108041 55067322 53110109
4093E3110109k120157k426230k716560k612633k566368k516149k573982k378013
$$ 53110109 50989952 48563722 45847162 43234529 40668161 38152012 35578030 33200017
4085C3200017k163357k159023j920387j706430j646350j554095j602734j253597
$$ 33200017 31036660 28877637 26957250 25250820 23604470 22050375 20447641 19194044
4077A9194044j087057j086114q75598r24695q05382o93177o28497p53906l44573
$$ 19194044 18106987 17020873 16145275 15220580 14415198 13722021 13093524 12339618 11995045
4068A1995045n82415m54788m12175k65032l12265l08578m11741k75890j81800
$$ 11995045 11412630 10957842 10545667 10280635 9968370 9659792 9248051 8972161 8790361
4059H790361j56812k35882j72326j80843o1261J61173L5596N8745J92734K47954
$$ 8790361 8633549 8397667 8225341 8044498 7983237 8144410 8180006 8238751 8431485 8679439
4049H679439N50591N32953J021422J429240J443264J246254O34931K3193o16554
$$ 8679439 9230030 9762983 10784405 12213645 13656909 14903163 15538094 15561287 14944733
4040A4944733j210396j226488j347438j209993r91076r67792n97326m84340l09738
$$ 14944733 13734337 12507849 11160411 9950418 8959342 7991550 7394224 6909884 6600146
4031F600146k67851j96604j57710q4287m05465k80569j00721q1325K0216j75287
$$ 6600146 6332295 6135691 5977981 5893694 5488229 5207660 5106939 5025614 5045830 4870543
4021D870543q8832q1552j60062j15284k11159j61329j36815l5368K4159j25737
$$ 4870543 4781711 4700159 4540097 4424813 4213654 4052325 3915510 3880142 3904301 3778564
4011C778564k20105o1410k60495p9459L9092O0580M7944j51869J02730p6699J0368
$$ 3778564 3558459 3497049 3236554 3157095 3196187 3256767 3304711 3152842 3255572 3178873 3189241
4000C189241J48786j20460p7592n0446o0375P0209O4305k5878p3625O5859l3931
$$ 3189241 3338027 3217567 3139975 3089529 3029154 3099363 3163668 3137790 3064165 3130024 3096093
3989C096093l9538J8504j4314O4523l9226J28141M9445k3839L8317Q634n1880
$$ 3096093 3056555 3075059 3060745 3125268 3086042 3214183 3263628 3239789 3278106 3286740 3234860
3978C234860k2210L3884j9064K257l7171L2988K06536J15035P4211O5801P2846
$$ 3234860 3212650 3246534 3227470 3229727 3192556 3225544 3432080 3547115 3621326 3687127 3759973
3967C759973o663P0624p0723n000M2962J41921O088P9861J25509R0128J03364
$$ 3759973 3753310 3823934 3753211 3748211 3791173 3933094 3939182 4019043 4144552 4234680 4338044
3956D338044j97372N0675K68376J81280N1330J88184R8411J15186M5709L5668
$$ 4338044 4140672 4191347 4459723 4641003 4692333 4880517 4978928 5094114 5139823 5175491
3946E175491J23580j02760K43483J22608k4095J57346R3044J25292J92367J56223
$$ 5175491 5299071 5196311 5439794 5562402 5538307 5695653 5788697 5913989 6106356 6262579
3936F262579J17485K78638K8765K29843K66224P3779K25072K21026J50600J87291
$$ 6262579 6380064 6658702 6687467 6917310 7183534 7257313 7482385 7703411 7854011 8041302
3926H041302J52171J84841K80446L14130J16526L04347M27457K58710M56043K95242
$$ 8041302 8193473 8378314 8658760 8972890 9089416 9393763 9821220 10079930 10535973 10831215
3916A0831215M94003N80840L77603O71732N56013M20110P30712N85339O60926
$$ 10831215 11325218 11906058 12283661 12955393 13511406 13931516 14662228 15247567 15908493
3907A5908493P12684O43943O49907O55486Q06930P02689Q31451Q78372P75822
$$ 15908493 16621177 17265120 17915027 18570513 19377443 20080132 20911583 21789955 22565777
3898B2565777P69467P32290O89036P91228Q64263P70344O60921Q12478Q12269
$$ 22565777 23335244 24067534 24756570 25547798 26412061 27182405 27843326 28655804 29468073
3889B9468073P52542P14507O08279N74742Q08452P18640P15164P09114N14962
$$ 29468073 30220615 30935122 31543401 32118143 32926595 33645235 34360399 35069513 35584475
3880C5584475M94060M31765M12941K62716o9288k1239k7546j58106m28801l52624
$$ 35584475 36078535 36510300 36923241 37185957 37116669 37095430 37067884 36909778 36480977 36128353
3870C6128353l91445m25219l32248o33539o63139n08649l36815m29852o13578
$$ 36128353 35736908 35311689 34979441 34345902 33682763 33174114 32837299 32407447 31793869
3861C1793869m93242l72553n47753n80296l90646l52610l42941j76555k00738
$$ 31793869 31300627 30928074 30380321 29800025 29409379 29056769 28713828 28537273 28336535
3852B8336535p7873j03106k7381n2216J18251K05427K45781M28214M11985M53605
$$ 28336535 28258662 28155556 28128175 28075959 28194210 28399637 28645418 29073632 29485617 29939222
3842B9939222N04408O61434O76127O24718Q56372R40533J032884R22247R95308
$$ 29939222 30443630 31105064 31781191 32405909 33262281 34202814 35235698 36157945 37153253
3833C7153253R87006J047764R96322J071906J080464R73936R44900Q06280R48224
$$ 37153253 38140259 39188023 40184345 41256251 42336715 43310651 44255551 45061831 46010055
3824D6010055Q94419O52968O06774N26037L61237L57789J98343n0455j30871q8801
$$ 46010055 46904474 47557442 48164216 48690253 49051490 49409279 49607622 49557167 49426296 49337495
3814D9337495k16512k95992n60051n05940o18846p26745r15034q55146r41872
$$ 49337495 49120983 48824991 48264940 47759000 47140154 46413409 45498375 44643229 43701357
3805D3701357j009116j212422j164088j262157j346609j177734j478722j418399
$$ 43701357 42692241 41479819 40315731 39053574 37706965 36529231 35050509 33632110
3797C3632110j335167j225990j358665j374595j352641j213559j192843j217030
$$ 33632110 32296943 31070953 29712288 28337693 26985052 25771493 24578650 23361620
3789B3361620j193350j134406j030069j158749r20111r74605q31899q34679r72865
$$ 23361620 22168270 21033864 20003795 18845046 17924935 16950330 16118431 15283752 14310887
3780A4310887n19549p57741n58590n80947m47563m45617n68840l66374j78009
$$ 14310887 13791338 13033597 12475007 11894060 11446497 11000880 10432040 10065666 9887657
3771I887657k61161l21643k40298L424j0205j00943k69895k11029j8680m5227
$$ 9887657 9626496 9304853 9064555 9067979 9057774 8956831 8686936 8475907 8457227 8412000
3761H412000k19469j21593N2349r4930p3781j10940j12176j04863q9928j49776
$$ 8412000 8192531 8070938 8123287 8028357 7954576 7843636 7731460 7626597 7536669 7386893
3751G386893j44442j25418N419j80625k7043j14266k32971k58238l40012k13332
$$ 7386893 7242451 7117033 7122452 6941827 6914784 6800518 6567547 6309309 5969297 5755965
3741E755965j91938j36960K9191k03086j03367k30285k69989k82206q9467j04437
$$ 5755965 5564027 5427067 5456258 5253172 5149805 4919520 4649531 4367325 4277858 4173421
3731D173421j39155j74302j51235j18360l23512j59804j57757j32739j36058p9363
$$ 4173421 4034266 3859964 3708729 3590369 3266857 3107053 2949296 2816557 2680499 2601136
3721B601136j17454O4750k19034j48627M2928p3615j28779m4518j03629L6465
$$ 2601136 2483682 2548432 2329398 2180771 2223699 2150084 2021305 1976787 1873158 1909623
3711A909623l8233j46846o0406l7908k653J10103k3119r3444m6745r2329j72636
$$ 1909623 1871390 1724544 1664138 1626230 1623577 1733680 1710561 1617117 1570372 1478043 1305407
3700A305407L8178L2271p5739J4975J5171n3670k9841L2188k18435N3260r6045
$$ 1305407 1343585 1375856 1300117 1315092 1330263 1276593 1246752 1278940 1060505 1113765 1017720
3689A017720p8009p5747N8046l0494K2216K0562K7334J2142O4475j12697j3526
$$ 1017720 939711 863964 922010 891516 913732 934294 961628 973770 1038245 925548 912022
3678I12022J855j1568n8884p4425j58444O9793j28079n2495Q8559M5395Q654o1476
$$ 912022 913877 902309 843425 769000 610556 680349 552270 499775 588334 633729 642383 580907
3666E80907p7321P7822J33447p5662L4224j695M3037k29373j71663k4274L5058
$$ 580907 503586 581408 714855 639193 673417 671722 714759 485386 313723 289449 324507
3655C24507J2740n2112k8161O4865O2421L7010p7653J89899j12482Q5664k6502
$$ 324507 337247 285135 256974 321839 384260 421270 343617 533516 421034 506698 480196
3644D80196N6008n0030j33045Q5727r2920m6226O3425k1339K4248r503J9770p9615
$$ 480196 536204 486174 353129 438856 345936 299710 363135 341796 366044 356541 376311 296696
3632B96696m3061J34673j0588n3540j7721m5093n6449J01930N2966j06366l4050
$$ 296696 253635 388308 377720 324180 306459 261366 204917 306847 359813 253447 219397
3621B19397q1941q2081N8379N0883O3221K77565j66738n7192n2743j11002P7270
$$ 219397 137456 55375 113754 164637 227858 505423 338685 281493 228750 117748 195018
3610A95018m6663o1132L1573M6656j12458n9462j6093l5959n167O1578J26284
$$ 195018 148355 87223 118796 165452 52994 -6468 -22561 -58520 -63687 -2109 124175
3599A24175L8568j14299R8260K0548N7601j3403m0197j9429m4434J4848J089q1851
$$ 124175 162743 48444 146704 167252 224853 211450 171253 151824 107390 122238 123327 41476
3587D1476o8859O1144J12069N5115n204k2199Q3182k559k3843o743m911r7047
$$ 41476 -27383 33761 145830 200945 195741 173542 256724 254165 230322 223579 218668 121621
3575A21621J8125j18689l6570J0470j4995J69898k429L9923k7330J8455K6745
$$ 121621 139746 21057 -15513 -5043 -20038 149860 147431 187354 160024 178479 205224
3564B05224l8651J25115j82305K0534J12574j44305k3609J5101J00501L9634m9321
$$ 205224 166573 291688 109383 129917 242491 98186 74577 89678 190179 229813 180492
3553A80492L3293l8213L470O8285q6372J33579O9517L4657j76957J07479J367
$$ 180492 213785 175572 179042 247327 160955 294534 364051 398708 221751 329230 330597
3542C30597j49251J14678q094P2969l58j25611j11122k4571n0471j04838J00330
$$ 330597 181346 296024 287930 360899 360541 234930 123808 99237 48766 -56072 44258
3531D4258J57439J19080Q9791K3248k0397R0649J23091K3409J37147k2974p9495
$$ 44258 201697 320777 410568 433816 413419 504068 627159 650568 787715 764741 685246
3520F85246k48732m2855k3373l7312j11741n730J73953J75545j4664p9664j29748
$$ 685246 436514 393659 370286 332974 221233 215503 389456 565001 550337 470673 340925
3509C40925o8567O5768P4917j7966r1712r0602j36013o897K2979J15923J30J46571
$$ 340925 272358 338126 413043 395077 303365 212763 76750 69853 92832 208755 208885 355456
3497C55456P784j4058J13028r6599l7320j5077K4346K5271j25465Q2925j14478
$$ 355456 363240 349182 462210 365611 328291 313214 337560 362831 237366 320291 205813
3486B05813N7808K2462L3037q4311j4125O8470j04844R118p0779J15003O0267
$$ 205813 263621 286083 319120 234809 220684 289154 184310 193428 122649 237652 297919
3475B97919k23599q4485Q9435J11997q6326J0632O9070k3170O9842j02342j2560
$$ 297919 74320 -10165 79270 191267 104941 115573 184643 161473 231315 128973 116413
3464A16413q3100J70393J57650m1247j02867K20028J0691l7142j6069K3943L4862
$$ 116413 33313 203706 361356 320109 217242 437270 447961 410819 394750 418693 453555
3453D53555J05520k8586p4276l2752k9194L0493L4063J04347j8879P7130J52946
$$ 453555 559075 530489 456213 423461 394267 424760 458823 563170 544291 621421 774367
3442G74367K4283p671J15805N3895j07537R7444J24634L6614K2724Q1311K79170
$$ 774367 798650 790979 906784 960679 853142 950586 1075220 1111834 1134558 1215869 1495039
3431A495039K11351N6301N9857J12598O6379l8654j50455j9936k58060j31597
$$ 1495039 1706390 1762691 1822548 1935146 2001525 1962871 1812416 1792480 1534420 1402823
3421A402823k86930j35714O2493q4233n7164N8040J8639j59196j23224o1941j73602
$$ 1402823 1115893 980179 1042672 958439 901275 959315 977954 818758 695534 633593 459991
3410D59991l8660k61O2875j5124j34819j00021j60793j36369P0900O9827j7509
$$ 459991 421331 421070 483945 468821 334002 233981 73188 -63181 7719 77546 60037
3399F0037J12132J19205j3010m8978N2271N538l5766j61394r007J09763O4077
$$ 60037 172169 291374 278364 229386 281657 287195 251429 90035 81028 190791 254868
3388B54868m1075j29087j01763m4495R769K6358j33406J50868Q6803l7098J28474
$$ 254868 213793 84706 -17057 -61552 -51783 -25425 -158831 -7963 78840 41742 170216
3377A70216R0118q0474j2838R9809j20355l6311l2932Q6121p6379q5422M1660
$$ 170216 260334 179860 167022 266831 146476 110165 77233 163354 86975 1553 43213
3366D3213K8803k6493J2609K6083N5993o2421J57696J04948Q943j15370r7309
$$ 43213 72016 45523 58132 84215 140208 77787 235483 340431 349374 234004 136695
3355A36695j29950j34848K0678L5346L081p4386L1259j69143J91474J58735m8658
$$ 136695 6745 -128103 -107425 -72079 -68998 -143384 -112125 -281268 -89794 68941 20283
3344B0283L0866j07142o5029l8107M094Q258k5016r983N144l0043l4446K3030
$$ 20283 51149 -55993 -121022 -159129 -155035 -146777 -171793 -181776 -176632 -206675 -241121 -218091
3332b18091L3595J73783r0242K0449J54337j09541n999N9380K9196q428l2060
$$ -218091 -184496 -10713 -100955 -80506 73831 -35710 -41709 17671 46867 38439 6379
3321F379L4149j09612n3695J95154M3926K134L618o7723j12378p9487R099j7130
$$ 6379 40528 -69084 -122779 72375 116301 118435 122053 54330 -58048 -137535 -128436 -145566
3309a45566J71300j19465j7016r0953M8933K16865p4932L4001k26256R2232j68096
$$ -145566 25734 -93731 -110747 -201700 -152767 64098 -10834 23167 -203089 -110857 -278953
3298b78953j00697K11945R4590l2031Q1766O0114p5764j45310J6651L524J9835
$$ -278953 -379650 -167705 -73115 -105146 -23380 36734 -39030 -184340 -167689 -164165 -144330
3287a44330m9036L6917m0367k5988P4424k08517j0734J46436J4856O299L09989
$$ -144330 -193366 -156449 -196816 -222804 -148380 -356897 -367631 -221195 -206339 -200040 109949
3276A09949J29300q2593j2905r7878R987j22732o3570k9254M5419R2430j58613
$$ 109949 239249 156656 143751 45873 55860 -66872 -130442 -159696 -114277 -21847 -180460
3265a80460M3735J4981M5483j38983J94400J346K7365M1967M2285j86701K2833
$$ -180460 -136725 -121744 -76261 -215244 -20844 -19498 7867 49834 92119 -94582 -71749
3254g1749J21742M355p7910j11817j50179M7830r8207j8300J39213P7699o0989
$$ -71749 49993 54348 -23562 -135379 -285558 -237728 -335935 -354235 -215022 -137323 -198312
3243a98312K1944K97623J14238j56053r3267p793n0905j62213K5307k9581O2920
$$ -198312 -176368 121255 235493 79440 -13827 -21620 -72525 -234738 -209431 -239012 -176092
3232a76092L7053n0573P9689P5907m6635j40208J78207n0276J2107J61761j37445
$$ -176092 -139039 -189612 -109923 -34016 -80651 -220859 -42652 -92928 -80821 80940 -56505
3221e6505j92655P7154L9772j39497j05562m9534j07374O5988q3608p2766R6042
$$ -56505 -249160 -172006 -132234 -271731 -377293 -426827 -534201 -468213 -551821 -624587 -528545
3210e28545K20743J55333M5552J13106O8884p0792j19925n588P7997k26440N1464
$$ -528545 -307802 -152469 -106917 6189 75073 4281 -115644 -121232 -43235 -269675 -218211
3199b18211r938p3416j7199K06505l9727J5993J9540j9781M9618J71331J1365
$$ -218211 -228149 -301565 -318764 -112259 -151986 -135993 -116453 -136234 -86616 84715 96080
3188I6080j95091r5214j46642j2824P3787q892J07919J45760J4087j00158n7784
$$ 96080 -99011 -194225 -340867 -353691 -279904 -288796 -180877 -35117 -21030 -121188 -178972
3177a78972m7946K4053m3343N0045Q8997q5625K0067j9281r5085J20056q230l9579
$$ -178972 -226918 -202865 -246208 -196163 -107166 -192791 -172724 -192005 -287090 -167034 -175264 -214843
3165b14843J2929j38646M8283R5109M2734j18451j23787j2480O0108J4415O5946
$$ -214843 -201914 -340560 -292277 -197168 -154434 -272885 -396672 -409152 -349044 -334629 -268683
3154b68683J99848r0561j31003N1905j598J84115M8022j06862k06458p7610L06230
$$ -268683 -68835 -159396 -290399 -238494 -240092 -55977 -7955 -114817 -321275 -398885 -92655
3143i2655J8781m318N3628R049Q0108l8018R1472k0922q5507k7964k4175r8079
$$ -92655 -73874 -78192 -24564 -15515 64593 26575 118047 97125 11618 -16346 -40521 -138600
3131a38600P4352k9701Q53K29659M2582q8222J6186k4258L7864l2751p6265K0020
$$ -138600 -64248 -93949 -93096 136563 179145 90923 107109 82851 120715 87964 11699 31719
3119C1719M7530j54355k4183p1883Q7931O3177j8770o1026N0781R267K9593N5153
$$ 31719 79249 -75106 -99289 -171172 -83241 -20064 -38834 -99860 -49079 -39812 -10219 44934
3107D4934j00887P8078j0721K2523q9027j447N7105P5491K3369l0624j38284J46366
$$ 44934 -55953 22125 11404 33927 -55100 -56547 558 76049 99418 68794 -69490 76876
3095G6876l4674P6346L0162N1496k7921p3263J05532j7975L6190o6991l6772L4606
$$ 76876 42202 118548 148710 200206 172285 99022 204554 186579 222769 155778 119006 153612
3083A53612j97273J12819k3309o4156L809p8871M6282j7232P312P3024k3600J46398
$$ 153612 -43661 69158 45849 -18307 -14498 -93369 -47087 -64319 -57007 16017 -7583 138815
3071A38815m187r6664o0095K6092J12548j05375p9395J29344k4773o8348M082
$$ 138815 134628 37964 -22131 3961 116509 11134 -68261 61083 36310 -32038 -27956
3060b7956J3871Q1086l8969K15496m3420j1339L8136p8937j29455K04071j54073
$$ -27956 -14085 67001 28032 243528 200108 188769 226905 147968 18513 222584 68511
3049F8511M9087j62449K9687K9461n8873p9068J19629N497j6820R025k7324J51515
$$ 68511 117598 -44851 -15164 14297 -44576 -123644 -4015 1482 -15338 -6313 -33637 117878
3037A17878q0326j25979Q8999m8301k2382m7825q1846p9668O1833J25153j09966
$$ 117878 37552 -88427 572 -47729 -70111 -117936 -199782 -279450 -217617 -92464 -202430
3026b02430J01095p1664J13306L8219K9463j56733j05087O7111K6185n2943N7375
$$ -202430 -101335 -172999 -59693 -21474 7989 -148744 -253831 -186720 -160535 -213478 -156103
3015a56103K515M4076j960J38883q9204o5262Q6713j25526K1601J13481J1597
$$ -156103 -153588 -109512 -111472 27411 -61793 -127055 -40342 -165868 -144267 -30786 -19189
3004a9189j74651N872L3382k846l2318j9327P8251M0807j29548j07340N811P4167
$$ -19189 -193840 -187968 -154586 -157432 -189750 -209077 -130826 -90019 -219567 -326907 -321096 -246929
2992b46929J58876j2823M3570n7158O9239J02728j49409m2186M866r8567q6335
$$ -246929 -88053 -100876 -57306 -114464 -45225 57503 -91906 -134092 -129226 -227793 -314128
2981c14128o606n4157J18720o6448J8912L4025K6484J2808P1365N5102Q0381J9953
$$ -314128 -320734 -374891 -256171 -322619 -303707 -269682 -243198 -230390 -159025 -103923 -23542 -3589
2969c589k45561M6757Q51l2068j58776k7680O5273N9206J18562R4437Q8753O1468
$$ -3589 -249150 -202393 -201542 -233610 -392386 -420066 -354793 -295587 -177025 -82588 6165 67633
2957F7633o1377j62908l9393P0740n9748n416p7243p2293j5719j45527N9823J06666
$$ 67633 6256 -156652 -196045 -125305 -185053 -190469 -267712 -340005 -355724 -501251 -441428 -334762
2945c34762L9500J01091k261j15155M7585K33620k3711n2067j61410J65433Q76
$$ -334762 -295262 -194171 -196432 -311587 -264002 -30382 -54093 -106160 -267570 -102137 -101261
2934a01261m4058m6700o2365N1281P8841j26734p8133l9295p3103J83473J90011
$$ -101261 -145319 -192019 -254384 -203103 -124262 -250996 -329129 -368424 -441527 -258054 -68043
2923f8043j7201l7205r3317n6646J78839L0567j6383r3268m5440k34858J2317
$$ -68043 -85244 -122449 -215766 -272412 -93573 -63006 -79389 -172657 -218097 -452955 -440638
2912d40638L21524o095j03586n3439Q1262K07997k52518n8031N4372K7835p0964
$$ -440638 -119114 -125209 -228795 -282234 -200972 7025 -245493 -303524 -249152 -221317 -292281
2901b92281k3728O4016Q095p9620p9967K0955j07236J40624n4953R5970P9424
$$ -292281 -316009 -251993 -243898 -323518 -403485 -382530 -489766 -349142 -404095 -308125 -228701
2890b28701N1130j0532k8291M5973o865Q393p9084q2069Q4365j4659l7872P260
$$ -228701 -177571 -188103 -216394 -170421 -177286 -168893 -247977 -330046 -245681 -260340 -298212 -290952
2878b90952Q5578K3980l904K8504q4877J91570l0448m0874J4986K1491K1558j30476
$$ -290952 -205374 -181394 -185298 -156794 -241671 -50101 -80549 -121423 -106437 -84946 -63388 -193864
2866a93864j0903P5251j05116p1859N8963K1514j6989J33115p1653J34387q7068
$$ -193864 -204767 -129516 -234632 -306491 -247528 -226014 -243003 -109888 -181541 -47154 -134222
2855a34222O1499j5755n8637J8818K247J8553k8061n2562j24037p08J3843O0955
$$ -134222 -72723 -88478 -147115 -128297 -126050 -107497 -135558 -188120 -312157 -312865 -299022 -238067
2843b38067o1902k14726K7478J72083O4257K927J70914J11596q6669r2217r3745
$$ -238067 -299969 -514695 -487217 -315134 -250877 -247950 -77036 34560 -52109 -144326 -238071
2832b38071n9059l3161o4608n8773n7080j4118J20855J32255R2036O8224o2082
$$ -238071 -297130 -330291 -394899 -453672 -510752 -524870 -404015 -271760 -179724 -111500 -173582
2821a73582J07911n5175l3361n9747P5771P6848j88462O5174k1508n9506K9781
$$ -173582 -65671 -120846 -154207 -213954 -138183 -61335 -249797 -184623 -206131 -265637 -235856
2810b35856r995N6975O227p4885N0357J4956m113L3895j1772j10324j81164M7178
$$ -235856 -245851 -188876 -182649 -257534 -207177 -192221 -196334 -162439 -174211 -284535 -465699 -418521
2798d18521J64285Q6939P8283m5674J9500L6906j53444k3953R245q8820Q3812
$$ -418521 -254236 -167297 -89014 -134688 -115188 -78282 -231726 -255679 -246434 -335254 -251442
2787b51442P0M5064j42156j4364J9539J33331K4352O0750M8904r142J5908N8485
$$ -251442 -251372 -206308 -348464 -362828 -343289 -209958 -185606 -124856 -75952 -85094 -69186 -10701
2775a0701j31527j15267Q5469p0114K0404J15491j43078K2504L7583O9293n2476
$$ -10701 -142228 -257495 -172026 -242140 -221736 -106245 -249323 -226819 -189236 -119943 -172419
2764a72419k5967k9117O1372r3771j01265O713L2301k867M7095J02924q9242J7202
$$ -172419 -198386 -227503 -166131 -259902 -361167 -354454 -322153 -325020 -277925 -175001 -264243 -247041
2752b47041Q5023L6039p1013M0532n298j01573P1970j7625n5726R4854l7845J9494
$$ -247041 -162018 -125979 -196992 -156460 -161758 -263331 -191361 -208986 -264712 -169858 -207703 -188209
2740a88209o4539Q6338j07006R8158L1506m8345J18835l910j32098m647o6212
$$ -188209 -252748 -166410 -273416 -175258 -143752 -192097 -73262 -77172 -209270 -213917 -280129
2729b80129n003K8086P3547R3558p321K1867k3630J8616J7089j14630j80421P1555
$$ -280129 -285132 -257046 -183499 -89941 -97262 -75395 -99025 -80409 -63320 -177950 -358371 -286816
2717b86816Q7150K7603j19338O413n8784n4622m9333J80062L8353q7067j6202
$$ -286816 -199666 -172063 -291401 -284988 -343772 -398394 -447727 -267665 -229312 -316379 -332581
2706c32581O5858O6525j19758O1153o1325J8607K2341J7279l1032K014o7480M4785
$$ -332581 -266723 -200198 -319956 -258803 -320128 -301521 -279180 -261901 -292933 -290919 -358399 -313614
2694c13614m2923J15257O7308n9784M282J53559l8190O8456L6446p7079j002P4719
$$ -313614 -356537 -241280 -173972 -233756 -229474 -75915 -114105 -45649 -9203 -86282 -87284 -12565
2682a2565m7638o4466q6994j47473q9746Q586J71886K41417O958o6502K4662J70910
$$ -12565 -60203 -124669 -211663 -359136 -448882 -440296 -268410 -26993 -20035 -86537 -61875 109035
2670A09035J7903j70021P758O4745J6290j73279l888j49267J20865j3593l8434
$$ 109035 126938 -43083 -35325 29420 45710 -127569 -131457 -280724 -159859 -173452 -211886
$$ [...]
##END NTUPLES=NMR SPECTRUM
##END=
