##TITLE=1H_DE-80H_X3
 200.13MHz, d2o
 8 sc
 
 19ns.26.2.2025
##JCAMPDX= 6.0         $$ Bruker NMR JCAMP-DX V2.0
##DATA TYPE= NMR SPECTRUM
##DATA CLASS= NTUPLES
##ORIGIN= UXNMR, Bruker Analytische Messtechnik GmbH
##OWNER= pz
$$ XWIN-NMR		Version 3.5
$$ Thu Jul 23 14:17:27 2026 Russian Standard Time (UT+4h)  Yarkov@DPX200
##.OBSERVE FREQUENCY= 200.1313
##.OBSERVE NUCLEUS= ^1H
##.ACQUISITION MODE= SIMULTANEOUS
##.ACQUISITION SCHEME= undefined
##.AVERAGES= 8
##.DIGITISER RES= 18
##SPECTROMETER/DATA SYSTEM= spect
##.PULSE SEQUENCE= zg30
##.SOLVENT NAME= CDCl3
##.SHIFT REFERENCE= (INTERNAL, CDCl3, 0, 15.5331)
##AUDIT TRAIL= $$ (NUMBER, WHEN, WHO, WHERE, WHAT)
$$ ##TITLE= Audit trail, XWIN-NMR		Version 3.5
$$ ##JCAMPDX= 5.01
$$ ##ORIGIN= Bruker BioSpin GmbH
$$ ##OWNER= Yarkov
$$ C:/Bruker/XWIN-NMR/data/yarkov2/nmr/H-C/1/pdata/1/auditp.txt
$$ ##AUDIT TRAIL=  $$ (NUMBER, WHEN, WHO, WHERE, WHAT)
(   1,<2026-07-23 14:16:39.65 +0400>,<Yarkov>,<DPX200>,
      <created by zg, POWCHK disabled, PULCHK disabled
       configuration hash MD5:
       00 E9 B6 7A A2 85 ED C7 34 08 36 98 17 FE 4E 26
       data hash MD5: 16K
       18 E2 B5 E7 89 6B B1 0C F6 7B 0C E3 A2 D2 64 D5>)
(   2,<2026-07-23 14:16:53.53 +0400>,<Yarkov>,<DPX200>,
      <Start of raw data processing
       efp BC_mod = 2 LB = 0.25 FT_mod = 6 PKNL = 1 PHC0 = -7254.183 PHC1 = 2.82197 SI = 16K 
       data hash MD5: 16K
       09 2A 04 02 CF A9 A3 66 DD AA C8 75 57 87 05 5A>)
$$ ##END=
$$ 
$$ hash MD5
$$ F5 7B 8F BC 36 E2 69 00 81 83 54 00 18 04 79 80
##$RELAX= 
##$RELAX= 
##$RELAX= 
##$RELAX= 
##$RELAX= 
##$RELAX= 
$$ Bruker specific parameters
$$ --------------------------
##$DU= <C:/Bruker/XWIN-NMR>
##$EXPNO= 1
##$NAME= <H-C>
##$PROCNO= 1
##$TYPE= <nmr>
##$USER= <yarkov2>
##$AMP= (0..31)
100 100 100 100 100 100 100 100 100 100 100 100 100 100 100 100 100 100 
100 100 100 100 100 100 100 100 100 100 100 100 100 100 
##$AQSEQ= 0
##$AQ_mod= 1
##$AUNM= <au_zg>
##$AUTOPOS= <>
##$BF1= 200.13
##$BF2= 200.13
##$BF3= 200.13
##$BF4= 200.13
##$BF5= 200.13
##$BF6= 200.13
##$BF7= 200.13
##$BF8= 200.13
##$BYTORDA= 1
##$CFDGTYP= 0
##$CFRGTYP= 5
##$CHEMSTR= <none>
##$CNST= (0..31)
1 1 145 1 1 1 1 1 1 1 1 1 1 1 1 1 1 1 1 1 1 1 1 1 1 1 1 1 1 1 1 1 
##$CPDPRG= <>
##$CPDPRG1= <>
##$CPDPRG2= <>
##$CPDPRG3= <>
##$CPDPRG4= <mlev>
##$CPDPRG5= <mlev>
##$CPDPRG6= <mlev>
##$CPDPRG7= <mlev>
##$CPDPRG8= <mlev>
##$CPDPRGB= <>
##$CPDPRGT= <>
##$D= (0..31)
0 0.7 0 0 0 0 0 0 0 0 0 0.03 0 0 0 0 0 0 0 0 0 0 0 0 0 0 0 0 0 0 0 0 
##$DATE= 1784801799
##$DBL= (0..7)
120 120 120 120 120 120 120 120 
##$DBP= (0..7)
150 150 150 150 150 150 150 150 
##$DBP07= 0
##$DBPNAM0= <>
##$DBPNAM1= <>
##$DBPNAM2= <>
##$DBPNAM3= <>
##$DBPNAM4= <>
##$DBPNAM5= <>
##$DBPNAM6= <>
##$DBPNAM7= <>
##$DBPOAL= (0..7)
0.5 0.5 0.5 0.5 0.5 0.5 0.5 0.5 
##$DBPOFFS= (0..7)
0 0 0 0 0 0 0 0 
##$DE= 6
##$DECBNUC= <off>
##$DECIM= 32
##$DECNUC= <off>
##$DECSTAT= 4
##$DIGMOD= 1
##$DIGTYP= 9
##$DL= (0..7)
0 120 120 120 120 120 120 120 
##$DP= (0..7)
$$ [...]
##$SUBNAM2= <"">
##$SUBNAM3= <"">
##$SUBNAM4= <"">
##$SUBNAM5= <"">
##$SUBNAM6= <"">
##$SUBNAM7= <"">
##$SUBNAM8= <"">
##$SUBNAM9= <"">
##$SW= 18.0517328524113
##$SWIBOX= (0..15)
0 0 2 0 0 0 0 0 0 0 0 0 0 0 0 0 
##$SW_h= 3612.71676300578
##$TD= 16384
##$TD0= 1
##$TE= 0
##$TE2= 300
##$TE3= 300
##$TEG= 300
##$TL= (0..7)
0 120 120 120 120 120 120 120 
##$TP= (0..7)
150 150 150 150 150 150 150 150 
##$TP07= 0
##$TPNAME0= <>
##$TPNAME1= <>
##$TPNAME2= <>
##$TPNAME3= <>
##$TPNAME4= <>
##$TPNAME5= <>
##$TPNAME6= <>
##$TPNAME7= <>
##$TPOAL= (0..7)
0.5 0.5 0.5 0.5 0.5 0.5 0.5 0.5 
##$TPOFFS= (0..7)
0 0 0 0 0 0 0 0 
##$TUNHIN= 0
##$TUNHOUT= 0
##$TUNXOUT= 0
##$USERA1= <user>
##$USERA2= <user>
##$USERA3= <user>
##$USERA4= <user>
##$USERA5= <user>
##$V9= 5
##$VALIST= <valist>
##$VCLIST= <CCCCCCCCCCCCCCC>
##$VD= 0
##$VDLIST= <DDDDDDDDDDDDDDD>
##$VPLIST= <PPPPPPPPPPPPPPP>
##$VTLIST= <TTTTTTTTTTTTTTT>
##$WBST= 1024
##$WBSW= 4
##$XGAIN= (0..3)
0 0 0 0 
##$XL= 0
##$YL= 0
##$YMAX_a= 269209
##$YMIN_a= -395358
##$ZGOPTNS= <>
##$ZL1= 120
##$ZL2= 120
##$ZL3= 120
##$ZL4= 120
##$ABSF1= 0
##$ABSF2= 0
##$ABSG= 0
##$ABSL= 0
##$ALPHA= 0
##$AQORDER= 0
##$ASSFAC= 0
##$ASSFACI= 0
##$ASSFACX= 0
##$ASSWID= 0
##$AUNMP= <proc_1d>
##$AZFE= 0.1
##$AZFW= 0.1
##$BCFW= 0
##$BC_mod= 2
##$BYTORDP= 0
##$COROFFS= 0
##$CY= -3
##$DATMOD= 1
##$DC= 0
##$DFILT= <>
##$DTYPP= 0
##$F1P= 0
##$F2P= 0
##$FCOR= 1
##$FTSIZE= 16384
##$FT_mod= 6
##$GAMMA= 0
##$GB= 0
##$INTBC= 1
##$INTSCL= 3.241238e-09
##$ISEN= 128
##$LB= 0.25
##$LEV0= 0
##$LPBIN= 0
##$MAXI= 10000
##$MC2= 0
##$MEAN= 0
##$ME_mod= 0
##$MI= 1.114404
##$NCOEF= 0
##$NC_proc= -5
##$NLEV= 6
##$NOISF1= 3.799351
##$NOISF2= 2.8
##$NSP= 0
##$NTH_PI= 0
##$NZP= 0
##$OFFSET= 15.53314
##$PC= 1
##$PHC0= -7254.183
##$PHC1= 2.82197
##$PH_mod= 1
##$PKNL= yes
##$PPARMOD= 0
##$PSCAL= 0
##$PSIGN= 0
##$REVERSE= no
##$SF= 200.129997710906
##$SI= 16384
##$SIGF1= 3
##$SIGF2= 2
##$SINO= 0.751879
##$SIOLD= 32768
##$SREGLST= <19F.Aceton>
##$SSB= 0
##$STSI= 16384
##$STSR= 0
##$SW_p= 3612.71676300578
##$SYMM= 0
##$S_DEV= 0
##$TDeff= 16384
##$TDoff= 0
##$TI= <>
##$TILT= no
##$TM1= 0
##$TM2= 0
##$TOPLEV= 0
##$USERP1= <user>
##$USERP2= <user>
##$USERP3= <user>
##$USERP4= <user>
##$USERP5= <user>
##$WDW= 1
##$XDIM= 16384
##$YMAX_p= 275204022
##$YMIN_p= -422073
$$ End of Bruker specific parameters
$$ ---------------------------------
##NTUPLES= NMR SPECTRUM
##VAR_NAME=  FREQUENCY,     SPECTRUM/REAL,   SPECTRUM/IMAG
##SYMBOL=    X,             R,               I
##VAR_TYPE=  INDEPENDENT,   DEPENDENT,       DEPENDENT
##VAR_FORM=  AFFN,          ASDF,            ASDF
##VAR_DIM=   16384,         16384,           16384
##UNITS=     HZ,            ARBITRARY UNITS, ARBITRARY UNITS
##FACTOR=    0.220516191357247, 1,           1
##FIRST=     3108.64730916593, 0,            0
##LAST=      -504.06945383985, 0,            0
##MIN=       -504.06945383985, -422073,      0
##MAX=       3108.64730916593, 275204022,    0
$$ Real data points
##PAGE= N=1
##DATA TABLE= (X++(R..R)), XYDATA
$$ [...]
7413A97473k4928p117J0637N5789k8892j3558K4591o590N517J8090J1634k7858
$$ 197473 172545 165428 176065 231854 202962 189404 213995 207405 212922 231012 242646 214788
7401B14788l0943K6882k3040j3431K8474j2453l6236l546L0480K6554O493K0404
$$ 214788 183845 210727 187687 174256 202730 190277 154041 150495 180975 207529 214022 234426
7389B34426r184m3811j4323O4614j2129l1294L7743J4757M4782J3762l9434K736
$$ 234426 225242 181431 167108 231722 219593 188299 226042 240799 285581 299343 259909 262645
7377B62645l872j1904j4596p040J5094k0541o036M4728J4860J4568J6471l9147
$$ 262645 258773 246869 232273 225233 240327 219786 213750 258478 273338 287906 304377 265230
7365B65230J4692k3050n3678M3213k0382j7680J8010M1030M8847l2146K8888N968
$$ 265230 279922 256872 203194 246407 226025 208345 226355 267385 316232 284086 312974 318942
7353C18942l8947o414j3074m1678K4080J6906L4548L1614j6441J0781K8525R245
$$ 318942 279995 273581 260507 218829 242909 259815 294363 325977 309536 320317 348842 358087
7341C58087K4534k4154o8287J489N381N083J207k0134K6534K2521J3377R38j9059
$$ 358087 382621 358467 290180 291669 297050 302133 303340 283206 309740 332261 345638 346576 327517
7328C27517J6263Q4j7905k589L518K6367M407l7451L591M6037J5572J9738j306
$$ 327517 343780 343864 325959 323370 326888 353255 357662 320211 323802 369839 385411 405149 403843
7315D03843q205J4732k5546j6959O464N802j9331J5903L206o356k994L6334L1464
$$ 403843 395638 410370 384824 367865 374329 380131 360800 376703 379909 373553 370559 406893 438357
7302D38357j3087K363L0314l4490j4094l8347M449L8158J0201M4637o881L110
$$ 438357 425270 427633 457947 423457 409363 371016 375465 413623 423824 468461 461580 464690
7290D64690j2999N955J0458K0584M75k1258p509j2853j265L7409K3227J2274M3685
$$ 464690 451691 457646 468104 488688 489163 467905 460396 447543 446278 483687 506914 519188 562873
7277E62873k1583p038K0402n1265J2780K8338j2218J285J5294l32K5736j0261
$$ 562873 541290 534252 554654 503389 516169 544507 532289 533574 548868 548536 574272 564011
7265E64011J2181o699K723L6108K2214j9278J0097J5857k5131O3469j1439j3586
$$ 564011 576192 569493 572216 608324 630538 611260 621357 637214 612083 675552 664113 650527
7253F50527J2725K8641J3476k0275J4952M6871J1949L6812L0642m7038N3296K787
$$ 650527 663252 691893 705369 685094 700046 746917 758866 795678 826320 779282 832578 835365
7241H35365j6734J5847Q644J5881J6060p098L2895N3977m529J3970q349J0956
$$ 835365 818631 834478 843122 859003 875063 867965 900860 954837 950308 964278 955929 966885
7229I66885J9492n152j41n2991J7080M0305K3726M7225J5020N0550J2080N589
$$ 966885 986377 981225 981084 928093 945173 985478 1009204 1056429 1071449 1121999 1134079 1139668
7217A139668L8621M3383R030k8218o463L5498L7420K2894L4015O6544J8881J0021
$$ 1139668 1178289 1221672 1230702 1202484 1196021 1231519 1268939 1291833 1325848 1392392 1411273 1421294
7205A421294K0584K6093K0206j5840L5926J2751M1849N6815J4001M7810O1812
$$ 1421294 1441878 1467971 1488177 1472337 1508263 1521014 1562863 1619678 1633679 1681489 1743301
7194A743301K7545M5236O1399j636J8561j2842L2234R8938M7424P5732N5341o646
$$ 1743301 1770846 1816082 1877481 1875845 1894406 1881564 1913798 2012736 2060160 2135892 2191233 2184587
7182B184587R4884P5499R5633Q2939L168L4325N4408M7512Q6439R2254P8130J08781
$$ 2184587 2279471 2354970 2450603 2533542 2536710 2571035 2625443 2672955 2759394 2851648 2929778 3038559
7170C038559P3716N8088R8620J43214J89663P6765O5823J44836J15002J24166
$$ 3038559 3112275 3170363 3268983 3412197 3601860 3678625 3744448 3889284 4004286 4128452
7160D128452J49279J36739K04860J93296J43510J96079J96992K11616K62896K39460
$$ 4128452 4277731 4414470 4619330 4812626 4956136 5152215 5349207 5560823 5823719 6063179
7150F063179K93033K69605L14482L66533L08032M02334M50824M52462M47626M93043
$$ 6063179 6356212 6625817 6940299 7306832 7614864 8017198 8468022 8920484 9368110 9861153
7140I861153N38701N71259O36293P46494P62688P95141Q28300R36211J022970
$$ 9861153 10399854 10971113 11607406 12353900 13116588 13911729 14740029 15676240 16699210
7131A6699210J103036J152770J227517J211605J285550J347821J383602J414154
$$ 16699210 17802246 18955016 20182533 21394138 22679688 24027509 25411111 26825265
7123B6825265J282637J201822J071710Q35365O49979M23144J84036q2832l53346
$$ 26825265 28107902 29309724 30381434 31216799 31866778 32289922 32473958 32391126 32037780
7114C2037780o25140q89410j088544j134117j206856j323904j317540j312102
$$ 32037780 31412640 30523230 29434686 28300569 27093713 25769809 24452269 23140167
7106B3140167j307298j295713j230281j134353j077800r84956r22750q80325q00931
$$ 23140167 21832869 20537156 19306875 18172522 17094722 16109766 15187016 14306691 13505760
7097A3505760p84266p41194o26916n91396o07920m91679n29792m48728m31257
$$ 13505760 12721494 11980300 11353384 10761988 10154068 9662389 9132597 8683869 8252612
7088H252612l81123l00630l26352l37255l09875k43374k17615k23575k54866k16933
$$ 8252612 7871489 7570859 7244507 6907252 6597377 6354003 6136388 5912813 5657947 5441014
7078E441014k15449k22175k11840j33448j64792j25458j19181j40603j49617j50719
$$ 5441014 5225565 5003390 4791550 4658102 4493310 4367852 4248671 4108068 3958451 3807732
7068C807732j10112j27685p7790j16602j48163j09208o3573n6255r4307m1928
$$ 3807732 3697620 3569935 3492145 3375543 3227380 3118172 3054599 2998344 2904037 2862109
7058B862109p9019q9809q1003r1399o9428p7646m9921j09061o6663n2759p1761
$$ 2862109 2783090 2693281 2612278 2520879 2451451 2373805 2323884 2214823 2148160 2095401 2023640
7047B023640j8738q1383m9472l8164k6128l137q7669k6458n4889m3005j3624l4679
$$ 2023640 2004902 1923519 1874047 1835883 1809755 1806618 1718949 1692491 1637602 1594597 1580973 1546294
7035A546294l0255j929r501k3053j7926l9828l6966n6269r8861j6611J2088k8856
$$ 1546294 1516039 1514110 1504609 1481556 1463630 1423802 1386836 1330567 1231706 1215095 1227183 1198327
7023A198327k9130o259l8637k0275l0201J3925p558j5685k8343k9207l0505p0204
$$ 1198327 1169197 1162938 1124301 1104026 1073825 1087750 1080192 1064507 1036164 1006957 976452 906248
7011I06248l104K140j8271K263K7968j2214j6845n0572k9767n456m2431k288j823
$$ 906248 903144 905284 887013 889276 917244 905030 888185 837613 807846 802390 759959 757671 755848
6998G55848n7689k658k5566j2904K3339r38l9067J5053J4636o528n0261k6901
$$ 755848 698159 695501 669935 657031 680370 679432 640365 655418 670054 663526 613265 586364
6986E86364M4866Q603j6446O992o06l5169j8835l7384O237j9323Q887j2298o581
$$ 586364 631230 639833 623387 630379 629773 594604 575769 538385 544622 525299 534186 521888 515307
6973E15307K8499l0417L95J8957k5883k0448q866P461J2236n1063J4334L5225
$$ 515307 543806 513389 513784 532741 506858 486410 477544 485005 497241 446178 460512 495737
6961D95737j9113k0742J4808j3716j2066k2201j9190J3298L1776j9632j1910o6724
$$ 495737 476624 455882 470690 456974 444908 422707 403517 416815 448591 428959 417049 350325
6949C50325K269J8909K3371j7199l8134n221q508n793m149J5956j2395j2519j7208
$$ 350325 352594 371503 394874 377675 339541 334320 325812 320019 315870 331826 319431 306912 289704
6936B89704j6336L0252J9327j9980L2162J9335k0528m8983k7246j9184n498K4545
$$ 289704 273368 303620 322947 302967 335129 354464 333936 284953 257707 238523 233025 257570
6924B57570J6937j7692M3839J8468j3103o227j9031J9582l4120n6546l9829j6244
$$ 257570 274507 256815 300654 319122 306019 299792 280761 300343 266223 209677 169848 153604
6912A53604Q465K0095K8477J2962q75P701K6287K520J9518m1730p0282j4307K0192
$$ 153604 162069 182164 210641 223603 222728 230429 256716 259236 278754 237024 166742 152435 172627
6899A72627J6916k4792M1016L8669m5838J5038k5906J9596K353n6105l7246L9594
$$ 172627 189543 164751 205767 244436 198598 213636 187730 207326 209679 153574 116328 155922
6887A55922L0444L749R432j00L263k589N775k693o1883j1341K4260k8990Q256
$$ 155922 186366 190115 199547 199447 202710 200121 205896 203203 141320 129979 154239 125249 133505
6874A33505l903j6726j167K9981K7260M0775j4486j3547l6993l2505o391j5616
$$ 133505 129602 112876 111709 141690 168950 209725 195239 181692 144699 112194 105803 90187
6862I0187L1291o61j8384K0532M0003K2315K362J6762J3402l723k6231j6922k8211
$$ 90187 121478 120817 102433 122965 162968 185283 187645 204407 217809 214086 187855 170933 142722
6849A42722L430J2585j568L1279j609j9798j4745L8038M0694j0671n8333j3959
$$ 142722 146152 158737 157169 188448 186839 167041 152296 190334 231028 220357 162024 148065
6837A48065j7550p445K9392P96j6049K5512q528k7581q971j2589K5280j4130N1680
$$ 148065 130515 123070 152462 153258 137209 162721 154193 126612 117641 105052 130332 116202 167882
6824A67882K1740p268L4495j455o7007k7463J8194P854J7355P018M4348k3556
$$ 167882 189622 182354 216849 215394 148387 120924 139118 146972 164327 171345 215693 192137
6812A92137j0157K9794o205l864J4401j9065O235M5373l1398k1322j3517K4597
$$ 192137 181980 211774 205569 201705 216106 197041 203276 248649 217251 195929 182412 207009
6800B07009K7065M952P605k441j3066J6346n735K1099K4572K583k3216J4124m787
$$ 207009 234074 239026 246631 244190 231124 247470 241735 262834 287406 289989 266773 280897 276110
6787B76110q748J1322o142J7445Q964k928o1187k0021o531k2905j2080l1330K3853
$$ 276110 267362 278684 272542 289987 298951 296023 234836 214815 208284 185379 173299 141969 165822
6774A65822K3933q730N2220l0570J3665n429l6030j1913P920n3088j7242k717
$$ 165822 189755 181025 233245 202675 216340 210911 174881 162968 170888 117800 100558 97841
6762I7841K8605K0229L541L6074j1521M053k1295R614N522k2702n6833l4723R880
$$ 97841 126446 146675 150216 186290 174769 178822 157527 167141 172663 149961 93128 58405 68285
6749F8285L2661K5481P1486P140l6232J6074J8642p662l5510j7955j0483l5023
$$ 68285 100946 126427 197913 205053 168821 184895 203537 195875 160365 142410 131927 96904
6737I6904M485j0421N591K7496J9846N294K6934j2244O471l2653j4354n830k0561
$$ 96904 101389 90968 96559 124055 143901 149195 176129 163885 170356 137703 123349 117519 96958
6724I6958J4369l4656M5146M3501J470R705j9093L4149J9848l2722j2147j8918
$$ 96958 111327 76671 121817 165318 166788 176493 157400 191549 211397 178675 166528 147610
6712A47610k6522m3802J1131J375K8225L5833K8634l246l429j8989p335l4484
$$ 147610 121088 77286 88417 89792 118017 153850 182484 179238 175809 156820 149485 115001
6700A15001j3088k1850l7721L0473M935L7163J5674J276K8352m601j7685m717
$$ 115001 101913 80063 42342 72815 77750 114913 130587 131863 160215 155614 137929 133212
6688A33212k4637L6158k8622n4174L4222K2260L758K286K0756L5509j8624l6532
$$ 133212 108575 144733 116111 61937 96159 118419 122177 124463 145219 180728 162104 125572
6676A25572k7593L590N808J5996J533j9268J6686k0102O14J6221r456J4269l6073
$$ 125572 97979 101569 107377 123373 124906 105638 122324 102222 102836 119057 109601 123870 87797
6663H7797K0306J891J1612L1067l4611j5801l4022j059M04l157L0127J6618l2593
$$ 87797 108103 109994 121606 152673 118062 102261 68239 67180 67584 64427 94554 111172 78579
6650G8579K3909M2324o489J0508l7313J9751O1349n3561q301m5284l2208O150
$$ 78579 102488 144812 138323 148831 111518 131269 192618 139057 130756 85472 53264 59414
6638E9414K9856M0887L777j8205L726n771j9719L0013R029L200k5303K304m8191
$$ 59414 89270 130157 133934 115729 119455 113684 93965 123978 133007 136207 110904 113208 65017
6625F5017J3008K7322J6007j7915R495j1507M26P5332l3937k183M127l8606m40
$$ 65017 78025 105347 121354 103439 112934 101427 101853 177185 143248 141065 145192 106586 106146
6612A06146J8865J1085J5428j4457J1762j4863n228N1800l0614o7425L6107l1312
$$ 106146 125011 136096 151524 137067 148829 133966 128738 180538 149924 82499 118606 87294
6600H7294L4704R759l4204j3165J0510K9710N820m676K3970n1532j1052Q050J0126
$$ 87294 121998 131757 97553 84388 94898 124608 130428 125752 149722 98190 87138 95188 105314
6587A05314Q523J7558k0916j1772M6988J7656k4788l565j391J5270m0536k0428
$$ 105314 113837 131395 110479 98707 145695 163351 138563 134998 133607 148877 108341 87913
6575H7913J515k7770K7286M2124L5380l8348J8022J2720N162j4574J119j7257
$$ 87913 89428 61658 88944 131068 166448 128100 146122 158842 164004 149430 150549 133292
6563A33292l6951n233K1135l886L6857j1730K228M107j5539J3715n199O673L8200
$$ 133292 96341 91108 112243 108357 145214 133484 135712 139819 124280 137995 132796 139469 177669
6550A77669l1461j6695l9562L887L6767N0325L9923m1824o6821J9942P85L3479
$$ 177669 146208 129513 89951 93838 130605 180930 220853 179029 112208 132150 132935 166414
6538A66414L750j8506l435M6394k9158k3742K0111Q613n151J6403J9736m0196
$$ 166414 170164 151658 148223 194617 165459 141717 161828 170441 165290 181693 201429 161233
6526A61233m1146l3136M6205L8581J5935l5232k9783N341L0420J6552l387N9432
$$ 161233 120087 86951 133156 171737 187672 152440 122657 127998 158418 174970 171583 231015
6514B31015J5660m6781J0672l3074j3389K8984r090n5919m953j2951J1410K2341
$$ 231015 246675 199894 210566 177492 164103 193087 183997 128078 123125 110174 121584 143925
6502A43925J1728L0614O3177l1301l5732J010l075m674m3103j2969J2516R218
$$ 143925 155653 186267 249444 218143 182411 183421 180346 175672 132569 119600 132116 141334
6490A41334J6729M056j4835j2463L4887K538p38N0576k6047j6265K4276k8132
$$ 141334 158063 162119 147284 134821 169708 172246 171508 222084 196037 179772 204048 175916
6478A75916n2003j5506k5170N2453N7006r924q990o197J0267j1797k8688J0997
$$ 175916 123913 108407 83237 135690 192696 182772 173782 167585 177852 166055 137367 148364
6466A48364r410j3267j6458j380M9446O4855j1156j6438k6680J1189J467o1611
$$ 148364 138954 125687 109229 107849 157295 222150 210994 194556 167876 179065 180532 118921
6454A18921M3992k9260j179o762O191N051R772L6101O228j0766J3908J7001l9042
$$ 118921 162913 133653 132474 125712 131903 136954 146726 182827 189055 178289 192197 209198 170156
6441A70156m7375L379n999K2792O7248j2813j6080j6499n405J4099M4338L6817
$$ 170156 122781 126160 120161 142953 210201 197388 181308 164809 159404 173503 217841 254658
6429B54658l4956n2073l9299m9227j2007L5960K6993M2561J3482k5868O07j0752
$$ 254658 219702 167629 128330 79103 67096 103056 130049 172610 186092 160224 160831 150079
6417A50079l2282O6074n92k9782k3347k6724R397j3458L7952M3933R341k5463
$$ 150079 117797 183871 183279 153497 130150 103426 112823 99365 137317 181250 190591 165128
6405A65128k6444N9474J6718k5471J7163l383j7698O94M425l6662o250l965j0714
$$ 165128 138684 198158 214876 189405 206568 203185 185487 186181 190606 153944 147694 143729 133015
6392A33015L0613o821P298R75J7747j7111k6785J5542N364j3275N237J023k8172
$$ 133015 163628 156807 164105 165080 182827 165716 138931 154473 159837 146562 151799 152822 124650
6379A24650J7642l7291L8291K2756M15J2239J5542K618j7015j0934R015j651L8541
$$ 124650 142292 105001 143292 166048 166463 178702 194244 196862 179847 168913 177928 176277 214818
6366B14818o943j4048k8895J5167K0934k0754K403L4880q627k7662l713J0552
$$ 214818 207875 193827 164932 180099 201033 180279 182682 217562 208935 181273 177560 188112
6354A88112K4072k7100Q324L365K4539Q9J0677k6819J7716m21L353k1643j7512
$$ 188112 212184 185084 193408 196773 221312 221401 232078 205259 222975 222554 225907 204264 186752
6341A86752J7638N762O44l97J6732l109L2577O531l6293L642l3137J254J0417
$$ 186752 204390 210152 210796 210399 227131 224022 256599 263130 226837 230479 197342 198596 209013
6328B09013r5j1928J4657K9732J0810n088p99J5556n5043M4357j8218m067m989
$$ 209013 208918 196990 211647 241379 252189 247101 246302 261858 206815 251172 232954 228887 223898
6315B23898m9827P642J5254J4281Q170j945k8638J9473K0063K8789M5793l6218
$$ 223898 174071 181713 196967 211248 219418 217473 188835 208308 228371 257160 302953 266735
6303B66735l6658k4957J3419J0436J6648j5986j0690K3137K1188j333l9990o187
$$ 266735 230077 205120 218539 228975 245623 229637 218947 242084 263272 261939 221949 215762
6291B15762J5388J9201L3989k1281k8703L567L9161K4893l8616j2854L1661m8140
$$ 215762 231150 250351 284340 263059 234356 237923 277084 301977 263361 250507 282168 234028
6279B34028k2900k6311Q10O2684L84j6087N907O290J3532K7865J96q017p812J1314
$$ 234028 211128 184817 185627 248311 248695 232608 238515 244805 258337 286202 286398 278381 270569 281883
6265B81883M710j2799k5143M2072J4397J1314J2244k8344m3579J082L6149Q570
$$ 281883 286593 273794 248651 290723 305120 316434 328678 300334 256755 257837 293986 302556
6253C02556j9302R897O703q318J9495j7992L3997n581l2934j1674L8156K1304
$$ 302556 283254 293151 299854 291536 311031 293039 327036 321455 288521 276847 315003 336307
6241C36307R685J4248K0325k9535l498M0000k1501K687j8561J7240K2489J2295
$$ 336307 345992 360240 380565 351030 347532 387532 366031 368718 350157 367397 389886 402181
6229D02181L1749L9946j0808M5541q175m236r784l0486k189N532j4006K6560k9682
$$ 402181 433930 473876 463068 508609 500434 496198 486414 455928 453739 459271 445265 471825 442143
6216D42143l5177O762O9415K3995j5248K1420M8841J4985l8396j227j585L0890
$$ 442143 406966 413728 483143 507138 491890 513310 562151 577136 538740 537513 535928 566818
6204E66818R228j1735L6446J1037O0522O8019M0365L9303J3338q067j2227k1936
$$ 566818 576046 564311 600757 611794 672316 740335 780700 820003 833341 825274 813047 791111
6192G91111L315L4206J5157P79k0282k8110n0637R736L6463m1067n8211K4589
$$ 791111 794426 828632 843789 844568 824286 796176 745539 755275 791738 750671 692460 717049
6180G17049o0520n8300p907M5108K7160K3482o114K1185n461k4953N0565o447
$$ 717049 656529 598229 590322 635430 662590 686072 679958 701143 695682 670729 721294 714847
6168G14847j5481l051J1585J7422J7855r912K0014N3749P1018l563k8515l9680
$$ 714847 699366 696315 707900 725322 743177 733265 753279 807028 878046 874483 845968 806288
6156H06288n6864J7925k7623p7126n0643M0375k8330j7126J4320j497K6056p917
$$ 806288 749424 767349 739726 662600 611957 652332 624002 606876 621196 619699 645755 637838
6144F37838M033j91m3649R182m620j109m2158k6103J2981L0848L4853K4029k513
$$ 637838 641871 641680 598031 607213 602593 601484 559326 533223 546204 577052 611905 635934 633421
6131F33421L9120K4178j2466J1847k8773l2631j7022j4020l7189j615O245K4054
$$ 633421 672541 696719 684253 696100 667327 634696 617674 603654 566465 564850 571095 595149
6119E95149j9246J2181K3132r207k5233J2356N1513m524o2210J9031l48p100L7407
$$ 595149 575903 588084 611216 602009 576776 589132 640645 636121 573911 592942 592594 585494 622901
6106F22901K7549n27j1601j6711K465J3195J6222Q687n163J0321K6405M7260M3112
$$ 622901 650450 649923 638322 621611 624076 637271 653493 662180 657017 667338 693743 741003 784115
6093G84115K2288K7020Q1224L1763J4320M7416O3395K5528K859N587J3212n5152
$$ 784115 806403 833423 914647 946410 960730 1008146 1071541 1097069 1099928 1105515 1118727 1063575
6081A063575k6182p231k315m5373m9928k0785k8513j2018o008n8708o0053l7840
$$ 1063575 1037393 1030162 1027847 982474 932546 911761 883248 871230 865222 806514 746461 708621
6069G08621J338J2830K2869K8305o089j1989L888q895k5041K4299K4686k9930
$$ 708621 709959 722789 745658 773963 767874 755885 759773 750878 725837 750136 774822 744892
6057G44892j0423k2513r243j2272p332J6460K5082K4086J8235l0300J6157M0766
$$ 744892 734469 711956 702713 690441 683109 699569 724651 748737 766972 736672 752829 793595
6045G93595n3396L6492J6225j2809p622N870L503L133N810L2842p202m8041J0040
$$ 793595 740199 776691 792916 780107 772485 778355 781858 784991 790801 823643 816441 768400 778440
6032G78440P1722J0318K9954m637j4568J8548O24j5222L1064j8937N9503N194
$$ 778440 850162 860480 890434 885797 871229 889777 890401 875179 906243 887306 946809 952003
6020I52003k3748Q2099o056J8599K0637k022M1744r749j1341L5564q365K4263
$$ 952003 928255 1010354 1004298 1022897 1043534 1041512 1083256 1073507 1062166 1097730 1089365 1113628
6008A113628k1696K2623M0075j4338k9855L0516L8947K0817J7403o659L6633J0162
$$ 1113628 1091932 1114555 1154630 1140292 1110437 1140953 1179900 1200717 1218120 1211461 1248094 1258256
5996A258256J6651m776J5958k9057K1003N0154J1723J2236M5925K104k2842j8195
$$ 1258256 1274907 1270131 1286089 1257032 1278035 1328189 1339912 1352148 1398073 1400177 1377335 1359140
5984A359140L9582M0681M7359N4223K9035L5833l2930j1462L6202p503k3915N4828
$$ 1359140 1398722 1439403 1486762 1540985 1570020 1605853 1572923 1561461 1597663 1590160 1566245 1621073
5972A621073O1247M3604J3012J9776L0830O7704M3059N3190m121q130O355K8694
$$ 1621073 1682320 1725924 1738936 1758712 1789542 1857246 1900305 1953495 1949374 1941244 1947599 1976293
5960A976293P5268P3833n753M1275O7899M9197N3062Q0041O190M8831M9992J6550
$$ 1976293 2051561 2125394 2119641 2160916 2228815 2278012 2331074 2411115 2417305 2466136 2516128 2532678
5948B532678R0527L3076P5288L0626M0268N8167Q3881Q9310L8818L3002P0778
$$ 2532678 2623205 2656281 2731569 2762195 2802463 2860630 2944511 3033821 3072639 3105641 3176419
5937C176419Q2423J02504Q8231R3842J16178J09796J66847J38874R9848J10658
$$ 3176419 3258842 3361346 3449577 3543419 3659597 3769393 3936240 4075114 4174962 4285620
5927D285620J38761J11996J56832J74527J52914J63113K06666K31525J94824K64084
$$ 4285620 4424381 4536377 4693209 4867736 5020650 5183763 5390429 5621954 5816778 6080862
5917F080862K72969K77970K46534K79932K86390L56026M05694M10424M17154M53131
$$ 6080862 6353831 6631801 6878335 7158267 7444657 7800683 8206377 8616801 9033955 9487086
5907I487086N01437N56499O28415O58848P37312P75830Q33386R13146J025938
$$ 9487086 9988523 10545022 11173437 11832285 12569597 13345427 14178813 15091959 16117897
5898A6117897J127942J184925J268804J424143J500049J539509J631102J718792
$$ 16117897 17245839 18430764 19699568 21123711 22623760 24163269 25794371 27513163
5890B7513163J687437J672604J607848J465888J225050R58525O49499L43727m7520
$$ 27513163 29200600 30873204 32481052 33946940 35171990 36130515 36780014 37123741 37076221
5881C7076221l55500p11568j010132j231698j442326j557321j634372j625087
$$ 37076221 36720721 36009153 34999021 33767323 32324997 30767676 29133304 27508217
5873B7508217j647193j609727j510765j444296j327932j227350j166023j105383
$$ 27508217 25861024 24251297 22740532 21296236 19968304 18740954 17574931 16469548
5865A6469548j017709r31542q67735q38600o85144o57912n90339n05674m89835
$$ 16469548 15451839 14520297 13652562 12813962 12128818 11470906 10880567 10374893 9885058
5856I885058m47965m17076l29077l30769l57707l40712l14353k97997k46366k31735
$$ 9885058 9437093 9020017 8690940 8360171 8002464 7661752 7347399 7049402 6803036 6571301
5846F571301j69862j44660j70696j65511j04749j02575j23139j31432j25590j19840
$$ 6571301 6401439 6256779 6086083 5920572 5815823 5713248 5590109 5458677 5333087 5213247
5836E213247r3924o0675p8223q4878o3871m2376m8637n1502n9425q3513l2081
$$ 5213247 5119323 5058648 4980425 4895547 4831676 4789300 4740663 4689161 4629736 4546223 4514142
5825D514142n3778m5750k4191J0241j3598O731K753M9159q925K0J1533l6897j7888
$$ 4514142 4460364 4414614 4390423 4400664 4387066 4393797 4396550 4445709 4436784 4436804 4448337 4411440 4393552
5812D393552j7038p157J9238O853M6349K9143R8812J07061O9453O2510J9704m438
$$ 4393552 4376514 4369357 4388595 4395448 4441797 4470940 4569752 4676813 4746266 4808776 4828480 4824042
5800D824042Q084O8910J03570J14720J15046J40950J24365J35237J92583J95136
$$ 4824042 4832126 4901036 5004606 5119326 5234372 5375322 5499687 5634924 5827507 6022643
5790F022643J81025K31327J92384K44821K16582K49899L12904K95115L38308L81508
$$ 6022643 6203668 6434995 6627379 6872200 7088782 7338681 7651585 7946700 8285008 8666516
5780H666516M13331M21839M44384M97562N93563O51087P17878P95434Q62983J065302
$$ 8666516 9079847 9501686 9946070 10443632 11037195 11688282 12406160 13201594 14064577 15129879
5770A5129879J176593J306958J480910J696065J961854K245843K638542L057375
$$ 15129879 16306472 17613430 19094340 20790405 22752259 24998102 27636644 30694019
5762C0694019L628444M363496N248963O133857P092941P914657Q222896P809407
$$ 30694019 34322463 38685959 43934922 50068779 57161720 65076377 73299273 81108680
5754H1108680O536184M450640J866027o10378k808990m667899o062981o986494
$$ 81108680 87644864 92095504 93961531 93351153 90542163 85874264 79811283 72824789
5746G2824789p382016p300316o806451o058088n308448m544298l922168l408160
$$ 72824789 65442773 58142457 51336006 45277918 39969470 35425172 31503004 28094844
5738B8094844k956380k499897k102774j792446j532819j400500j236173j013542
$$ 28094844 25138464 22638567 20535793 18743347 17210528 15810028 14573855 13560313
5730A3560313q99060q69358p62772o33287n95824n91123m97953m42447l63624
$$ 13560313 12661253 11791895 11029123 10395836 9800012 9208889 8710936 8268489 7904865
5721G904865l14517k87692k83126k65104k38485k27445k02741k24130j92260j82617
$$ 7904865 7590348 7302656 7019530 6754426 6515941 6288496 6085755 5861625 5669365 5486748
5711E486748j77416j41609j66449j58215j37418j14534p8338j22858j59130k10972
$$ 5486748 5309332 5167723 5001274 4843059 4705641 4591107 4512769 4389911 4230781 4019809
5701D019809j59283j43570r7275r7151q0182n4618j09510j10827n6185m8012m9252
$$ 4019809 3860526 3716956 3619681 3522530 3442348 3387730 3278220 3167393 3111208 3063196 3013944
5690C013944j08714j10019j49024j00193p2882q3330k1939k6618o4044l7581l5508
$$ 3013944 2905230 2795211 2646187 2545994 2473112 2389782 2367843 2341225 2277181 2239600 2204092
5679B204092l2535l2513n8220m6200p6526o8026p5002q140J0278l9119m9581l1669
$$ 2204092 2171557 2139044 2080824 2034624 1958098 1890072 1815070 1806930 1817208 1778089 1728508 1696839
5667A696839K9085j5829m6335o8122n5231l4228j2752l4518l0438j0670M237L8640
$$ 1696839 1725924 1710095 1663760 1595638 1540407 1506179 1493427 1458909 1428471 1417801 1422038 1460678
5655A460678m535J7687n2689j07552k0074k716k6228k3749n7458j3865l8107K9012
$$ 1460678 1456143 1473830 1421141 1313589 1293515 1290799 1264571 1240822 1183364 1169499 1131392 1160404
5643A160404r666l2803J8091m6796n5725l4497m1461l5232k3175j1146o903j9861
$$ 1160404 1150738 1117935 1136026 1089230 1033505 999008 957547 922315 899140 887994 881091 861230
5631H61230j8639J458l6831q8K7599L8575j4793j6393P67j008P197o248L5080
$$ 861230 842591 844049 807218 807130 834729 873304 858511 842118 842885 841877 849074 842826 877906
5618H77906L2572n8824m9780L520L1916J742K4980m532k5340J4440K565k5326
$$ 877906 910478 851654 801874 805394 837310 839052 864032 859500 834160 848600 851165 825839
5606H25839j788k9962k3671J0017k9181k8046r247Q558r620P755K0822k7395r792
$$ 825839 824051 794089 770418 780435 751254 723208 713961 722519 712899 720654 741476 714081 704289
5593G04289N382J1602k8798n6415m288q293l6427O004N5924M024N439K837K4627
$$ 704289 709671 721273 692475 636060 631772 623479 587052 593056 648980 653004 658443 661280 685907
5580F85907j4791l963m7598m5611j9405J5307o340J9531K1405J583M0352O368
$$ 685907 671116 667153 619555 573944 554539 569846 563506 583037 604442 606025 646377 652745
5568F52745k4375k0684k6752k1923m123o3428K4697j677o0384K2053L4603l548
$$ 652745 628370 607686 580934 559011 554888 491460 516157 514480 454096 476149 510752 507204
5556E07204m359k5822l4951j4724m3926l6957p670N72J7765K2173L214J9241l525
$$ 507204 502845 477023 442072 427348 383422 346465 338795 339367 357132 379305 382519 401760 398235
5543C98235j2082J7514Q536l2769m8386j6733K6450j7769r940L3867Q611K116
$$ 398235 386153 403667 412203 379434 331048 314315 340765 322996 313056 346923 355534 357650
5531C57650K1660J2764J250m3146r329m5665n2934K2967j3927K9225L1962O988
$$ 357650 379310 392074 393324 350178 340849 295184 242250 265217 251290 280515 312477 319465
5519C19465j0510o84M4526j4298m3761K750k0892Q507O0460n1175L340M7486n7729
$$ 319465 308955 308271 352797 338499 294738 297488 276596 285103 345563 294388 297728 345214 287485
5506B87485j1553J6869q399K2903m1877j895j6812j4208N8600j6711K3140K1945
$$ 287485 275932 292801 284402 307305 265428 263533 246721 232513 291113 274402 297542 319487
5494C19487P161j7220j0966N612k2839l8400Q1176k6858J143J709Q34J0805m3630
$$ 319487 326648 309428 298462 304074 281235 242835 324011 297153 298296 300005 300839 311644 268014
5481B68014M0517n646L777j9644M745k2960k3091L1966r573k3650J3395Q80q872
$$ 268014 308531 302885 306662 287018 291763 268803 245712 277678 268105 244455 257850 258730 249858
5468B49858k4953M2233L6477k3310k2811L5540l5542J8171M010Q558K0119j4897
$$ 249858 224905 267138 303615 280305 257494 293034 257492 275663 279673 288231 308350 293453
5456B93453j5937j0451M954j0469l3596j6321N2808l201M9098K4455k3631M30
$$ 293453 277516 267065 272019 261550 227954 211633 264441 261240 310338 334793 311162 311592
5444C11592j1143j5872l2342K6826J0192L026M555L3783K1884L270K5391j0065
$$ 311592 300449 284577 252235 279061 289253 292279 296834 330617 352501 355771 381162 371097
5432C71097K6896J8979m793m0836J31j3600N132K8381O7434M7404L7989K4253
$$ 371097 397993 416972 412179 371343 371474 357874 363006 391387 458821 506225 544214 568467
5420E68467K2104K2731M2813J1180L6174j5000k8255j5782k2685K6700M9l2617
$$ 568467 590571 613302 656115 667295 703469 688469 660214 644432 621747 648447 648496 615879
5408F15879j6155q8235p6537O688l6402P408l950k9687l5952l2849J3317L2596
$$ 615879 599724 511489 434952 441640 405238 412646 408696 379009 343057 310208 323525 356121
5396C56121M2429L8363l4105o3433k8690n005j9633M570M0442l35p573p722J6815
$$ 356121 398550 436913 402808 339375 310685 305680 286047 290617 331059 330724 323151 315429 332244
5383C32244J03n162M4402j4610k3965k3750j03841p032O902L5383O5589l4469
$$ 332244 332347 327185 371587 356977 333012 309262 205421 198389 205291 240674 306263 271794
5371B71794J5405K7809k331L5236k2507m6850j9215n8536N29L1816j1300P116
$$ 271794 287199 315008 312677 347913 325406 278556 259341 200805 201334 233150 221850 228966
5359B28966K1425j30j0337J3223N5875n5468J8344n596o866k1237J7748J3734
$$ 228966 250391 250261 239924 253147 309022 253554 271898 266302 259436 238199 255947 269681
5347B69681p598M3918K2635k9190j7542k0499k1523J9715J7380m9582q376L3597
$$ 269681 262083 306001 328636 299446 281904 261405 239882 259597 276977 227395 219019 252616
5335B52616k4428M5443M3958O029j9101m7399l2616L1254o00J6772J8862j1583
$$ 252616 228188 273631 317589 323618 304517 257118 224502 255756 255156 271928 290790 279207
5323B79207l6043O591K1385L976k6784J6775k770l1431J6300n261J1753P847J127
$$ 279207 243164 249755 271140 275116 248332 265107 262337 230906 247206 241945 253698 261545 262672
5310B62672p264R665j9433J414M691k8151L7144J9934l3540l039j683K0160L2927
$$ 262672 255408 265073 245640 247054 251745 223594 260738 280672 247132 244093 242410 262570 295497
5297B95497k6815M579k8407l283L592n6080L0612l736J1128j7057j5004Q0642
$$ 295497 268682 273261 244854 241571 245163 189083 219695 215959 227087 210030 195026 275668
5285B75668K8615L0682O884l1027M10j6041l8755j0087j8722R71L1618k4698K2415
$$ 275668 304283 334965 341849 310822 311232 295191 256436 246349 227627 228598 260216 235518 257933
5272B57933L3996l0040J3067J5201J8615k6854k3582m3792L300M9878o025K0150
$$ 257933 291929 261889 274956 290157 308772 281918 258336 214544 217844 267722 261697 281847
5260B81847R249j0388j9328Q369M375m6919J9043j6376n3107K1450K3372J9802
$$ 281847 291096 280708 261380 269749 274124 227205 246248 229872 176765 198215 221587 241389
5248B41389M0848J1593J6765n622l8091j9762p659P2j0152q77o664k7012M6107
$$ 241389 282237 293830 310595 304973 266882 247120 239461 239533 229381 228504 221840 194828 240935
5235B40935N4557K7259K6797N260l1312m9280l3521j2822M697J3440J185K6036
$$ 240935 295492 322751 349548 354808 323496 274216 240695 227873 232570 246010 247195 273231
5223B73231j5243n998K6727L5313J3344j7668j5682j8332k1835J3890m200J8262
$$ 273231 257988 251990 278717 314030 327374 309706 294024 275692 253857 267747 263547 281809
5211B81809K5098n2459K9955K4880n253N9222R025k3802k5430l7408K7221m4230
$$ 281809 306907 254448 284403 309283 304030 363252 372277 348475 323045 285637 312858 268628
5199B68628O826N5110k0599m254N389J3176j5360m9915O8326N385l8665R805K6716
$$ 268628 275454 330564 309965 305711 311100 324276 308916 259001 327327 332712 294047 303852 330568
5186C30568l0230J9960P909j925j7055q219K2625L651l6824j7916L809l5464J3779
$$ 330568 300338 320298 328207 326282 309227 301008 323633 327284 290460 272544 276353 240889 254668
5173B54668M7410K6135M086M031J5763o986k9256J94o058K6759j7912L722J1157
$$ 254668 302078 328213 332299 336330 352093 345107 315851 316045 309987 336746 318834 322556 333713
5160C33713l6892l3824L1938J4417j2082j5606J3254Q478o3402K9899Q948K5030
$$ 333713 296821 262997 294935 309352 297270 281664 294918 303396 239994 269893 278841 303871
5148C03871O3522l186J9533k8732n2374M6363N657L5151P488n9255K1785j8920
$$ 303871 367393 364207 383740 355008 302634 348997 354654 389805 397293 338038 359823 340903
5136C40903Q1K179j2340j5199J4456j1752l5898N291K8344J7367K7155q536L0774
$$ 340903 340984 343163 330823 315624 330080 318328 282430 287721 316065 333432 360587 352051 382825
5123C82825j5916l1908O0882r303O129l6345o7065K1548L3234k911L6140j4477
$$ 382825 366909 335001 395883 386580 392709 356364 289299 310847 344081 341170 377310 362833
5111C62833K0391R638j972K9646m5668J6049J620n8856j8051j5044N997J8819
$$ 362833 383224 392862 390890 420536 374868 390917 392537 333681 315630 300586 306583 325402
5099C25402M0073O0920O371j2171k1206k0552L6818J3967L68M583l9132j9167
$$ 325402 365475 426395 432766 420595 399389 378837 415655 429622 429990 434573 395441 376274
5087C76274q721L6516P4J0357l4657p855m803P349L9211K218j4465K6215l6285
$$ 376274 367553 404069 404143 414500 379843 371988 367185 374534 413745 415963 401498 427713 391428
5074C91428j8053N7312N400K6405K1039K6356K0146q8952m7900J737m762M8488
$$ 391428 373375 430687 436087 462492 483531 509887 530033 441081 393181 394918 390156 438644
5062D38644J2340M0682j56k9580K3194N883J8848J1490m6466j0361k5153L247
$$ 438644 450984 491666 491510 461930 485124 491007 509855 521345 474879 464518 439365 442612
5050D42612N2427J4821O374K8280n592K7579j4918M7805P761j5122l9902r434
$$ 442612 495039 509860 516234 544514 538922 566501 551583 599388 607149 592027 552125 542691
5038E42691L0609L802N4868p028O5225l7482p6337K3613m489m490K6555o226J4696
$$ 542691 573300 577102 631970 624942 690167 652685 576348 599961 595472 590982 617537 611311 626007
5025F26007j8109k3744M4397k870O608j2881n085j3449l4898L9485J2759k2756
$$ 626007 607898 584154 628551 625681 632289 619408 614323 600874 565976 605461 618220 595464
5013E95464L870k2115M2843L6179j5437M431n299j8094k2969j5494j5726J4513
$$ 595464 599334 577219 620062 656241 640804 645235 639936 621842 598873 583379 567653 582166
5001E82166K4472p481n300N5089j5257P714j8081k0793L0753m643j6972m2283
$$ 582166 606638 599157 593857 648946 633689 641403 623322 602529 633282 628639 611667 569384
4989E69384k6122J0229N7460M8469M051P160j8681j2500O186j8811K6456L6177
$$ 569384 543262 553491 610951 659420 663471 670631 651950 639450 645636 626825 653281 689458
4977F89458m6117J0588M8824k3270K5244J9252M3176k6877n4686J3984j5032J5625
$$ 689458 643341 653929 702753 679483 704727 723979 767155 740278 685592 699576 684544 700169
4965G00169M5531r920K129J5234J6425K2269k2117N407k639l3345l332J8286k916
$$ 700169 745700 735780 737909 753143 769568 791837 769720 775127 772488 739143 735811 754097 751181
4952G51181j3566O366j5943L4933K4463J4462Q4782k5015j1860l7185j9678K7571
$$ 751181 737615 743981 728038 762971 787434 801896 886678 861663 849803 812618 792940 820511
4940H20511l7719j7105J6862N127O907M749J8021K8338k1786L1604J2451l248
$$ 820511 782792 765687 782549 787676 794583 799332 817353 845691 823905 855509 867960 864712
4928H64712l9193n1540n450J5936L8735K1352m611j1040k3126J5478O81j669K3348
$$ 864712 825519 773979 768529 784465 823200 844552 839941 828901 805775 821253 821934 820265 843613
4915H43613j6980m443K7818R800M2026r255K8168K7056k3177k2430l8113J0319
$$ 843613 826633 822190 850008 859808 901834 892579 920747 947803 924626 902196 864083 874402
4903H74402L6585P579p099P011J0428j6469p968Q1139O895K020k3313k7735P845
$$ 874402 910987 918566 911467 918478 928906 912437 904469 985608 992503 994523 971210 943475 951320
4890I51320k4476L9655K1626k0964K2939Q381J4521K9684l769r743L7160L4332
$$ 951320 926844 966499 988125 967161 990100 998481 1013002 1042686 1038917 1029174 1066334 1100666
4878A100666L203o587j2007j611j1339L7253M6559k540L8198q842k0384J5763
$$ 1100666 1103869 1097282 1085275 1083664 1072325 1109578 1156137 1153597 1191795 1182953 1162569 1178332
4866A178332L0323L2360j1616o529P371K2555l728Q0380N267m716N5169k5615
$$ 1178332 1208655 1241015 1229399 1222870 1230241 1252796 1249068 1329448 1334715 1329999 1385168 1359553
4854A359553J2263K9622j9093j5977L0120L0374O5944k5409O3927k6879k5656
$$ 1359553 1371816 1401438 1382345 1366368 1396488 1426862 1492806 1467397 1531324 1504445 1478789
4843A478789O2771o910L4316K2342l5854L8936P7251K8284k7430J1162L2064L1841
$$ 1478789 1541560 1534650 1568966 1591308 1555454 1594390 1671641 1699925 1672495 1683657 1715721 1747562
4831A747562N3594N76R23K0324J3925N4123M6376M9355N5065O268J5182l030M8746
$$ 1747562 1801156 1801732 1802655 1822979 1836904 1891027 1937403 1986758 2041823 2048091 2063273 2060243 2108989
4818B108989O2162M6800M2012J3936K3845N9286M7648P5326M3843Q6015K7218
$$ 2108989 2171151 2217951 2259963 2273899 2297744 2357030 2404678 2480004 2523847 2609862 2637080
4807B637080K340O1050N6328Q0162J02556N8138J17785P9990O5986J30143R2030
$$ 2637080 2639420 2700470 2756798 2836960 2939516 2997654 3115439 3195429 3261415 3391558 3483588
4796C483588J08819P5190R7924J14549J23736J51174J38760K01534J78586J55946
$$ 3483588 3592407 3667597 3765521 3880070 4003806 4154980 4293740 4495274 4673860 4829806
4786D829806K18075K43293K29288K32421K75261K75808K74174L13791L40593L27998
$$ 4829806 5047881 5291174 5520462 5752883 6028144 6303952 6578126 6891917 7232510 7560508
4776G560508M01458M01398M61945M82133M47867N19400M79555M52783M46792M28593
$$ 7560508 7961966 8363364 8825309 9307442 9755309 10274709 10754264 11207047 11653839 12082432
4766A2082432M45060M15749M09997M50769M05123M41674L96759M27112L81062
$$ 12082432 12527492 12943241 13353238 13804007 14209130 14650804 15047563 15474675 15855737
4757A5855737L05904M42520M36937M33305M40006M72101N56376N22152N94749
$$ 15855737 16161641 16604161 17041098 17474403 17914409 18386510 18942886 19465038 20059787
4748B0059787O87239O95312O85040O59839O77212O45065N61261N85286M96062
$$ 20059787 20747026 21442338 22127378 22787217 23464429 24109494 24670755 25256041 25752103
4739B5752103M06414L75964K67384J24011N3830o833j00449k09606k65130l06995
$$ 25752103 26158517 26534481 26801865 26925876 26979706 26972873 26872424 26662818 26397688 26090693
4729B6090693l91071l82573m10144m37390m12651l33572l37673l69920l35324
$$ 26090693 25699622 25317049 24906905 24469515 24056864 23723292 23385619 23015699 22680375
4720B2680375l39592l50327k84876l58928l83515m21952m20212m14810m14391
$$ 22680375 22340783 21990456 21705580 21346652 20963137 20541185 20120973 19706163 19291772
4711A9291772m44106n01402m95058m65203n10805m42805m91577m31575l89557
$$ 19291772 18847666 18346264 17851206 17386003 16875198 16432393 15940816 15509241 15119684
4702A5119684m05701l11968k83961k30638j37427j41056j01440o3180O700R9910
$$ 15119684 14713983 14402015 14118054 13887416 13749989 13608933 13507493 13444313 13451013 13550923
4692A3550923J75049K05455K00090L21763L61516L86760M38486M66354M18114
$$ 13550923 13725972 13931427 14131517 14453280 14814796 15201556 15640042 16106396 16524510
4683A6524510M15926L80263M42669L52722L86617M29366L54543L75313L80154
$$ 16524510 16940436 17320699 17763368 18116090 18502707 18932073 19286616 19661929 20042083
4674B0042083L12041L78775L27502L50504L50859K96390L54103L35232L55638
$$ 20042083 20354124 20732899 21060401 21410905 21761764 22058154 22412257 22747489 23103127
4665B3103127L82074M32378M38469M08162L67626L58400K95342K80066K07024
$$ 23103127 23485201 23917579 24356048 24764210 25131836 25490236 25785578 26065644 26272668
4656B6272668J37540J20291K8464j34847j62922k28048l48324l99834m72509m91221
$$ 26272668 26410208 26530499 26558963 26424116 26261194 26033146 25684822 25284988 24812479 24321258
4646B4321258n43072o41984o27979o17941o47176n88653o15211n56991n05927
$$ 24321258 23778186 23136202 22508223 21890282 21243106 20654453 20039242 19482251 18976324
4637A8976324m77198m80245m29587m44404m14563m14969m49092m37413l99497
$$ 18976324 18499126 18018881 17589294 17144890 16730327 16315358 15866266 15428853 15029356
4628A5029356m02822m23700l74647m30745m93520m58928m30936m39036n00057
$$ 15029356 14626534 14202834 13828187 13397442 12903922 12444994 12014058 11575022 11074965
4619A1074965m88939n16948m93732m55211m71094m39071m21447l81685l51836
$$ 11074965 10586026 10069078 9575346 9120135 8649041 8209970 7788523 7406838 7055002
4610G055002l23244k96785k74406l05144k39735k43467k88773k12955k03477j70144
$$ 7055002 6731758 6434973 6160567 5855423 5615688 5372221 5083448 4870493 4667016 4496872
4600D496872j62921j78336j06030j63249j25978j32066r1138r0306l5272o1666
$$ 4496872 4333951 4155615 4049585 3886336 3760358 3628292 3537154 3446848 3411576 3349910
4590C349910r6723j36054r3157j14293K55m8347o9359n8615q8373n4342p9834
$$ 3349910 3253187 3117133 3023976 2909683 2909938 2861591 2792232 2733617 2645244 2590902 2511068
4579B511068l5011j6370m4818q2259k7514l7813m3215m2351r517j5908j5100p3044
$$ 2511068 2476057 2459687 2414869 2332610 2305096 2267283 2224068 2181717 2172200 2156292 2141192 2068148
4567B068148p7138j5766m674k4065k3568k622o403m5256k3668K0437N0672N3721
$$ 2068148 1991010 1975244 1970570 1946505 1922937 1920315 1913912 1868656 1844988 1865425 1916097 1969818
4555A969818M4461M4420N0106N4828J56157J32432J81700J34673L4283K2676m4493
$$ 1969818 2014279 2058699 2108805 2163633 2319790 2452222 2633922 2768595 2802878 2825554 2781061
4544B781061n5983q8835j18842j31911j70019j21776j12320j36586o2626l6578
$$ 2781061 2725078 2636243 2517401 2385490 2215471 2093695 1981375 1844789 1782163 1745585
4534A745585o8317n8172n6158k1040n8499J0965L0343m3212o9537n5753K7397
$$ 1745585 1677268 1619096 1562938 1541898 1483399 1494364 1524707 1481495 1411958 1356205 1383602
4523A383602R105J0048L0065j2625k2260k9151O098N9567K8234J9475Q151k6573
$$ 1383602 1392707 1402755 1432820 1420195 1397935 1368784 1374882 1434449 1462683 1482158 1490309 1463736
4511A463736K926r549L502j8849J5093J7363k7178j0026k5073j6203k237O3138
$$ 1463736 1466662 1457113 1460615 1441766 1456859 1474222 1447044 1437018 1411945 1395742 1393505 1456643
4499A456643L3544K605l2942M39o810R374n819M3582L0565o586m859Q469M7618
$$ 1456643 1490187 1492792 1459850 1460289 1453479 1462853 1457034 1500616 1531181 1524595 1519736 1528205 1575823
4486A575823L3023K6004L8586k7248k3038j1190m559J4158N549k0192m9m3699
$$ 1575823 1608846 1634850 1673436 1646188 1623150 1611960 1607401 1621559 1627108 1606916 1606867 1563168
4474A563168j9428K4900j1763L0931j5554j5162P019j8331k6237L2244L4328M9172
$$ 1563168 1543740 1568640 1556877 1587808 1572254 1557092 1564111 1545780 1519543 1551787 1586115 1635287
4462A635287L5268L5448K8554m219M303K023K382j7362l8271l9035m0732J2436
$$ 1635287 1670555 1706003 1734557 1730338 1734641 1736664 1739046 1721684 1683413 1644378 1603646 1616082
4450A616082k9863J678l8411p827M963j9015K8345M1195j6966L8623O2319R766
$$ 1616082 1586219 1587897 1549486 1541659 1546622 1527607 1555952 1597147 1580181 1618804 1681123 1690889
4438A690889L8165M3209L7603M662O712J6165m1791J0134K4500K2731J9909k0865
$$ 1690889 1729054 1772263 1809866 1814528 1821240 1837405 1795614 1805748 1830248 1852979 1872888 1852023
4426A852023m5238j0312J9735P1049M4474K9780J5720K0715k9211n1253K9727
$$ 1852023 1806785 1796473 1816208 1887257 1931731 1961511 1977231 1997946 1968735 1917482 1947209
4415A947209m8001p150m8596n6392M0359Q971J3545j3604r911N3288K2004j7472
$$ 1947209 1899208 1892058 1843462 1787070 1827429 1836400 1849945 1836341 1826430 1879718 1901722 1884250
4403A884250O042J568O2240K3427K7990O1661K4024L5240L2293P8590R0553P3667
$$ 1884250 1890292 1891860 1954100 1977527 2005517 2067178 2091202 2126442 2158735 2237325 2327878 2401545
4391B401545N7359K1081N4749N8548N4198M7685M4373N4340M2425M9773L8649
$$ 2401545 2458904 2479985 2534734 2593282 2647480 2695165 2739538 2793878 2836303 2886076 2924725
4380B924725J6943N7038M1940l3638L2395l7500k642L3810k3744q233J843K7582
$$ 2924725 2941668 2998706 3040646 3007008 3039403 3001903 2999261 3033071 3009327 3001094 3002937 3030519
4368C030519N2495N874M5053r880k9775n4445k4266J2738L1702K5522K6746N840
$$ 3030519 3083014 3088888 3133941 3124061 3094286 3039841 3015575 3028313 3060015 3085537 3112283 3118123
4356C118123O122N327R0106L7770P9065O2946P2782K4871O5188M1675P7698N8601
$$ 3118123 3124245 3129572 3219678 3257448 3336513 3399459 3472241 3497112 3562300 3603975 3681673 3740274
4344C740274N1697Q4512M2966R7300P8982O5372J47382O2256O2692M8567Q926
$$ 3740274 3791971 3876483 3919449 4016749 4095731 4161103 4308485 4370741 4433433 4482000 4490926
4333D490926J6478L2518N2565M6806J3096L2959K1386M5241L9038J11191R8651
$$ 4490926 4507404 4539922 4592487 4639293 4652389 4685348 4706734 4751975 4791013 4902204 5000855
4322E000855Q0256J32420J27465J02970Q8644R9726J05947O7341J8407N8863L5461
$$ 5000855 5081111 5213531 5340996 5443966 5532610 5632336 5738283 5805624 5824031 5882894 5918355
4311E918355J39485J53506Q3496J43198J32873J17757J07545J15934J73817J94418
$$ 5918355 6057840 6211346 6294842 6438040 6570913 6688670 6796215 6912149 7085966 7280384
4301G280384K40443K47600K98793K84534L56853L62439L95627L90904M01913L32465
$$ 7280384 7520827 7768427 8067220 8351754 8708607 9071046 9466673 9857577 10259490 10591955
4291A0591955L82577M17039M37530L93218M60324N15635N67330P21016Q29107
$$ 10591955 10974532 11391571 11829101 12222319 12682643 13198278 13765608 14486624 15315731
4282A5315731Q69532J060577J128409J324018J462951J636039J880845K277790
$$ 15315731 16185263 17245840 18374249 19698267 21161218 22797257 24678102 26955892
4274B6955892K620506L048622L180456L583944L866639N096572P184561J0301121
$$ 26955892 29576398 32625020 35805476 39389420 43256059 48352631 55537192 65838313
4266F5838313J4234347J9984557K9262094M2516927M6176740L9342831J7848213
$$ 65838313 80072660 100057217 129319311 171836238 218012978 257355809 275204022
4259B75204022m712278j2411704j7807951k2688223l1153767l4681829l1135577
$$ 275204022 270491744 258080040 240272089 217583866 186430099 151748270 120612693
4252A20612693k4758328j8038299j3194716r649903p457889o282645n143211m027799
$$ 120612693 95854365 77816066 64621350 54971447 47513558 41230913 36087702 32059903
4244C2059903l065541k390847j881481j698149j398464j167612r42469p93798
$$ 32059903 28994362 26603515 24722034 23023885 21625421 20457809 19515340 18721542
4236A8721542o54856n93386m98914m44201l46524k68775j95820j21633K9988J02102
$$ 18721542 18066686 17473300 16974386 16530185 16183661 15914886 15719066 15597433 15627421 15729523
4226A5729523K43607K90608L49401M23515M43707N27748N76309O09744O36143
$$ 15729523 15973130 16263738 16613139 17036654 17480361 18008109 18584418 19194162 19830305
4217A9830305O19859O01178O57138P04788P42303Q13329Q38184Q28720Q56734
$$ 19830305 20450164 21051342 21708480 22413268 23155571 23968900 24807084 25635804 26492538
4208B6492538R33263R00086R27548R57384R42543R73412R91871R93192R11384
$$ 26492538 27425801 28325887 29253435 30210819 31153362 32126774 33118645 34111837 35023221
4199C5023221R25028R28569Q90736Q42142P29051P16350N93770O14766N70215
$$ 35023221 35948249 36876818 37767554 38609696 39338747 40055097 40648867 41263633 41833848
4190D1833848M99898M70775L59523K28434K11357Q9631n0946j02508k32187l18486
$$ 41833848 42333746 42804521 43164044 43392478 43603835 43693466 43642520 43540012 43307825 42989339
4180D2989339m38399m54978n26876n92800o75424p42411p90065q11012r10211
$$ 42989339 42550940 42095962 41569086 40976286 40300862 39558451 38768386 37957374 37047163
4171C7047163r57168j011670j011812j003852j099182j108444j125438j108389
$$ 37047163 36089995 35078325 34066513 33062661 31963479 30855035 29729597 28621208
4163B8621208j131150j128490j069541j087144j019828j022699j006488j019641
$$ 28621208 27490058 26361568 25292027 24204883 23185055 22162356 21155868 20136227
4155B0136227r96131r23082q46981q47068q05668q19619p04303o92802o35237
$$ 20136227 19140096 18217014 17370033 16522965 15717297 14897678 14193375 13500573 12865336
4146A2865336n76008n73668n11297m57770m42312m00381m43768l58710l16015
$$ 12865336 12289328 11715660 11204363 10746593 10304281 9903900 9460132 9101422 8785407
4137H785407l25165k75319k42156k29070j80936j80298j35120j17726j07404r3447
$$ 8785407 8460242 8184923 7942767 7713697 7532761 7352463 7217343 7099617 6992213 6898766
4127F898766r1887j26049j50233j64453p1024l8897j04861m4082l8729q6310o4111
$$ 6898766 6806879 6680830 6530597 6366144 6295120 6256223 6151362 6107280 6068551 5982241 5918130
4116E918130q302k0190q0568j19082j21321n6741o4559r702m2471k0364l8782
$$ 5918130 5909828 5889638 5809070 5689988 5568667 5511926 5447367 5437665 5395194 5374830 5336048
4105E336048r0795k93q0766q2388K676m5340n8828k2546k099K226k9692P787K3262
$$ 5336048 5245253 5244960 5164194 5081806 5084482 5039142 4980314 4957768 4955669 4957895 4928203 4935990 4959252
4092D959252j1840K8741j3999k4283l1722l4390l35k82q111j9714J3589K9439
$$ 4959252 4947412 4976153 4962154 4937871 4906149 4871759 4871424 4871142 4863031 4843317 4856906 4886345
4080D886345K6791K1093M6954R1393P6366J3091J3580O3245o07j1562K745k4739
$$ 4886345 4913136 4934229 4981183 5072576 5148942 5162033 5175613 5238858 5238251 5226689 5229434 5204695
4068E204695j8792j0949K7871l2781o699j921K0147J2334j4030L9977M6516L0808
$$ 5204695 5185903 5174954 5202825 5170044 5163345 5161424 5181571 5193905 5179875 5219852 5266368 5297176
4056E297176J5703k160M6463M9566L313J5637L4814N1138N2121j946K2407K6213
$$ 5297176 5312879 5310719 5357182 5406748 5410061 5425698 5460512 5511650 5563771 5561825 5584232 5610445
4044E610445Q8030L1339J8942K812k0792J6357L9338M7363K1930L2019O5578J3549
$$ 5610445 5698475 5729814 5748756 5751568 5730776 5747133 5786471 5833834 5855764 5887783 5953361 5966910
4032E966910N7884L6709N7442P2988N1423K1274O3421K9154K1010R6110M2910
$$ 5966910 6024794 6061503 6118945 6191933 6243356 6264630 6328051 6357205 6378215 6474325 6517235
4021F517235J08169N4844N3181O4386R265L7478M9562M1134K4498M6131M4921
$$ 6517235 6625404 6680248 6733429 6797815 6807080 6844558 6894120 6935254 6959752 7005883 7050804
4010G050804M0994N5242Q3826R3007Q2994L1079K6590O5048M2872L0099R2706
$$ 7050804 7091798 7147040 7230866 7323873 7406867 7437946 7464536 7529584 7572456 7602555 7695261
3999G695261P9415O4645M8737O4161O8173N0356Q8070J07213N4862L0732J4450
$$ 7695261 7774676 7839321 7888058 7952219 8020392 8070748 8158818 8266031 8320893 8351625 8366075
3988H366075J9033M6230N9767P9421N3906Q3562R9930J62848J48350J40398J48414
$$ 8366075 8385108 8431338 8491105 8570526 8624432 8707994 8807924 8970772 9119122 9259520 9407934
3977I407934J41935J80507K10000K27898K38653K59060J83273J82892J52196J13093
$$ 9407934 9549869 9730376 9940376 10168274 10406927 10665987 10849260 11032152 11184348 11297441
3967A1297441O9814N9851L3089K0794O401J0498P3053O9652J42461J48147J26583
$$ 11297441 11367255 11427106 11460195 11480989 11487390 11497888 11570941 11640593 11783054 11931201 12057784
3956A2057784J39361J68410J61622J73281J91823J58606J69285J92217J88001
$$ 12057784 12197145 12365555 12527177 12700458 12892281 13050887 13220172 13412389 13600390
3947A3600390J86129J85517K23816K42909K17521K46083K41887K13692K07742
$$ 13600390 13786519 13972036 14195852 14438761 14656282 14902365 15144252 15357944 15565686
3938A5565686K10701K66342K16007K46594K97940L07015L24126L51458L98529
$$ 15565686 15776387 16042729 16258736 16505330 16803270 17110285 17434411 17785869 18184398
3929A8184398M74134M53671M84759N83736N80582N74591O42772O83011P50484
$$ 18184398 18658532 19112203 19596962 20180698 20761280 21335871 21978643 22661654 23412138
3920B3412138P60091Q24339Q64562Q71979R25268R57754R65979R44054R37772
$$ 23412138 24172229 24996568 25861130 26733109 27658377 28616131 29582110 30526164 31463936
3911C1463936R33900R52642J001242R85943J023914J040783J132823J158287J203838
$$ 31463936 32397836 33350478 34351720 35337663 36361577 37402360 38535183 39693470 40897308
3902D0897308J259656J271720J356322J381739J315726J329605J267461J220908
$$ 40897308 42156964 43428684 44785006 46166745 47482471 48812076 50079537 51300445
3894E1300445J174975J141653J144210J070064J019548J012057R18651R33361
$$ 51300445 52475420 53617073 54761283 55831347 56850895 57862952 58781603 59714964
3886E9714964R31961Q16858P73437O32716N70074N09099L72545K86535K18089
$$ 59714964 60646925 61463783 62237220 62869936 63440010 63949109 64321654 64608189 64826278
3877F4826278J35861J30332J12173J20560J60526J69321J88338K26936J70612
$$ 64826278 64962139 65092471 65204644 65325204 65485730 65655051 65843389 66070325 66240937
3868F6240937K26685K39368L15283L66918M57244O48257Q35746J047911J360369
$$ 66240937 66467622 66706990 67022273 67389191 67846435 68494692 69330438 70378349 71738718
3859G1738718J641043J867831K196187K500042K821331L081925L357418L652513
$$ 71738718 73379761 75247592 77443779 79943821 82765152 85847077 89204495 92857008
3851I2857008L783430L997027M105792L983079L842218L628604L235547K845251
$$ 92857008 96640438 100637465 104743257 108726336 112568554 116197158 119432705 122277956
3843A22277956K375442J894807J375299Q74071N08374J59200j62220m44210o99510
$$ 122277956 124653398 126548205 127923504 128797575 129305949 129465149 129302929 128858719 128159209
3834A28159209r73605j252915j581011j984242k328368k718611l146446l448639
$$ 128159209 127185604 125932689 124351678 122367436 120039068 117320457 114174011 110725372
3826A10725372l705883l823467l822427l774769l603375l297800k951124k575052
$$ 110725372 107019489 103196022 99373595 95598826 91995451 88697651 85746527 83171475
3818H3171475k235071j806585j467167j163656q25841n78859k86083q7152J28870
$$ 83171475 80936404 79129819 77662652 76498996 75673155 75094296 74808213 74721061 74849931
3809G4849931L52452N57518P62824Q86257J019322J078366J046858J077971J036300
$$ 74849931 75202383 75759901 76522725 77408982 78428304 79506670 80553528 81631499 82667799
3800H2667799R05127P54037N98226L97375K76606P3186J4797j31317k69103l69582
$$ 82667799 83572926 84326963 84925189 85322564 85599170 85672356 85687153 85555836 85286733 84917151
3790H4917151n35784n91269o93725p81145r54191r86474j100311j257999j380686
$$ 84917151 84381367 83790098 83096373 82315228 81361037 80374563 79274252 78016253 76635567
3781G6635567j470091j613657j724577j900015k027241k167924k170738k237213
$$ 76635567 75165476 73551819 71827242 69927227 67899986 65732062 63561324 61324111
3773F1324111k270421k260364k298469k218048k182750k123016k046045k056088
$$ 61324111 59053690 56793326 54494857 52276809 50094059 47971043 45924998 43868910
3765D3868910k013005j985918k005822j911918j938825j870805j795182j742890
$$ 43868910 41855905 39869987 37864165 35952247 34013422 32142617 30347435 28604545
3757B8604545j678472j565539j483221j308654j228273j141444r69024r34290
$$ 28604545 26926073 25360534 23877313 22568659 21340386 20198942 19229918 18295628
3749A8295628p96776p48409o22154m93062m30424l64858l19347k33809k19759
$$ 18295628 17498852 16750443 16128289 15635227 15204803 14839945 14520598 14286789 14067030
3740A4067030j60951j21137j38653q6274j28565j06866q6184r4309l6812j26172
$$ 14067030 13906079 13784942 13646289 13560015 13431450 13324584 13238400 13144091 13107279 12981107
3730A2981107l5871P252n1579m8354m7104o9238o1254j15855j20556j77879k41534
$$ 12981107 12945236 12952488 12900909 12852555 12805451 12736213 12674959 12559104 12438548 12260669 12019135
3719A2019135k28673k88026k59492l24499l36792l25818l58308l49973k79795
$$ 12019135 11790462 11502436 11242944 10918445 10581653 10255835 9897527 9547554 9267759
3710I267759l48280l14127k83826l56690l14906l25483l08810l29009l53630l40294
$$ 9267759 8919479 8605352 8321526 7964836 7649930 7324447 7015637 6686628 6332998 5992704
3700E992704l02226k87620k76686k37126k46214j95077j73652k04125j77555j79206
$$ 5992704 5690478 5402858 5126172 4889046 4642832 4447755 4274103 4069978 3892423 3713217
3690C713217j24047j61200j11441j44646j10502q3779j04144j32634k9573n2891
$$ 3713217 3589170 3427970 3316529 3171883 3061381 2977602 2873458 2740824 2711251 2658360
3680B658360j12883p9918j54677l6997n3366j09159p1254n3426o0629k1906n5634
$$ 2658360 2545477 2465559 2310882 2273885 2220519 2111360 2040106 1986680 1926051 1904145 1848511
3669A848511j0684l4707m3554n0046p5185j7958n1920r9092p1047M978P24j2389
$$ 1848511 1837827 1803120 1759566 1709520 1634335 1616377 1564457 1465365 1394318 1399296 1400020 1387631
3657A387631l0324l4185j2388m8410l7578Q080j8211l6966j7058j00350k4142
$$ 1387631 1357307 1323122 1310734 1262324 1224746 1232826 1214615 1177649 1160591 1060241 1036099
3646A036099M939l3996M183J177n1812l1505L477n500m3098l2855l1440n9038
$$ 1036099 1041038 1007042 1011225 1012402 960590 929085 932562 927062 883964 851109 819669 760631
3634G60631r714r966J5717m335m281K406n0430R888K021m6537p406m3492j4595
$$ 760631 750917 740951 756668 752333 748052 750458 700028 709916 711937 665400 657994 614502 599907
3621E99907j4817m1780Q101n947L3407j24k3698m5020j1625r487m3655l1026j1069
$$ 599907 585090 543310 551411 545464 578871 578747 555049 510029 498404 488917 445262 414236 403167
3608D03167j4956J5449m005K9402K063k2055J9611j9152K953l8629l617K6022
$$ 403167 388211 403660 399655 429057 431120 409065 428676 409524 412477 373848 370231 396253
3596C96253l9092j5293K905l6031J638o154N1970M4151l1551l9988n146j2635
$$ 396253 357161 341868 344773 308742 310380 304226 356196 400347 368796 328808 323662 311027
3584C11027J9137l4668l3268L5209k2450J6073M0620L0941j3396j0910L8916K1643
$$ 311027 330164 295496 262228 297437 274987 291060 331680 362621 349225 338315 377231 398874
3572C98874m2306J9909R503l5670O5837M0397J8777J9695o1066m799M8171l429
$$ 398874 356568 376477 385980 350310 416147 456544 475321 495016 433950 429151 477322 473893
3560D73893M4004N4277m803K5557K8889j125O472k9369O6267R433J1069J4701
$$ 473893 517897 572174 567371 592928 621817 620692 627164 597795 664062 673495 684564 699265
3548F99265l8529L2100n141J9684P2613J3792N8458L6271J0797L2198l4905K077
$$ 699265 660736 692836 687695 707379 779992 793784 852242 888513 899310 931508 896603 898680
3536H98680l8798m8178j9882m1285k9047n3541m0356j2094k5785j3173l0745k0053
$$ 898680 859882 811704 791822 750537 721490 667949 627593 615499 589714 576541 545796 525743
3524E25743r745q631K4338m5661M018L2961K7889M0543j5433N4488N6344Q905
$$ 525743 515998 507367 531705 486044 490062 523023 550912 591455 576022 630510 686854 695759
3512F95759M4300N7212R5110R6455O2287Q5261N5982o254m099o9508l7664n4914
$$ 695759 740059 797271 892381 988836 1051123 1136384 1192366 1186112 1182013 1112505 1074841 1019927
3500A019927j01387o3063j18402n4202j8033n9247j5502m7178l7760k9908j0024
$$ 1019927 918540 855477 737075 682873 664840 605593 590091 542913 505153 475245 465221
3489D65221J5992J7955m3278l2214m425k9048l0309R481J2436N4047N191J2635
$$ 465221 481213 499168 455890 423676 419251 390203 359894 369375 381811 435858 441049 453684
3477D53684K5502R152M9716Q709j9985l2912j6320j0901l3326o2967k2792m1467
$$ 453684 479186 488338 538054 546763 526778 493866 477546 466645 433319 370352 347560 306093
3465C06093J0926J6046p7273k5329m9058l8546M2424l3617M1324j189j4016M551
$$ 306093 317019 333065 255792 230463 181405 142859 185283 151666 192990 191801 177785 182336
3453A82336L675k3181J3165K9470j5283k0601L2476L7715K154M5676K2074L3882
$$ 182336 186011 162830 175995 205465 190182 169581 202057 239772 241926 287602 309676 343558
3441C43558O8806K7355p613K4539Q3114N6071J28195J04616J26727J78301J88065
$$ 343558 412364 439719 432106 456645 539759 595830 724025 828641 955368 1133669 1321734
3430A321734K67299L16053K44370J89764N7118p8891q8491j70962k12625k03330
$$ 1321734 1589033 1905086 2149456 2339220 2396338 2317447 2228956 2057994 1845369 1642039
3420A642039k02471j88792k24287j22375j26056j06279n4031j06543o8103m3455
$$ 1642039 1439568 1250776 1026489 904114 778058 671779 617748 511205 443102 399647
3410C99647o3245J1886n2994n2956O610l5353Q129n1870n0905j6286N259m4476
$$ 399647 336402 348288 295294 242338 248948 213595 221724 169854 118949 102663 107922 63446
3398F3446K8182P018Q243L5181M3538M9850o996O062L6236K3162J5364M5214m9889
$$ 63446 91628 98646 106889 142070 185608 235458 228462 234524 270760 293922 309286 354500 304611
3385C04611o8948o82m6574m6782n6616o551j1460k4524l3076n0506j7094J1224
$$ 304611 235663 234981 188407 141625 85009 78458 66998 42474 9398 -41108 -58202 -46978
3373d6978J0322k3069n0137j5244n875q133O1620J6824j5938L5685J5077K4446
$$ -46978 -36656 -59725 -109862 -125106 -130981 -139114 -77494 -60670 -76608 -40923 -25846 -1400
3361a400P4794K2745K5509J6925l6759k166p1737n4200o0237k5876k1693p568
$$ -1400 73394 96139 121648 138573 101814 99648 27911 -26289 -86526 -112402 -134095 -141663
3349a41663k6626l2993K7711j8919k2864j6202n455j6609m6859J0615j0764q451
$$ -141663 -168289 -201282 -173571 -192490 -215354 -231556 -237011 -253620 -300479 -289864 -300628 -309079
3337c09079M1712oL0786Pj5479Q770l3672j7490o067K617o50l6667k372M2107
$$ -309079 -267367 -267373 -236587 -236580 -252059 -243289 -276961 -294451 -300518 -297901 -298551 -335218 -337590 -295483
3323b95483q78K9078o211k8279k0835k3399j7472L8343J8228j3755k1220J323
$$ -295483 -296361 -267283 -273494 -301773 -322608 -346007 -363479 -325136 -306908 -320663 -341883 -340560
3311c40560K6752j7665K4175j8731Q629k958J7455l4785r250J3680m4877j8552
$$ -340560 -313808 -331473 -307298 -326029 -317400 -320358 -302903 -337688 -346938 -333258 -378135 -396687
3299c96687L6536J7814K9218j8663L9042K1139n2606K3423n0091k1598L3099q2699
$$ -396687 -360151 -342337 -313119 -331782 -292740 -271601 -324207 -300784 -350875 -372473 -339374 -422073
3287d22073K5001M0703N418J4322p773J0022K6901j67k904J6176n4862J1288J1338
$$ -422073 -397072 -356369 -350951 -336629 -344402 -334380 -307479 -307646 -310550 -294374 -349236 -337948 -326610
3274c26610k4574k5042J5672J0903j221k9361L2904J915r48P768m2408o414R355
$$ -326610 -351184 -376226 -360554 -349651 -350872 -380233 -347329 -345414 -346362 -338594 -381002 -387416 -378061
3261c78061K0548J7847k2064J5573K8980l0645J2571O403m0953j3835j6119L1997
$$ -378061 -357513 -339666 -361730 -346157 -317177 -347822 -335251 -328848 -369801 -383636 -399755 -367758
3249c67758M8456l5195O42L959J8283L4551j8535J7393l8308l0659q324m2734
$$ -367758 -319302 -354497 -353855 -349896 -331613 -297062 -315597 -298204 -336512 -367171 -375495 -418229
3237d18229K1230K3247k1467K152L1449J7054L0941j5671n301j0887m770K2217
$$ -418229 -396999 -373752 -395219 -393067 -361618 -344564 -313623 -329294 -334595 -345482 -350252 -328035
3225c28035j6630k7138q955k3854L0200K9326p872k9149K327N7535l550l9530
$$ -328035 -344665 -371803 -380758 -404612 -374412 -345086 -352958 -382107 -379780 -322245 -325795 -365325
3213c65325J3801j2560P51N3590j9154m7678L1277l800n332L8163q752L5077m4244
$$ -365325 -351524 -364084 -363333 -309743 -328897 -376575 -345298 -349098 -354430 -316267 -325019 -289942 -334186
3200c34186M293M2454o7988L916J7254k6002J6510k8609L442p375k436M1458r51
$$ -334186 -329893 -287439 -355427 -351511 -334257 -360259 -343749 -372358 -368916 -376291 -378727 -337269 -338220
3187c38220J1979M779j7535q050Q510j4318r470L224L2441j1961j7268R491K3442
$$ -338220 -326241 -321462 -338997 -347047 -338537 -352855 -362325 -359101 -326660 -338621 -355889 -346398 -322956
3174c22956K9194p884P205k5736k639r098n762K9375l1017L7795M592m0442Q765
$$ -322956 -293762 -301646 -294441 -320177 -322816 -331914 -337676 -308301 -339318 -301523 -296931 -337373 -328608
3161c28608J2152K1219r123j1153M5869l4446j5749K1304l2386L470q55q286K7315
$$ -328608 -316456 -295237 -304360 -315513 -269644 -304090 -319839 -298535 -330921 -327451 -328306 -336592 -309277
3148c09277O139K3245O150j5619R832j6467L46L7203n3729n384n594l2735R419
$$ -309277 -303138 -279893 -273743 -289362 -279530 -295997 -295651 -258448 -312177 -317561 -323155 -355890 -346471
3135c46471O965M1110J8446J6031O071K3140m2481j4885j072n916k2271M6725
$$ -346471 -339506 -298396 -279950 -263919 -257848 -234708 -277189 -292074 -293146 -299062 -321333 -274608
3123b74608p871P987J1106J7020K4542L542M0129k1996l0965m3868N70J6693k5302
$$ -274608 -282479 -274492 -263386 -246366 -221824 -218282 -178153 -200149 -231114 -274982 -274412 -257719 -283021
3110b83021k1380K4517L191K2327j7060j6491M9554r78j2221j3803J372K1428
$$ -283021 -304401 -279884 -276693 -254366 -271426 -287917 -238363 -239341 -251562 -265365 -263993 -242565
3098b42565j033J3293J1974j0391N0820j2626r778P256j0201l082J5611K985l1479
$$ -242565 -243598 -230305 -218331 -228722 -177902 -190528 -200306 -193050 -203251 -206333 -190722 -187737 -219216
3085b19216K3655J5777l608K4830J8247l5026j342k7921J8591k0727k2354k551
$$ -219216 -195561 -179784 -183392 -158562 -140315 -175341 -176683 -204604 -186013 -206740 -229094 -231645
3073b31645j2025J9134J5199l2827l9898J4230N7849m011j077L7853p449l9731
$$ -231645 -243670 -224536 -209337 -242164 -282062 -267832 -209983 -213994 -215071 -177218 -184667 -224398
3061b24398m2219K312J6123J3966L4156k4476k0178P538N100k985J3381q074J5789
$$ -224398 -266617 -264305 -248182 -234216 -200060 -224536 -244714 -237176 -232076 -235061 -221680 -229754 -213965
3048b13965J8384k0459k1863j9680J8295k2243R778j6817j925J4317M0699j3008
$$ -213965 -195581 -216040 -237903 -257583 -239288 -261531 -251753 -268570 -270495 -256178 -215479 -228487
3036b28487j6934j6449j6579M240K8869J8401J7813n566n7283M0824J4052m2938
$$ -228487 -245421 -261870 -278449 -274209 -245340 -226939 -209126 -214692 -271975 -231151 -217099 -260037
3024b60037L5019k8530k0851J4034j5961p284l5664J586M8182L915r691m5010
$$ -260037 -225018 -253548 -274399 -260365 -276326 -283610 -319274 -317688 -269506 -265591 -275282 -320292
3012c20292M774p8J2355J8861j8626k6461N576J1539o203M0337j7354R797j1852
$$ -320292 -315518 -315596 -303241 -284380 -303006 -329467 -323891 -312352 -318555 -278218 -295572 -285775 -297627
2999b97627j1446j0977l882m807J058j3101l4432K2735L515N3642k6717n7935
$$ -297627 -309073 -320050 -323932 -328739 -327681 -340782 -375214 -352479 -348964 -295322 -322039 -379974
2987c79974O6827L9552n183m5703l6779J7196j0377p573J8723j3946j6498l0603
$$ -379974 -313147 -273595 -278778 -324481 -361260 -344064 -354441 -362014 -343291 -357237 -373735 -404338
2975d04338K7842M8146P300J5789k304j6724q190j2864M6733K259O706j7815j0292
$$ -404338 -376496 -328350 -321050 -305261 -307565 -324289 -332479 -345343 -298610 -296351 -289645 -307460 -317752
2962c17752l6138Q394k54N756J469j8658J7906J6336o935l3092J2213k099R014
$$ -317752 -353890 -345496 -345750 -339994 -338525 -357183 -339277 -322941 -329876 -362968 -350755 -352854 -343840
2949c43840K0076k8451q696m183M7133L4482k3782j3756M73r405j5635J2826j2161
$$ -343840 -323764 -352215 -360911 -365094 -317961 -283479 -307261 -321017 -320544 -329949 -345584 -332758 -344919
2936c44919J786k0070L5357M542k6075j2863K3406M9307l6407p421J2469o1989
$$ -344919 -343133 -363203 -327846 -323304 -349379 -362242 -338836 -289529 -325936 -333357 -320888 -382877
2924c82877K1906J2285L685k409P188K2867J5680j913n027O564K7395l4809k4695
$$ -382877 -360971 -348686 -345001 -347410 -340222 -317355 -301675 -303588 -308615 -302051 -274656 -309465 -334160
2911c34160J2384l375L4571J3322l1281m7366Q381J875J1345J9481l970J7670
$$ -334160 -321776 -325151 -290580 -277258 -308539 -355905 -347524 -345649 -334304 -314823 -318793 -301123
2899c01123j0280o4765L0963j1735Q34J8654m694J7375k736J513K8057j0502J9681
$$ -301123 -311403 -376168 -345205 -356940 -356106 -337452 -342146 -324771 -327507 -325994 -297937 -308439 -288758
2886b88758j0236j8833K8115n7765o469K1372K14j5847M1156O008J91j5421j0046
$$ -288758 -298994 -317827 -289712 -347477 -353946 -332574 -332360 -348207 -307051 -301043 -300852 -316273 -326319
2873c26319J1218r513R093j7979J3119K6284k6248J2967J1096j1345q333k2523
$$ -326319 -315101 -324614 -315521 -333500 -320381 -294097 -320345 -307378 -296282 -307627 -315960 -338483
2861c38483j5590j0347K7844q941L4806l684K4361j5846o7909M1854q24j5336
$$ -338483 -354073 -364420 -336576 -345517 -310711 -314395 -290034 -305880 -373789 -331935 -332759 -348095
2849c48095J3743P019N0896j0260l1594R899n9240q386Q2030k5656o961m155P751
$$ -348095 -334352 -327333 -276437 -286697 -318291 -308392 -367632 -376018 -293988 -319644 -326605 -330760 -323009
2836c23009K5186j449J4854o1827o504J8981L5754M124R523k3788k2206L7493
$$ -323009 -297823 -299272 -284418 -346245 -352749 -333768 -298014 -293890 -284367 -308155 -330361 -292868
2824b92868L8629m8002p608k6335o221J0579J8834N4043k6065j2961K7159l9933
$$ -292868 -254239 -302241 -309849 -336184 -342405 -331826 -312992 -258949 -285014 -297975 -270816 -310749
2812c10749J0137l1316n456K7335k0858L3078Q769k3939j6894J7463n395j5126
$$ -310749 -300612 -331928 -337384 -310049 -330907 -297829 -289060 -312999 -329893 -312430 -317825 -332951
2800c32951P47J6261k6122L6649N914j0342L1562j0607P266j8419l1518J980q293
$$ -332951 -332204 -315943 -342065 -305416 -299502 -309844 -278282 -288889 -281623 -300042 -331560 -329580 -337873
2787c37873j0737J8132m389Q132N760K4987K5095l4387K2275n8893j0172J558
$$ -337873 -348610 -330478 -334867 -326735 -320975 -295988 -270893 -305280 -283005 -341898 -352070 -350512
2775c50512K9635j395J837L1425Q530N1906n1879J9345J2693l175l7915r602k2502
$$ -350512 -320877 -322272 -320435 -289010 -280480 -228574 -280453 -261108 -248415 -251590 -289505 -299107 -321609
2762c21609N854J0167k8294L4508l6673K257j958L0589J7040p771p29k8616m1043
$$ -321609 -315755 -305588 -333882 -299374 -336047 -333790 -335748 -305159 -288119 -295890 -296619 -325235 -366278
2749c66278K8287J368R608K9719j8443J7027K0657m6380L4535M659n883j7263
$$ -366278 -337991 -336623 -327015 -297296 -315739 -298712 -278055 -324435 -289900 -285241 -291124 -308387
2737c08387k0069R249K2293r819o725J2571k5842J5676j6393K1562M0564Q712
$$ -308387 -328456 -319207 -296914 -306733 -313458 -300887 -326729 -311053 -327446 -305884 -265320 -256608
2725b56608j1119m656l211l8855j6388K353p603K7009K8183J0801n1604K5653
$$ -256608 -267727 -272383 -275594 -314449 -330837 -328484 -336087 -309078 -280895 -270094 -321698 -296045
2713b96045j4256k3067j0627L3042N580l7753l390j0397P277O163M4922k805P764
$$ -296045 -310301 -333368 -343995 -310953 -305373 -343126 -346516 -356913 -349636 -343473 -298551 -301356 -293592
2700b93592r403K1377J1414j7216j6858p924J3146r976J2610J42m9313J8282K4035
$$ -293592 -302995 -281618 -270204 -287420 -304278 -312202 -299056 -309032 -296422 -296280 -345593 -327311 -303276
2687c03276Q241K719J6471L947m898p789j766K1106o5823k3269L2390N85J0738
$$ -303276 -295035 -292316 -275845 -271898 -276796 -284585 -286351 -265245 -331068 -354337 -321947 -321362 -310624
2674c10624N5921Q290j1704m7283j677N9226m8457r390L7579O665n519Q001L1942
$$ -310624 -254703 -246413 -258117 -305400 -307077 -247851 -296308 -305698 -268119 -261454 -266973 -258972 -227030
2661b27030l9653k5991M0914r326O617O3K1479j6101n6392r384m699q092R906
$$ -227030 -266683 -292674 -251760 -261086 -254469 -254406 -232927 -249028 -305420 -314804 -319503 -327595 -317689
2648c17689L9094M641K2081k8789j0240j3338J6697m252o039J3850l4759k3017
$$ -317689 -278595 -273954 -251873 -280662 -290902 -304240 -287543 -291795 -297834 -283984 -318743 -341760
2636c41760K4585J8510K6081K8259l024j0333m6584j7818j3502L328K2809J1785
$$ -341760 -317175 -298665 -272584 -244325 -247349 -257682 -304266 -322084 -335586 -332258 -309449 -297664
2624b97664M9806l9103j3386L1456k3037P536M398m740k2237j8888P4790l2885
$$ -297664 -247858 -286961 -300347 -268891 -291928 -284392 -279994 -284734 -306971 -325859 -251069 -283954
2612b83954k6052M6455o922o505l7609j7173j2660N4458N7537m3844l0316J0075
$$ -283954 -310006 -263551 -270473 -276978 -314587 -331760 -344420 -289962 -232425 -276269 -306585 -296510
2600b96510Q584P048j344l7586J0102N2015P339k7895J3254R438Q570K1640j6147
$$ -296510 -287926 -280878 -282222 -319808 -309706 -257691 -250352 -278247 -264993 -255555 -246985 -225345 -241492
2587b41492j9586m633M918M0183k5999m1402J438J4927J5612m1269O2670n352
$$ -241492 -261078 -265711 -260793 -220610 -246609 -288011 -286573 -271646 -256034 -297303 -234633 -239985
2575b39985p1311L9669n313J7269k6152l333L5299j4807K081l453J7350J0489
$$ -239985 -311296 -271627 -276940 -259671 -285823 -289156 -253857 -268664 -266583 -270036 -252686 -242197
2563b42197J6196J7624j4137k2319J6262K2174r457k5156O4637L7108n598l6094
$$ -242197 -226001 -208377 -222514 -244833 -228571 -206397 -215854 -241010 -176373 -139265 -144863 -180957
2551a80957j8309k397J966n44K0248n0997l4583j4834j6499J4223K2948n0137
$$ -180957 -199266 -201663 -199697 -200241 -179993 -230990 -265573 -280407 -296906 -282683 -259735 -309872
2539c09872L1052M4736l2283M999n999l2751k7016N4517L6194K0748J0943n4944
$$ -309872 -278820 -234084 -266367 -261368 -267367 -300118 -327134 -272617 -236423 -215675 -204732 -259676
2527b59676k5481L095J6935J6648l3301J3285K9983k5878l0962J2488K8387R854
$$ -259676 -285157 -282062 -265127 -248479 -281780 -268495 -238512 -264390 -295352 -282864 -254477 -244623
2515b44623l682m774K2803J7840q32J1641m177J7971l3699k4005l1289j7439j3426
$$ -244623 -248305 -253079 -230276 -212436 -213268 -201627 -205804 -187833 -221532 -245537 -276826 -294265 -307691
2502c07691K0224J0883L237M8211j1199k1480M593M4747Q212m6460j1677m4305
$$ -307691 -287467 -276584 -273347 -225136 -236335 -257815 -253222 -208475 -200263 -246723 -258400 -302705
2490c02705n862N7386J6224K2633p458K2645P863m363l7038k0358l894O0198k5833
$$ -302705 -308567 -251181 -234957 -212324 -219782 -197137 -189274 -193637 -230675 -251033 -254927 -194729 -220562
2477b20562l1289j1523m0346L9453R010J5615L4377P656j1796k9284l5994L1602
$$ -220562 -251851 -263374 -303720 -264267 -255257 -239642 -205265 -197609 -209405 -238689 -274683 -243081
2465b43081J8975J6749m8712J0234K5331J5963N326M679k3024l4977L7425j9586
$$ -243081 -224106 -207357 -256069 -245835 -220504 -204541 -199215 -194536 -217560 -252537 -215112 -234698
2453b34698l4247J2742l071J5187Q148n238L4261J7841j6166K0562l2415J0512
$$ -234698 -268945 -256203 -259274 -244087 -235939 -241177 -206916 -189075 -205241 -184679 -217094 -206582
2441b06582k289j2288j4338n391k1940k426O3142r233p660J2769K5922J2412L409
$$ -206582 -208871 -221159 -235497 -240888 -262828 -265254 -202112 -211345 -219005 -206236 -180314 -167902 -164493
2428a64493m658l5096l3491j3520M1840J066l0652K3813j2672m7225J5503O2305
$$ -164493 -169151 -204247 -237738 -251258 -209418 -208352 -239004 -215191 -227863 -275088 -259585 -197280
2416a97280L0952N135m3370N710o935j2292J1548k503o021q68M506j105K1439
$$ -197280 -166328 -161193 -204563 -198853 -205788 -218080 -206532 -209035 -215056 -215924 -211418 -212523 -191084
2403a91084K0497M379J0605o516L030l3941k2485N294L183O3198Q65l3666k1327
$$ -191084 -170587 -166208 -155603 -162119 -159089 -193030 -215515 -210221 -207038 -143840 -142975 -176641 -197968
2390a97968J5411m649P52L0054L8901j4525l6557L1292j2785K6432j4319l7306
$$ -197968 -182557 -187206 -186454 -156400 -117499 -132024 -168581 -137289 -150074 -123642 -137961 -175267
2378a75267o945L1360L5427K1639N303j2451j3863k4082J6780L068l4232O406
$$ -175267 -182212 -150852 -115425 -93786 -88483 -100934 -114797 -138879 -122099 -119031 -153263 -146857
2366a46857Q22K5710J4059p072J6601K2978k9541J9349M4597m8713l2563Q096
$$ -146857 -146035 -120325 -106266 -113338 -96737 -73759 -103300 -83951 -39354 -88067 -120630 -112534
2354a12534J8421O2273L0090j5043m607N228K1525P482N1307l9098l5128j3195
$$ -112534 -94113 -31840 -1750 -16793 -21400 -16172 5353 12835 64142 25044 -10084 -23279
2342b3279J5345M0429m1355K8166N0179k7527K7574l415J2405J5180K3659Q845
$$ -23279 -7934 32495 -8860 19306 69485 41958 69532 66117 78522 93702 117361 126206
2330A26206l7062j1928K0591L7852Q820K1374J0366K7661M8368L1501K0982J0190
$$ 126206 89144 77216 97807 135659 144479 165853 176219 203880 252248 283749 304731 314921
2318C14921j806M9769N9634L0374L5158O356L2950P2130M1938R7612P2051Q3990
$$ 314921 313115 362884 422518 452892 488050 494406 527356 599486 641424 739036 811087 895077
2306H95077J38252J59623K08675K07139J55527J20897J54313J30735J84688K03508
$$ 895077 1033329 1192952 1401627 1608766 1764293 1885190 2039503 2170238 2354926 2558434
2296B558434L00234M11829O61288Q93317J234201J768998K728146L280682K989340
$$ 2558434 2858668 3270497 3931785 4825102 6059303 7828301 10556447 13837129 16826469
2287A6826469J689338j32776q67395j287614j605102k136784k406457k135932
$$ 16826469 18515807 18383031 17515636 16228022 14622920 12486136 10079679 7943747
2279G943747j706601j262146q93081o81763n18646l47419l17140k61445k21063
$$ 7943747 6237146 4975000 4081919 3400156 2881510 2534091 2216951 1955506 1734443
2270A734443j99603j59713j29784j03810j40857j31583j04913j00698q1500n9081
$$ 1734443 1534840 1375127 1245343 1141533 1000676 869093 764180 663482 581982 522901
2260E22901o2806p1898o2285m7729j1225k3693L434R056m1149l8956l4485Q457
$$ 522901 460095 388197 325912 278183 266958 243265 246699 255755 214606 175650 141165 149622
2248A49622p00q357o909J4890k5306J8017m6086k1502j0574j8473n490k0052L617
$$ 149622 148922 140565 133656 148546 123240 141257 95171 73669 63095 44622 39132 19080 22697
2235B2697j3608j7410k4076j962P129J0658l7029k9967o232j1693l5476J0538
$$ 22697 9089 -8321 -32397 -34359 -27230 -16572 -53601 -83568 -89800 -101493 -136969 -126431
2223a26431n253J9490j604n600k9307J6503o002K0621m8654J4314K3039n783m338
$$ -126431 -131684 -112194 -113798 -119398 -148705 -132202 -138204 -117583 -166237 -151923 -128884 -134667 -139005
2210a39005j6667K6199o578n3987n000M319O304q649k7127L9048p749K098J1299
$$ -139005 -155672 -129473 -136051 -190038 -195038 -190719 -184415 -193064 -220191 -181143 -188892 -186794 -175495
2197a75495K677l2831K8251o454J6482j3851j8768K526l5323l4991L445l971L5677
$$ -175495 -172818 -205649 -177398 -183852 -167370 -181221 -199989 -197463 -232786 -267777 -264332 -268303 -232626
2184b32626K5271L3m0548J3446J1148j1609j1936l6858l414M705J5412k5623J6845
$$ -232626 -207355 -207322 -247870 -234424 -223276 -234885 -246821 -283679 -287093 -282388 -266976 -292599 -275754
2171b75754K5862P111j206L2242L2141j2517j1509k8108l1476q633K5450L1249
$$ -275754 -249892 -242781 -243987 -211745 -179604 -192121 -203630 -231738 -263214 -271847 -246397 -215148
2159b15148l6532l45J3122K3774l5998j904L2937j8156o3940K4060l88l174j7038
$$ -215148 -251680 -252025 -238903 -215129 -251127 -253031 -220094 -238250 -302190 -278130 -278518 -281692 -298730
2146b98730M4613L8489k1162j8371N7013M002K23q805k1295k0738j8716M0665
$$ -298730 -254117 -215628 -236790 -255161 -198148 -194146 -193923 -202728 -224023 -244761 -263477 -222812
2134b22812j7773l63k1806j6333K4483K2504J0967k2056k7324l2825k7939L0312
$$ -222812 -240585 -240948 -262754 -279087 -254604 -232100 -221133 -243189 -270513 -303338 -331277 -300965
2122c00965O502K7380j3207K255N960l289K537j5817o09K4620j0020L688j8522
$$ -300965 -294463 -267083 -280290 -278035 -272075 -275364 -272827 -288644 -289253 -264633 -274653 -270965 -289487
2109b89487P906L9910K0922l3213K6323l6382n231m747k3301O074J2563J2525
$$ -289487 -281581 -241671 -220749 -253962 -227639 -264021 -269252 -273999 -297300 -291226 -278663 -266138
2097b66138p79l636l1312j1607J541P1710l8678q890K2038n0535J9508J4469j1068
$$ -266138 -266917 -270553 -301865 -313472 -311931 -240221 -278899 -287789 -265751 -316286 -296778 -282309 -293377
2084b93377n047M5570K9268q447n3774j8177K7217N259K5018M14k0849j8840j3503
$$ -293377 -298424 -252854 -223586 -232033 -285807 -303984 -276767 -271508 -246490 -246076 -266925 -285765 -299268
2071b99268O1965K7059l7336k2791m2573J2635M0848k2755K2077o177k6053M5958
$$ -299268 -237303 -210244 -247580 -270371 -312944 -300309 -259461 -282216 -260139 -266316 -292369 -246411
2059b46411o883J2493j858J8100Q550l1859K58k2366m9828n929M2458M0740K9888
$$ -246411 -253294 -240801 -242659 -224559 -216009 -247868 -247610 -269976 -319804 -325733 -283275 -242535 -212647
2046b12647j2870l1370j0883J0540k235J5607r233j7757k9818O614N0989J6978
$$ -212647 -225517 -256887 -267770 -257230 -259465 -243858 -253091 -270848 -300666 -294052 -243063 -226085
2034b26085j0721j2427m6923K5721o728M918J9218P080J4890m7050j5565K9889
$$ -226085 -236806 -249233 -296156 -270435 -277163 -272245 -253027 -245947 -231057 -278107 -293672 -263783
2022b63783K8071k673K6728j8371J8258M1109k6651k2423n625J198r560j162j1
$$ -263783 -235712 -238385 -211657 -230028 -211770 -170661 -197312 -219735 -225360 -224162 -233722 -234884 -234895
2009b34895l4772J2125N7682n216j2279m598l7019l3915j2192M2404J7857o154
$$ -234895 -269667 -257542 -199860 -205076 -217355 -221953 -258972 -292887 -305079 -262675 -244818 -250972
1997b50972j9654k2313k3437K2637K1971J2356K050k1892j4268N986M552K0790
$$ -250972 -270626 -292939 -316376 -293739 -271768 -259412 -257362 -279254 -293522 -287536 -282984 -262194
1985b62194L6628l5535k9577j6158R402K7400j6930L3687O072N142l9218j1017
$$ -262194 -225566 -261101 -290678 -306836 -297434 -270034 -286964 -253277 -247205 -242063 -281281 -292298
1973b92298o230j2177o692M3299J4213k4611N831J7788q147l0736K9998M4812
$$ -292298 -298528 -310705 -317397 -274098 -259885 -284496 -278665 -260877 -269024 -299760 -269762 -224950
1961b24950N104l1817N930k6818M5K9335J3026J2303j139q774m156j1607l6346
$$ -224950 -219846 -251663 -245733 -272551 -272506 -243171 -230145 -217842 -218981 -227755 -231911 -243518 -279864
1948b79864K3836j0429O199J3219m0672j4512q63N4410J5611j5813L4601j8422
$$ -279864 -256028 -266457 -260258 -247039 -287711 -302223 -303086 -248676 -233065 -248878 -214277 -232699
1936b32699O31j4581l5482J5768J666k6239q054R103J8817l9455J5635N9750J436
$$ -232699 -232068 -246649 -282131 -266363 -264697 -290936 -298990 -289887 -271070 -310525 -294890 -235140 -233704
1923b33704j1742k3021J2298O896K113J028m6188j7216p245J1198J1798J072J5785
$$ -233704 -245446 -268467 -256169 -249273 -247160 -246132 -292320 -309536 -316781 -305583 -293785 -292713 -276928
1910b76928K2721n1656M8250K5579o9325N795J4423K8588m6678j560P519R845
$$ -276928 -254207 -305863 -257613 -232034 -301359 -295564 -281141 -252553 -299231 -300791 -293272 -283427
1898b83427L0788N4158k2452j8079j3576J3390k9979K7070k4398k5843L8947J2939
$$ -283427 -252639 -198481 -220933 -239012 -252588 -239198 -269177 -242107 -266505 -292348 -253401 -240462
1886b40462n2451K0590J0147L846M824L495j1127l4158J0850J422Q144r089J6688
$$ -240462 -292913 -272323 -262176 -258330 -253506 -250011 -261138 -295296 -284446 -283024 -274880 -283969 -267281
1873b67281P334O612K377o181o292J079N35n311k8117o009k508O323J8895n352
$$ -267281 -259947 -253335 -250958 -257139 -263431 -262352 -261817 -267128 -295245 -301254 -303762 -297439 -278544 -283896
1859b83896M6898K2147j6141l5164l2157K1617K6204n838n603j5182m1121L1706
$$ -283896 -236998 -214851 -230992 -266156 -298313 -276696 -250492 -256330 -261933 -277115 -318236 -286530
1847b86530J9867l884L9962L356l5400R622j3893n361j3077o158M63m33L6258
$$ -286530 -266663 -270547 -230585 -227229 -262629 -253007 -266900 -272261 -285338 -291496 -291033 -291466 -255208
1834b55208k616O14L7632j9247m699K1931m3628m6406O751N6232K6913k8967N15
$$ -255208 -257824 -257210 -219578 -238825 -243524 -221593 -265221 -311627 -304876 -248644 -221731 -250698 -250183
1821b50183q808m5967m317J5621J5508J8321k5271N422n266L3818L0133K0977
$$ -250183 -258991 -304958 -309275 -293654 -278146 -259825 -285096 -279674 -284940 -251122 -220989 -200012
1809b00012n4663n273j4093j0096j4000k7727L5173L3050J6352o804K0909j7163
$$ -200012 -254675 -259948 -274041 -284137 -298137 -325864 -290691 -257641 -241289 -248093 -227184 -244347
1797b44347o192M901j8837m8Q551p423j9976j9589M4898M2047k1854l1277P590
$$ -244347 -250539 -245638 -264475 -264523 -255972 -263395 -283371 -302960 -258062 -216015 -237869 -269146 -261556
1784b61556N984k808k9204k6741L841j5886J631K9472L5655J791L891N3344L237
$$ -261556 -255572 -258380 -287584 -314325 -310484 -326370 -324739 -295267 -259612 -257821 -253930 -200586 -197349
1771a97349k8724l4626k3974K2944l032P530M04k6395J4942L6003J5694r62j1851
$$ -197349 -226073 -260699 -284673 -261729 -264761 -257231 -256827 -283222 -268280 -232277 -216583 -217545 -229396
1758b29396j1366l1008n305Q36K956L1285J3252k2956m857n370O858N0689j650
$$ -229396 -240762 -271770 -277075 -276239 -273283 -241998 -228746 -251702 -256559 -261929 -255071 -204382 -206032
1745b06032M972k8398p886j0377k2824j2072j9585j3343M2513L6671J3217k1319
$$ -206032 -201060 -229458 -237344 -247721 -270545 -282617 -302202 -315545 -273032 -236361 -223144 -244463
1733b44463r818K1936L884J313n4031k233l2860m765M2382j3419N77J1147J9474
$$ -244463 -254281 -232345 -228461 -227148 -281179 -283412 -316272 -321037 -278655 -292074 -291497 -280350 -260876
1720b60876R162p064k6409k1264J7596o438J0600P806R146j0500N9898j2299j3171
$$ -260876 -251714 -258778 -285187 -306451 -288855 -295293 -284693 -276887 -267741 -278241 -218343 -230642 -243813
1707b43813j395k2603L0605j9588J4514j4258k5494k1045N7807j154j715K2668
$$ -243813 -245208 -267811 -237206 -256794 -242280 -256538 -282032 -303077 -245270 -246424 -248139 -225471
1695b25471j1587j8566J0116K0617p558m375l2373q941Q642l486k5827K7901K4722
$$ -225471 -237058 -255624 -245508 -224891 -232449 -236824 -269197 -278138 -269496 -272982 -298809 -270908 -246186
1682b46186j072K7095m4065J612j8537K8540M9745j2552l5639J0390m991p0898
$$ -246186 -247258 -220163 -264228 -262616 -281153 -252613 -202868 -215420 -251059 -240669 -245660 -316558
1670c16558K7934J5943N101K8368l1109K3676K054J7673L1087j9576J5347n0679
$$ -316558 -288624 -272681 -267580 -239212 -270321 -246645 -244591 -226918 -195831 -215407 -200060 -250739
1658b50739l2790j4712k7288L710J8570J8166r610M3161n791k291j429M1860M3829
$$ -250739 -283529 -298241 -325529 -321819 -303249 -285083 -294693 -251532 -257323 -259614 -261043 -219183 -175354
1645a75354o8506n5047K6258k8737j9085O2619J8110N278J2758L7660M181j8034
$$ -175354 -243860 -298907 -272649 -301386 -320471 -257852 -239742 -234464 -221706 -184046 -179865 -197899
1633a97899j9883J64m8100j0110j0379J4143J0616L290J1129N4107L908k6965
$$ -197899 -217782 -217618 -265718 -275828 -286207 -272064 -261448 -258158 -247029 -192922 -189014 -215979
1621b15979O803J2180j0995k5995k122J3332l3513K334R669J3346R898p056r18
$$ -215979 -209176 -196996 -207991 -233986 -236108 -222776 -256289 -253955 -244286 -230940 -221042 -228098 -229016
1608b29016j000l768J5532n98j9398j5897q560K3171O580P773J3671L4363l8903
$$ -229016 -230016 -233784 -218252 -218850 -238248 -254145 -262705 -239534 -232954 -225181 -211510 -177147 -216050
1595b16050k6957n890j0643J0362K6712l370m2047J0679J6271J3202K864L7269
$$ -216050 -243007 -248897 -259540 -249178 -222466 -225836 -267883 -257204 -240933 -227731 -224867 -187598
1583a87598P538J1667m5505p6319K3606n67N361N468N814k2626k842K8278q130
$$ -187598 -180060 -168393 -213898 -290217 -266611 -267178 -261817 -256349 -250535 -273161 -276003 -247725 -255855
1570b55855J3327M936K3201j512n8575r837K815J4048J9978j6161L951P353k5659
$$ -255855 -242528 -237592 -214391 -215903 -274478 -284315 -281500 -267452 -247474 -263635 -259684 -252331 -277990
1557b77990K3904J5843j6122j6789J9664J6092J0110O259n473n021P946l3331
$$ -277990 -254086 -238243 -254365 -271154 -251490 -235398 -225288 -219029 -224502 -229523 -221577 -254908
1545b54908r650M395j4075l635j5474p438L1837J3143J4295J0950K0540o048m574
$$ -254908 -264558 -260163 -274238 -277873 -293347 -300785 -268948 -255805 -241510 -230560 -210020 -216068 -220642
1532b20642k9573j2032p383N6023L7078k0793r489j3459p699j6174L2271K8305
$$ -220642 -250215 -262247 -269630 -213607 -176529 -197322 -206811 -220270 -227969 -244143 -211872 -183567
1520a83567k8563j5113l2619j333k5790j7699K0501J7825J2043J8373j5113j0194
$$ -183567 -212130 -227243 -259862 -261195 -286985 -304684 -284183 -266358 -254315 -235942 -251055 -261249
1508b61249r069R761N0116J683k8110k8292q968k820L3767K498l950J6029l969
$$ -261249 -270318 -260557 -210441 -208758 -236868 -265160 -274128 -276948 -243181 -240683 -244633 -228604 -232573
1495b32573l1397m965l7695L963L2150N4869m0560l0554M9251L1292R998J3883
$$ -232573 -263970 -268935 -306630 -302667 -270517 -215648 -256208 -286762 -237511 -206219 -196221 -182338
1483a82338m3030j7247l2702L2042n468j4321M911R646Q042n0531L6735M1801
$$ -182338 -225368 -242615 -275317 -243275 -248743 -263064 -258153 -248507 -240465 -290996 -254261 -212460
1471b12460K1923l1895k9698m968l1417o155O862R403L5103o790j0391K2392j4433
$$ -212460 -190537 -222432 -252130 -257098 -288515 -294670 -287808 -278405 -243302 -250092 -260483 -238091 -252524
1458b52524q249L7418j2558P419J5206k0159k1484l809j8578L5727M7065l2273
$$ -252524 -260773 -223355 -235913 -228494 -213288 -233447 -254931 -258740 -277318 -241591 -194526 -226799
1446b26799P4k3748L2702K6056j2390k5607k3690j4525J5843J0451L2177k5361
$$ -226799 -226725 -250473 -217771 -191715 -204105 -229712 -253402 -267927 -252084 -241633 -209456 -234817
1434b34817J2011r963k5274k3099K348K1397n402j7357K5316j4165r589M5675
$$ -234817 -222806 -232769 -258043 -281142 -278794 -257397 -262799 -280156 -254840 -269005 -278594 -232919
1422b32919K132j4175J2573J4262m6585p977N658N5140P661k6490K2071J1227
$$ -232919 -230787 -244962 -232389 -218127 -264712 -272689 -267031 -211891 -204230 -230720 -208649 -197422
1410a97422j1632K1642j5544j9533n996J0011k3693K8996J0978j3941j860L6078
$$ -197422 -209054 -187412 -202956 -222489 -228485 -218474 -242167 -213171 -202193 -216134 -217994 -181916
1398a81916k1107p096k1675M473Q835o148o979J0822o02k3060K9961j0586q571
$$ -181916 -203023 -210119 -231794 -227321 -218486 -224634 -231613 -220791 -221393 -244453 -214492 -225078 -233649
1385b33649M6587r338l6572j4378o559m913L3326J1973l0919m55K9844l874J14
$$ -233649 -187062 -196400 -232972 -247350 -253909 -258822 -225496 -213523 -244442 -244897 -215053 -218927 -218813
1372b18813L3651J1910k6731m3995j1824j9167J584N0537j6407j5448K1461J2394
$$ -218813 -185162 -173252 -199983 -243978 -255802 -274969 -273385 -222848 -239255 -254703 -233242 -220848
1360b20848J9170l796k8968j2037O591m2837k0045K1926J4122N800P636J415J5833
$$ -220848 -201678 -205474 -234442 -246479 -239888 -282725 -302770 -280844 -266722 -260922 -253286 -251871 -236038
1347b36038J3568k048k3174j9057n988J9387J4022M468k7434J6161J4445l318
$$ -236038 -222470 -224518 -247692 -266749 -272737 -253350 -239328 -234860 -262294 -246133 -231688 -235006
1335b35006M446j2358j973K321j4666q165j0074n927K2197j5368K6135K4528L0004
$$ -235006 -230560 -242918 -244891 -242570 -257236 -265401 -275475 -281402 -259205 -274573 -248438 -223910 -193906
1322a93906N5764k3259m1750k7135k6829j9468K7068O070j4068j7356L2036L3416
$$ -193906 -138142 -161401 -203151 -230286 -257115 -276583 -249515 -243445 -257513 -274869 -242833 -209417
1310b09417J538K4532p106j9221l3399R09J4974l2530m921L3221J2804k23Q030
$$ -209417 -207879 -183347 -190453 -209674 -243073 -242164 -227190 -259720 -264641 -231420 -218616 -218839 -210809
1297b10809j242N942K3373K5711Q002l0252n8849K901M670n77j3571l1170M2915
$$ -210809 -212051 -206109 -182736 -157025 -149023 -179275 -238124 -235223 -230553 -231130 -244701 -275871 -232956
1284b32956j4633N245O012J039k770k904J6829l1450J4362j7005J5094J8049j1634
$$ -232956 -247589 -242344 -236332 -235293 -238063 -240967 -224138 -255588 -241226 -258231 -243137 -225088 -236722
1271b36722L3695j7276p672J0634p526q145J1318L128L454r276o556p431p87K023
$$ -236722 -203027 -220303 -227975 -217341 -224867 -233012 -221694 -218566 -215112 -224388 -230944 -238375 -239162 -237139
1257b37139n106k149j5305M0011L4953j366k5959k8760m3471J3237J5140J0767
$$ -237139 -242245 -244394 -259699 -219688 -184735 -186101 -212060 -240820 -284291 -271054 -255914 -245147
1245b45147K7683j4579J2651K0667k2307J6331J5631L6068j6285k3201l244k4419
$$ -245147 -217464 -232043 -219392 -198725 -221032 -204701 -189070 -153002 -169287 -192488 -195732 -220151
1233b20151j2550j9918m074l331O0019K269j6527M1186n392k2759m3164j974p998
$$ -220151 -232701 -252619 -256693 -260024 -200005 -197736 -214263 -173077 -178469 -201228 -244392 -246366 -254364
1220b54364r173Q393J6666J3885J7925M876J1907n016j1431K5099j7792k4128
$$ -254364 -263537 -255144 -238478 -224593 -206668 -201792 -189885 -194901 -206332 -181233 -199025 -223153
1208b23153J255l2664k3170J117L3365L1979j2190K0229j7424j8588K1893M299
$$ -223153 -221898 -254562 -277732 -276615 -243250 -211271 -223461 -203232 -220656 -239244 -217351 -213052
1196b13052m5044J9010k0606l9158K4121J3658P3808J3429m7672K8571J3899l6317
$$ -213052 -258096 -239086 -259692 -298850 -274729 -261071 -187263 -173834 -221506 -192935 -179036 -215353
1184b15353L4766l7497m809M6291r3324j6290L4159J4399m42J8510L1651k0516
$$ -215353 -180587 -218084 -222893 -176602 -269926 -286216 -252057 -237658 -238100 -219590 -187939 -208455
1172b08455k3552k0942j4941m6455L5469p057r940r076K9570P1920K9275K803
$$ -208455 -232007 -252949 -267890 -314345 -278876 -285933 -295873 -304949 -275379 -203459 -174184 -171381
1160a71381J2994K5183n1411j7112m6535K6803k5249j5739K2669L254j257K2269
$$ -171381 -158387 -133204 -184615 -201727 -248262 -221459 -246708 -262447 -239778 -236524 -237781 -215512
1148b15512R307P729J2041o138l524l9053n7595j5384M4495K2160J6374M2603
$$ -215512 -206205 -198476 -186435 -192573 -196097 -235150 -292745 -308129 -263634 -241474 -225100 -182497
1136a82497j1645k556J199K2889n1601J6685j6020j2868J7963j8775J0275j4830
$$ -182497 -194142 -196698 -195499 -172610 -224211 -207526 -223546 -236414 -218451 -237226 -226951 -241781
1124b41781k1762O3454J4492P441k2654k4245j3452R029L4681K819J184j4337
$$ -241781 -263543 -200089 -185597 -178156 -200810 -225055 -238507 -229478 -194797 -191978 -190794 -205131
1112b05131l264J0812K649k9891R049l4606r594M6328K9293M22m7000o2922L2917
$$ -205131 -208395 -197583 -194934 -224825 -215776 -250382 -259976 -213648 -184355 -183933 -230933 -293855 -260938
1099b60938K4123P345l9353K9100j0456j012L5528Q488K4035l569m5377O465j8923
$$ -260938 -236815 -229470 -268823 -239723 -250179 -251191 -215663 -207175 -183140 -186709 -232086 -225621 -244544
1086b44544Q131l112j3029O800J832L5959j1141M253K2874J3639j5921k0142n3215
$$ -244544 -236413 -239525 -252554 -245754 -243922 -207963 -219104 -214851 -191977 -178338 -194259 -214401 -267616
1073b67616k5585K3656L1325N808j0637o220L4144J5152j4800L2272K8161o456
$$ -267616 -293201 -269545 -238220 -232412 -243049 -249269 -215125 -199973 -214773 -182501 -154340 -160796
1061a60796p4695J190j5384p729J6519J1236m6270K732L3938K7142L0843K2336
$$ -160796 -235491 -234301 -249685 -257414 -240895 -229659 -275929 -273197 -239259 -212117 -181274 -158938
$$ [...]
##END NTUPLES=NMR SPECTRUM
##END=
