##TITLE=1H_DE-80H_X3
 200.13MHz, d2o
 8 sc
 
 19ns.26.2.2025
##JCAMPDX= 6.0         $$ Bruker NMR JCAMP-DX V2.0
##DATA TYPE= NMR SPECTRUM
##DATA CLASS= NTUPLES
##ORIGIN= UXNMR, Bruker Analytische Messtechnik GmbH
##OWNER= pz
$$ XWIN-NMR		Version 3.5
$$ Thu Jul 23 13:52:41 2026 Russian Standard Time (UT+4h)  Yarkov@DPX200
##.OBSERVE FREQUENCY= 200.1313
##.OBSERVE NUCLEUS= ^1H
##.ACQUISITION MODE= SIMULTANEOUS
##.ACQUISITION SCHEME= undefined
##.AVERAGES= 8
##.DIGITISER RES= 18
##SPECTROMETER/DATA SYSTEM= spect
##.PULSE SEQUENCE= zg30
##.SOLVENT NAME= CDCl3
##.SHIFT REFERENCE= (INTERNAL, CDCl3, 0, 15.5012)
##AUDIT TRAIL= $$ (NUMBER, WHEN, WHO, WHERE, WHAT)
$$ ##TITLE= Audit trail, XWIN-NMR		Version 3.5
$$ ##JCAMPDX= 5.01
$$ ##ORIGIN= Bruker BioSpin GmbH
$$ ##OWNER= Yarkov
$$ C:/Bruker/XWIN-NMR/data/yarkov2/nmr/H-C/1/pdata/1/auditp.txt
$$ ##AUDIT TRAIL=  $$ (NUMBER, WHEN, WHO, WHERE, WHAT)
(   1,<2026-07-23 13:51:59.82 +0400>,<Yarkov>,<DPX200>,
      <created by zg, POWCHK disabled, PULCHK disabled
       configuration hash MD5:
       00 E9 B6 7A A2 85 ED C7 34 08 36 98 17 FE 4E 26
       data hash MD5: 16K
       AF 96 16 49 A8 53 42 7F 07 F5 05 3C AF 49 88 AF>)
(   2,<2026-07-23 13:52:05.23 +0400>,<Yarkov>,<DPX200>,
      <Start of raw data processing
       efp BC_mod = 2 LB = 0.25 FT_mod = 6 PKNL = 1 PHC0 = -7254.183 PHC1 = 2.82197 SI = 16K 
       data hash MD5: 16K
       56 28 9E 90 A4 E6 91 07 FC EB 31 19 2A 67 CA 71>)
$$ ##END=
$$ 
$$ hash MD5
$$ D3 CF 78 AA BD B5 4E 8D 2E 31 24 B5 E6 25 23 9F
##$RELAX= 
##$RELAX= 
##$RELAX= 
##$RELAX= 
##$RELAX= 
##$RELAX= 
$$ Bruker specific parameters
$$ --------------------------
##$DU= <C:/Bruker/XWIN-NMR>
##$EXPNO= 1
##$NAME= <H-C>
##$PROCNO= 1
##$TYPE= <nmr>
##$USER= <yarkov2>
##$AMP= (0..31)
100 100 100 100 100 100 100 100 100 100 100 100 100 100 100 100 100 100 
100 100 100 100 100 100 100 100 100 100 100 100 100 100 
##$AQSEQ= 0
##$AQ_mod= 1
##$AUNM= <au_zg>
##$AUTOPOS= <>
##$BF1= 200.13
##$BF2= 200.13
##$BF3= 200.13
##$BF4= 200.13
##$BF5= 200.13
##$BF6= 200.13
##$BF7= 200.13
##$BF8= 200.13
##$BYTORDA= 1
##$CFDGTYP= 0
##$CFRGTYP= 5
##$CHEMSTR= <none>
##$CNST= (0..31)
1 1 145 1 1 1 1 1 1 1 1 1 1 1 1 1 1 1 1 1 1 1 1 1 1 1 1 1 1 1 1 1 
##$CPDPRG= <>
##$CPDPRG1= <>
##$CPDPRG2= <>
##$CPDPRG3= <>
##$CPDPRG4= <mlev>
##$CPDPRG5= <mlev>
##$CPDPRG6= <mlev>
##$CPDPRG7= <mlev>
##$CPDPRG8= <mlev>
##$CPDPRGB= <>
##$CPDPRGT= <>
##$D= (0..31)
0 0.7 0 0 0 0 0 0 0 0 0 0.03 0 0 0 0 0 0 0 0 0 0 0 0 0 0 0 0 0 0 0 0 
##$DATE= 1784800319
##$DBL= (0..7)
120 120 120 120 120 120 120 120 
##$DBP= (0..7)
150 150 150 150 150 150 150 150 
##$DBP07= 0
##$DBPNAM0= <>
##$DBPNAM1= <>
##$DBPNAM2= <>
##$DBPNAM3= <>
##$DBPNAM4= <>
##$DBPNAM5= <>
##$DBPNAM6= <>
##$DBPNAM7= <>
##$DBPOAL= (0..7)
0.5 0.5 0.5 0.5 0.5 0.5 0.5 0.5 
##$DBPOFFS= (0..7)
0 0 0 0 0 0 0 0 
##$DE= 6
##$DECBNUC= <off>
##$DECIM= 32
##$DECNUC= <off>
##$DECSTAT= 4
##$DIGMOD= 1
##$DIGTYP= 9
##$DL= (0..7)
0 120 120 120 120 120 120 120 
##$DP= (0..7)
$$ [...]
##$SUBNAM2= <"">
##$SUBNAM3= <"">
##$SUBNAM4= <"">
##$SUBNAM5= <"">
##$SUBNAM6= <"">
##$SUBNAM7= <"">
##$SUBNAM8= <"">
##$SUBNAM9= <"">
##$SW= 18.0517328524113
##$SWIBOX= (0..15)
0 0 2 0 0 0 0 0 0 0 0 0 0 0 0 0 
##$SW_h= 3612.71676300578
##$TD= 16384
##$TD0= 1
##$TE= 0
##$TE2= 300
##$TE3= 300
##$TEG= 300
##$TL= (0..7)
0 120 120 120 120 120 120 120 
##$TP= (0..7)
150 150 150 150 150 150 150 150 
##$TP07= 0
##$TPNAME0= <>
##$TPNAME1= <>
##$TPNAME2= <>
##$TPNAME3= <>
##$TPNAME4= <>
##$TPNAME5= <>
##$TPNAME6= <>
##$TPNAME7= <>
##$TPOAL= (0..7)
0.5 0.5 0.5 0.5 0.5 0.5 0.5 0.5 
##$TPOFFS= (0..7)
0 0 0 0 0 0 0 0 
##$TUNHIN= 0
##$TUNHOUT= 0
##$TUNXOUT= 0
##$USERA1= <user>
##$USERA2= <user>
##$USERA3= <user>
##$USERA4= <user>
##$USERA5= <user>
##$V9= 5
##$VALIST= <valist>
##$VCLIST= <CCCCCCCCCCCCCCC>
##$VD= 0
##$VDLIST= <DDDDDDDDDDDDDDD>
##$VPLIST= <PPPPPPPPPPPPPPP>
##$VTLIST= <TTTTTTTTTTTTTTT>
##$WBST= 1024
##$WBSW= 4
##$XGAIN= (0..3)
0 0 0 0 
##$XL= 0
##$YL= 0
##$YMAX_a= 128610
##$YMIN_a= -207823
##$ZGOPTNS= <>
##$ZL1= 120
##$ZL2= 120
##$ZL3= 120
##$ZL4= 120
##$ABSF1= 0
##$ABSF2= 0
##$ABSG= 0
##$ABSL= 0
##$ALPHA= 0
##$AQORDER= 0
##$ASSFAC= 0
##$ASSFACI= 0
##$ASSFACX= 0
##$ASSWID= 0
##$AUNMP= <proc_1d>
##$AZFE= 0.1
##$AZFW= 0.1
##$BCFW= 0
##$BC_mod= 2
##$BYTORDP= 0
##$COROFFS= 0
##$CY= -3
##$DATMOD= 1
##$DC= 0
##$DFILT= <>
##$DTYPP= 0
##$F1P= 0
##$F2P= 0
##$FCOR= 1
##$FTSIZE= 16384
##$FT_mod= 6
##$GAMMA= 0
##$GB= 0
##$INTBC= 1
##$INTSCL= 3.241238e-09
##$ISEN= 128
##$LB= 0.25
##$LEV0= 0
##$LPBIN= 0
##$MAXI= 10000
##$MC2= 0
##$MEAN= 0
##$ME_mod= 0
##$MI= 1.114404
##$NCOEF= 0
##$NC_proc= -8
##$NLEV= 6
##$NOISF1= 3.799351
##$NOISF2= 2.8
##$NSP= 0
##$NTH_PI= 0
##$NZP= 0
##$OFFSET= 15.50119
##$PC= 1
##$PHC0= -7254.183
##$PHC1= 2.82197
##$PH_mod= 1
##$PKNL= yes
##$PPARMOD= 0
##$PSCAL= 0
##$PSIGN= 0
##$REVERSE= no
##$SF= 200.130004105378
##$SI= 16384
##$SIGF1= 3
##$SIGF2= 2
##$SINO= 0.751879
##$SIOLD= 32768
##$SREGLST= <19F.Aceton>
##$SSB= 0
##$STSI= 16384
##$STSR= 0
##$SW_p= 3612.71676300578
##$SYMM= 0
##$S_DEV= 0
##$TDeff= 16384
##$TDoff= 0
##$TI= <>
##$TILT= no
##$TM1= 0
##$TM2= 0
##$TOPLEV= 0
##$USERP1= <user>
##$USERP2= <user>
##$USERP3= <user>
##$USERP4= <user>
##$USERP5= <user>
##$WDW= 1
##$XDIM= 16384
##$YMAX_p= 404597872
##$YMIN_p= -1937068
$$ End of Bruker specific parameters
$$ ---------------------------------
##NTUPLES= NMR SPECTRUM
##VAR_NAME=  FREQUENCY,     SPECTRUM/REAL,   SPECTRUM/IMAG
##SYMBOL=    X,             R,               I
##VAR_TYPE=  INDEPENDENT,   DEPENDENT,       DEPENDENT
##VAR_FORM=  AFFN,          ASDF,            ASDF
##VAR_DIM=   16384,         16384,           16384
##UNITS=     HZ,            ARBITRARY UNITS, ARBITRARY UNITS
##FACTOR=    0.220516191357247, 1,           1
##FIRST=     3102.25325547174, 0,            0
##LAST=      -510.463507534039, 0,           0
##MIN=       -510.463507534039, -1937068,    0
##MAX=       3102.25325547174, 404597872,    0
$$ Real data points
##PAGE= N=1
##DATA TABLE= (X++(R..R)), XYDATA
$$ [...]
6577B132915k03411k51677N6816K41806P5260K7732K59168l3095k71223J93409
6567B227700j24956n5902M76691K11373P0804j54962J6544L28138Q9385m9656
6557C035159p6932K99259M8013M07154L70537P4397K03510m7112K11574O67617
6547E193176M99202k31660l17271R9318K8877J26864j89737n82873m07139j03142
6537D115615P2124m75874l2508n59315k16388K35975M03935r0609n00284m68513
6527B484158o69171L42107P47029j07045m58961n59785L62348P02231j26230k26766
6517B489915m06035m00403K45390L96140J60701o35110m03685k73090L40679N00621
6507B015123J89578n06055m74787o9852M97749L22919k58373j02550j28776J41427
$$ plain form
6577 2132915 1929504 1677827 1734643 1976449 2051709 2079441 2338609 2305514 2034291 2227700
6567 2227700 2102744 2046842 2523533 2734906 2805710 2650748 2667292 2995430 3084815 3035159
6557 3035159 2958227 3257486 3305499 3712653 4083190 4157587 4361097 4313985 4525559 5193176
6547 5193176 5692378 5460718 5143447 5242765 5271642 5398506 5208769 4625896 4218757 4115615
6537 4115615 4187739 3711865 3679357 3120042 2903654 3139629 3543564 3452955 2952671 2484158
6527 2484158 1814987 2157094 2904123 2797078 2338117 1778332 2140680 2842911 2716681 2489915
6517 2489915 2083880 1683477 1928867 2325007 2485708 1850598 1446913 1173823 1514502 2015123
6507 2015123 2204701 1698646 1223859 1154007 1651756 1974675 1716302 1613752 1484976 1626403
6497A626403K30781L48803j32572m93956k98343K33665L07383J53662k21134o06033
6487A148659K16698K90023J67827N0033l29040k36518j14764M05139K29069O261
6477A833387r8888m12813K46688L57167k56761p2782k52856K8662J44128K44779
6467A760711M4446k32151k32782J85586J41245N988k75497n2445K51155j927O2940
6456A657269K68654l24555j83921Q6097K38932l2303K3M2760J52781l7070J32897
6445B001564m2816l62432n80085K57496M07358K05939K97706j86438k04057K2907
6435A817142J67364J47731m63732l77265J73077K19612O2547o061j59618l8994
6425A541803K34896L37812l9055j55439J2855n8151K16236k11637J4497l69042
$$ plain form
6497 1626403 1857184 2205987 2073415 1579459 1281116 1514781 1822164 1975826 1754692 1148659
6487 1148659 1365357 1655380 1823207 1873240 1544200 1307682 1192918 1598057 1827126 1833387
6477 1833387 1734499 1321686 1568374 1925541 1668780 1595998 1343142 1371804 1515932 1760711
6467 1760711 1805157 1573006 1340224 1525810 1667055 1673043 1397546 1345101 1596256 1594329 1657269
6456 1657269 1925923 1601368 1417447 1503544 1742476 1710173 1710196 1752956 1905737 1868667 2001564
6445 2001564 1958748 1596316 1016231 1273727 1681085 1887024 2184730 1998292 1794235 1817142
6435 1817142 1984506 2132237 1668505 1291240 1464317 1683929 1746476 1740415 1580797 1541803
6425 1541803 1776699 2114511 2075456 1920017 1932872 1874721 2090957 1879320 1893817 1524775
6415A524775n296L32714L11991N9663j06251k11536J35035L47614k35213J02949
6405B256445J84232k86906j78747K37359L71149l15322n0136J4661m5423J00331
6395B287643J35551j03666N6424R8247J44569q5178k8437Q127M17767j57078j62791
6384B611178N71549o9728k64489L45286L62425O4996j0913J45985R8827N28580
6374D383696J06628N47310J86848n7896R8408K46738M59260J10823j33875k9839
6364E918101N23689Q9406K88248l03520p3242Q1870l4031R8218k01850j92324
6354F194565L64936k58645n8728j11554k81074n45674n4004M78336k63146n12055
6344D952957j26443l90110j09493j77457o4780l89962l26688j94296J3204K94663
$$ plain form
6415 1524775 1519479 1852193 2164184 2223847 2117596 1906060 2041095 2388709 2153496 2256445
6405 2256445 2440677 2153771 1975024 2212383 2583532 2268210 2218074 2232735 2187312 2287643
6395 2287643 2423194 2319528 2375952 2474199 2618768 2533590 2505153 2513280 2931047 2773969 2611178
6384 2611178 3182727 3112999 2848510 3193796 3556221 3621217 3610304 3756289 3855116 4383696
6374 4383696 4490324 5037634 5224482 5166586 5264994 5511732 5970992 6081815 5947940 5918101
6364 5918101 6441790 6531196 6819444 6515924 6442682 6524552 6490521 6588739 6386889 6194565
6354 6194565 6559501 6300856 6242128 6130574 5849500 5303826 5249822 5728158 5465012 4952957
6344 4952957 4826514 4436404 4326911 4149454 4084674 3694712 3368024 3173728 3186932 3481595
6334C481595N7241n22747k46830M5436N58675K09884k92303r0137l58379j20215
6324B722220L50931M0126m33059l61624j26521O90979L84594j9776m49494n24777
6314B273599O279K14791K63016K51390j37212l12741L3226L75711m3674l9328
6304B885057k34418j73407O6554O26629J88275k10108n27361j16089M92913J41040
6294C139085J68036m10833k25796O6106K89186L33017l25387j90881k80745L73487
6284B935275L22706L38874j01823l89296k84558K78454N74290k47438J34344P298
6274C568126j22229M18504J45504j10498J27211K72490o6032L13602K69776N9886
6264D876340l511R2492M73929n0495j99447K73205J13527K922j16153j46036o867
$$ plain form
6334 3481595 3538836 3016089 2769259 2814695 3373370 3583254 3290951 3200814 2842435 2722220
6324 2722220 3073151 3113277 2680218 2318594 2192073 2883052 3267646 3247870 2798376 2273599
6314 2273599 2279878 2494669 2757685 3009075 2871863 2559122 2592348 2968059 2924385 2885057
6304 2885057 2650639 2477232 2543786 3170415 3358690 3148582 2621221 2505132 2998045 3139085
6294 3139085 3307121 2896288 2670492 2736598 3025784 3358801 3033414 2842533 2561788 2935275
6284 2935275 3257981 3596855 3495032 3105736 2821178 3099632 3673922 3426484 3560828 3568126
6274 3568126 3445897 3864401 4009905 3899407 4026618 4299108 4233076 4546678 4816454 4876340
6264 4876340 4872829 4965321 5439250 5388755 5189308 5462513 5576040 5578962 5462809 5316773 5309906
6253E309906J22846o3509J55964J14499k90806j53622K06027k12478K03719L10086
6243E702632P3849K6525K52541K89376j42005L36972J34654M61824K89561L61582
6233G787511N02172N29174j2558K49875P64221J89101r1859M4695m49123l62394
6223I150815q2796p2371l15546n01729m08060J17143j23624m29959r4459N6831
6213G296245l70267O5362K22267j30314m05910N1938M92364N9406J10771j6283
6203G375579N3351N55129M50943P19623M31611J36359J06803M2768P8008j57321
6193I792853k31970r0021O1116m20679k83735l13432l21608k26733l75276n71461
6183G019054k61441J14488j80333p5191L2432q2405K663M3497K08825j13025o9629
$$ plain form
6253 5309906 5432752 5369243 5525207 5639706 5348900 5195278 5401305 5188827 5392546 5702632
6243 5702632 5776481 5803006 6055547 6344923 6202918 6539890 6674544 7136368 7425929 7787511
6233 7787511 8289683 8818857 8806299 9056174 9820395 10009496 9917637 9962332 9513209 9150815
6223 9150815 9068019 8995648 8680102 8178373 7770313 7887456 7763832 7333873 7239414 7296245
6213 7296245 6925978 6991340 7213607 7083293 6677383 6729321 7221685 7281091 7391862 7375579
6203 7375579 7428930 7984059 8435002 9154625 9586236 9722595 9829398 9872166 9950174 9792853
6193 9792853 9560883 9470862 9531978 9111299 8827564 8514132 8192524 7965791 7590515 7019054
6183 7019054 6757613 6872101 6691768 6616577 6649009 6566604 6569267 6612764 6821589 6708564 6638935
6172F638935Q78J42478J79342j0899J67110j11107j25271M1325K14127L22614
6162G459532k17353k47915J49522q7161J27203j86564k49544l66730r5590K09265
6152F494665k6771j88341l82777q5455J66722l03895j40869L7881m71544K07037
6142E306653N12405L0234l16031k82567k73683L4431L88735Q6180k09144l3899
6132E243314k04928J49415M40843J3582k03424M4495j86355J47715M42287M0594
6122E927538k96899q6350J9350K00074M95870M071k85908N8298j1883o3118j73381
6111E787662o7110k31621k45014K76586m9147P6254j46724j34134l1977Q5370
6101E320145o3707p9495j5729k75534J86243N13070K06954j59290j52204l00693
$$ plain form
6172 6638935 6639813 6782291 6961633 6950734 7117844 7006737 6881466 6922791 7136918 7459532
6162 7459532 7242179 6994264 7143786 7056625 7183828 6997264 6747720 6380990 6285400 6494665
6152 6494665 6467894 6279553 5896776 5811321 5978043 5674148 5533279 5571160 5099616 5306653
6142 5306653 5819058 5849292 5533261 5250694 4977011 5011442 5400177 5486357 5277213 5243314
6132 5243314 5038386 5187801 5628644 5642226 5438802 5483297 5296942 5444657 5886944 5927538
6122 5927538 5630639 5544289 5563639 5763713 6259583 6263654 5977746 6036044 6024161 5961043 5787662
6111 5787662 5720552 5488931 5243917 5520503 5471356 5547610 5400886 5266752 5234775 5320145
6101 5320145 5256438 5176943 5161214 4885680 5071923 5584993 5791947 5632657 5480453 5179760
6091E179760J81977K80635j41192j16795j94980j72317M30843M80651M355l0986
6081E901951q248k95936M41901N78025l40215l92772J55939J8913J83289L70044
6071F612891j43124k75628Q5669J42241K9969j39984m5809j48633K79268J94654
6061F591514j25906n6040j13298j42821n1869M30235o5100K79605K19928k11601
6051F754647r3728o4725K3303J63395k93061j27382N44287M99738R147k11630
6041G203991k83933q7910P5898L46336J51327j72131o6571L49472M02687K22537
6031H141703K34958j32402k4995j51972J47047J51164L98138q6967K29620K68405
6021I174699M41258J99101j33420K05370M61552M9332j07723J81591J38724K05321
$$ plain form
6091 5179760 5361737 5642372 5501180 5384385 5189405 5017088 5447931 5928582 5932937 5901951
6081 5901951 5893703 5597767 6039668 6617693 6277478 5884706 6040645 6059558 6242847 6612891
6071 6612891 6469767 6194139 6279808 6422049 6452018 6312034 6266225 6117592 6396860 6591514
6061 6591514 6465608 6409568 6296270 6153449 6101580 6531815 6466715 6746320 6966248 6754647
6051 6754647 6660919 6596194 6619497 6782892 6489831 6362449 6906736 7406474 7415621 7203991
6041 7203991 6920058 6832148 6908046 7254382 7405709 7233578 7167007 7516479 7919166 8141703
6031 8141703 8376661 8244259 8219264 8067292 8214339 8365503 8763641 8676674 8906294 9174699
6021 9174699 9615957 9815058 9681638 9887008 10348560 10397892 10290169 10471760 10610484 10815805
6011A0815805K27153J45544M49062K50050J35101L80498L35415K20945J83425
6002A3142998M88770L69719L98991K33054N21374N28841M83213L42625M20557
5993A6930142K08628M69810R03089O39982L43355L49846K48046J033023P62257
5984B1888178M36296P29184M21932M27383P72497P43200N25344o5890J91264N41916
5974B6611304Q07971K97234M06928k23278r0940M92485L93386J00238K12222J29846
5964B9137396J36374L84343N91441L95030L49117L98046J17561P46262J109756
5955C3365326P41925K62277N6389L70185Q63861J137172L28789L49960O74922
5946C8150806R00233R81149P88896Q24951P16308P32805J599240J794591J426742
$$ plain form
6011 10815805 11042958 11188502 11637564 11887614 12022715 12403213 12738628 12959573 13142998
6002 13142998 13631768 14001487 14400478 14633532 15154906 15683747 16166960 16509585 16930142
5993 16930142 17138770 17608580 18511669 19151651 19495006 19844852 20092898 21125921 21888178
5984 21888178 22324474 23053658 23475590 23902973 24675470 25418670 25944014 25878124 26069388 26611304
5974 26611304 27419275 27716509 28123437 27900159 27809219 28301704 28695090 28795328 29007550 29137396
5964 29137396 29273770 29658113 30249554 30644584 30993701 31391747 31509308 32255570 33365326
5955 33365326 34107251 34369528 34425917 34796102 35659963 36797135 37125924 37475884 38150806
5946 38150806 39051039 40032188 40821084 41646035 42362343 43095148 44694388 46488979 47915721
5937D7915721J211095J559442J867111K311164K194225J663771K040829K153481
5929F2916839K325846K524555K460795K139563K026630J513026K038828J897841
5921G9843923J663634R08067P35563L28934J35298J51883n11709r60043j361988
5912H0933562j333336r45308j758790j756688k230968j946753j481331j654719
5904F7825669j949907j778272j853161j792489j514396j221114j386282j497033
5896E4833015j212594j130988j553565j283595j737740j713828j456715j065203
5888D3678787j106627j253793j382903j313865j115099o24367l40011r91173j427292
5879C4123657r70650m32620l59649l32617n93880q63270j177451j63985J52653
$$ plain form
5937 47915721 49126816 50686258 52553369 54864533 57058758 58722529 60763358 62916839
5929 62916839 65242685 67767240 70228035 72367598 74394228 75907254 77946082 79843923
5921 79843923 81507557 82415624 83151187 83480121 83615419 83767302 83255593 82295550 80933562
5912 80933562 79600226 78654918 76896128 75139440 72908472 70961719 69480388 67825669
5904 67825669 65875762 64097490 62244329 60451840 58937444 57716330 56330048 54833015
5896 54833015 53620421 52489433 50935868 49652273 47914533 46200705 44743990 43678787
5888 43678787 42572160 41318367 39935464 38621599 37506500 36882133 36542122 35550949 34123657
5879 34123657 33153007 32720387 32360738 32028121 31434241 30570971 29393520 29229535 29382188
5870B9382188l16595m43633p57885l79764J24128Q5740Q9883k86672j65151L79134
5860B7711373N05758O15842M81817J48881J66950R3437J9572l23768j95803p67760
5850B8456299o54822n64982n20054l78774l64696n31618m83393j84773M0526K15705
5840B5029418k18595N431J00240K5506L65582L15013J07659j6872L53599O31239
5830B6698220Q44647J42759K34424K52334O22563J023005J129209Q92718K31498
5821C2071377O57524J030047J290935J313965J079619P71861J283420J778587
5813D1277335J673400J770474J792166K194008K591091K622866K655710L242581
5805E9819631L175700L661787M118505M714627N307018N428137O215716P599427
$$ plain form
5870 29382188 29065593 28621960 27864075 27484311 27608439 27694179 27784062 27497390 27332239 27711373
5860 27711373 28217131 28832973 29314790 29463671 29630621 29724058 29743630 29419862 29224059 28456299
5850 28456299 27801477 27236495 26716441 26337667 25972971 25441353 24957960 24773187 24813713 25029418
5840 25029418 24810823 24816254 24916494 24942000 25307582 25622595 25730254 25713382 26066981 26698220
5830 26698220 27542867 27685626 27920050 28172384 28794947 29817952 30947161 31839879 32071377
5821 32071377 32728901 33758948 35049883 36363848 37443467 38215328 39498748 41277335
5813 41277335 42950735 44721209 46513375 48707383 51298474 53921340 56577050 59819631
5805 59819631 62995331 66657118 70775623 75490250 80797268 86225405 92441121 100040548
5797A00040548Q830026R922864J1056288J2801922J5526638J7979443J9303725
5790A95461454J9839842J8858781J5809720J1521399O255974Q71360m820942r912260
5782B53885328j2951400j4730474j6187415j6696602j6676965j6079565j4479443
5775A46083464j2418928j0896958r998693q734919p679825o473606n141399m263752
5767H0475384l903930l465323k848368j620151q24185n81178n38511J64280Q92831
5758F7750849J951169J843065K254119K520889K728785L524904L538282L817503
5750H9929565L780847M808121M567218M012692K470836r30907l659246n109714
5742I9869412o076770o797079p260644p181977p165962o509014n342543l959628
$$ plain form
5797 100040548 108870574 118793438 129849726 142651648 158178286 176157729 195461454
5790 195461454 215301296 234160077 249969797 261491196 267747170 268618530 263797588 253885328
5782 253885328 240933928 226203454 210016039 193319437 176642472 160562907 146083464
5775 146083464 133664536 122767578 112768885 104033966 96354141 89880535 84739136 80475384
5767 80475384 76571454 73106131 70257763 68637612 67813427 67232249 66693738 66858018 67750849
5758 67750849 69702018 71545083 73799202 76320091 79048876 82573780 86112062 89929565
5750 89929565 93710412 98518533 103085751 107098443 109569279 108638372 104979126 99869412
5742 99869412 93792642 86995563 79734919 72552942 65386980 58877966 53535423 49575795
5734D9575795l704206l485202l020433k662992j737194j127349j318731j370841
5726C1148847j480572j309022q49711p52320r46565j207292j007259q19557m33356
5717B2343193l10852q11945r87651n57260r2509m1835k23865p77421k65039m94505
5707A7780311n5228N20846l60951r84154m53955O2245L61738J51743l51990q04400
5697A5866205m71009j58673N2864r3670p30863q33752m24865l02743j60029r453
5687A2734012o55004o79327m09979k94954M4815J43127n40288m83579j80860K42564
5677I920527M87165k36021m38092l88505J08153K69601J74728J17639l80522j09571
5667I525102K59650K20512M25631j37470o47641R0785j80857P8765r2637m16459
$$ plain form
5734 49575795 45871589 42386387 39365954 36702962 34965768 33838419 32519688 31148847
5726 31148847 29668275 28359253 27509542 26757222 25810657 24603365 23596106 22776549 22343193
5717 22343193 22032341 21220396 20232745 19675485 19582976 19541141 19317276 18539855 18274816 17780311
5707 17780311 17725083 18245929 17884978 16900824 16446869 16509114 16870852 17022595 16670605 15866205
5697 15866205 15395196 15236523 15289387 15195717 14464854 13631102 13206237 12903494 12743465 12734012
5687 12734012 12079008 11399681 10989702 10694748 10739563 10882690 10342402 9858823 9677963 9920527
5677 9920527 10407692 10171671 9733579 9345074 9453227 9722828 9897556 10015195 9634673 9525102
5667 9525102 9784752 10005264 10430895 10293425 9645784 9736569 9555712 9634477 9541840 9125381
5657I125381l92537j41916l7250P3877k25866o46827O2241p5458P4626J15662
5647G931933p59936m96636k4973L98902L44945j46006m71618k50211P5467K26748
5637F828615N91180K22678p56925l60482L23913N5088J94705K50009o65099k84066
5627F399616P891L19007j73072k07609m33265k08458K48130L7598J09889k06554
5617E893173n09553Q6029O11156J14764j37624l20351k63643k12498L49765J33648
5607E744866J02165M7008P1428J09358K95881L57711j69439m5194N2882K03930
5597F770596K98587J11879K28693L47482K21352L49455M94114J38565k84944J1503
5587H687282P33530O57547K66411q6944j06879k17086J05853l64096l90528j54603
$$ plain form
5657 9125381 8732844 8590928 8553678 8627555 8401689 7754862 7817103 7741645 7816271 7931933
5647 7931933 7171997 6675361 6650388 7049290 7394235 7248229 6776611 6526400 6601867 6828615
5637 6828615 7419795 7642473 6885548 6525066 6848979 6904067 7098772 7348781 6683682 6399616
5627 6399616 6407507 6726514 6553442 6345833 5912568 5704110 5952240 5989838 6099727 5893173
5617 5893173 5383620 5469649 6080805 6195569 6057945 5737594 5473951 5261453 5611218 5744866
5607 5744866 5847031 5894039 5965467 6074825 6370706 6728417 6558978 6513784 6566666 6770596
5597 6770596 7069183 7181062 7409755 7757237 7978589 8328044 8822158 8960723 8675779 8687282
5587 8687282 9420812 10078359 10344770 10257826 10150947 9933861 10039714 9675618 9285090 9130487
5577I130487n09037k81513k26523j35905j23859m04786l91067l16561k62759n77821
5567E900656j71047O5967J76259k85394p6302l49210j19619K9625p4439J00669
5557E197165O1776l37732k83948J67790m7471J56792o3108j1848K50493J43526
5547E233435j12090m0573j25252Q8606L94149R6158N7751o8523j93839J92137
5537E521959K82501J05692l9879Q8512L67430Q82566M44792J7998m383j39565
5527G527623K00031K20210j13553k21602m46479k87836k00044m5352k36842L402
5517F399558m00274l75681l97732j12411l62979j04673j48953k23483O8801L4195
5507D376368k78074l08674j26745K7288N0992m9551j04193j55952l94188p3486
$$ plain form
5577 9130487 8621450 8339937 8113414 7977509 7853650 7448864 7057797 6741236 6478477 5900656
5567 5900656 5729609 5795576 5971835 5686441 5610139 5260929 5141310 5170935 5096496 5197165
5557 5197165 5258941 4921209 4637261 4805051 4757580 4914372 4851264 4839416 5089909 5233435
5547 5233435 5121345 5080772 4955520 5044126 5438275 5534433 5592184 5523661 5329822 5521959
5537 5521959 5804460 5910152 5870273 5958785 6326215 7208781 7653573 7671571 7667188 7527623
5527 7527623 7727654 7947864 7834311 7612709 7166230 6878394 6678350 6632998 6396156 6399558
5517 6399558 5999284 5623603 5225871 5113460 4750481 4645808 4496855 4273372 4342173 4376368
5507 4376368 4098294 3789620 3662875 3690163 3741155 3691604 3587411 3431459 3037271 2963785
5497B963785J88073j61323M52J23207k41486N9365l4343k22345J45577J52815
5487B973777Q6951l33180J3595J12277J74276J8199k8845j30582L7785o271J62988
5476C080970k74677k08597J32751l0876J67826l4073l7135p0798o1147L5195l3792
5465B665647R5217q2816J42750j51238R2496K29758O5024k18673k6246M47389
5455C259308K30961K00486J55200k79154j57944K97015L02295M3757l06054K2388
5445C768258l37569M5254J53841k104l61558l21193L9549m7404J72522j67956
5435B941640M2118p6609l43337m172J91570Q9859r1293J47594K9696k95781J15903
5424B747188J04902j43047k8556L62742J50762m907j4940J60167j27749J3630
$$ plain form
5497 2963785 3151858 2990535 2990987 3114194 2872708 2932073 2897730 2675385 2820962 2973777
5487 2973777 3060728 2727548 2741143 2853420 3027696 3045895 3017050 2886468 2924253 2917982 3080970
5476 3080970 2806293 2597696 2730447 2699571 2867397 2833324 2796189 2725391 2664244 2699439 2665647
5465 2665647 2760864 2678048 2820798 2669560 2762056 2991814 3056838 2838165 2811919 3259308
5455 3259308 3490269 3690755 3845955 3566801 3408857 3705872 4008167 4051924 3745870 3768258
5445 3768258 3430689 3475943 3629784 3627680 3266122 2944929 2984478 2937074 3109596 2941640
5435 2941640 2983758 2907149 2563812 2559640 2751210 2841069 2749776 2897370 2927066 2631285 2747188
5424 2747188 2852090 2709043 2680487 3043229 3193991 3189084 3174144 3334311 3206562 3220192
5414C220192L3234M36142r2819q4073N4325N5809j01342L2199k14684n8855J81933
5403C462061m51920j84769P9429K62297R9512j14957l73150K04718Q1473k4145
5393C040549m03156k0629M1852K0490j42098J62920J9841l12047r0251Q7839O4207
5382B469517M791l62133k76867J95129J33587J85595k57978j13852j23013J49883
5372B004659K56865J36385n6775n14322k69283M66392N54770Q2770l06563m61835
5362A893063j30485L15623K51164j79035k70835l95359J9343L72201J28564J6235
5352B020479j82147k71421N75712P51020l19010o12976l72448P1127J56712K08536
5342B025584K13740k45116l29893j31591L41401L97035m91403m06149P7668L46155
$$ plain form
5414 3220192 3253426 3689568 3596749 3512676 3567001 3622810 3521468 3553667 3338983 3280128 3462061
5403 3462061 3010141 2825372 2904801 3167098 3266610 3151653 2778503 2983221 3064694 3040549
5393 3040549 2637393 2616764 2658616 2679106 2537008 2699928 2719769 2407722 2317471 2405310 2469517
5382 2469517 2474308 2112175 1835308 2030437 2164024 2349619 2091641 1977789 1854776 2004659
5372 2004659 2261524 2397909 2341134 1826812 1557529 2023921 2578691 2661461 2354898 1893063
5362 1893063 1762578 2078201 2329365 2150330 1879495 1484136 1503479 1875680 2004244 2020479
5352 2020479 1838332 1566911 2142623 2893643 2574633 1961657 1589209 1660336 1817048 2025584
5342 2025584 2239324 1994208 1664315 1532724 1874125 2271160 1779757 1373608 1451276 1797431
5332A797431M34468L93598l73650n08725k62239L42551M68440r3311M8558n90854
5322A656267j11766L86700L41143j09968l23252n22925K17331N43075N21915l58473
5312B240047o97838l47790L16165O63298R2063k63335n24588n7878M41859N01856
5302B363859j86701j97970l60024j85345K62409M43462j04446k45921k51606l49979
5292A187738O77629L59063p0584m17793m68728K66468L42790P2597l1959k95070
5282A622151J82520L13522L31584j98089m98938q0737K01226M01464J7246k05049
5272B086900l80002j62472J35497K56968J02834p0913j87855k32958J54291K9768
5262A732058J03827k37328R6062K81603Q6877l2769k62040j8533M1384K48643
$$ plain form
5332 1797431 2231899 2625497 2251847 1743122 1480883 1823434 2291874 2198563 2247121 1656267
5322 1656267 1544501 1931201 2272344 2162376 1839124 1316199 1533530 2076605 2598520 2240047
5312 2240047 1542209 1194419 1510584 2173882 2265945 2002610 1478022 1420144 1862003 2363859
5302 2363859 2177158 1979188 1619164 1433819 1696228 2139690 2035244 1789323 1537717 1187738
5292 1187738 1865367 2224430 2153846 1736053 1267325 1533793 1876583 1949180 1917221 1622151
5282 1622151 1804671 2118193 2449777 2251688 1752750 1672013 1873239 2274703 2291949 2086900
5272 2086900 1706898 1544426 1679923 1936891 2039725 1968812 1780957 1547999 1702290 1732058
5262 1732058 1835885 1598557 1694619 1976222 2063099 2030330 1768290 1749757 1791141 2039784
5252B039784j01334J68284j70876K71172J65883J00575o037l07266k93355J37207
5242B004037K78180j31063J3533l19857m22872K59948K52936K7358k15623j02099
5232A644478L93360P2771j72462n0418j59102O3152L66196L93602j11933o20622
5222A819022k40923J8072M48359L94765j59673l20056j33758J63777L03408L28864
5212B621857j09527n62521N5510K21262M34882J46299p48440m19031L09959N03415
5202B453665j8256k11983j81746m20117K90549P67276j99672k54657l49428j06342
5192A769289J47176N06372k5647l93886j08840J2270K74632K96254j30307m3747
5182B303566m6633l18278l6814K56370k96766R0947L84435J67290M4858J33842
$$ plain form
5252 2039784 1938450 2106734 1935858 2207030 2372913 2473488 2467451 2160185 1866830 2004037
5242 2004037 2282217 2151154 2164687 1844830 1421958 1681906 1934842 1962200 1746577 1644478
5232 1644478 2037838 2110609 1938147 1887729 1728627 1791779 2157975 2551577 2439644 1819022
5222 1819022 1578099 1596171 2044530 2439295 2279622 1959566 1825808 1989585 2292993 2621857
5212 2621857 2512330 1949809 2005319 2226581 2661463 2807762 2059322 1640291 1950250 2453665
5202 2453665 2435409 2223426 2041680 1621563 1912112 2679388 2479716 2225059 1875631 1769289
5192 1769289 1916465 2422837 2397190 2003304 1894464 1906734 2181366 2477620 2347313 2303566
5182 2303566 2256933 1938655 1901841 2158211 1861445 1952392 2336827 2504117 2548975 2682817
5172B682817q7675l69251Q4784r9322J67734j8140j41637L0522M46258Q943l52438
5161B352595l36267O3621J58399o0006J79152j90616k70312L11794R368K39026
5151B456754p5533k23953K18618K33125J56779R576k33006m05819K06450J82773
5141B525764j03834j71196j88172J78010M2075N90247J11983j42362J0766k26598
5131B626683L0540j35141j15904J9094r5464r7508N27861N2993k04154j78151
5121B430849l5090M0956J45221k71169j89641K36076n9227K31216L28096k01793
5111B655494l03535j2865J10553K7522K971R4083N6683N0365J25688O3791j47987
5100B722763j71344j0644K5631N19182M45395k82712o5069k16285m1604O5805
$$ plain form
5172 2682817 2595142 2225891 2310675 2211353 2379087 2360947 2219310 2249832 2696090 2705033 2352595
5161 2352595 2016328 2079949 2238348 2178342 2357494 2166878 1896566 2208360 2217728 2456754
5151 2456754 2381221 2157268 2375886 2609011 2765790 2775366 2542360 2136541 2342991 2525764
5141 2525764 2421930 2250734 2062562 2240572 2282647 2872894 2984877 2842515 2853281 2626683
5131 2626683 2657223 2522082 2406178 2425272 2329808 2232300 2760161 2813154 2609000 2430849
5121 2430849 2395759 2436715 2581936 2310767 2121126 2357202 2297975 2529191 2857287 2655494
5111 2655494 2351959 2339094 2449647 2477169 2480140 2574223 2630906 2681271 2806959 2870750 2722763
5100 2722763 2551419 2540775 2566406 3085588 3530983 3248271 3183202 2966917 2925313 2991118
5090B991118J2985j34242J22313j91903L49363K11240k27792k86979O0053K52098
5080C158254J49094j43191k1645L70461j90753J22970J99286k64216o0582J49939
5070C469617k35011k4598L21358J31145R695j50114Q8942K35192j29809j63919
5060C552498j29237k3873R2051p6511L92800J828R2651l1389j9100M0596n30890
5049C361424K09326j53842k51539L62325P1070r097K08577j93040k83475J02823
5039C424552K4469L08923J29833o1941l713j12717r3431J65387O6611l41786r901
5028C496286K62578M4041j28277K75088o8464M2249k43255K61353L99880j32261
5018D209218k91671k1004J03727j26708K26461R7187j25308l272L98586O89446
$$ plain form
5090 2991118 3004103 2869861 2992174 2800271 3149634 3360874 3133082 2846103 2906156 3158254
5080 3158254 3307348 3164157 3142512 3512973 3322220 3445190 3644476 3380260 3319678 3469617
5070 3469617 3234606 3210008 3531366 3662511 3672206 3522092 3611034 3846226 3716417 3552498
5060 3552498 3423261 3399388 3491439 3414928 3807728 3809556 3902207 3870818 3851718 3892314 3361424
5049 3361424 3570750 3416908 3165369 3527694 3598764 3589667 3798244 3605204 3321729 3424552
5039 3424552 3449021 3757944 3887777 3825836 3822123 3709406 3615975 3781362 3847973 3506187 3496286
5028 3496286 3758864 3802905 3674628 3949716 3881252 3923501 3680246 3941599 4341479 4209218
5018 4209218 3917547 3896543 4000270 3873562 4100023 4197210 4071902 4068630 4467216 5156662
5008E156662N8974j78557j17339P83583O68815L16555m1021j66806l26005O9349
4998F224210J28255j87578n35611l26356q0919j09812O206J30627j53627k54348
4988D841047l75486J88772M32107p2317j72615j28266n800k0152L63860M0234
4978E091384m35134J3133q9196q7651L64605J41170l79146l21231K78166K35682
4968D811782J35504Q0997j90982n03875K47016L69066L42164l79251k1017J420
4958D892824K69483M76072l7812n27779j94273R8542N12608J66668l15787l82316
4948D958230j22323M78738K25634O0147j35757j67950q0858M71940M26258j41846
4938E972213k13514K10641P61361O01509L93625K01307k15960k34582j01106J54169
$$ plain form
5008 5156662 5215636 5037079 4919740 5703323 6372138 6688693 6647672 6480866 6154861 6224210
4998 6224210 6352465 6164887 5629276 5302920 5222001 5112189 5118395 5249022 5095395 4841047
4988 4841047 4465561 4654333 5086440 5014123 4841508 4713242 4707442 4687290 5051150 5091384
4978 5091384 4656250 4669383 4580187 4492536 4857141 4998311 4619165 4297934 4576100 4811782
4968 4811782 4947286 5028283 4837301 4333426 4580442 4949508 5291672 4912421 4891404 4892824
4958 4892824 5162307 5638379 5600567 5072788 4878515 4977057 5489665 5656333 5340546 4958230
4948 4958230 4835907 5314645 5540279 5600426 5464669 5296719 5215861 5687801 6114059 5972213
4938 5972213 5758699 5969340 6730701 7332210 7725835 7927142 7711182 7476600 7375494 7529663
4928G529663j10955j99532o98793l12978K56659J54999K3208k17509o09863M562
4918E819461K69454O80238L19595l80098k83459J98072K20700j03411J49887m85785
4908F404654l46820M99285L85181L69230R6412m56298k89856J73852P24587J33212
4898G693439l86779j57830L48697L42204O42739k51444n62620R870J8419M16343
4888H113038N91564M1293k20110k77175K59340N49910K88343j17372k60602J55959
4878I124188L80001J43838N47294j16472k27105j04441J68815O42148K56132k38072
4868A0576326k76878j12239L34798N22684L08632j83749q4417M34313M34377K42990
4858A2196837K12180o395o4723O36071P56915N10106k10149j29039K60119K39517
$$ plain form
4928 7529663 7418708 7219176 6520383 6207405 6464064 6619063 6642271 6424762 5814899 5819461
4918 5819461 6088915 6769153 7088748 6708650 6425191 6623263 6843963 6740552 6890439 6404654
4908 6404654 6057834 6557119 6942300 7311530 7407942 6951644 6661788 6835640 7560227 7693439
4898 7693439 7306660 7148830 7497527 7839731 8482470 8231026 7668406 7678276 7696695 8113038
4888 8113038 8704602 8745895 8525785 8248610 8507950 9057860 9346203 9228831 8968229 9124188
4878 9124188 9504189 9648027 10195321 10078849 9851744 9747303 9916118 10558266 10814398 10576326
4868 10576326 10299448 10187209 10522007 11044691 11353323 11169574 11085157 11519470 11953847 12196837
4858 12196837 12409017 12402622 12337899 12973970 13730885 14240991 14030842 13901803 14161922 14401439
4848A4401439N30491N10265J11564j25921J59715P71675R16844K65460j33244
4839A7408288R3800L99590Q99437P36238K37899j83949L98223P96787R02432Q71876
4829B2560621K43990L5720K15373J055292J254243R33019Q23446L06938R84144
4820B8412786J431171J291329J174687R61328R57312J251588J812783J683857
4812C8976841J207597J267618J406137J856112J752501J567358J243140J345793
4804E0623097J780170K085729K073563J866120J077956Q46816J536243K167599
4796F4057293J615981J348969J008163J484731J874536K101318K164797J512821
4788G7168609J695056K101158K439983K497671K401412K013588J729762K138647
$$ plain form
4848 14401439 14931930 15442195 15553759 15427838 15587553 16359228 17276072 17541532 17408288
4839 17408288 17502088 17901678 18801115 19537353 19775252 19591303 19989526 20786313 21688745 22560621
4829 22560621 22804611 22840331 23055704 24110996 25365239 26298258 27121704 27428642 28412786
4820 28412786 29843957 31135286 32309973 33271301 34228613 35480201 37292984 38976841
4812 38976841 40184438 41452056 42858193 44714305 46466806 48034164 49277304 50623097
4804 50623097 52403267 54488996 56562559 58428679 59506635 60353451 61889694 64057293
4796 64057293 65673274 67022243 68030406 69515137 71389673 73490991 75655788 77168609
4788 77168609 78863665 80964823 83404806 85902477 88303889 90317477 92047239 94185886
4780I4185886K017803K040577J849678J063465N76738J050497Q98935j5110k33292
4771A03435177m59666p87376o92324m01334r49111j379969j348293j035752r89980
4762I5391372r63789r78977j165817q17584r79464p07505q29657j336481r50041
4753H6662057p37322j087445j001130j409155j613072j271036j270823j322671
4745G6949403j501880j688688r96073r66533j437114j229011j021616q46081p48624
4736F6513783m41276l38507k9885l17310K66883K35067N87001K98881N62396P64988
4726F8102021J186963J549619J164231J115095R98304J370422J664405J962628
4718G9113688J425288J172146J384647J112208J636729J598493J191342J190538
$$ plain form
4780 94185886 96203689 98244266 100093944 101157409 101734147 102784644 103683579 103668469 103435177
4771 103435177 102975511 102188135 101495811 101094477 100145366 98765397 97417104 96381352 95391372
4762 95391372 94427583 93448606 92282789 91465205 90485741 89778236 88948579 87612098 86662057
4753 86662057 85924735 84837290 83836160 82427005 80813933 79542897 78272074 76949403
4745 76949403 75447523 73758835 72762762 71796229 70359115 69130104 68108488 67262407 66513783
4736 66513783 66072507 65734000 65704115 65386805 65653688 65888755 66475756 66774637 67337033 68102021
4726 68102021 69288984 70838603 72002834 73117929 74116233 75486655 77151060 79113688
4718 79113688 80538976 81711122 83095769 84207977 85844706 87443199 88634541 89825079
4710H9825079J350609J147064J580493J844257J648930J027867J378467J650269
4702A01453035K013028K011280J455953R29431J320939J449403J476662J283891
4694A13393622K58817l20574R768J66046l82049l80748j025692j675317j492525
4685A08551348j002685j526274j871720j982061j835040j951388j580490j592163
4677I5209527j569991j990219j611132j247261r82320j227666j654435j884930
4669H3041573j863459j579071j142538j443390j968020k087749k035970j703680
4661F9217696j598541k016868k519946k192900k647766j739202j184575j764237
4653E3553661k042346k380889k060516r72414j288656j692282k000625j948348
$$ plain form
4710 89825079 91175688 92322752 93903245 95747502 97396432 98424299 99802766 101453035
4702 101453035 103466063 105477343 106933296 107862727 109183666 110633069 112109731 113393622
4694 113393622 113652439 113331865 113341633 113507679 113125630 112744882 111719190 110043873 108551348
4685 108551348 107548663 106022389 104150669 102168608 100333568 98382180 96801690 95209527
4677 95209527 93639536 91649317 90038185 88790924 87808604 86580938 84926503 83041573
4669 83041573 81178114 79599043 78456505 77013115 75045095 72957346 70921376 69217696
4661 69217696 67619155 65602287 63082341 60889441 58241675 56502473 55317898 53553661
4653 53553661 51511315 49130426 47069910 46097496 44808840 43116558 41115933 39167585
4645C9167585j229505n23457r09074j574931j740503j392983q03602l27653m62837
4636C0203040j453391j462133q44715o19268l09636m16690q30155r79415l31349
4627B2956288M9731l65935o10141p19676n64031k23474J57545J93536k53326p82136
4617A9838381k13687o9r9427k06770m97286K2459K92503K27855L86692p2959n93975
4606A9083717k42715J60812M08544J36219r2615L5310j04890N56258L85276j19167
4596B0206749k63734J93947J05413K61414L60065q9537M5674L21542l66685J57175
4586B0932023N62775k7739R2276l9173J1048M44654L77804k75384j42993j85478
4576B1749813p6355R6350m13867m81423j36930q0854k39592k24638m26248n86072
$$ plain form
4645 39167585 37938080 37414623 36505549 34930618 33190115 31797132 30993530 30665877 30203040
4636 30203040 28749649 27287516 26442801 25823533 25513897 25097207 24267052 23287637 22956288
4627 22956288 23006019 22640084 22029943 21310267 20746236 20522762 20680307 20873843 20620517 19838381
4617 19838381 19624694 19624625 19525198 19318428 18821142 18843601 19136104 19363959 19750651 19677692 19083717
4606 19083717 18841002 19001814 19410358 19546577 19453962 19489272 19384382 19940640 20325916 20206749
4596 20206749 19943015 20136962 20242375 20503789 20863854 20774317 20819991 21141533 20774848 20932023
4586 20932023 21494798 21467059 21559335 21520162 21531210 21975864 22353668 22078284 21935291 21749813
4576 21749813 21673458 21769808 21355941 20874518 20737588 20656734 20417142 20192504 19766256 19180184
4566A9180184o47124M3649k17530m19940l54399n96862m77925m461q4235l34461
4556A6086896m38752o50977k09421K02000L414j06183n12996l50096j80290k2430
4546A3821165k0500l76627m38810m52018k30211j95946M8150k33787n44373j70619
4536A1206424k92905J94187r2717n72774m00760k64427L20951N35525j11623j002463
4526I519418m50634R0069M04599J99744j96095k77905k29565p9547K70339J54923
4516I405346l77953l88019J08078K93639K95348m4739l64502l18297j01089J10745
4506H618557K03705R9809m9786l09511K50982J93354M2162j79391k11176k53467
4496H405238Q7134J40341J34097J70468m32713N7682J52639j46011N5573k64886
$$ plain form
4566 19180184 18533060 18576709 18359179 17939239 17584840 16987978 16510053 16505592 16421357 16086896
4556 16086896 15648144 14997167 14787746 14989746 14993160 14886977 14373981 14023885 13843595 13821165
4546 13821165 13800665 13424038 12985228 12533210 12302999 12107053 12155203 11921416 11377043 11206424
4536 11206424 10913519 11107706 11014989 10442215 10041455 9777028 10097979 10633504 10521881 9519418
4526 9519418 9068784 9158853 9563452 9763196 9567101 9289196 9059631 8980084 9250423 9405346
4516 9405346 9027393 8639374 8747452 9041091 9336439 9291700 8927198 8608901 8507812 8618557
4506 8618557 8822262 8922071 8872285 8562774 8813756 9007110 9049272 8869881 8658705 8405238
4496 8405238 8492372 8632713 8766810 8937278 8504565 8562247 8714886 8568875 8624448 8359562
4486H359562l1530J46076m1798J5068L8121j63811K2812N4968o1231M9091k06292
4475H181036K8538K09251j17395p0246o1187k89279k47093J64811L04509n3049
4465H049896j79651o0803o6972M46316L21490m60973o95655L69096M58681L94340
4455H575765j7451j02255J9691J1048J92067K50983J4268n31563J75441L86089
4445H974083J69902k2425l69636q3376M48076O23129j8179j07230k06221K14588
4435I622711N92878k8577K43383k25222m02653J99128Q47616O30585k58444l74741
4425A0846664J34676K31429K87330N15539N9239q5974K48157N68759J96832M79555
4415A3482206J69709k21223J41101K2576O22958Q3749J50437L553M85157K45399
$$ plain form
4486 8359562 8328032 8474108 8432310 8447378 8485499 8321688 8344500 8399468 8338237 8387328 8181036
4475 8181036 8209574 8418825 8301430 8231184 8169997 7880718 7633625 7798436 8102945 8049896
4465 8049896 7870245 7809442 7742470 8188786 8510276 8049303 7353648 7722744 8181425 8575765
4455 8575765 8558314 8456059 8475750 8486798 8678865 8929848 8944116 8412553 8587994 8974083
4445 8974083 9143985 9121560 8751924 8668548 9116624 9739753 9721574 9614344 9408123 9622711
4435 9622711 10215589 10187012 10430395 10205173 9802520 10001648 10849264 11479849 11221405 10846664
4425 10846664 10981340 11212769 11500099 12015638 12074877 11988903 12237060 12805819 13002651 13482206
4415 13482206 13651915 13430692 13571793 13594369 14217327 14301076 14451513 14455066 14940223 15185622
4405A5185622j09460q7345k58773Q7988K12620M02069L71848R214l43255j41363
4395A5329165J82012l7216K54622k39300l41592j6211J68334J02277j912p2369
4385A5327810n90042P7639L39689j32873l6435o3825k83919j50076R0077O3284
4375A4641329n8553j36258N78321K37641M86421J14895J19223j43118l26668k9913
4365A5483320J70568O3240j15446m56399k41472j11581K13298M5209q4526K33026
4355A5199237m38186J7222L05562M94047k85393J55402J17718R3890L45493K54689
4345A6259681O1484k10969k2272L66660O13987P2922o08567j53239J45704N26928
4335A7052319P88370j60395n28076K4217L60188M98089Q7558J21156l86387O622
$$ plain form
4405 15185622 15076162 14988817 14730044 14818032 15030652 15432721 15804569 15813783 15470528 15329165
4395 15329165 15511177 15473961 15728583 15489283 15147691 15131480 15299814 15402091 15400179 15327810
4385 15327810 14737768 14815407 15155096 15022223 14985788 14921963 14638044 14487968 14578045 14641329
4375 14641329 14582776 14446518 15024839 15262480 15748901 15863796 15983019 15839901 15513233 15483320
4365 15483320 15653888 15717128 15601682 15145283 14903811 14792230 15005528 15050737 14966211 15199237
4355 15199237 14761051 14778273 15083835 15577882 15292489 15447891 15565609 15659499 16004992 16259681
4345 16259681 16321165 16110196 16087924 16454584 17068571 17141493 16532926 16379687 16525391 17052319
4335 17052319 17840689 17680294 17152218 17176435 17536623 18034712 18122270 18243426 17857039 17863661
4325A7863661N11640K14948l1784n4507P467M22427O24870M69069J56623m92591
4315A9691823P2080M18066M67546L25109j6936o4012K8213N98160M37735J54203
4305B2111987j72897j90613K78903L97315N46434K3309j0602N9737L06919L09181
4295B3659673L14210L64444O2383L2985J96682L35603J58626K57197k7049K62435
4285B5617189L87113N63419R5393N0195J63927J41736M08249N50376M74480N98438
4275B9050515L95110L09012N77980M90867P55235P86702O57922Q29536Q30802
4266C4683681N69593Q89850Q28630J066123J193050J119853J542983J459119J083406
4257D4436288J205685J652138J826862J764372J807601K056074J851492K200010
$$ plain form
4325 17863661 18375301 18590249 18558465 18503958 18511425 18933852 19558722 20027791 20184414 19691823
4315 19691823 19763903 20181969 20649515 20974624 20957688 20893676 20921889 21520049 21957784 22111987
4305 22111987 21939090 21748477 22027380 22424695 22971129 22994438 22983836 23043573 23350492 23659673
4295 23659673 23973883 24338327 24400710 24433695 24630377 24965980 25124606 25381803 25354754 25617189
4285 25617189 26004302 26567721 26663114 26713309 26877236 27018972 27427221 27977597 28452077 29050515
4275 29050515 29445625 29754637 30332617 30823484 31578719 32365421 33023343 33852879 34683681
4266 34683681 35253274 36143124 36971754 38037877 39230927 40350780 41893763 43352882 44436288
4257 44436288 45641973 47294111 49120973 50885345 52692946 54749020 56600512 58800522
4249E8800522K099606K393143K660487K244220K335233K630647K906570L007755
4241G9078183L111956K891167K974120K846624L160969L475576K927429K903355
4233A03369379L033536L287310L029905K989406K950998K662109K137365K532203
4225A25992211K475434K493221K297225J778864K020171J467228J126783J218111
4217A40869248J007138Q75050P10091L68825j20275k38700J07774r10742p73710
4208A41894699o03842j077030j401240j166071j365780j369907j533077j581468
4200A31796284k452994k041740k204390k277355k317787k209536j928060k390990
4192A13973432k258061k609508k213743k129704k334300k144033k007853k363577
$$ plain form
4249 58800522 60900128 63293271 65953758 68197978 70533211 73163858 76070428 79078183
4241 79078183 82190139 85081306 88055426 90902050 94063019 97538595 100466024 103369379
4233 103369379 106402915 109690225 112720130 115709536 118660534 121322643 123460008 125992211
4225 125992211 128467645 130960866 133258091 135036955 137057126 138524354 139651137 140869248
4217 140869248 141876386 142751436 143461527 143830352 143710077 143471377 143579151 142668409 141894699
4208 141894699 141290857 140213827 138812587 137646516 136280736 134910829 133377752 131796284
4200 131796284 129343290 127301550 125097160 122819805 120502018 118292482 116364422 113973432
4192 113973432 111715371 109105863 106892120 104762416 102428116 100284083 98276230 95912653
4184I5912653k138842j680946k047532j888421j737328j764866j703089j385820
4176H1565809j447655j691681j515101j695019j607300j507684j402604j431752
4168F9267013j418890j415030j338818j186409j072610j376741j459000j150770
4160E8848745j054487j159251j043258r42266r88968j138816p12836o89954j444808
4151D9674101j206695q67928r50114r07081p04864q83563j176350r24846j98492
4142D1854168l87841p05238r45444j248368p54882j50898k57115n70405o04124
4133C6229853n52769l69337l7519k72293k47076n50435n40617j67670L06616M55092
4123C4253845m13973m85537m2579M48467N61079L20481o755k27541J11535R56247
$$ plain form
4184 95912653 93773811 92092865 90045333 88156912 86419584 84654718 82951629 81565809
4176 81565809 80118154 78426473 76911372 75216353 73609053 72101369 70698765 69267013
4168 69267013 67848123 66433093 65094275 63907866 62835256 61458515 59999515 58848745
4160 58848745 57794258 56635007 55591749 54649483 53660515 52521699 51808863 51118909 49674101
4151 49674101 48467406 47599478 46649364 45742283 45037419 44153856 42977506 42052660 41854168
4142 41854168 41466327 40761089 39815645 38567277 37812395 37661497 37404382 36833977 36229853
4133 36229853 35677084 35307747 35270228 34997935 34750859 34200424 33659807 33492137 33798753 34253845
4123 34253845 33839872 33354335 33311756 33760223 34321302 34641783 34635028 34407487 34519022 35475269
4113C5475269R68875K52397J95706o7375r7141K17107O25536Q3954M955j55962
4103C7503321m2889L90804J48022P8173l35634k73743n5902P56860L14122k19184
4093C8263950m09698n12369m67544M74740p0584p74725o82246o5387N15511N01985
4083C6773633L9115l96719k05652R7664N12442N21449r3374j12397Q2706L40494
4073C7559361J76489J2579j52585j44105k19538K55231L95102L09659j07301k75726
4063C7809166J16071K45256K32663j39595m45976k54759K37233L03758k24689
4054C7879128r825K80876J00251J37149K5993k4017K35507K55488r5178N21346
4044C9306718K35580L43454K20723L34025J42997M48671M13160L70772J46322
$$ plain form
4113 35475269 36444144 36696541 36892247 36824872 36727731 36944838 37570374 37654328 37659283 37503321
4103 37503321 37460432 37851236 37999258 38077431 37741797 37468054 37412152 38169012 38483134 38263950
4093 38263950 37854252 37341883 36874339 37349079 37278495 36503770 35821524 35756137 36271648 36773633
4083 36773633 36812748 36416029 36210377 36308041 36820483 37341932 37248558 37136161 37218867 37559361
4073 37559361 37735850 37748429 37595844 37451739 37232201 37487432 37882534 38192193 38084892 37809166
4063 37809166 37925237 38170493 38403156 38263561 37817585 37562826 37800059 38103817 37879128
4054 37879128 37869303 38150179 38250430 38387579 38413572 38389555 38625062 38880550 38785372 39306718
4044 39306718 39542298 39885752 40106475 40440500 40583497 41032168 41445328 41816100 41962422
4035D1962422K54876O78125P23974P75147N81940L54032M98213P17446M74405
4026D7020580O56705K64267J38041K39058M90060J21713L8742M20224M55816N48919
4016E0394125J57473K3704l5400r060R0528J37898J7381J45285J17330j54201
4006E0885063L34393L19247J81297R3152J88177N42144K99543J50078O54873L35850
3996E3983817O40447P85091O08222N12602P66292J238442Q38216R93450R65167
3987F1331746J086546P72073J137951J654981J211798J159401R62598J250162
3979G0567256J285989J628601J522484J268094K010681J798921J654670J815155
3971H3551851K084931K019693K191067K219039K298301J848852K409231K972826
$$ plain form
4035 41962422 42217298 42895423 43619397 44394544 44976484 45330516 45828729 46546175 47020580
4026 47020580 47677285 47941552 48079593 48318651 48808711 48930424 48969166 49389390 49845206 50394125
4016 50394125 50551598 50575302 50539902 50530842 50621370 50759268 50776649 50921934 51039264 50885063
4006 50885063 51219456 51538703 51720000 51813152 52001329 52543473 52843016 52993094 53647967 53983817
3996 53983817 54624264 55409355 56017577 56530179 57296471 58534913 59373129 60366579 61331746
3987 61331746 62418292 63190365 64328316 65983297 67195095 68354496 69317094 70567256
3979 70567256 71853245 73481846 75004330 76272424 78283105 80082026 81736696 83551851
3971 83551851 85636782 87656475 89847542 92066581 94364882 96213734 98622965 101595791
3963A01595791K280395K388910K428913K619142K506945K681985K651729K488426
3955A21642236K917384K784506L159824L200185K830783K921295L133463L092149
3947A45681825L242188K895486L018129K919851L165357L114544L085870L351117
3939A70474367L554031L758740L952421M340633M359487M510599M497654N000297
3931B04448229N323355N203892M749901M244988M322887M469398M240010M255339
3923B41257999M164112L898935L624894L736146L461867K743542K808925J906140
3915B67602560J494072J277883R42890O25950J25866k82959l01918K29024q6117
3906B71627251n47846n63889m57761m24935q087j74483p30001l83892M6551L38588
$$ plain form
3963 101595791 103876186 106265096 108694009 111313151 113820096 116502081 119153810 121642236
3955 121642236 124559620 127344126 130503950 133704135 136534918 139456213 142589676 145681825
3947 145681825 148924013 151819499 154837628 157757479 160922836 164037380 167123250 170474367
3939 170474367 174028398 177787138 181739559 186080192 190439679 194950278 199447932 204448229
3931 204448229 209771584 214975476 219725377 223970365 228293252 232762650 237002660 241257999
3923 241257999 245422111 249321046 252945940 256682086 260143953 262887495 265696420 267602560
3915 267602560 269096632 270374515 271317405 271943355 272069221 271786262 271484344 271713368 271627251
3906 271627251 271079405 270515516 270057755 269632820 269624733 269450250 268720249 268336357 268382908 268721496
3896B68721496J134766J226686J465910J956910L041474M120982M396693M613045
3888B90677962N233556N437777O403237P047579P546853O925223O760233P091891
3880C43124311P207740P266103O669263N500944M832283N074265M384892L269845
3872C87329646K213817J080569O06678K47864n59850j316431k001759l059390
3864C84541144m480360m187019m988641n812079o585215p406189p470667p322030
3856C36288944p186476p306425p531476p101721o465877o023026m816675m477305
3848B85379963l833947l136608k680554j268924n60357r50163j81748L91332J042365
3839B74201359J422501J692982J757439K094753K512636K692985L031213K745026
$$ plain form
3896 268721496 269856262 271082948 272548858 274505768 277547242 281668224 286064917 290677962
3888 290677962 295911518 301349295 307752532 314800111 322346964 329272187 336032420 343124311
3880 343124311 350332051 357598154 364267417 369768361 374600644 379674909 384059801 387329646
3872 387329646 389543463 390624032 391230710 391478574 390918724 389602293 387600534 384541144
3864 384541144 380060784 375873765 370885124 365073045 358487830 351081641 343610974 336288944
3856 336288944 329102468 321796043 314264567 307162846 300696969 294673943 289857268 285379963
3848 285379963 281546016 278409408 275728854 274459930 273899573 272949410 272767662 273158994 274201359
3839 274201359 275623860 277316842 279074281 281169034 283681670 286374655 289405868 292150894
3831B92150894K527259K347968K206350K175876J909253R60617J15300J71079
3823C04564596R0851j41178o13523j402223j480156j699912j906236k104432k323541
3814B92984246k522959l089697l540030l504191l939589m063977m189132n002983
3806B63131688n548295n396298m712058n088344n605870n896470o226659n858989
3798B18798705n219265n276421n214110n496881n591619n260018m937738m555436
3790A77247217m771741n023800m626077m077280l750476l420545l721945l632535
3782A44222818l229111k179394j657685j566583j538761j696824p72952J04086
3774A31685594Q36689Q34728M57657J117636J337102J835144K031643R45802M15783
$$ plain form
3831 292150894 294678153 297026121 299232471 301408347 303317600 304278217 304393517 304564596
3823 304564596 304655447 304514269 303900746 302498523 301018367 299318455 297412219 295307787 292984246
3814 292984246 290461287 287371590 283831560 280327369 276387780 272323803 268134671 263131688
3806 263131688 257583393 252187095 247475037 242386693 236780823 230884353 224657694 218798705
3798 218798705 213579440 208303019 203088909 197592028 192000409 186740391 181802653 177247217
3790 177247217 172475476 167451676 162825599 158748319 154997843 151577298 147855353 144222818
3782 144222818 140993707 138814313 137156628 135590045 134051284 132354460 131581508 131685594
3774 131685594 132522283 133357011 133814668 134932304 136269406 138104550 140136193 141081995 141497778
3765A41497778M23122L88217K91151K39452n74537j679834j741878j385117p73121
3756A36685233j343307k027244k687419k779707k714011k794988k980460m137896
3748A15220201m728041n049466m421705l886095m327039n029231m886394l996881
3740G8895349l618904k928251l199111l288534l078795k489571k144545j608590
3732E6539048j965790k549562k046438j402408r73953j169489j367029j716035
3724D3348344j291262q38356l71498p25440j051884j280325q13955l73497q18830
3715C5783297o63918j067148p58848m56716q90342l05376o41392j262010j122938
3706B8614609o26320j60230j037593r48855p67911r35052q35476m09049m20834
$$ plain form
3765 141497778 141920900 142309117 142600268 142839720 142265183 140585349 138843471 137458354 136685233
3756 136685233 135341926 133314682 130627263 127847556 125133545 122338557 119358097 115220201
3748 115220201 110492160 105442694 101020989 97134894 92807855 87778624 82892230 78895349
3740 78895349 75276445 72348194 69149083 65860549 62781754 60292183 58147638 56539048
3732 56539048 54573258 52023696 49977258 48574850 47600897 46431408 45064379 43348344
3724 43348344 42057082 41218726 40847228 40121788 39069904 37789579 36975624 36602127 35783297
3715 35783297 35119379 34052231 33293383 32836667 31946325 31640949 30999557 29737547 28614609
3706 28614609 27988289 27828059 26790466 25841611 25073700 24138648 23303172 22894123 22473289
3697B2473289o43743j070875q46824m58529m19008m23016n68127p22484m71321
3688A6849362j79067j87743m56853n15453m37244j41927j15267j11587J71910
3679A4876131l31274m58289l24833q8195j28608k3312l42827n17565k31270M8629
3669A2478587J0029j56691l43555n2370j93527k03259j8357j39959m88800k06122
3659A0685976k32955m84182k01502n4337j35940j29586k95070j51103J14958n88788
3649H527471m50571m663k67737R2657j62090o340k13572j84822J70574m2029R6052
3638G554930l00100l64228N7755K25191K65677j23152l64691k64174K31361R7172
3628G015741J95214o1019k33542j99394j84932J16097J49312n5486j25692l34999
$$ plain form
3697 22473289 21829546 20758671 19911847 19453318 19034310 18611294 18043167 17320683 16849362
3688 16849362 16670295 16482552 16025699 15510246 15073002 14931075 14815808 14704221 14876131
3679 14876131 14544857 14086568 13761735 13673540 13544932 13521620 13178793 12661228 12429958 12478587
3669 12478587 12488616 12331925 11988370 11936000 11742473 11539214 11520857 11380898 10892098 10685976
3659 10685976 10453021 9968839 9767337 9713000 9577060 9447474 9152404 9001301 9116259 8527471
3649 8527471 8076900 8072237 7804500 7897157 7735067 7728727 7515155 7330333 7500907 7458878 7554930
3638 7554930 7254830 6890602 6948357 7173548 7439225 7316073 6951382 6687208 6918569 7015741
3628 7015741 7210955 7149936 6916394 6717000 6532068 6648165 6797477 6741991 6616299 6281300
3618F281300J11362N20031l0502k34506j12927K0424J88768p0886j77084n7580
3608F438400M8265k8529M6160K50774k92958j84776p964K07018P1455K0631o7289
3597F501187l04758J24153K45197o6591n8350m3732J89978j36364n8218L13215
3587F705717M7732j92692k78359J89730M69204k6520P6756K0945k69003L60170
3577G103680P00455K03052K61781M94162K14939N71399J50919L05028J240211
3568A1245626N57130K18946M1941L9488P74l6109l30431n17747k33780l16002
3558A0669836k32938J98531k73573p47274p61083l01071K69692L43466j11764
3549I053822m47071m5023O30656O40648L98893L91942L95029Q48859P90540J215033
$$ plain form
3618 6281300 6392662 6912693 6882191 6647685 6534758 6555182 6743950 6673064 6495980 6438400
3608 6438400 6486665 6458136 6504296 6755070 6462112 6277336 6269372 6476390 6547845 6568476 6501187
3597 6501187 6196429 6320582 6565779 6499188 6440838 6397106 6587084 6450720 6392502 6705717
3587 6705717 6753449 6560757 6282398 6472128 6941332 6914812 6991568 7012513 6743510 7103680
3577 7103680 7804135 8007187 8268968 8763130 8978069 9549468 9700387 10005415 11245626
3568 11245626 11802756 12021702 12063643 12103131 12103905 12067796 11737365 11219618 10985838 10669836
3558 10669836 10436898 10635429 10361856 9614582 8853499 8552428 8822120 9165586 9053822
3549 9053822 8606751 8561728 9192384 9833032 10231925 10623867 11018896 11867755 12658295 13873328
3539A3873328J623721J001405J067219N86354N60974K83518l94088q85122p60648
3530A6956661n09654o24907r29046j174981j025449p49158l56721R6810m79472
3521A1204083r14277q81733l18707k4290J55522O4712m62816m84413j1737O01480
3511H927824K02126J47889l69017K17384P60719P96686K23076l46722m36556J84978
3501A0308387O0627K5540n51931p88771p25552n28594l00679M7472n65450p29746
3491F251303m09508l11172j94562q0160k40947m66661l3063Q2855L03850M6725
3481D948660N8828l35147k97065J34087M60550m5354l02331m15432L61286N69003
3471E137085N46633K56015Q7617o8928L61170O12534N17070R7129n7266J30004
$$ plain form
3539 13873328 15497049 16498454 17565673 18152027 18713001 18996519 18602431 17717309 16956661
3530 16956661 16447007 15822100 14893054 13718073 12692624 11943466 11586745 11683555 11204083
3521 11204083 10289806 9408073 9089366 9065076 9220598 9285310 8822494 8338081 8326344 8927824
3511 8927824 9129950 9277839 8908822 9126206 9886925 10683611 10906687 10559965 10123409 10308387
3501 10308387 10369014 10394554 9842623 9053852 8328300 7799706 7499027 7546499 6981049 6251303
3491 6251303 5841795 5530623 5336061 5255901 5014954 4548293 4515230 4598085 4901935 4948660
3481 4948660 5007488 4672341 4375276 4509363 4969913 4924559 4622228 4206796 4568082 5137085
3471 5137085 5683718 5939733 6027350 5958422 6319592 6932126 7449196 7546325 7489059 7619063
3461G619063L5966L22808n3988o7080j07836j28281K91955K73920M6924j86560
3451H046891l94345n39669k6462J02828o4424m27011p15276m02415j56261K59996
3441E683852K49569j24812r4998K48765P54041R14147M56607J87954O5630J42072
3431H482827J9785l72763o37206n64246n63586o51368n07385l73092o46397p07790
3421C478779j23335j18711l04017j74661j24628k58675n0829K62819m9802k25607
3411B311333j87630L23605M2655J38138O2391r0582J56387L22410L92301L77016
3401C848024J46789l39409j77333l38928l65089j68635k47820m2201l69212l59784
3391A586402n70627l51918j75507K14656r6116p4453j5782j38697j25679R4580
$$ plain form
3461 7619063 7655029 7977837 7923849 7856769 7748933 7620652 7912607 8186527 8233451 8046891
3451 8046891 7652546 7112877 7086415 7189243 7124819 6697808 5982532 5580117 5423856 5683852
3441 5683852 5933421 5808609 5713611 5962376 6716417 7630564 8087171 8275125 8340755 8482827
3431 8482827 8502612 8129849 7492643 6928397 6364811 5713443 5206058 4832966 4186569 3478779
3421 3478779 3355444 3236733 2932716 2758055 2633427 2374752 2323923 2586742 2536940 2311333
3411 2311333 2123703 2447308 2489963 2628101 2690492 2599910 2756297 3078707 3471008 3848024
3401 3848024 3994813 3655404 3478071 3139143 2774054 2605419 2357599 2315398 1946186 1586402
3391 1586402 1015775 663857 488350 703006 606890 532437 516655 377958 252279 346859
3381C46859K55093K0582n01169j51799L52656K43725J80999k77200n38679k34279
3371c03212M24246M15997j84176l86491k01026L1456L1274L04315J35893o06814
3361c38538k90872L63131N33487L8896l61033l90253R772M3298K60248j08000
3351b39864o9239j84447j56311N63751J78515j20271n76294n46759K34749N72911
3341c43259L48501j36569n99815l3963L12007O34353L15062o65051n15315k56743
3331i40792M80454N29029J62270o62700n55724K42967M96625L74110m7647n06638
3321d28046k08048K66801J36358j27241k49340l49327L53039K14169L97112j67518
3311a62041p25939l82148m0259K68491K75806J99013k04285k82391J08597N40381
$$ plain form
3381 346859 601952 622534 121365 -30434 322222 565947 746946 469746 -68933 -303212
3371 -303212 121034 537031 352855 -33636 -234662 -203206 -171932 132383 268276 -338538
3361 -338538 -629410 -266279 267208 306104 -54929 -445182 -435410 -392112 -131864 -239864
3351 -239864 -309103 -493550 -649861 -86110 92405 -27866 -604160 -1150919 -916170 -343259
3341 -343259 5242 -131327 -731142 -765105 -453098 181255 496317 -168734 -684049 -940792
3331 -940792 -460338 68691 230961 -431739 -987463 -744496 -247871 126239 78592 -428046
3321 -428046 -636094 -369293 -232935 -360176 -609516 -958843 -605804 -391635 5477 -162041
3311 -162041 -887980 -1270128 -1310387 -1041896 -766090 -567077 -771362 -1053753 -945156 -404775
3301d04775k01376k90650j09418j04907K40794J91394m6556j76904j47680k46096
3291a296174L16944J65604o3362k37956m7504L5492L69304J81862j72017l28161
3281a075968m12761O90554J37282r0330p0595l86706Q5122m7718J09125J72371
3271h89624m0618l26141j60801M77866K19186O5539p0681l85325K3612M22440
3261f64547L26517j19787l34120m38140K0530J77175j65K48829k01020k2816J06531
3250i01013r3867K89963q2724n02260p4430m7007L77589L44488j1811l83999j76350
3239a261421K84544J74867j24788J054k33459J7729L22226j24098j60951k2714
3229a127011k15701r9135N43300L25384r0230j93701k24657j9551M64799P6540
$$ plain form
3301 -404775 -606151 -896801 -1006219 -1111126 -870332 -678938 -725494 -902398 -1050078 -1296174
3291 -1296174 -979230 -813626 -876988 -1114944 -1162448 -1126956 -757652 -575790 -747807 -1075968
3281 -1075968 -1488729 -798175 -660893 -751223 -821818 -1208524 -1123402 -1171120 -1061995 -889624
3271 -889624 -930242 -1256383 -1417184 -939318 -720132 -654593 -725274 -1110599 -1086987 -664547
3261 -664547 -338030 -457817 -791937 -1230077 -1209547 -1032372 -1032537 -783708 -984728 -1007544 -901013
3250 -901013 -994880 -704917 -787641 -1289901 -1364331 -1411338 -1033749 -689261 -701072 -1085071 -1261421
3239 -1261421 -976877 -802010 -926798 -925744 -1159203 -1141474 -819248 -943346 -1104297 -1127011
3229 -1127011 -1342712 -1441847 -898547 -573163 -663393 -857094 -1081751 -1101302 -636503 -559963
3219e59963J15895k62171m75809j36443N11765K1878l88245M1648o321L81856
3209g55910J83654k03998k01327k16058L8046J04458K20984j2445j01978p9418
3199a023992m70737M18156J86369L6491j00087P0804P4812n9234Q6169P6940k20631
3188i24940k2636M0033j9128J13326j1112l20818J51218K6652J02561k77836k13684
3177a356364r0641K55978N03842j3481L942j42029r4067j85621J53030N5833j77543
3166a087121O1970J05684K36366j8235l40574l75342L558K96682J82870K59201
3156f74941j17573k88407J40869k0511K31024J76438k28667j44475O0635K84108
3146e81500n6919n8859j1615j18454K66551J57271K83145J85513m95961m7751
$$ plain form
3219 -559963 -444068 -706239 -1182048 -1318491 -806726 -784848 -1173093 -1131445 -1137766 -755910
3209 -755910 -572256 -776254 -977581 -1193639 -1155593 -1051135 -830151 -842596 -944574 -1023992
3199 -1023992 -1494729 -1076573 -890204 -853713 -953800 -882996 -808184 -867418 -781249 -704309 -924940
3188 -924940 -947576 -907543 -926671 -813345 -824457 -1145275 -994057 -967405 -864844 -1142680 -1356364
3177 -1356364 -1447005 -1191027 -687185 -700666 -696724 -838753 -932820 -1118441 -965411 -909578 -1087121
3166 -1087121 -1025151 -919467 -683101 -701336 -1041910 -1417252 -1413694 -1117012 -934142 -674941
3156 -674941 -792514 -1080921 -940052 -960563 -729539 -553101 -781768 -926243 -865608 -581500
3146 -581500 -638419 -697278 -708893 -827347 -560796 -403525 -120380 65133 -430828 -478579
3136d78579K19610m0532J8349k76652k05662L48436R3105j43825k89069J06205
3126f48614k38110J61676M03157l4748j51346k70384j98679P05848N35473r9498
3116A64775j64347j43719m8729K80655J36799j20678n75437p2445K64438L57090
3106G8402K12303o19138m39366p0450L97287N40779j00512o44392k7956L14297
3096c58746N41948r9659l94031n21103j89609N03575M03067M63675n92239o32462
3086h75584m9432O84261N16550k11931l53803m19331K12987Q49827J80673l94940
3076A39277p87881l75499M63088M57334K27389l91160n93864p2953L59507P73181
3066A98419K7292p50596m61909J90656Q08271n7615j65153l81475o78666J74109
$$ plain form
3136 -478579 -258969 -299501 -281152 -557804 -763466 -415030 -321925 -465750 -754819 -648614
3126 -648614 -886724 -725048 -321891 -356639 -507985 -778369 -977048 -271200 264273 164775
3116 164775 428 -143291 -192020 88635 225434 104756 -470681 -543126 -278688 78402
3106 78402 290705 -328433 -767799 -838249 -440962 99817 -695 -645087 -673043 -358746
3096 -358746 183202 83543 -310488 -831591 -1021200 -517625 -114558 349117 -243122 -875584
3086 -875584 -925016 -240755 275795 63864 -289939 -709270 -496283 353544 534217 139277
3076 139277 -648604 -1024103 -561015 -103681 123708 -267452 -861316 -934269 -574762 198419
3066 198419 225711 -524885 -986794 -796138 12133 -45482 -210635 -592110 -1270776 -1096667
3056a096667L98368K53347M9745p66073m11762N64082M43010J14370l50208m10209
3046a211997k4301L17942N37365J8407o46710n98464L51649P29498j49507k34540
3036i10658l75283K34633R7743K87185J00928j55886k14135j76948M85226M6173
3026e81022r1878k63572k57707n2656R5967K07088j81181p6000j33632J83376
3016a151217K00703j46706j13505k46737K37794j8845R6816J49747k08837n4639
3006a255426K22786p4664l212J48617J39033l86798L41019J50364l60933j69826
2996a249040K56199R865j6830o6471K585j21958K77939J39819R2559k53111m06275
2985a334719J32756K62239J45546k36026m48413j75858J61962R2340L06398J13906
$$ plain form
3056 -1096667 -698299 -444952 -395207 -1161280 -1573042 -1008960 -565950 -451580 -801788 -1211997
3046 -1211997 -1236298 -918356 -380991 -362584 -1009294 -1607758 -1256109 -526611 -676118 -910658
3036 -910658 -1285941 -1051308 -953565 -666380 -565452 -721338 -935473 -1112421 -627195 -581022
3026 -581022 -672900 -936472 -1194179 -1246835 -1150868 -943780 -1124961 -1200961 -1334593 -1151217
3016 -1151217 -950514 -1097220 -1210725 -1457462 -1219668 -1238513 -1141697 -991950 -1200787 -1255426
3006 -1255426 -1032640 -1107304 -1110516 -961899 -822866 -1209664 -868645 -718281 -1079214 -1249040
2996 -1249040 -992841 -982976 -999806 -1066277 -1063692 -1185650 -907711 -767892 -675333 -928444 -1334719
2985 -1334719 -1201963 -939724 -794178 -1030204 -1478617 -1654475 -1492513 -1400173 -1093775 -979869
2975i79869j51122j22132L0293J77075r3768J42310R122l71157N3260J29301L5032
2964a141655k6790k040l82607P7100M04830K16162k43986l16293r8380M19388
2954a094271K65328K7507k42323l10015P1785J99452L33167J31191n85400j62622
2944a366201N7487K0501L30355J35775k75658j71833r1541M92719M775m63570
2934a327191l30720j74315N48467J77849J55793k33267l93962J07789L51023J49128
2924i69406O7794m79096k30544J54440M02440L41251l86593k46010K6562J46516
2914a172646N97704j31986n65088m91234j7829O29233L97080k32938n44043J24492
2904a407255J85788M62252K50452m40852m12997q5690L51429M52814j91508o47204
$$ plain form
2975 -979869 -1130991 -1253123 -1222830 -1045755 -1139523 -997213 -988091 -1359248 -1305988 -1176687 -1141655
2964 -1141655 -1168445 -1170485 -1553092 -1475992 -1071162 -855000 -1098986 -1415279 -1513659 -1094271
2954 -1094271 -828943 -801436 -1043759 -1353774 -1281989 -1082537 -749370 -618179 -1203579 -1366201
2944 -1366201 -1308714 -1288213 -957858 -822083 -1097741 -1269574 -1361115 -868396 -863621 -1327191
2934 -1327191 -1657911 -1832226 -1283759 -1105910 -950117 -1183384 -1577346 -1469557 -1118534 -969406
2924 -969406 -901612 -1380708 -1611252 -1456812 -1054372 -713121 -1099714 -1345724 -1319162 -1172646
2914 -1172646 -574942 -706928 -1272016 -1763250 -1781079 -1151846 -754766 -987704 -1531747 -1407255
2904 -1407255 -1221467 -759215 -508763 -949615 -1362612 -1448302 -1096873 -644059 -835567 -1482771
2894a482771k62842K86019O25088K67182m06105n40095k74855M09840N47216j0268
2884h41591m49249l47859O5778N62483L96031o1507q82449k85606M84652M86711
2874h72606o6783k84421m17706k95552L83238N67397J38795l73329l21141K40882
2864a301226R4230L12845k04441n53287q7837P7083N83245K61823l57352p54956
2854a929873N6976J91300M65595M91572k27437o57116J33163L33626M21761K42114
2844d78319m12737n30752K07689M14514M7499j77396k76269J14933p0800l6591
2834a198229K91564O7071n64052J71345J49158K33159n5999k04191k48448N2416
2824a306206L83671p3102j1448l6006k21453R6998r931m84881J51863K50609j04910
$$ plain form
2894 -1482771 -1745613 -1459594 -834506 -567324 -973429 -1513524 -1788379 -1378539 -831323 -841591
2884 -841591 -1290840 -1638699 -1572921 -1010438 -614407 -675914 -1558363 -1843969 -1359317 -872606
2874 -872606 -939389 -1223810 -1641516 -1937068 -1553830 -986433 -847638 -1220967 -1542108 -1301226
2864 -1301226 -1206996 -894151 -1098592 -1651879 -1739716 -1662633 -1079388 -817565 -1174917 -1929873
2854 -1929873 -1872897 -1681597 -1216002 -724430 -951867 -1608983 -1475820 -1142194 -720433 -478319
2844 -478319 -891056 -1421808 -1214119 -799605 -752106 -929502 -1205771 -1090838 -1161638 -1198229
2834 -1198229 -906665 -839594 -1403646 -1232301 -1083143 -849984 -905983 -1110174 -1358622 -1306206
2824 -1306206 -922535 -995637 -1007085 -1043091 -1264544 -1167546 -1177477 -1662358 -1510495 -1259886 -1364796
2813a364796O7197R3655o0898p8080J38773R664J8797l7056J19428o2124j78717
2802a334157Q3235J32281K11517m4458l6235j53519j07366j8521J92510J37983
2792i36730k0623j37730K468O5808R7909l5940j24547k06789J81551K22386O1866
2781h30371J2497k16296m38416k6849O33789R8148m03192k33174J12536J32771
2771a158557J0137L27470k58910l35869J64170K16082N1999p921j46737j84596
2761a322732Q6030P4739L12263R9801k81896k84849j5688L83295R2931j87438
2751a043544k34959K35939K00798O2713K12547o68972n68781q852K91428N35464
2741i86219J1900l23920k60647J9215O25245L6905m62310k42632R6264J83909
$$ plain form
2813 -1364796 -1297599 -1203944 -1264842 -1342922 -1204149 -1194485 -1175688 -1212744 -1093316 -1155440 -1334157
2802 -1334157 -1250922 -1118641 -907124 -951582 -987817 -1141336 -1248702 -1267223 -1074713 -936730
2792 -936730 -957353 -1095083 -1092615 -1026807 -928898 -964838 -1089385 -1296174 -1114623 -892237 -830371
2781 -830371 -817874 -1034170 -1472586 -1499435 -865646 -767498 -1170690 -1403864 -1291328 -1158557
2771 -1158557 -1148420 -820950 -1079860 -1415729 -1251559 -1035477 -983478 -991399 -1138136 -1322732
2761 -1322732 -1236702 -1161963 -849700 -749899 -1031795 -1316644 -1332332 -949037 -856106 -1043544
2751 -1043544 -1278503 -1042564 -841766 -779053 -566506 -1235478 -1804259 -1813111 -1521683 -986219
2741 -986219 -974319 -1298239 -1558886 -1539671 -914426 -877521 -1339831 -1582463 -1486199 -1302290
2731a302290N23543K50359n76030m20019j62275M27508J77378j9756k80459j39767
2721a521808j7347K60773K60769n09k42648l13014K43406N4778J67439k2370l59367
2710a489898k09010K06687L41864k4430j35721n46020J24723M75407K98707j5498
2700i73189m29571J17548K98738K8852n8793k05967L5370k43448k0296L65212
2690a085544J48532J77264m25900j91612J79537L27887n5547j8474Q217m15199
2680a350839J36124J75677K09571J48139m41527m95693J69578L44443k62476J3118
2670a353885j26148k03348N2678L61569J81293N7815J06l44504J50521J75178
2660a048725n342L8135k23501j18311q1491L68504P2342q5896j22668j82362Q6621
$$ plain form
2731 -1302290 -778747 -528388 -1104418 -1524437 -1686712 -1259204 -1081826 -1101582 -1382041 -1521808
2721 -1521808 -1539155 -1278382 -1017613 -1018122 -1260770 -1573784 -1330378 -1275600 -1108161 -1130531 -1489898
2710 -1489898 -1698908 -1492221 -1150357 -1174787 -1310508 -1856528 -1731805 -1256398 -957691 -973189
2700 -973189 -1402760 -1285212 -986474 -957622 -1016415 -1222382 -1187012 -1430460 -1450756 -1085544
2690 -1085544 -937012 -759748 -1185648 -1377260 -1197723 -869836 -925383 -943857 -935640 -1350839
2680 -1350839 -1214715 -1039038 -829467 -681328 -1122855 -1618548 -1448970 -1104527 -1367003 -1353885
2670 -1353885 -1480033 -1683381 -1630703 -1269134 -1087841 -1030026 -1029920 -1374424 -1223903 -1048725
2660 -1048725 -1054067 -1015932 -1239433 -1357744 -1439235 -1070731 -998389 -1084285 -1206953 -1389315 -1302694
2649a302694L19491l1196J3007l16669K3009L14516M44112q6312l63269l64612
2639a350617k5476K33990M07081L6912m92445r216j9132N17242m4943k11013j5951
2628i73568j78488J46482L24799j44908k07135M020l22535K46318O68212R0010
2618c46793l84291o60784K20119L39048M57130Q6220m36949n59587j8499M26165
2608h78221L49391j63381j16140m11180p4374L00754L63178K38316l57254n17863
2598a266774n37771M99157M19991J02710j28500k38303j32185M17232K99302r4514
2588f59655j83166k48635J05499M88055L57343o1015J95533N8916j34260L47521
2578B66136L88538m70130m96991l17179j48458Q5986L25540k8528k92776l86302
$$ plain form
2649 -1302694 -983203 -1014399 -1001392 -1318061 -1295052 -980536 -536424 -622736 -986005 -1350617
2639 -1350617 -1376093 -1142103 -735022 -698110 -1190555 -1199771 -1218903 -701661 -746604 -957617 -973568
2628 -973568 -1152056 -1005574 -680775 -825683 -1032818 -1028798 -1351333 -1105015 -436803 -346793
2618 -346793 -731084 -1391868 -1171749 -832701 -375571 -289351 -726300 -1285887 -1304386 -878221
2608 -878221 -528830 -692211 -808351 -1219531 -1293905 -993151 -629973 -391657 -748911 -1266774
2598 -1266774 -1804545 -1305388 -885397 -782687 -911187 -1149490 -1281675 -864443 -565141 -659655
2588 -659655 -842821 -1091456 -985957 -497902 -140559 -201574 -6041 52875 -81385 266136
2578 266136 654674 184544 -312447 -629626 -778084 -692098 -366558 -395086 -687862 -1074164
2568a074164J24407L28002K59113j48730l92953m14312K47376P75994p0142n46770
2558i12179k42614j50497j58196N94132K33334j04315l82102l27056L88187N52343
2548e08963L2303l80946n53569J61524P11913M52430j59885m72295o32302K62012
2538a087778O86079L40113r2979p22981p22254M33922N94282K8719l29849l05665
2528a178391K19376L43254M85317K15109p52082p59473K15393O71601J49960J4117
2518c75819l83867n13488N85050N87379k01054n41177m76571Q0563O33703K20378
2508c84903j42933j99058k42715p2239O41531M32102j98191l78998l46533l526
2498h95463J64989K01959p4646k12482k4327M0164L75300r6562j04566l69781
$$ plain form
2568 -1074164 -949757 -621755 -362642 -511372 -904325 -1318637 -1071261 -295267 -365409 -912179
2558 -912179 -1154793 -1305290 -1463486 -869354 -636020 -740335 -1122437 -1449493 -1061306 -508963
2548 -508963 -476660 -857606 -1411175 -1249651 -537738 -85308 -245193 -717488 -1349790 -1087778
2538 -1087778 -401699 -61586 -154565 -877546 -1599800 -1165878 -571596 -542877 -872726 -1178391
2528 -1178391 -959015 -615761 -130444 84665 -667417 -1426890 -1211497 -539896 -389936 -375819
2518 -375819 -759686 -1273174 -688124 -100745 -301799 -842976 -1319547 -1238984 -605281 -384903
2508 -384903 -527836 -726894 -969609 -1041848 -400317 31785 -166406 -545404 -891937 -895463
2498 -895463 -730474 -528515 -603161 -815643 -839970 -799806 -424506 -521068 -625634 -995415
2488i95415J298K92261K64788Q8123j78164j57760p6185K79707J52670j62103
2478d90780n44485J60613K42378J61257q3627l6560n6897j31407R3550Q7511q1884
2467f80331o758k87236L3071L52087j10505K08578k0080o3948o2913J52491N5974
2456d29570m28665j23802J55897M39146K25864j06600j83746k06927K79161K04310
2446a74932m004j60471N5753J41022j1855j73067r4753J08677N0589K7944K13754
2435b1343k59168o4543J8630q116j39600K37265J08596J02678J04406j61127j81384
2424b63706J55711J15330o3410l6146r975l4381l3790Q6783m8406J35787J47570
2413A51367n0378j9972j4380J59274N3455j53639r2231l0484j6392J8430M6930
$$ plain form
2488 -995415 -994117 -701856 -437068 -348945 -527109 -684869 -761054 -481347 -328677 -490780
2478 -490780 -1035265 -874652 -632274 -471017 -554644 -591204 -648101 -779508 -685958 -598447 -680331
2467 -680331 -687089 -974325 -941254 -589167 -699672 -491094 -511174 -575122 -638035 -485544 -429570
2456 -429570 -858235 -982037 -826140 -386994 -161130 -267730 -451476 -658403 -379242 -174932
2446 -174932 -178936 -339407 -283654 -142632 -154487 -327554 -422307 -313630 -263041 -235097 -21343
2435 -21343 -280511 -345054 -326424 -334540 -474140 -236875 -128279 -25601 78805 -82322 -263706
2424 -263706 -107995 7335 -56075 -92221 -102196 -136577 -170367 -83584 -131990 3797 151367
2413 151367 100989 81017 66637 225911 279366 125727 33496 3012 -13380 5050 51980
2402E1980K21493k41408j39171K72004K41948L16693k43244k2484j54081k86739
2392A6991K40925N73042j89576j76342k12239j36727L52232M99437l9934k34197
2382F93612j55810J70639K72762J78241q6336j81656l80356J71333M28026K14949
2372A325404k69784m26207r6457N83679O36837R7065m48198m77603L99202N79303
2362A903241J61177J98791k35120m70521j6461N95535M68877q2510k97629j24265
2352B101115K60691N93293K99778R8599k06957M7988K82864P00293K52329j20644
2342D309349j93017P65164P90975M41276J6317j97003R2365R05602J697044J536927
2332A0164999J133794J238938J313521J761342J927877J356522L58915R34907
$$ plain form
2402 51980 273473 32065 -107106 164898 406846 723539 480295 457811 303730 16991
2392 16991 257916 830958 641382 465040 252801 116074 468306 967743 927809 693612
2382 693612 537802 708441 981203 1159444 1073108 891452 511096 682429 1110455 1325404
2372 1325404 1055620 629413 532956 1116635 1753472 1850537 1402339 924736 1323938 1903241
2362 1903241 2064418 2263209 2028089 1557568 1541107 2136642 2605519 2523009 2225380 2101115
2352 2101115 2361806 2955099 3254877 3353476 3146519 3194507 3477371 4177664 4429993 4309349
2342 4309349 4116332 4881496 5672471 6113747 6130064 5933061 6025426 6931028 8628072 10164999
2332 10164999 11298793 12537731 13851252 15612594 17540471 18896993 19255908 20190815
2324B0190815K315239L561071M242494M952892P485880J6731951K8758213L5146612
2316A23385167L1403970J4778802j179008o155621j0110016j9520970k1301114
2309A11301210k0368321j7946434j5168132j2864105j0056904p078675n200516
2302B2618123l033930j534147j117474j529451k074647k055789j654854p15138
2294H902693k33634q20798j191691j406644m94253m9691K97894m84825q40038
2285C679013q25015m1818M18187J49593m18434q51520k51139J94294N26412J21755
2275B701328n46578p01720l39785M66320O41194N7219q08978m01868j06905P5010
2265A035237M04485l32490o09760l81876J84222K43267M18096l75124o06724l03190
$$ plain form
2324 20190815 22506054 26067125 30309619 35262511 42748391 59480342 88238555 123385167
2316 123385167 154789137 169567939 168388931 162233310 152123294 132602324 111301210
2309 111301210 90932889 72986455 57818323 44954218 34897314 27818639 22618123
2302 22618123 19584193 18050046 16932572 15403121 13328474 11272685 9617831 8902693
2294 8902693 8669059 7848261 6656570 5249926 4755673 4705982 5003876 4519051 3679013
2285 3679013 2853998 2812180 3230367 3379960 2961526 2110006 1858867 2053161 2579573 2701328
2275 2701328 2154750 1453030 1113245 1579565 2220759 2277978 1469000 1067132 960227 1035237
2265 1035237 1439722 1107232 497472 115596 299818 543085 961181 586057 -20667 -323857
2255c23857K92542L59569J95790j68983k47454o18295J32045K74400N9713J91751
2245A47221n84623Q2920J02587Q8906J97471J0487n0702j64642K02337L62680
2235C94642j28570l02215n80911m87510M78823M8492J08411j44341m37938K16539
2225h34578J86083M05955j39214n36772m8001K16235K28796j082n4326l77198
2215i54102j70609K17900N40746K47255m39169m81695K48760k55756M83896l0241
2205e93015l61386J08969M0274k21399M62480l3549k69725l03644Q7232L05261
2195g78502O4813O8564o91059j71884L74840K92550J86586k68462m34779J94851
2185a162482K20304R3807J8491l16538j87038K0139K23223J10551l12417j48905
$$ plain form
2255 -323857 -31315 328254 524044 355061 107607 -510688 -378643 -104243 -44530 147221
2245 147221 -437402 -354482 -251895 -162989 34482 44969 -5733 -170375 31962 394642
2235 394642 266072 -36143 -617054 -1104564 -625741 -577249 -468838 -613179 -1051117 -834578
2225 -834578 -648495 -242540 -381754 -918526 -966527 -750292 -521496 -522578 -576904 -954102
2215 -954102 -1124711 -906811 -366065 -118810 -557979 -1039674 -790914 -1046670 -562774 -593015
2205 -593015 -954401 -845432 -805158 -1026557 -564077 -597626 -867351 -1170995 -1083763 -778502
2195 -778502 -713689 -645125 -1336184 -1508068 -1133228 -840678 -654092 -922554 -1357333 -1162482
2185 -1162482 -942178 -848371 -829880 -1146418 -1333456 -1313317 -1090094 -979543 -1291960 -1440865
2175a440865O5340L87014M9754k2270n1271k09411l4407J77622k49077J63151
2165a164420o6539j24139L07809K55234J03032M1251m01603k44570K29983R7263
2155i66699J39274l40026k61327M791M24077P6507p8916l08875o9539j58834K33288
2144a306279K00343J8882l8146l87610M815L29178p4740L4435J47352k73000K20825
2133a123945P1394j36301Q6758Q5251R0748K4105j5414l26402k08038r2365K47763
2122a296446J61095R463J88085l43670k95947J80978K44706J33130l1681j45214
2112a195501j87332j71637M27636N5209k22390L3688J87467j52916J5996j07234
2102a317014k22866j18320L38724J92293o9196k79147L0918J11036K55408K7222
$$ plain form
2175 -1440865 -1375525 -988511 -938757 -961027 -1012298 -1221709 -1256116 -1078494 -1327571 -1164420
2165 -1164420 -1230959 -1355098 -1047289 -792055 -689023 -647772 -1049375 -1293945 -1063962 -966699
2155 -966699 -827425 -1167451 -1428778 -1423987 -999910 -923403 -1002319 -1311194 -1380733 -1539567 -1306279
2144 -1306279 -1105936 -1087054 -1125200 -1512810 -1507995 -1178817 -1253557 -1219122 -1071770 -1344770 -1123945
2133 -1123945 -1052551 -1188852 -1102094 -1016843 -926095 -901990 -917404 -1243806 -1451844 -1544209 -1296446
2122 -1296446 -1135351 -1125888 -937803 -1281473 -1577420 -1396442 -1151736 -1018606 -1050287 -1195501
2112 -1195501 -1382833 -1554470 -1126834 -1071625 -1294015 -1260327 -1072860 -1225776 -1209780 -1317014
2102 -1317014 -1539880 -1658200 -1319476 -1127183 -1196379 -1475526 -1444608 -1333572 -1078164 -1050942
2092a050942o3823l55769K25747L08621J07616J5265k16406l86103j7814K16235
2082a217373K22220J62563k42321J616r1479M891n2314k91609R1864o3072K08097
2071a266917M36948j15597j37786j84782l46151J16136J40407M25995R7923l04597
2061a138421P1234R1506K37345J36844n12861k68539L39051L72339j09670k98986
2051a080158r4168k69458J91531M91806K95145o5735n9075J56698p6205j51952
2041f61571L229k04016j96704q2185M55341J33561l44447j96537j21937J42120
2031a073146J7098n1627l02842p6343L69937K75731K846j32516j29025k00037
2021a299924J82447O7597j09428j84318P5299p0381M1666k416J85117m3226j8125
$$ plain form
2092 -1050942 -1114765 -1470534 -1244787 -936166 -828550 -813285 -1029691 -1415794 -1433608 -1217373
2082 -1217373 -995153 -832590 -1074911 -1073295 -1164774 -1159883 -1212197 -1503806 -1411942 -1475014 -1266917
2071 -1266917 -829969 -945566 -1083352 -1268134 -1614285 -1498149 -1357742 -931747 -833824 -1138421
2061 -1138421 -1067187 -975681 -738336 -601492 -1114353 -1382892 -1043841 -671502 -781172 -1080158
2051 -1080158 -1174326 -1443784 -1252253 -760447 -465302 -531037 -590112 -433414 -509619 -661571
2041 -661571 -658342 -862358 -1059062 -1141247 -685906 -552345 -896792 -1093329 -1215266 -1073146
2031 -1073146 -1056048 -1107675 -1410517 -1486860 -1116923 -841192 -838346 -970862 -1099887 -1299924
2021 -1299924 -1117477 -1049880 -1159308 -1343626 -1268327 -1338708 -1297042 -1299458 -1114341 -1157567 -1175692
2010a175692J2373K27257k39825j96595j97094P2766L21152Q713n4223j0109j43895
1999a375172j79983K69912L05423j33675P1139o2291m1557l231j33794O0768Q6050
1988a136411J71076O6361M7904j07704k300j24843k2277L52671o7621k32127k06325
1977a261596l6749J14280q3653L61188l1052l12459k94211m2966M12686K05275
1967i69257K2249k05466j78570M9746O13347j36482k83461j14984j40111J41595
1957a201394o6246J66782J29187j64211j14034L27302l0612J85430l1725j63146
1947i62667l053q2417k07479O814L7922M3118Q7069j0057q7430j28132J59833
1936a146479l1251l02873M19898P5493k68405K09301K03074j35431j31411N853
$$ plain form
2010 -1175692 -1163319 -936062 -1175887 -1372482 -1569576 -1496810 -1175658 -1166945 -1221168 -1231277 -1375172
1999 -1375172 -1555155 -1285243 -979820 -1113495 -1042356 -1104647 -1146204 -1149435 -1283229 -1222461 -1136411
1988 -1136411 -965335 -898974 -851070 -958774 -961074 -1085917 -1108194 -755523 -823144 -1055271 -1261596
1977 -1261596 -1298345 -1184065 -1267718 -906530 -937582 -1250041 -1544252 -1587218 -1174532 -969257
1967 -969257 -947008 -1152474 -1331044 -1281298 -667951 -804433 -1087894 -1202878 -1342989 -1201394
1957 -1201394 -1267640 -1100858 -971671 -1135882 -1249916 -922614 -953226 -767796 -799521 -962667
1947 -962667 -965720 -1048137 -1255616 -1248802 -1210880 -1167762 -1080693 -1090750 -1178180 -1306312 -1146479
1936 -1146479 -1177730 -1480603 -1060705 -985212 -1253617 -1044316 -841242 -976673 -1108084 -1102231
1926a102231k98728j70625J42287J81413K87545J04426j56683k13722j02898J0969
1916a318247K22953k4876n65701L1504K31079K61991J37847j06116Q3840M7863
1906i97863L1444L2955j87951N1192m3125m2890R4850j48575j21318j38381k66651
1895a736313K84066M87154J08755j81790k96598j79653K10790K98277J87442k03801
1885a021671k00692j09604K22085M85781l05123k59148p443r1495L73332L43547
1875e70431m68467k01692j60286M5283J74334M4623J49263l24069m3735K38599
1865a116578K74277r5999n37203q7318M39918l7286M4850P2139l3838L3045K204
1854a041789j25089l17566J79784J93207J63931j95861m0731J41278N6972k17259
$$ plain form
1926 -1102231 -1400959 -1571584 -1429297 -1247884 -960339 -855913 -1012596 -1226318 -1329216 -1318247
1916 -1318247 -1095294 -1120170 -1685871 -1654367 -1423288 -1161297 -1023450 -1129566 -1045726 -997863
1906 -997863 -966419 -933464 -1121415 -1070223 -1113348 -1156238 -1061388 -1209963 -1331281 -1469662 -1736313
1895 -1736313 -1452247 -965093 -856338 -1038128 -1334726 -1514379 -1303589 -1005312 -817870 -1021671
1885 -1021671 -1222363 -1331967 -1109882 -624101 -929224 -1188372 -1195815 -1287310 -913978 -570431
1875 -570431 -1038898 -1240590 -1400876 -1355593 -1181259 -1136636 -987373 -1311442 -1355177 -1116578
1865 -1116578 -842301 -938300 -1475503 -1562821 -1122903 -1160189 -1115339 -1043200 -1077038 -1043993 -1041789
1854 -1041789 -1166878 -1484444 -1304660 -1111453 -947522 -1143383 -1184114 -1042836 -985864 -1203123
1844a203123K6722J85243L17060k69815k47671l6510J61794K44286k4844j49973
1834i96831j34084m0014K38038K97683j54522o9207j99944J28190L29802j07671
1824g08560J35l05814R0589J14531q158J7965m10497O9359K7459N8695L66767
1813f87529k55839k55825j036L05649K28858l18959l17727J10945J52580K84516
1803g54367J38192j70413k14113j00267j66618l0756L12973m5735j23347K10287
1793i44164k7476J24949P6626l35062n8404j12279J64791P1513L05697p9406j93699
1782a006914p0781J15291l59823K18327K33446j44129p9349J39219J68932j67984
1772i53765j50989k02992j32722K91876j34180j78615j63611q7108M50614n0536
$$ plain form
1844 -1203123 -1176401 -991158 -674098 -943913 -1191584 -1228094 -1066300 -822014 -846858 -996831
1834 -996831 -1130915 -1170929 -932891 -635208 -789730 -858937 -1058881 -930691 -600889 -708560
1824 -708560 -708425 -1014239 -923650 -809119 -817277 -799312 -1209809 -1140450 -1112991 -1054296 -687529
1813 -687529 -943368 -1199193 -1200229 -894580 -665722 -984681 -1302408 -1191463 -1038883 -754367
1803 -754367 -616175 -786588 -1000701 -1100968 -1267586 -1298342 -985369 -1031104 -1154451 -944164
1793 -944164 -971640 -846691 -770065 -1105127 -1163531 -1275810 -1111019 -1039506 -733809 -813215 -1006914
1782 -1006914 -1077695 -962404 -1322227 -1103900 -870454 -1014583 -1093932 -954713 -785781 -953765
1772 -953765 -1104754 -1307746 -1440468 -1148592 -1282772 -1461387 -1624998 -1712106 -1261492 -1312028
1762a312028K44849K6992j6777K18181j85486l555k70653q2100L57797K74619
1752g48161q6174m54374j0675R0583k3081M90777l85665l93101J35534M1051N01983
1741h41303L13417l50360l72876N9887J96370M00295R8976o47325l60181M70421
1731a032679L47284J86029l46852m44097j79530M39763N20288J9848n17565n10848
1721a518359M02978L78153K36865r191p05607k00695L95583M75972Q0090j93357
1711f57568n93221o07012M81899Q99075K65460n82393o79213r3112Q02140N25340
1701b38605m6992q72168n33947J86104O66353N27208l31726q91247j35991P84440
1691h86571N76687K568n40149p25862m245P90380N03943L005q74393n18760K14414
$$ plain form
1762 -1312028 -1067179 -1040187 -1056964 -838783 -1024269 -1027824 -1298477 -1380577 -1022780 -748161
1752 -748161 -834335 -1288709 -1299384 -1208801 -1231882 -741105 -1126770 -1519871 -1384337 -1343286 -841303
1741 -841303 -527886 -878246 -1251122 -1191235 -994865 -594570 -495594 -1142919 -1503100 -1032679
1731 -1032679 -685395 -499366 -846218 -1290315 -1469845 -1030082 -509794 -489946 -1007511 -1518359
1721 -1518359 -1115381 -737228 -500363 -509554 -1215161 -1415856 -1020273 -544301 -464211 -657568
1711 -657568 -1250789 -1857801 -1375902 -476827 -211367 -793760 -1472973 -1566085 -763945 -238605
1701 -238605 -285597 -1157765 -1691712 -1505608 -839255 -312047 -643773 -1535020 -1671011 -886571
1691 -886571 -309884 -307316 -847465 -1573327 -1577572 -787192 -283249 -280244 -1154637 -1673397 -1458983
1680a458983O17161L76225l07828o03498k94427L21186O84049N21473o34975p21456
1670a501073Q1911O18744N11601k02825o46903n48403J79215O48501N61134j45527
1660d43625o93776m12114O22725N00692J57927p40182o90233J6430N94574N85462
1650e02120j22808o58791k73899M64825N10868R9977l99056m41464n8052L81440
1640i99080L87749n2309o21798M2551J16129P0882M89180j62854o71987l14164
1630a715701M40403O12335Q7069o90971l58295M61182K43226q1480J1799m25607
1620a416040J6575L28069L63074L42472k40578k43955m9614L19501K87192m07585
1610g00889m92417k53297M21192L64375R4985m45974m84757j66338M52140O46249
$$ plain form
1680 -1458983 -841822 -465597 -773425 -1376923 -1671350 -1350164 -666115 -144642 -779617 -1501073
1670 -1501073 -1419162 -800418 -288817 -491642 -1138545 -1686948 -1507733 -859232 -298098 -443625
1660 -443625 -1137401 -1549515 -926790 -426098 -268171 -1008353 -1698586 -1682156 -1087582 -502120
1650 -502120 -624928 -1283719 -1557618 -1092793 -581925 -481948 -881004 -1322468 -1380520 -999080
1640 -999080 -611331 -663640 -1285438 -1242887 -1126758 -1055876 -566696 -729550 -1401537 -1715701
1630 -1715701 -1275298 -662963 -575894 -1266865 -1625160 -1163978 -920752 -1002232 -990433 -1416040
1620 -1416040 -1399465 -1071396 -708322 -365850 -606428 -850383 -899997 -580496 -293304 -700889
1610 -700889 -1193306 -1446603 -1025411 -661036 -566051 -1012025 -1496782 -1663120 -1210980 -564731
1600e64731l60019n51674j25201M48479N15325q8994k94074l63844l8548M37721
1590i85560L45820j93919m23412m5318l00733K31699L85940J23448k42188j53033
1580a257256L37132L77148j64804j21751m00189o8729M39963O76295k51980m55281
1570h89452q2896K51570J59714M727k30356m68803l17050L26866L81898j08920
1560i72702k89575Q4239J96081J74180P5008j47906k67919k85644K01012L62579
1550h70647K48610k74175l43383k61823J96722L31388K22564l78424Q2455J51841
1540h94872R8361O7457k13408j32167J59343o1766j64117M6619j88136L5535M9971
1529a197180K47960j77986k20883N5401K02012K31958R3154m3932k81506l6737
$$ plain form
1600 -564731 -924750 -1476424 -1601625 -1153146 -637821 -726815 -1020889 -1384733 -1423281 -985560
1590 -985560 -639740 -833659 -1257071 -1302389 -1603122 -1371423 -985483 -862035 -1104223 -1257256
1580 -1257256 -920124 -542976 -707780 -829531 -1229720 -1298449 -858486 -182191 -434171 -889452
1570 -889452 -972348 -720778 -561064 -556337 -786693 -1255496 -1572546 -1245680 -863782 -972702
1560 -972702 -1262277 -1178038 -981957 -807777 -732769 -880675 -1148594 -1434238 -1233226 -870647
1550 -870647 -622037 -896212 -1239595 -1501418 -1304696 -973308 -750744 -1129168 -1046713 -894872
1540 -894872 -796511 -729054 -942462 -1074629 -915286 -977052 -1141169 -1094550 -1282686 -1247151 -1197180
1529 -1197180 -949220 -1127206 -1348089 -1292688 -1090676 -858718 -765564 -809496 -1091002 -1127739
1519a127739J20369L11773k31013j42652j47680j4284N19948O5750k64528k81332
1509a191388K54491J28176J59018M0248n99190Q5211J57223J71086j32897J33365
1499g94657j71085m59002K04024N19752L41380k59585m58625j27062M21505K70374
1489e12981j96575k54558l71723J26923L84134L00041R5834n60972l55425L56088
1479i89214L12260j84883N1108l89021j28505K08972J67592L01075k5376m38174
1469a114166j82205L64418L79596k00872j41627k92530O0169P1248L50387j23450
1459h29032k84620k30440M5494M67930k1591o8915j74073o6402K52792k3883k7913
1448i60653J91165k44540m2947n9361k5219K74533l02836j12837L30758L11547
$$ plain form
1519 -1127739 -1007370 -695597 -926610 -1069262 -1216942 -1231226 -711278 -645528 -910056 -1191388
1509 -1191388 -936897 -808721 -649703 -609455 -1208645 -1123434 -966211 -795125 -928022 -794657
1499 -794657 -965742 -1424744 -1220720 -700968 -359588 -619173 -1077798 -1204860 -783355 -512981
1489 -512981 -709556 -964114 -1335837 -1208914 -824780 -524739 -428905 -989877 -1345302 -989214
1479 -989214 -676954 -861837 -810729 -1199750 -1328255 -1119283 -951691 -650616 -675992 -1114166
1469 -1114166 -1296371 -931953 -552357 -753229 -894856 -1187386 -1127217 -1055969 -705582 -829032
1459 -829032 -1113652 -1344092 -1298598 -830668 -852259 -921174 -1095247 -1161649 -908857 -932740 -960653
1448 -960653 -769488 -1014028 -1056975 -1116336 -1141555 -867022 -1169858 -1282695 -951937 -640390
1438f40390O3677j86625n61154N5403L15113k0966K43502m151l03366J03974L53200
1427e81783k55543k1676m27340o7995j8904L31078L6333n5386j51254K40637q427
1416i80260k3278j9517p0965J58533j14895M975Q5254k24595m18492L56743M12318
1405h34179J14295q3711m02797J2143J26629P6591j35455k2893j32195J48294
1395a133278M11223M4745J35318l17069k88840m2249L24622M3896m32836j17757
1385a372225J60094L08253l00907j10699j78417m974O30414J25023M6844k20391
1375i16985j93999k75058L27872M68643J10584n72302j63262R5180J59081R8039
1365h62207J2068k05074r2557K36908L88057r9311k52439k51458K3363L07823
$$ plain form
1438 -640390 -576713 -763338 -1324492 -1269089 -953976 -974942 -731440 -735591 -1038957 -934983 -581783
1427 -581783 -837326 -859002 -1286342 -1354337 -1373241 -1042163 -1005830 -1061216 -1212470 -971833 -980260
1416 -980260 -1003538 -1023055 -1094020 -935487 -1050382 -1045407 -960153 -1184748 -1603240 -1246497 -834179
1405 -834179 -719884 -803595 -1206392 -1194249 -1067620 -991029 -1126484 -1149377 -1281572 -1133278
1395 -1133278 -722055 -677310 -541992 -859061 -1147901 -1190150 -865528 -821632 -1254468 -1372225
1385 -1372225 -1212131 -903878 -1204785 -1315484 -1493901 -1498875 -868461 -743438 -696594 -916985
1375 -916985 -1110984 -1386042 -1058170 -589527 -478943 -1051245 -1214507 -1119327 -960246 -862207
1365 -862207 -850139 -1055213 -1147770 -910862 -522805 -622116 -874555 -1126013 -1102650 -794827
1355g94827Q396r2339l75688k35313O9312O46422K69966o4727j25449k88059m2877
1344a025183K27691Q5299l7265k10930l57328j26156K94341o9445j32829Q5513
1334a266292K0162k7332J67030J78514j6747j92552L02033j57157l19356J01421
1324a210276K53262O3952j96383m5899L2598L88364r5662K2938j14855j8670J03463
1313h17168k9850n9777L833q32k51883K22169J51280P2281k6902O5609k88508
1302i59748L654L16548K4930L7256j30480l73809J31031M15167l13702P6638j1916
1291g84431l36087K24337K67194l12851j80080o4702o4610K83050K95733j1272
1281f83719k55452j16229J25640o683K04498J6940J34654j8428J5603k67746J96570
$$ plain form
1355 -794827 -786431 -878770 -1254458 -1489771 -1420459 -774037 -504071 -568798 -694247 -982306 -1025183
1344 -1025183 -797492 -712193 -749458 -960388 -1317716 -1443872 -1149531 -1218976 -1351805 -1266292
1334 -1266292 -1246130 -1273462 -1106432 -927918 -944665 -1137217 -835184 -992341 -1311697 -1210276
1324 -1210276 -957014 -893062 -1089445 -1135344 -1102746 -714382 -810044 -787106 -901961 -920631 -817168
1313 -817168 -847018 -906795 -902962 -903794 -1155677 -933508 -782228 -709947 -736849 -671240 -959748
1302 -959748 -956094 -639546 -614616 -577360 -707840 -1081649 -950618 -535451 -849153 -772515 -784431
1291 -784431 -1120518 -896181 -628987 -941838 -1121918 -1186620 -1251230 -968180 -672447 -683719
1281 -683719 -939171 -1055400 -929760 -936443 -731945 -715005 -580351 -598779 -583176 -850922 -654352
1270f54352J43962j83321k5577m1942J94561k95457k19928j6241R6417R6967M6573
1259h58338j06679j47560j77015K06039K6995n6172J90303Q933j24642n3699L28
1248a091507q6277Q1567K51421L5588j14645m2588Q5518L16578k4122J01273j19608
1237f06802r6558P9988J09162J71138j00858m51100k81177L79830J81266K570
1227f12541k29766j25323k79446L2999K61997L23453R9315l20565k40779j58722
1217a249378L91681K49249m57711j40344J79370K01200J98888k74745k36503K89619
1207h48674P6719J78504J8017m4712j66316l62286l05332J75577M62522K7750
1197g88231P4968j21498j59913L28844j24672j80733k17400P4244J82817q4411
$$ plain form
1270 -654352 -510390 -693711 -719288 -761230 -566669 -862126 -1082054 -1098295 -1001878 -904911 -858338
1259 -858338 -965017 -1112577 -1289592 -1083553 -1056558 -1112730 -922427 -913494 -1038136 -1091835 -1091507
1248 -1091507 -1177784 -1096217 -844796 -809208 -923853 -966441 -880923 -564345 -588467 -487194 -606802
1237 -606802 -703360 -623372 -514210 -343072 -443930 -895030 -1176207 -796377 -615111 -612541
1227 -612541 -842307 -967630 -1247076 -1214077 -952080 -628627 -529312 -849877 -1090656 -1249378
1217 -1249378 -857697 -608448 -1066159 -1206503 -1027133 -825933 -627045 -901790 -1138293 -848674
1207 -848674 -771955 -593451 -575434 -620146 -786462 -1148748 -1454080 -1278503 -815981 -788231
1197 -788231 -713263 -834761 -994674 -665830 -790502 -971235 -1188635 -1114391 -931574 -1015985
1187a015985K50087R2916j68012m1267K3146M0515j1507j75895j35675j39885
1177a281562L52594K59946k77647q1038K14440N5231J52450L5696k52218j34856
1167i56964m4201J47995M0166j63880k51118p8833J89702J03910J95544K10568
1157f07111J07197k64131j21947K93519K56393m30052m49469J24951L00999J25686
1147f63965j38457l91515l23321J26385L99720L29557m4599n26110n8841n6422
1137a347568K56913K54378j4550l07618p2227L11181J5284P2804K2481j45796
1127i54718n4777M56307Q8404k41779l05448p5704O6018K36265K02563j79705
1117g62574m03044L70605K99855q4260j90291n26762J30222J41459K38793J96071
$$ plain form
1187 -1015985 -765898 -672982 -840994 -882261 -859115 -818600 -830107 -1006002 -1141677 -1281562
1177 -1281562 -928968 -669022 -946669 -1027707 -813267 -758036 -605586 -569890 -822108 -956964
1167 -956964 -1001165 -853170 -813004 -976884 -1228002 -1306835 -1117133 -1013223 -817679 -607111
1157 -607111 -499914 -764045 -885992 -592473 -336080 -766132 -1215601 -1090650 -789651 -663965
1147 -663965 -802422 -1193937 -1517258 -1390873 -991153 -661596 -706195 -1232305 -1291146 -1347568
1137 -1347568 -1090655 -836277 -850827 -1158445 -1230672 -919491 -904207 -831403 -808922 -954718
1127 -954718 -1009495 -553188 -464784 -706563 -1012011 -1087715 -1021697 -785432 -582869 -762574
1117 -762574 -1165618 -795013 -495158 -579418 -769709 -1296471 -1166249 -1024790 -785997 -589926
1107e89926l14916m52943k11787M71184P07267o3962n99264j37882R4386J12691
1097i85152N87127P1060n80904m62762k2094R06437J66531n27778k73563L9057
1087a082041L68425M49864j15621m77635n06785Q2174N70219K41231j56465n40225
1077a166859l49629O6893Q45743J20771n03278m27364J00936L51608J62345l2005
1067h30839j64636k72951j43308N49785M18574l11662k16514l4813O4611L56013
1057e85740J7448k89586k75085O3085L11391M27167j00624l35360k02193O398
1047i63099J23298J50501k19121p0982j08702j39789Q6058J20249k0719j19528
$$ plain form
1107 -589926 -904842 -1357785 -1569572 -1098388 -391121 -455083 -1054347 -1192229 -1097843 -985152
1097 -985152 -398025 -326965 -907869 -1370631 -1392725 -486288 -319757 -847535 -1121098 -1082041
1087 -1082041 -713616 -263752 -379373 -857008 -1363793 -1281619 -711400 -470169 -626634 -1166859
1077 -1166859 -1516488 -1449595 -603852 -483081 -986359 -1413723 -1312787 -961179 -798834 -830839
1067 -830839 -995475 -1268426 -1411734 -861949 -443375 -755037 -971551 -1006364 -941753 -585740
1057 -585740 -568292 -857878 -1132963 -1069878 -758487 -331320 -431944 -767304 -969497 -963099
1047 -963099 -839801 -689300 -908421 -979403 -1088105 -1227894 -1141836 -1021587 -1042306 -1161834
$$ [...]
##END NTUPLES=NMR SPECTRUM
##END=
