##TITLE=1H_DE-80H_X3
 200.13MHz, d2o
 8 sc
 
 19ns.26.2.2025
##JCAMPDX= 6.0         $$ Bruker NMR JCAMP-DX V2.0
##DATA TYPE= NMR SPECTRUM
##DATA CLASS= NTUPLES
##ORIGIN= UXNMR, Bruker Analytische Messtechnik GmbH
##OWNER= pz
$$ XWIN-NMR		Version 3.5
$$ Mon Jul 13 10:16:03 2026 Russian Standard Time (UT+4h)  Yarkov@DPX200
##.OBSERVE FREQUENCY= 200.1313
##.OBSERVE NUCLEUS= ^1H
##.ACQUISITION MODE= SIMULTANEOUS
##.ACQUISITION SCHEME= undefined
##.AVERAGES= 8
##.DIGITISER RES= 18
##SPECTROMETER/DATA SYSTEM= spect
##.PULSE SEQUENCE= zg30
##.SOLVENT NAME= CDCl3
##.SHIFT REFERENCE= (INTERNAL, CDCl3, 0, 15.4924)
##AUDIT TRAIL= $$ (NUMBER, WHEN, WHO, WHERE, WHAT)
$$ ##TITLE= Audit trail, XWIN-NMR		Version 3.5
$$ ##JCAMPDX= 5.01
$$ ##ORIGIN= Bruker BioSpin GmbH
$$ ##OWNER= Yarkov
$$ C:/Bruker/XWIN-NMR/data/yarkov2/nmr/H-C/1/pdata/1/auditp.txt
$$ ##AUDIT TRAIL=  $$ (NUMBER, WHEN, WHO, WHERE, WHAT)
(   1,<2026-07-13 10:15:02.10 +0400>,<Yarkov>,<DPX200>,
      <created by zg, POWCHK disabled, PULCHK disabled
       configuration hash MD5:
       00 E9 B6 7A A2 85 ED C7 34 08 36 98 17 FE 4E 26
       data hash MD5: 16K
       0C 5C 67 84 97 75 4F 25 49 6F FA 5B ED E6 59 DF>)
(   2,<2026-07-13 10:15:07.29 +0400>,<Yarkov>,<DPX200>,
      <Start of raw data processing
       efp BC_mod = 2 LB = 0.25 FT_mod = 6 PKNL = 1 PHC0 = -7258.148 PHC1 = 6.42196 SI = 16K 
       data hash MD5: 16K
       83 B2 D2 6B 7A CE D7 7D 03 E7 4B D6 27 45 CB 81>)
(   3,<2026-07-13 10:15:23.42 +0400>,<Yarkov>,<DPX200>,
      <pk PHC0 = 5.2 PHC1 = 0 
       data hash MD5: 16K
       CE 81 7B 14 71 55 BC 5F F1 60 5D C5 A7 62 58 65>)
$$ ##END=
$$ 
$$ hash MD5
$$ 73 5B 4E 19 4C 2D 8A F0 52 3E 6E 86 FA 88 74 85
##$RELAX= 
##$RELAX= 
##$RELAX= 
##$RELAX= 
##$RELAX= 
##$RELAX= 
$$ Bruker specific parameters
$$ --------------------------
##$DU= <C:/Bruker/XWIN-NMR>
##$EXPNO= 1
##$NAME= <H-C>
##$PROCNO= 1
##$TYPE= <nmr>
##$USER= <yarkov2>
##$AMP= (0..31)
100 100 100 100 100 100 100 100 100 100 100 100 100 100 100 100 100 100 
100 100 100 100 100 100 100 100 100 100 100 100 100 100 
##$AQSEQ= 0
##$AQ_mod= 1
##$AUNM= <au_zg>
##$AUTOPOS= <>
##$BF1= 200.13
##$BF2= 200.13
##$BF3= 200.13
##$BF4= 200.13
##$BF5= 200.13
##$BF6= 200.13
##$BF7= 200.13
##$BF8= 200.13
##$BYTORDA= 1
##$CFDGTYP= 0
##$CFRGTYP= 5
##$CHEMSTR= <none>
##$CNST= (0..31)
1 1 145 1 1 1 1 1 1 1 1 1 1 1 1 1 1 1 1 1 1 1 1 1 1 1 1 1 1 1 1 1 
##$CPDPRG= <>
##$CPDPRG1= <>
##$CPDPRG2= <>
##$CPDPRG3= <>
##$CPDPRG4= <mlev>
##$CPDPRG5= <mlev>
##$CPDPRG6= <mlev>
##$CPDPRG7= <mlev>
##$CPDPRG8= <mlev>
##$CPDPRGB= <>
##$CPDPRGT= <>
##$D= (0..31)
0 0.7 0 0 0 0 0 0 0 0 0 0.03 0 0 0 0 0 0 0 0 0 0 0 0 0 0 0 0 0 0 0 0 
##$DATE= 1783923301
##$DBL= (0..7)
120 120 120 120 120 120 120 120 
##$DBP= (0..7)
150 150 150 150 150 150 150 150 
##$DBP07= 0
##$DBPNAM0= <>
##$DBPNAM1= <>
##$DBPNAM2= <>
##$DBPNAM3= <>
##$DBPNAM4= <>
##$DBPNAM5= <>
##$DBPNAM6= <>
##$DBPNAM7= <>
##$DBPOAL= (0..7)
0.5 0.5 0.5 0.5 0.5 0.5 0.5 0.5 
##$DBPOFFS= (0..7)
0 0 0 0 0 0 0 0 
$$ [...]
##$SUBNAM2= <"">
##$SUBNAM3= <"">
##$SUBNAM4= <"">
##$SUBNAM5= <"">
##$SUBNAM6= <"">
##$SUBNAM7= <"">
##$SUBNAM8= <"">
##$SUBNAM9= <"">
##$SW= 18.0517328524113
##$SWIBOX= (0..15)
0 0 2 0 0 0 0 0 0 0 0 0 0 0 0 0 
##$SW_h= 3612.71676300578
##$TD= 16384
##$TD0= 1
##$TE= 0
##$TE2= 300
##$TE3= 300
##$TEG= 300
##$TL= (0..7)
0 120 120 120 120 120 120 120 
##$TP= (0..7)
150 150 150 150 150 150 150 150 
##$TP07= 0
##$TPNAME0= <>
##$TPNAME1= <>
##$TPNAME2= <>
##$TPNAME3= <>
##$TPNAME4= <>
##$TPNAME5= <>
##$TPNAME6= <>
##$TPNAME7= <>
##$TPOAL= (0..7)
0.5 0.5 0.5 0.5 0.5 0.5 0.5 0.5 
##$TPOFFS= (0..7)
0 0 0 0 0 0 0 0 
##$TUNHIN= 0
##$TUNHOUT= 0
##$TUNXOUT= 0
##$USERA1= <user>
##$USERA2= <user>
##$USERA3= <user>
##$USERA4= <user>
##$USERA5= <user>
##$V9= 5
##$VALIST= <valist>
##$VCLIST= <CCCCCCCCCCCCCCC>
##$VD= 0
##$VDLIST= <DDDDDDDDDDDDDDD>
##$VPLIST= <PPPPPPPPPPPPPPP>
##$VTLIST= <TTTTTTTTTTTTTTT>
##$WBST= 1024
##$WBSW= 4
##$XGAIN= (0..3)
0 0 0 0 
##$XL= 0
##$YL= 0
##$YMAX_a= 59216
##$YMIN_a= -88750
##$ZGOPTNS= <>
##$ZL1= 120
##$ZL2= 120
##$ZL3= 120
##$ZL4= 120
##$ABSF1= 0
##$ABSF2= 0
##$ABSG= 0
##$ABSL= 0
##$ALPHA= 0
##$AQORDER= 0
##$ASSFAC= 0
##$ASSFACI= 0
##$ASSFACX= 0
##$ASSWID= 0
##$AUNMP= <proc_1d>
##$AZFE= 0.1
##$AZFW= 0.1
##$BCFW= 0
##$BC_mod= 2
##$BYTORDP= 0
##$COROFFS= 0
##$CY= -3
##$DATMOD= 1
##$DC= 0
##$DFILT= <>
##$DTYPP= 0
##$F1P= 0
##$F2P= 0
##$FCOR= 1
##$FTSIZE= 16384
##$FT_mod= 6
##$GAMMA= 0
##$GB= 0
##$INTBC= 1
##$INTSCL= 3.241238e-09
##$ISEN= 128
##$LB= 0.25
##$LEV0= 0
##$LPBIN= 0
##$MAXI= 10000
##$MC2= 0
##$MEAN= 0
##$ME_mod= 0
##$MI= 1.114404
##$NCOEF= 0
##$NC_proc= -7
##$NLEV= 6
##$NOISF1= 3.799351
##$NOISF2= 2.8
##$NSP= 0
##$NTH_PI= 0
##$NZP= 0
##$OFFSET= 15.49237
##$PC= 1
##$PHC0= -7252.948
##$PHC1= 6.42196
##$PH_mod= 1
##$PKNL= yes
##$PPARMOD= 0
##$PSCAL= 0
##$PSIGN= 0
##$REVERSE= no
##$SF= 200.130005869897
##$SI= 16384
##$SIGF1= 3
##$SIGF2= 2
##$SINO= 0.751879
##$SIOLD= 32768
##$SREGLST= <19F.Aceton>
##$SSB= 0
##$STSI= 16384
##$STSR= 0
##$SW_p= 3612.71676300578
##$SYMM= 0
##$S_DEV= 0
##$TDeff= 16384
##$TDoff= 0
##$TI= <>
##$TILT= no
##$TM1= 0
##$TM2= 0
##$TOPLEV= 0
##$USERP1= <user>
##$USERP2= <user>
##$USERP3= <user>
##$USERP4= <user>
##$USERP5= <user>
##$WDW= 1
##$XDIM= 16384
##$YMAX_p= 309333404
##$YMIN_p= -1341649
$$ End of Bruker specific parameters
$$ ---------------------------------
##NTUPLES= NMR SPECTRUM
##VAR_NAME=  FREQUENCY,     SPECTRUM/REAL,   SPECTRUM/IMAG
##SYMBOL=    X,             R,               I
##VAR_TYPE=  INDEPENDENT,   DEPENDENT,       DEPENDENT
##VAR_FORM=  AFFN,          ASDF,            ASDF
##VAR_DIM=   16384,         16384,           16384
##UNITS=     HZ,            ARBITRARY UNITS, ARBITRARY UNITS
##FACTOR=    0.220516191357247, 1,           1
##FIRST=     3100.48802935223, 0,            0
##LAST=      -512.228733653546, 0,           0
##MIN=       -512.228733653546, -1341649,    0
##MAX=       3100.48802935223, 309333404,    0
$$ Real data points
##PAGE= N=1
##DATA TABLE= (X++(R..R)), XYDATA
$$ [...]
$$ plain form
8978 412054 575794 419678 350097 215103 301844 283036 292327 483512 469812 248883 236640
8967 236640 440956 514793 492588 415174 566328 308587 479835 651997 671322 698504 362566
8956 362566 667047 924883 696768 858750 820102 893504 865943 827349 954635 945541 998599
8945 998599 954214 1004970 1167527 1378355 1485016 1602765 1505166 1857356 1998996 2224057
8935 2224057 2581906 2811732 3060337 3541572 3985156 5181353 6216660 8136966 11723877
8926 11723877 15901732 18615993 18079832 16086782 13902722 11551058 9455882 8181883
8918 8181883 6495917 5442622 4797638 4392483 3565010 2978729 2786656 2695529 2160175
8909 2160175 2115327 2015433 1792324 1698493 1415683 1452353 1411277 1341272 1278166 1278157 1129199 1197360
$$ packed form
8978D12054J63740j56116o9581j34994Q6741j8808R291J91185j3700k20929j2243
8967B36640K04316P3837k2205p7414J51154k57741J71248J72162J9325K7182l35938
8956C62566L04481K57836k28115J61982l8648P3402k7561l8594J27286r094N3058
8945I98599m4385N0756J62557K10828J06661J17749r7599L52190J41640K25061
8935B224057L57849K29826K48605M81235M43584J196197J035307J920306L586911
8926A1723877M177855K714261n36161j993050k184060k351664k095176j273999
8918H181883j685966j053295o44984m05155q27473n86281j92073r1127n35354
8909B160175m4848r9894k23109r3831k82810L6670m1076p0005o3106rj48958O8161
$$ plain form
8897 1197360 724533 997873 1299792 1077980 846157 843926 811640 653634 803815 975950
8887 975950 873136 846164 575756 775108 818404 544533 646894 691626 465372 489710
8877 489710 425277 364423 776525 385106 339397 584596 483341 478501 457168 584854 785706
8866 785706 315106 671638 574688 529672 312488 470279 509038 180002 177771 463527 375467
8855 375467 29898 330603 230568 432042 89183 280396 538811 150599 285827 466409
8845 466409 425533 115774 129692 420904 447321 411565 355846 446886 203757 94375 171434
8834 171434 274602 320095 212841 326738 75818 307986 50307 79844 263313 -7833
8824 -7833 323359 390136 365836 293634 315225 306853 323130 183949 284574 188282 -146552
$$ packed form
8897A197360m72827K73340L01919k21812k31823k231l2286j58006J50181J72135
8887I75950j02814k6972k70408J99352M3296k73871J02361M4732k26254K4338
8877D89710o4433o0854M12102l91419m5709K45199j01255m840k1333J27686K00852
8866G85706m70600L56532r6950m5016k17184J57791L8759l29036k231K85756q8060
8855C75467l45569L00705j00035K01474l42859J91213K58415l88212J35228J80582
8845D66409m0876l09759J3918K91212K6417l5756n5719R1040k43129j09382P7059
8834A71434J03168M5493j07254J13897k50920K32168k57679K9537J83469k71146
8824g833L31192O6777k4300p2202K1591q372J6277j39181J00625r6292l34834
$$ plain form
8813 -146552 43057 240123 145913 207118 119289 219311 -146493 -57306 346237 264080 188816
8802 188816 236872 50269 290445 211975 203518 153786 132175 238734 97949 118802 289824
8791 289824 398409 11376 -3215 132876 166808 -139567 -185348 91111 238468 4606
8781 4606 64595 184888 167338 -139599 123609 192339 93554 135550 -79772 199992 73858
8770 73858 -10937 68722 165545 -99041 -99269 63650 372120 84506 48848 296548 15896
8759 15896 66576 -31389 307556 298831 179610 181116 280053 123160 166799 200801 167157 155086
8747 155086 168147 322673 197811 -109956 80535 9815 53938 424131 265068 264720 -10898
8736 -10898 251372 147458 274221 346230 51040 -67210 -193853 48416 133149 33628
$$ packed form
8813a46552J89609J97066r4210O1205q7829J00022l65804Q9187M03543q2157p5264
8802A88816M8056j86603K40176p8470q457m9732k1611J06559j40785K0853J71022
8791B89824J08585l87033j4591J36091L3932l06375m5781K76459J47357k33862
8781D606N9989J20293j7550l06937K63208O8730r8785M1996k15322K79764j26134
8770G3858q4795P9659R6823k64586k28J62919L08470k87614l5658K47700k80652
8759A5896N0680r7965L38945q725j19221J506R8937j56893M3639L4002l3644j2071
8747A55086J3061J54526j24862l07767J90491p0720M4123L70193j59063l48k75618
8736a0898K62270j03914J26763P2009k95190j18250j26643K42269Q4733r9521
$$ plain form
8726 33628 123884 146577 119263 218254 25093 -50365 280378 167623 -109983 -112914 201098
8715 201098 356988 42381 -66352 191399 266517 63488 97306 9728 146577 -103031
8705 -103031 64936 232482 26743 -55095 -132392 -56874 118212 -86764 95140 323925
8695 323925 168223 85049 -72584 155239 136273 175857 108172 340281 16802 -79049 306553
8684 306553 195195 207582 -7810 192910 236175 74393 56992 59434 128444 67128 56174
8673 56174 300613 47208 115068 -39699 57070 129322 -43878 13401 202620 277069 7187
8662 7187 172669 223954 -62404 -237346 -84072 213175 201851 95749 159821 131708 -66168
8651 -66168 -282203 169800 54399 -138715 111465 99132 46445 39650 -48969 301915 178637
$$ packed form
8726C3628R0256K2693k7314R8991j93161p5458L30743j12755k77606k931L14012
8715B01098J55890l14607j08733K57751P5118k03029L3818q7578J36849k49608
8705a03031J67967J67546k05739q1838p7297P5518J75086k04976J81904K28785
8695C23925j55702q3174j57633K27823j8966L9584o7685K32109l23479r5851L85602
8684C06553j11358J2387k15392K00720M3265j61782j7401K442O9010o1316j0954
8673E6174K44439k53405O7860j54767R6769P2252j73200N7279J89219P4449k69882
8662G187J65482N1285k86358j74942J53274K97247j1324j06102O4072k8113j97876
8651f6168k16035M52003j15401j93114K50180j2333n2687o795q8619L50884j23278
$$ plain form
8640 178637 45163 271758 122296 128209 18757 42772 108711 193222 -73963 -216015 18290
8629 18290 -154098 10370 173683 257338 12154 -159368 60896 86769 103968 107040 316381
8618 316381 140819 -93411 153859 127951 -6208 57012 56636 -44655 -41694 90020 228389
8607 228389 24243 17264 44294 274301 41800 263315 250504 -49098 -36195 189150 145586
8596 145586 124896 29789 39057 39414 -38652 -76909 -148493 260735 68745 360175 10261
8585 10261 280118 171139 -42644 73134 -42260 255963 702263 514669 218773 174034
8575 174034 83392 299930 117599 70318 277141 53643 43999 126980 131032 8469 -100996
8564 -100996 197469 120454 -258265 54080 310504 110984 344696 252450 230892 34783
$$ packed form
8640A78637j33474K26595j49462N913j09452K4015O5939Q4511k67185j42052K34305
8629A8290j72388J64468J63313Q3655k45184j71522K20264K5873J7199L072K09341
8618C16381j75562k34230K47270k5908j34159O3220l76j01291K961J31714J38369
8607B28389k04146o979K7030K30007k32501K21515j2811k99602J2903K25345m3564
8596A45586k0690r5107R268L57p8066l8257p1584M09228j91990K91430l49914
8585A0261K69857j08979k13783J15778j15394K98223M46300j87594k95896m4739
8575A74034r0642K16538j82331m7281K06823k23498r644Q2981M052j22563j09465
8564a00996K98465p7015l78719L12345K56424j99520K33712r2246k1558j96109
$$ plain form
8554 34783 -64414 38192 30112 -135926 -81430 189395 230776 22546 91836 16392 200642
8543 200642 99952 22025 240773 73213 66163 -116685 123689 -167694 -117722 -183229 14909
8532 14909 112698 -70555 154337 21509 74820 104660 139376 59507 145198 160907 -27643
8521 -27643 98290 325929 -90825 -139113 -89878 -70898 -107971 -321867 193351 302172 26523
8510 26523 -83687 250277 278576 -74111 15329 53695 228593 240297 141587 293487 183409
8499 183409 54537 53539 161089 89184 164976 77439 66634 233233 23073 159169 324949
8488 324949 -13094 -887 24743 102462 71100 -70353 7164 53699 211249 325755 407901
8477 407901 141966 -22390 -24042 -58388 -221522 313388 215792 70309 -10933 94136 23746
$$ packed form
8554C4783r9197J02606q080j66038N4496K70825M1381k08230O9290p5444J84250
8543B00642j00690p7927K18748j67560p050j82848K40374k91383M9972o5507J98138
8532A4909R7789j83253K24892j32828N3311K9840L4716p9869Q5691J5709j88550
8521b7643J25933K27639m16754m8288M9235J8980l7073k13896N15218J08821k75649
8510B6523j10210L33964K8299l52687Q9440L8366J74898J1704r8710J51900j10078
8499A83409j28872r98J07550p1905P5792q7537j0805J66599k10160J36096J65780
8488C24949l38043J2207K5630P7719l1362j41453P7517M6535J57550J14506Q2146
8477D07901k65935j64356j652l4346j63134N34910r7596j45483q1242J05069p0390
$$ plain form
8466 23746 -69079 162889 131781 251380 162782 212743 283566 -14448 138247 286071 -39196
8455 -39196 213388 199045 234840 -79439 118144 200644 225319 60508 28115 444047 120650
8444 120650 71073 98778 223091 89416 -108513 -17326 241130 269670 -205073 -131352 259634
8433 259634 -143487 -55115 66608 237522 147303 -210401 172731 132978 176733 26330
8423 26330 54444 200795 -16156 133271 65480 2162 166933 -16769 -375 169118 164002
8412 164002 -71647 -127551 185701 298019 98488 -50379 354004 191674 -192336 77046
8402 77046 211317 373784 95944 147918 143974 177667 110051 332482 159733 -131648 175927
8391 175927 316472 228600 121841 166887 -91553 -26274 25138 214489 -32292 -162262
$$ packed form
8466B3746r2825K31968l1108J19599q8598M9961P0823k98014J52695J47824l25267
8455c9196K52584j4343L5795l14279J97583Q2500K4675j64811l2393M15932l23397
8444A20650m9577K7705J24313j33675j97929R1187K58456K8540m74743P3721L90986
8433B59634m03121Q8372J21723J70914r0219l57704L83132l9753M3755j50403
8423B6330K8114J46351k16951J49427o7791o3318J64771j83702J6394J69493n116
8412A64002k35649n5904L13252J12318j99531j48867M04383j62330l84010K69382
8402G7046J34271J62467k77840N1974l944L3693o7616K22431j72749k91381L07575
8391A75927J40545q7872j06759M5046k58440O5279N1412J89351k46781j29970
$$ plain form
8381 -162262 -49375 -164142 166809 75223 -162588 44883 -198268 -203770 -279886 52739
8371 52739 18212 -227957 -7839 179690 140839 -72587 165045 113481 -71409 -15805 237884
8360 237884 194677 -30085 43180 -6680 92282 -46660 58426 220148 -11817 184705
8350 184705 116270 -155671 159944 169222 183822 245047 28945 382162 -56812 -111594 187989
8339 187989 80286 108434 40959 166661 200785 163048 333938 149022 281832 194624 77233
8328 77233 59942 -105968 148973 10354 302602 111278 314830 171952 270811 176975
8318 176975 32544 328661 257243 79649 61735 362226 132439 241346 86643 130078
8308 130078 252360 80568 81055 -6145 -237914 249485 249478 136529 176873 255653 43094 -57051
$$ packed form
8381a62262J12887j14767L30951r1586k37811K07471k43151n502p6116L32625
8371E2739l4527k46169K20118J87529l8851k13426K37632n1564j84890N5604K53689
8360B37884m3207k24762P3265m9860R8962j38942J05086J61722k31965J96522
8350A84705o8435k71941L15615R278J4600O1225k16102L53217m38974n4782K99583
8339A87989j07703K8148o7475J25702L4124l7737J70890j84916J32810q7208j17391
8328G7233j7291j65910K54941j38619K92248j91324K03552j42878R8859r3836
8318A76975j44431K96117p1418j77594j7914L00491k29787J08907j54703M3435
8308A30078J22282j71792M87q7200k31769M87399pj12949M0344P8780k12559j00145
$$ plain form
8296 -57051 225287 513166 153704 33742 103955 84291 211513 76685 712537 -47906
8286 -47906 -307488 197519 7541 267178 -78553 287762 330512 -177638 157224 207420
8276 207420 214518 -62459 -178833 77718 294180 -58559 349314 113348 -14741 70617
8266 70617 -36587 513491 69448 -232336 352597 295653 120682 194180 106265 427270
8256 427270 -220502 90870 310833 128510 -147365 -115894 404361 111763 -93069 299340
8246 299340 88407 147406 29536 -142637 239848 3610 206658 -83742 151789 101139
8236 101139 206400 16089 12153 410329 -15153 135419 410106 412481 161159 250925 411448
8225 411448 291319 142326 84673 386038 86889 -45383 51789 252783 7007 -112751
$$ packed form
8296e7051K82338K87879l59462j19962P0213j9664J27222j34828O35852p60443
8286d7906k59582N05007j89978K59637l45731L66315M2750n08150L34862N0196
8276B07420P098k76977j16374K56551K16462l52739M07873k35966j28089Q5358
8266G0617j07204N50078m44043l01784N84933n6944j74971P3498q7915L21005
8256D27270o47772L11372K19963j82323k75875L1471N20255k92598k04832L92409
8246B99340k10933N8999j17870j72173L82485k36238K03048k90400K35531n0650
8236A01139J05261j90311l936L98176m25482J50572K74687K375k51322Q9766J60523
8225D11448j20129j48993n7653L01365k99149j32272R7172K00994k45776j19758
$$ plain form
8215 -112751 452028 -56302 -1007 -130830 98703 519295 -35518 -76892 502794 186688
8205 186688 -168501 -46053 174445 208674 -459710 -119379 368653 -302098 -123387 -43004
8195 -43004 -42426 -157221 -1341649 -564328 119302 458129 108110 338489 377488 -294494
8185 -294494 209201 277048 20514 -35163 191603 115727 55090 -13236 424988 294863 147745
8174 147745 118197 10288 100298 204538 117209 397423 90385 32897 248681 62051
8164 62051 360762 78309 86941 356096 291043 407200 230780 167557 278496 137928 293724
8153 293724 108143 201838 323441 6596 32518 31727 272163 34409 -65218 349418 -111288
8142 -111288 17737 4364 445999 326076 -246 163028 139068 -17446 107116 146032
$$ packed form
8215a12751N64779n08330N5295j29823K29533M20592n54813m1374N79686l16106
8205A86688l55189J22448K20498L4229o68384L40331M88032o70751J78711Q0383
8195d3004N78j14795j184428P77321O83630L38827l50019K30379L8999o71982
8185b94494N03695O7847k56534n5677K26766p5876o0637o8326M38224j30125j47118
8174A47745k9548j07909R0010J04240q7329K80214l07038n7488K15784j86630
8164F2051K98711k82453Q632K69155o5053J16157j76420o3223J10939j40568J55796
8153B93724j85581R3695J21603l16845K5922p91K40436k37754r9627M14636m60706
8142a11288J29025j3373M41635j19923l26322J63274k3960j56514J24562L8916
$$ plain form
8132 146032 133795 -60465 82297 525140 -150967 221388 319070 319024 52479 -10943 165130
8121 165130 -441 -36501 82324 217304 -4060 -200261 123908 123342 -19034 139856
8111 139856 242394 241916 191525 98735 22707 358668 -123772 230292 88274 -144565 198244
8100 198244 -75549 378111 111079 117527 498819 190682 239406 -160673 76410 219481
8090 219481 -141861 334157 242526 -154028 37308 188371 266660 26543 26045 483921 33171
8079 33171 -89196 211412 130769 145648 -165393 30501 208698 -166214 300434 182022
8069 182022 219222 114493 -57483 94666 62512 62288 297246 140279 195439 281668 -100734
8058 -100734 155519 104384 170781 181267 85628 256180 120731 204363 251293 225312 286969
$$ packed form
8132A46032j2237j94260J42762M42843o76107L72355R7682m6k66545o3422J76073
8121A65130j65571l6060J18825J34980k21364j96201L24169n66j42376J58890
8111A39856J02538m78n0391r2790p6028L35961m82440L54064j42018k32839L42809
8100A98244k73793M53660k67032O448L81292l08137M8724m00079K37083J43071
8090B19481l61342M76018r1631l96554J91336J51063P8289k40117m98M57876m50750
8079C3171j22367L00608q0643J4879l11041J95894J78197l74912M66648j18412
8069A82022L7200j04729j71976J52149l2154k24K34958j56967N5160Q6229l82402
8058a00734K56253n1135O6397J0486r5639J70552j35449Q3632M6930k5981O1657
$$ plain form
8047 286969 99986 174817 87186 64249 89162 184125 260669 293566 258859 -11667 50007
8036 50007 95587 -184348 151536 285883 46037 -214132 -265647 90970 -99562 -205453
8026 -205453 272433 8566 -314191 -186923 140160 347300 -176273 -75919 -4944 -98896
8016 -98896 -39858 91355 145997 255805 -19425 210246 79141 -199596 192226 -205772
8006 -205772 153535 153881 50079 268041 41236 116006 179180 -228024 220437 -71124 -97908
7995 -97908 159298 -129343 243956 298803 323984 214066 -67172 217423 154083 -53544
7985 -53544 169237 161248 229495 -79898 -97750 292452 236689 253433 386164 245044 11237
7974 11237 145817 59527 42227 117096 243983 396930 93646 293496 -40775 125463
$$ packed form
8047B86969j86983P4831q7631k2937K4913R4963P6544L2897l4707k70526O1674
8036E0007M5580k79935L35884J34347k39846k60169n1515L56617j90532j05891
8026b05453M77886k63867l22757J27268L27083K07140n23573J00354P0975r3952
8016i8896N9038J31213N4642J09808k75230K29671j31105k78737L91822l97998
8006b05772L59307L46j03802K17962k26805P4770O3174m07204M48461k91561k6784
7995i7908K57206k88641L73299N4847K5181j09918k81238K84595o3340k07627
7985e3544K22781p989O8247l09393j7852L90202n5763J6744J32731j41120k33807
7974A1237J34580q6290j7300P4869J26887J52947l03284J99850l34271J66238
$$ plain form
7964 125463 166425 263752 35257 -98128 208316 144568 218299 23193 286286 51211
7954 51211 -59844 42685 238576 295103 78237 70448 177276 16496 71822 137294 123228
7943 123228 304290 31116 -26162 257637 228490 150279 13531 35515 486181 71128
7933 71128 162359 168361 -99576 156351 -78965 269551 121020 -48136 242892 -19965
7923 -19965 177072 405209 287492 -41655 70672 -5545 303211 155790 276501 333057
7913 333057 -37428 75426 -76595 80406 106059 94072 224811 102342 -60833 74764
7903 74764 -54885 353089 132314 145236 290258 52443 84766 79607 -7031 208393 164189
7892 164189 -14916 392659 127757 10805 231250 331279 423882 217572 178544 94828
$$ packed form
7964A25463M0962R7327k28495j33385L06444o3748P3731j95106K63093k35075
7954E1211j11055J02529J95891N6527k16866p789J06828j60780N5326O5472j4066
7943A23228J81062k73174n7278K83799k9147p8211j36748K1984M50666m15053
7933G1128R1231O002k67937K55927k35316L48516j48531j69156K91028k62857
7923a9965J97037K28137j17717l29147J12327p6217L08756j47421J20711N6556
7913C33057l70485J12854j52021J57001K5653j1987J30739j22469j63175J35597
7903G4764j29649M07974k20775J2922J45022k37815L2323n159q6638K15424m4204
7892A64189j79105M07575k64902j16952K20445J00029R2603k06310l9028q3716
$$ plain form
7882 94828 117147 206179 162272 296214 124077 230603 215524 13431 206112 416500 242280
7871 242280 -31588 47486 -71116 -82226 112186 351875 499568 183618 42646 79688
7861 79688 -6997 141444 195599 216932 225817 122865 -160508 67764 246616 346545 176101
7850 176101 205392 284467 -16899 235818 241127 201453 89182 64302 -10697 2664 -218403
7839 -218403 28340 182993 119072 327680 -172809 -21217 81496 188211 119552 18411
7829 18411 325017 78091 131666 131449 213330 158584 107030 224673 545887 191633 101484
7818 101484 157751 46513 258679 186722 202616 132937 18439 112749 230344 124335 194894
7807 194894 175596 210607 41250 179420 160681 346430 270433 -54394 -25405 135657 161591
$$ packed form
7882I4828K2319Q9032m3907J33942j72137J06526j5079k02093J92681K10388j74220
7871B42280k73868P9074j18602j1110J94412K39689J47693l15950j40972L7042
7861G9688q6685J48441N4155K1333Q885j02952k83373K28272J78852R9929j70444
7850A76101K9291P9075l01366K52717N309l9674j12271k4880p4999J3361k21067
7839b18403K46743J54653o3921K08608n00489J51592J02713J06715o8659j01141
7829A8411L06606k46926N3575k17Q1881n4746n1554J17643L21214l54254r0149
7818A01484N6267j11238K12166p1957J5894o9679j14498R4310J17595j06009P0559
7807A94894j9298L5011j69357J38170j8739J85749p5997l24827K8989J61062K5934
$$ plain form
7796 161591 168093 359172 -43570 154377 84776 276185 381610 166104 492409 151784
7786 151784 176775 -12500 246779 202120 -6147 355164 325977 267430 182052 217447 311901
7775 311901 169292 -9435 274240 187205 152816 65044 251459 380675 252235 220708
7765 220708 242007 393779 128863 133605 355644 443158 227588 207607 242509 180080 103925
7754 103925 209721 308897 379443 279862 289181 455869 296114 384653 220986 357787 359058
7743 359058 544307 397866 433622 512631 294161 286016 299963 211549 317900 300476 328179
7732 328179 612184 418361 459282 269439 401344 376126 443947 479451 202138 505790
7722 505790 208534 368659 252506 183613 399387 109975 239123 135613 213597 20310
$$ packed form
7796A61591O502J91079m02742J97947o9601J91409J05425k15506L26305l40625
7786A51784K4991j89275K59279m4659k08267L61311k9187n8547q5378L5395R4454
7775C11901j42609j78727K83675q7035l4389q7772J86415J29216j28440l1527
7765B20708K1299J51772k64916M742K22039Q7514k15570j9981L4902o2429p6155
7754A03925J05796R9176P0546r9581R319J66688j59755Q8539j63667J36801J271
7743C59058J85249j46441L5756P9009k18470q145J3947q8414J06351j7424K7703
7732C28179K84005j93823M0921j89843J31905k5218O7821L5504k77313L03652
7722E05790k97256J60125j16153o8893K15774k89412J29148j03510P7984j93287
$$ plain form
7712 20310 305529 211170 209827 205978 236481 384363 324487 233190 205046 298733 364136 81316
7700 81316 195708 447939 295382 242818 -42401 214303 15016 -139166 -19735 182827
7690 182827 187203 288422 206018 182384 189954 59379 411966 330622 308311 216382 224944 132525
7678 132525 368175 393388 81894 324040 40481 162046 81618 130866 245726 189160
7668 189160 -6999 104034 301963 322481 30852 21183 302027 367895 271909 27010 192515
7657 192515 352561 368821 134091 490832 209397 191021 237046 190939 423892 130979
7647 130979 456172 375117 356096 216098 -6474 345873 174452 264376 170256 90872 299296
7636 299296 135712 74639 429105 442376 312302 285797 152557 265047 140878 133685 329206
$$ packed form
7712B0310K85219r4359j343l849L0503J47882n9876r1297k8144R3687O5403k82820
7700H1316J14392K52231j52557n2564k85219K56704j99287j54182J19431K02562
7690A82827M376J01219q2404k3634P570j30575L52587q1344k2311r1929Q562r2419
7678A32525K35650K5213l11494K42146k83559J21565q0428M9248J14860n6566
7668A89160j96159J11033J97929K0518k91629r669K80844O5868r5986k44899J65505
7657A92515J60046J6260k34730L56741k81435j8376M6025m6107K32953k92913
7647A30979L25193q1055j9021j39998k22572L52347j71421Q9924r4120p9384K08424
7636B99296j63584o1073L54466J3271j30074k6505j33240J12490j24169p193J95521
$$ plain form
7625 329206 281908 -51975 -24253 146092 223352 132543 361049 246714 90797 59846 77696
7614 77696 108227 147372 227892 113540 359927 51367 467396 66238 143251 160167 -32336
7603 -32336 224493 -36694 98015 85053 246087 69863 85546 276211 182931 280150 69370
7592 69370 278988 316940 -137233 122463 31346 194457 -110516 -9888 395573 134563
7582 134563 87185 107211 304923 333250 73772 267698 163259 113710 253483 289030 287446
7571 287446 334805 -12413 147311 156034 -157832 128040 -135520 491486 297681 23710
7561 23710 44875 247308 85855 262590 186796 362398 51147 -112531 345090 151147
7551 151147 316031 89486 9474 167837 68148 159376 440467 -1416 322877 85773
$$ packed form
7625C29206m7298l33883K7722J70345P7260r0809K28506j14335j55917l0951J7850
7614G7696L0531L9145Q0520j14352K46387l08560M16029m01158P7013J6916j92503
7603c2336K56829k61187J34709j2962J61034j76224J5683J90665r3280R7219k10780
7592F9370K09618L7952m54173K59696r1117J63111l04973J00628M05461k61010
7582A34563m7378K0026J97712K8327k59478J93926j04439m9549J39773L5547j584
7571B87446M7359l47218J59724Q723l13866K85872k63560O27006j93805k73971
7561B3710K1165K02433j61453J76735p5794J75602l11251j63678M57621j93943
7551A51147J64884k26545q0012J58363r9689R1228K81091m41883L24293k37104
$$ plain form
7541 85773 240681 162548 266960 355957 246612 296830 260905 206025 254392 94922 302749
7530 302749 290979 4986 107050 222680 347645 124303 183326 26548 250233 -156108
7520 -156108 249154 441027 327406 121001 96205 187602 203983 -111300 89212 359752
7510 359752 103419 234561 305079 273251 178687 143601 226042 282188 6317 451552 266820
7499 266820 457497 180798 36809 273807 243168 142981 230276 92718 160765 85524
7489 85524 89563 304520 82162 -43032 43395 164116 303559 165688 -55438 94393
7479 94393 -131678 -28463 -67273 361577 93414 170769 174241 123891 207075 275061 139207
7468 139207 138626 218674 140561 346719 125257 96526 101898 142157 273295 183618 150522 384416
$$ packed form
7541H5773J54908p8133J04412Q8997j09345N0218l5925n4880M8367j59470K07827
7530C02749j1770k85993J02064J15630J24965k23342N9023j56778K23685m06341
7520a56108M05262J91873j13621k06405k4796R1397J6381l15283K00512K70540
7510C59752k56333J31142P0518l1828r4564l5086Q2441N6146k75871M45235j84732
7499B66820J90677k76699j43989K36998l0639j00187Q7295j37558O8047p5241
7489H5524M039K14957k22358j25194Q6427J20721J39443j37871k21126J49831
7479I4393k26071J03215l8810M28850k68163P7355L472n0350Q3184O7986j35854
7468A39207n81Q0048p8113K06158k21462k8731N372M0259J31138q9677l3096K33894
$$ plain form
7456 384416 38126 215110 106387 379380 179757 -67436 218133 188435 262285 204231
7446 204231 370596 541198 209632 28850 48031 189629 70711 -5319 399316 40150
7436 40150 14881 60755 183620 253881 23997 217057 311776 -32528 75297 382646 419627
7425 419627 364185 238013 212250 175628 -88886 90792 413352 178019 -72842 20739
7415 20739 136721 83825 173140 253665 318139 163719 143426 55614 332724 118274 128006
7404 128006 311976 124340 139771 -206711 242211 299967 176528 145935 338509 297875
7394 297875 -48249 -26544 213056 203461 296792 236652 76143 189115 22611 113879 163860
7383 163860 222286 95158 130523 165528 -63546 145644 21720 160357 333502 -109272
$$ packed form
7456C84416l46290J76984j08723K72993j99623k47193K85569k9698P3850n8054
7446B04231J66365J70602l31566j80782J9181J41598j18918p6030M04635l59166
7436D0150k5269M5874J22865P0261k29884J93060R4719l44304J07825L07349L6981
7425D19627n5442j26172k5763l6622k64514J79678L22560k35333k50861R3581
7415B0739J15982n2896Q9315Q0525O4474j54420k0293q7812K77110k14450R732
7404A28006J83970j87636J5431l46482M48922N7756j23439l0593J92574m0634
7394B97875l46124K1705K39600r595R3331o0140j60509J12972j66504R1268M9981
7383A63860N8426j27128L5365L5005k29074K09190j23924J38637J73145m42774
$$ plain form
7373 -109272 156602 144109 359482 242951 32140 421622 55394 -21445 -4838 202697
7363 202697 -23553 -51464 252860 110888 -971 58826 248083 48641 7955 118603
7353 118603 -42005 98747 -23621 170336 128913 9992 161717 102681 219457 9508
7343 9508 159144 137611 254640 138332 -26524 219363 194505 92152 135976 325485 268704
7332 268704 209819 -61016 43 249588 51290 292024 65740 -54696 12041 169317
7322 169317 352958 237930 379574 90823 77557 74859 145177 278733 -25855 99255
7312 99255 162422 77930 30300 87837 126975 30453 156538 84392 32461 50250 -27370 157411
7300 157411 6381 257661 9890 157987 270538 26271 123684 151807 316054 1572
$$ packed form
7373a09272K65874j2493K15373j16531k10811L89482l66228p6839J6607K07535
7363B02697k26250k7911L04324j41972j11859N9797J89257j99442m0686J10648
7353A18603j60608J40752j22368J93957m1423j18921J51725n9036J16776k09949
7343I508J49636k1533J17029j16308j64856K45887k4858j02353M3824J89509n6781
7332B68704n8885k70835O1059K49545j98298K40734k26284j20436O6737J57276
7322A69317J83641j15028J41644k88751j3266k698P0318J33556l04588J25110
7312I9255O3167q4492m7630N7537L9138r6522J26085p2146n1931J7789p7620J84781
7300A57411j51030K51280k47771J48097J12551k44267R7413K8123J64247l14482
$$ plain form
7290 1572 49551 222635 277464 146628 -1445 183693 284874 48258 71062 10115 225865
7279 225865 7588 156946 326974 72648 264989 -50602 146934 162956 208164 258400
7269 258400 162184 189263 70855 242833 261249 476639 251855 307952 136860 108595 174124
7258 174124 245875 476223 -43461 144348 223348 192244 62591 91764 327375 99304
7248 99304 89077 278653 111390 281394 153152 193271 194891 274238 259434 388917 211146
7237 211146 202876 460399 -19968 497198 109591 112862 69614 -30999 223035 -168031 362954
7226 362954 217747 152808 -71299 108579 452655 84166 155437 273911 264164 -51207
7216 -51207 180183 219819 348112 98090 150004 275081 160427 -63692 117271 184040
$$ packed form
7290A572M7979J73084N4829j30836j48073J85138J01181k36616K2804o0947K15750
7279B25865k18277J49358J70028k54326J92341l15591J97536J6022M5208N0236
7269B58400r6216K7079j18408J71978J8416K15390k24784N6097j71092k8265O5529
7258A74124P1751K30348n19684J87809P9000l1104j29653K9173K35611k28071
7248I9304j0227J89576j67263J70004j28242M0119J620P9347j4804J29483j77771
7237B11146q270K57523m80367N17166l87607L271m3248j00613K54034l91066N30985
7226C62954j45207o4939k24107J79878L44076l68489P1271J18474r747l15371
7216e1207K31390L9636J28293k50022N1914J25077j14654k24119J80963O6769
$$ plain form
7206 184040 190823 46083 191266 489642 173774 154080 228559 260777 48029 51317 113290
7195 113290 474136 -47092 67886 162087 148341 13863 -144243 358623 198100 40153
7185 40153 94771 463814 343674 187864 187418 399239 370799 152501 83828 56639 122328
7174 122328 124622 75595 185676 102692 -42567 58638 65572 171628 10257 109736 406059
7163 406059 157556 235620 -2838 263806 287543 169617 385870 219238 111803 201045
7153 201045 156379 342198 292935 209864 328208 74960 415000 245915 506254 228876
7143 228876 57119 36188 475305 193705 270424 573918 629649 555557 183927 708721
7133 708721 696660 577605 148798 446592 316330 232268 -52611 415767 474998 39920
$$ packed form
7206A84040O783j44740J45183K98376l15868j9694P4479L2218k12748L288O1973
7195A13290L60846n21228J14978R4201j3746j34478j58106N02866j60523j57947
7185D0153N4618L69043j20140j55810m46K11821k8440k18298o8673k7189O5689
7174A22328K294m9027J10081q2984j45259J01205O934J06056j61371R9479K96323
7163D06059k48503P8064k38458K66644K3737j17926K16253j66632j07435Q9242
7153B01045m4666J85819m9263q3071J18344k53248L40040j69085K60339k77378
7143B28876j71757k0931M39117k81600P6719L03494N5731p4092l71630N24794
7133G08721j2061j19055m28807K97794j30262q4062k84879M68378N9231m35078
$$ plain form
7123 39920 -22277 168657 311501 -172339 73818 206287 167738 122343 92473 271443 314603
7112 314603 -3346 106280 227303 302379 75147 205588 125463 437549 185516 39791
7102 39791 236225 219336 179913 124058 63575 174054 99195 -65962 106743 196903 87589
7091 87589 24164 254359 211308 165461 98055 199260 26303 130954 -20524 310659 211628
7080 211628 428520 127842 128759 117458 116879 260908 -100352 248141 73486 447666 173249
7069 173249 353336 360578 400566 337013 9953 144875 218607 160301 204669 160103 245902
7058 245902 134365 37119 194735 274584 290439 251810 242503 355727 202859 169981 316847
7047 316847 149880 316479 261585 324824 -5793 -375 107403 273606 216744 413531 177045
$$ packed form
7123C9920o2197J90934J42844m83840K46157J32469l8549m5395k9870J78970M3160
7112C14603l17949J09626J21023P5076k27232J30441q0125L12086k52033j45725
7102C9791J96434j6889l9423n5855o0483J10479p4859j65157J72705R0160j09314
7091H7589o3425K30195m3051m5847o7406J01205j72957J04651j51478L31183r9031
7080B11628K16892l00678R17j1301n79J44029l61260L48493j74655L74180k74417
7069A73249J80087P242L9988o3553l27060J34922P3732n8306M4368m4566Q5799
7058B45902j11537r7246J57616P9849J5855l8629r307J13224j52868l2878J46866
7047C16847j66967J66599n4894O3239l30617N418J07778J66203n6862J96787k36486
$$ plain form
7036 177045 274773 297553 288012 151040 197550 186624 108327 13661 24840 338926 215824
7025 215824 271822 81451 314092 85586 189888 284464 406046 288945 91308 -49023
7015 -49023 298568 137600 116609 160306 -99764 323667 -69576 342539 260489 349124 216680
7004 216680 56144 327358 145605 389401 288968 219857 111226 69442 485800 300894
6994 300894 159863 151655 224304 52703 147630 148879 236559 236158 -117047 85825 11709 189095
6982 189095 140507 180343 226700 345324 236653 268480 322747 317930 96313 148948 126509
6971 126509 101893 -8196 248165 154157 111624 189915 211928 317399 2544 394095 117562
6960 117562 232345 -151805 201973 270796 -14672 189836 124884 218823 82393 207359
$$ packed form
7036A77045R7728K2780r541j36972M6510j0926p8297r4666J1179L14086j23102
7025B15824N5998j90371K32641k28506J04302R4576J21582j17101j97637j40331
7015d9023L47591j60968k0991M3697k60070M23431l93243M12115q2050Q8635j32444
7004B16680j60536K71214j81753K43796j00433o9111j08631m1784M16358j84906
6994C00894j41031q208P2649j71601R4927J249Q7680m01l53205K02872p4116J77386
6982A89095m8588L9836M6357J18624j08671L1827N4267m817k21617N2635k2439
6971A26509k4616j10089K56361r4008m2533P8291K2013J05471l14855L91551k76533
6960A17562J14783l84150L53778O8823k85468K04508o4952R3939j36430J24966
$$ plain form
6950 207359 351289 358462 266867 104985 -12226 191445 60232 274063 229437 198801 99198
6939 99198 30099 250659 156676 147751 376666 384435 370331 227356 149914 229454 178095 77087
6927 77087 138802 175912 384144 138121 33190 160800 205285 167791 94107 58222 194176
6916 194176 -60482 -57382 364405 86701 394523 -83099 249535 250830 63860 257657
6906 257657 214336 221244 127120 101385 323980 213085 9365 188005 59630 298393 -9562
6895 -9562 142045 415912 422657 170264 160730 316337 488157 75655 94469 250694 303478
6884 303478 188860 219244 438250 386412 314216 278605 476321 173916 535568 192235
6874 192235 573691 260548 210679 443661 282263 236766 176935 288965 336745 367959 361708
$$ packed form
6950B07359J43930P173r1595j61882j17211K03671j31213K13831m4626l0636r9603
6939I9198o9099K20560r3983q925K28915P769j4104j42975p7442P9540n1359j01008
6927G7087O1715L7110K08232k46023j04931J27610M4485l7494p3684l5885J35954
6916A94176k54658L100M21787k77704L07822m77622L32634J295j86970J93797
6906B57657m3321O908r4124k5735K22595j10895k03720J78640j28375K38763l07955
6895i562J51607K73867O745k52393r534J55607J71820m12502J8814J56225N2784
6884C03478j14618L0384K19006n1838p2196l5611J97716l02405L61652l43333
6874A92235L81456l13143m9869K32982j61398m5497n9831J12030M7780L1214o251
$$ plain form
6863 361708 427077 362151 222791 -32475 469492 491123 432111 221399 419760 569290
6853 569290 125420 258833 634461 497180 436917 165810 435196 476289 390558 445830
6843 445830 412323 397719 152717 369147 345283 255316 199538 94530 410374 354186 371064
6832 371064 291930 364798 278516 146923 437892 57567 190513 -137343 540892 521643
6822 521643 92005 146130 307220 539888 390785 384628 598093 453545 437624 567683
6812 567683 443844 444282 114836 442755 385975 565654 303942 395967 347614 279779 200649
6801 200649 309341 431654 337133 175572 286161 686254 404241 271131 212614 378349
6791 378349 140115 50908 160017 296320 8646 -23642 227003 479916 318017 153521
$$ packed form
6863C61708O5369o4926j39360k55266N01967K1631n9012k10712J98361J49530
6853E69290m43870J33413L75628j37281o0263k71107K69386M1093q5731N5272
6843D45830l3507j4604k45002K16430k3864q9967n5778j05008L15844n6188J6878
6832C71064p9134P2868q6282j31593K90969l80325J32946l27856O78235j9249
6822E21643m29638N4125J61090K32668j49103o157K13465j44548j5921J30059
6812E67683j23839M38l29446L27919n6780J79679k61712R2025m8353o7835p9130
6801B00649J08692J22313r4521j61561J10589M00093k82013j33110n8517J65735
6791C78349k38234q9207J09109J36303k87674l2288K50645K52913j61899j64496
$$ plain form
6781 153521 168983 301631 272947 264928 185672 265344 161022 37496 180373 226928 154239
6770 154239 154649 289699 423973 152009 72852 244104 203951 145282 -167285 246094 99026
6759 99026 95631 163082 60177 95207 137187 340897 153977 29442 317305 193427 234375
6748 234375 207725 23111 177868 121112 321918 110734 232409 29916 262130 189612
6738 189612 206033 168360 1822 190009 -97125 130590 66186 275152 342644 283591 271893
6727 271893 334209 367253 348770 75158 386812 145646 269975 265022 204231 465698 384653
6716 384653 332172 223267 348559 505567 378788 316669 372614 258518 64875 -18738
6706 -18738 306348 191946 19058 202700 369887 221999 52249 162264 355030 164117
$$ packed form
6781A53521J5462J32648k8684q019p9256P9672j04322j23526J42877M6555p2689
6770A54239M10J35050J34274k71964p9157J71252m0153n8669l12567M13379j47068
6759I9026l395O7451j02905L5030M1980K03710j86920j24535K87863j23878M0948
6748B34375k6650j84614J54757n6756K00806k11184J21675k02493K32214p2518
6738A89612J6421l7673j66538J88187k87134K27715o4404K08966O7492n9053j1698
6727B71893O2316L3044j8483k73612L11654k41166J24329m953o0791K61467q1045
6716C84653n2481j08905J25292J57008j26779o2119N5945j14096j93643q3613
6706a8738L25086j14402j72888J83642J67187j47888j69750J10015J92766j90913
$$ plain form
6696 164117 126445 334892 408712 169518 -104504 170654 353006 250560 157502 364597
6686 364597 349808 224748 32298 188062 398703 192270 166339 229091 208652 141842 123140
6675 123140 455317 179173 -90565 156884 236635 218282 -52911 253447 146355 -102052
6665 -102052 -18047 -70010 188593 41559 -71284 357148 178058 400455 152311 215657
6655 215657 172537 242178 285419 155151 399117 274049 305859 303358 385169 260471 302298
6644 302298 275095 179439 247598 318249 286601 183164 -69612 276879 385346 326879 362604
6633 362604 353563 501256 200791 183720 139731 383948 457567 231509 9030 204011 160343
6622 160343 -24305 60782 536463 597305 253102 447701 273460 244401 44895 161010
$$ packed form
6696A64117l7672K08447P3820k39194k74022K75158J82352j02446r3058K07095
6686C64597j4789j25060j92450J55764K10641k06433k5931O2752k0439o6810j8702
6675A23140L32177k76144k69738K47449P9751j8353k71193L06358j07092k48407
6665a02052Q4005n1963K58603j47034j12843M28432j79090K22397k48144O3346
6655B15657m3120O9641M3241j30268K43966j25068L1810k501Q1811j24698M1827
6644C02298k7203r5656O8159P0651l1648j03437k52776L46491J08467n8467L5725
6633C62604r041J47693l00465j7071m3989K44217P3619k26058k22479J94981m3668
6622A60343j84648Q5087M75681O0842l44203J94599j74241k9059j99506J16115
$$ plain form
6612 161010 424750 221928 82830 158451 278797 348850 453186 423095 184251 265434
6602 265434 205900 277287 393207 248592 218445 249837 276950 57398 -86886 107709 447090
6591 447090 232619 211650 242556 220810 348131 191131 243595 468261 424942 517151 316018
6580 316018 399025 372536 5190 133348 304197 172906 65064 -116769 295191 449700
6570 449700 252422 688869 407055 373027 -126490 88272 270888 189459 294385 439973
6560 439973 294176 211211 281736 419829 553778 264191 187929 333302 427785 366137 263491
6549 263491 249685 532434 257617 242440 146284 456996 318204 270479 347762 302634 177043
6538 177043 191998 72452 179562 327085 323019 263456 225909 288934 221010 324776 344260
$$ packed form
6612A61010K63740k02822j39098P5621J20346P0053J04336l0091k38844Q1183
6602B65434n9534P1387J15920j44615l0147L1392K7113k19552j44284J94595L39381
6591D47090k14471k0969L0906k1746J27321j57000N2464K24666m3319R2209k01133
6580C16018Q3007k6489l67346J28158J70849j31291j07842j81833M11960J54509
6570D49700j97278M36447k81814l4028m99517K14762J82616q1429J04926J45588
6560D39973j45797q2965P0525J38093J33949k89587p6262J45373R4483o1648j02646
6549B63491j3806K82749k74817j5177r6156L10712j38792m7725P7283m5128j25591
6538A77043J4955j19546J07110J47523m066n9563l7547O3025o7924J03766J9484
$$ plain form
6527 344260 550660 415521 411889 163731 89181 160223 472665 481340 323392 278185 468980
6516 468980 288460 385743 621955 752763 517815 264658 551300 650370 363970 256142
6506 256142 534162 288263 438165 295618 355213 439961 343043 600354 649481 492667
6496 492667 521344 637730 1130168 1204962 1018477 1126569 1237220 897891 665560 689803
6486 689803 1088015 1025664 448074 845401 716182 765338 374966 580452 717781 493071
6476 493071 677129 646250 535100 281564 380186 766715 622268 553308 623490 468432
6466 468432 362018 448980 531250 541287 653121 253909 197424 199693 572872 368959 333347
6455 333347 460244 375415 342215 298289 688453 521097 359993 462013 364472 336346 377870
$$ packed form
6527C44260K06400j35139l632k48158p4550P1042L12442Q675j57948m5207J90795
6516D68980j80520R7283K36212J30808k34948k53157K86642R9070k86400j07828
6506B56142K78020k45899J49902j42547N9595Q4748r6918K57311M9127j56814
6496D92667K8677J16386M92438P4794j86485J08092J10651l39329k32331K4243
6486F89803L98212o2351n77590L97327j29219M9156l90372K05486J37329k24710
6476D93071J84058l0879j11150k53536R8622L86529j44447o8960P0182j55058
6466D68432j06414Q6962Q2270J0037J11834l99212n6485K269L73179k03913l5612
6455C33347J26897q4829l3200m3926L90164j67356j61104J02020r7541k8126M1524
$$ plain form
6444 377870 413977 532133 381830 455866 366191 420904 441909 556585 647013 578092 501186
6433 501186 503413 193729 326630 418863 374603 723121 556534 351707 348379 389784 578764
6422 578764 356091 363546 687492 280320 278828 235850 545107 410150 406290 525593 384981
6411 384981 166011 245734 506045 395910 462528 514399 479942 298927 254446 475644 613056
6400 613056 587296 451737 409602 616856 481400 502962 572842 680919 613927 279067 562516
6389 562516 631208 711581 487013 650714 494936 263873 337014 419285 570209 477005 661217
6378 661217 714302 370043 440914 646582 609268 622355 496927 579825 578221 488144 661795
6367 661795 627446 649470 695443 397620 597745 603233 704178 746277 551092 803550 582981
$$ packed form
6444C77870L6107J18156j50303P4036q9675N4713K1005J14676R0428o8921p6906
6433E01186K227l09684J32901R2233m4260L48518j66587k04827l328M1405J88980
6422E78764k22673P455L23946m07172j492m2978L09257j34957l860J19303j40612
6411C84981k18970P9723K60311j10135O6618N1871l4457j81015m4481K21198J37412
6400F13056k5760j35559m2135K07254j35456K1562O9880J08077o6992l34860K83449
6389E62516O8692Q0373k24568J63701j55778k31063P3141Q2271J50924r3204J84212
6378F61217N3085l44259P0871K05668l7314J3087j25428Q2898j604r0077J73651
6367F61795l4349K2024M5973k97823K00125N488J00945M2099j95185K52458k20569
$$ plain form
6356 582981 617871 578694 478643 615071 741050 793791 704195 819435 744611 734142 587303
6345 587303 878996 937013 962644 978273 751164 992183 876293 957569 1165236 1010594
6335 1010594 1159692 1111906 1212184 1534932 1671986 1782862 1726530 1511535 1586094 1505320
6325 1505320 1735365 1721470 1578143 1432852 1286193 1449686 1238150 1278469 1627471 1412518
6315 1412518 1182403 1225193 1446559 1333425 1247100 1323095 1652363 1786420 1334280 1456064
6305 1456064 1607766 1548423 1755841 1884367 2344233 2656511 2856428 3402842 3809929 3726391
6295 3726391 3370640 3360642 3014335 2603416 2394979 2329376 2389554 2038865 2083182 2301249
6285 2301249 2117305 1820404 1783976 2196860 2080980 2168902 2093249 2161844 2149610 1936565
$$ packed form
6356E82981L4890l9177j00051J36428J25979N2741q9596J15240p4824j0469j46839
6345E87303K91693N8017K5631J5629k27109K41019j15890Q1276K07667j54642
6335A010594J49098m7786J00278L22748J37054J10876n6332k14995P4559q0774
6325A505320K30045j3895j43327j45291j46659J63493k11536M0319L49002k14953
6315A412518k30115M2790K21366j13134q6325P5995L29268J34057m52140J21784
6305A456064J51702n9343K07418J28526M59866L12278J99917N46414M07087q3538
6295C726391l55751r998l46307m10919k08437o5603O0178l50689M4317K18067
6285B301249j83944k96901l6428M12884j15880Q7922p5653O8595j2234k13045
$$ plain form
6275 1936565 2275193 2245978 2408563 2506086 2316934 2546725 2834913 3184083 3571846 4027992
6265 4027992 4429443 4370656 4211648 4117672 3786764 3555222 3516186 3104783 2949426 2726663
6255 2726663 2736686 2873031 2480865 2672712 2351901 2575608 2509383 2341442 2474706 2536615
6245 2536615 2860977 2582651 2855956 2948398 2893169 2697398 3072513 3243836 3131609 3527833
6235 3527833 3545863 3975440 4006315 4224184 4420057 4161069 4235329 4076674 4121789 4298748
6225 4298748 4265456 4425117 4242598 4372003 4391604 4487606 4741125 4889244 4990068 4934094
6215 4934094 5043504 5241598 5748503 5369391 5742853 5840751 5958721 6055910 6110272 6180379
6205 6180379 6071242 6330196 6420220 6921476 7225289 7758228 8076424 8368036 8865336 9264020
$$ packed form
6275A936565L38628k9215J62585R7523j89152K29791K88188L49170L87763M56146
6265D027992M01451n8787j59008r3976l30908k31542l9036m11403j55357k22763
6255B726663J0023J36345l92166J91847l20811K23707o6225j67941J33264O1909
6245B536615L24362k78326K73305R2442n5229j95771L75115J71323j12227L96224
6235C527833J8030M29577L0875K17869J95873k58988P4260j58655M5115J76959
6225D298748l3292J59661j82519J29405J9601R6002K53519J48119J00824n5974
6215D934094J09410J98094N06905l79112L73462R7898J17970R7189N4362P0107
6205F180379j09137K58954R0024N01256L03813N32939L18196K91612M97300L98684
$$ plain form
6195 9264020 9890147 10712910 11093942 11899613 12587963 13795878 14532343 15137255 16122098
6186 16122098 16585163 17781064 19137459 20669684 21971680 23504115 25288712 27598512
6178 27598512 29794878 32514418 36011322 40042926 45136491 51477447 60157832 71859089
6170 71859089 88046959 110759589 139664977 168824946 186968254 188244576 178488061
6163 178488061 163334694 145433823 126428787 107827316 91987660 78281896 66752973
6156 66752973 57934568 50307878 44155422 38766190 34376275 30717887 27449680 24941129
6148 24941129 22793148 20828684 19616560 18324541 17103570 16326882 15476135 14646057 13841605
6139 13841605 13279389 12572441 11809590 11225594 11098517 10600495 10035806 9832746 9675656
$$ packed form
6195I264020O26127Q22763L81032Q05671O88350J207915P36465O04912R84843
6186A6122098M63065J195901J356395J532225J301996J532435J784597K309800
6178B7598512K196366K719540L496904M031604N093565O340956Q680385J1701257
6170G1859089J6187870K2712630K8905388K9159969J8143308J276322r756515
6163A78488061j5153367j7900871j9005036j8601471j5839656j3705764j1528923
6156F6752973q818405p626690o152456n389232m389915l658388l268207k508551
6148B4941129k147981j964464j212124j292019j220971p76688q50747q30078q04452
6139A3841605n62216p06948p62851n83996j27077m98022n64689k03060j57090
$$ plain form
6130 9675656 9274074 8912401 8592881 8618423 8075381 7883641 7323044 7110182 7057714 6653788
6120 6653788 6590050 6098706 6053648 5744938 5338843 5209149 5055852 5053863 4810879 4580312
6110 4580312 4573313 4467302 4417562 4235310 4348566 3736193 4097075 3810070 3643835 3763924
6100 3763924 3592626 3691739 3464709 3675719 3475133 3276139 3340605 3410015 3185881 3327969
6090 3327969 3013425 3205454 3089832 2976385 3156973 3060035 3041714 2825727 2843762 2966414
6080 2966414 2656070 2430268 2401477 2422792 2547303 2290072 2285207 2432914 2383413 2046673
6070 2046673 2137864 2479413 2382714 2050481 1845620 2113892 2138499 1878470 1937518 1956098
6060 1956098 2017194 1717365 2102277 2074634 2079102 1957552 1655948 1956651 1939482 1849863 1783201
$$ packed form
6130I675656m01582l61673l19520K5542n43042j91740n60597k12862n2468m03926
6120F653788o3738m91344m5058l08710m06095j29694j53297j989k42984k30567
6110D580312o999j06011m9740j82252J13256o12373L60882k87005j66235J20089
6100C763924j71298R9113k27030K11010k00586j98994O4466O9410k24134J42088
6090C327969l14544J92029j15622j13447J80588r6938j8321k15987J8035J22652
6080B966414l10344k25802k8791K1315J24511k57231m865J47707m9501l36740
6070B046673R1191L41549r6699l32233k04861K68272K4607k60029N9048J8580
6060A956098O1096k99829L84912k7643M468j21550l01604L00703j7169q9619o6662
$$ plain form
6049 1783201 1711794 1709302 1823705 1841915 1787574 1466351 1708528 1697985 1923128 1595740 1921283
6038 1921283 1959238 1728776 1643424 1527499 1607603 1518464 1508711 1737601 1779461 1503799 1593138
6027 1593138 1646827 1796881 1464706 1694168 1935308 1740952 1512600 1583355 1922071 1845719
6017 1845719 1713332 1648569 1596250 1680424 1382362 1546413 1713502 1654987 1468979 1572823
6007 1572823 1657882 1968589 1818052 1757702 1786540 1781784 1646358 1694367 1757694 1896250 1871696
5996 1871696 1584470 1904835 1791876 1962200 1697153 1935594 1807973 1728585 1947739 1910829
5986 1910829 1701820 1707649 1520955 1709339 1604318 1676862 1889318 1632597 2115802 1943807
5976 1943807 2121380 2126314 2090250 1888994 2171200 2352775 2149157 2234965 2199284 2214887 1920443
$$ packed form
6049A783201p1407k492J14403J8210n4341l21223K42177j0543K25143l27388L25543
6038A921283L7955k30462q5352j15925Q0104q9139r753K28890M1860k75662Q9339
6027A593138N3689J50054l32175K29462K41140j94356k28352P0755L38716p6352
6017A845719j32387o4763n2319Q4174k98062J64051J67089n8515j86008J03844
6007A572823Q5059L10707j50537o0350K8838m756j35426M8009O3327J38556k4554
5996A871696k87226L20365j12959J70324k65047K38441j27621p9388K19154l6910
5986A910829k09009N829j86694J88384j05021P2544K12456k56721M83205j71995
5976A943807J77573M934l6064k01256K82206J81575k03618Q5808l5681J5603k94444
$$ plain form
5965 1920443 1993555 1994709 2183496 2148959 2233454 2383149 2091089 2182256 2279937 2483008 2509411
5954 2509411 2498175 2510614 2452065 2470041 2475290 2596940 2510858 2656716 2673182 2659234 2937747
5943 2937747 2990026 2791237 2929655 3187074 3250471 2936015 3114315 3159010 3485204 3085482
5933 3085482 3314685 3655185 3451157 3668473 3451083 4034596 4085543 4453317 4255756 4585299
5923 4585299 4797778 4728986 4780231 5047963 5234010 5170338 5245973 5574145 5735585 5651558
5913 5651558 5957011 6340962 6021062 6113442 6669544 6745898 6766955 6656535 7280569 7240025
5903 7240025 7357803 7691967 7911910 7976512 7952453 8083160 8371263 8500615 8682169 9096057
5893 9096057 9520878 10140147 10893886 11235658 11815079 12770430 13327985 13843066 14455431 15060418
$$ packed form
5965A920443P3112J154J88787l4537Q4495J49695k92060R1167R7681K03071K6403
5954B509411j1236J2439n8549J7976N249J21650q6082J45858J6466j3948K78513
5943B937747N2279j98789J38418K57419O3397l14456J78300M4695L26194l99722
5933C085482K29203L40500k04028K17316k17390N83513N0947L67774j97561L29543
5923D585299K12479o8792N1245K67732J86047o3672P5635L28172J61440q4027
5913E651558L05453L83951l19900R2380N56102P6354K1057j10420O24034m0544
5903G240025J17778L34164K19943O4602k4059J30707K88103J29352J81554M13888
5893I096057M24821O19269P53739L41772N79421R55351N57555N15081O12365O04987
$$ plain form
5883 15060418 15550484 16420826 17333380 18437984 19357013 20981567 22639940 24745814 26566701
5874 26566701 29002053 30815449 32723646 35089450 37592258 41109305 45219800 50184046
5866 50184046 56016670 63514077 72833678 85811903 103775645 131119091 172518822 230400644
5858 230400644 287314142 309333404 293067132 267699105 239949544 208217568 176831093
5851 176831093 147946256 123734112 104232601 88508144 75716231 65856533 56892249
5844 56892249 49591084 43630142 39044358 34921158 31865139 29720944 27814794 26262149
5836 26262149 24762598 23598690 22205794 21396175 20276030 19172432 18499729 17728564 17098295
5827 17098295 15962236 15661613 14959618 14420300 14047451 13619320 13411172 12697744 12346097
$$ packed form
5883A5060418M90066Q70342R12554J104604R19029J624554J658373K105874J820887
5874B6566701K435352J813396J908197K365804K502808L517047M110495M964246
5866E0184046N832624P497407R319601J2978225J7963742K7343446M1399731N7881822
5858B30400644N6913498K2019262j6266272k5368027k7749561l1731976l1386475
5851A76831093k8884837k4212144j9501511j5724457j2791913r859698q964284
5844E6892249p301165n960942m585784m123200l056019k144195j906150j552645
5836B6262149j499551j163908j392896q09619j120145j103598o72703p71165o30269
5827A7098295j136059l00623p01995n39318l72849m28131k08148p13428l51647
$$ plain form
5818 12346097 11594998 11170434 10874115 10406251 9753072 9373914 9126458 8874577 8100774
5809 8100774 8120472 7726850 7279829 7193340 6998124 6792739 6447887 6458907 6426717 6122540
5799 6122540 5781316 6025913 5744515 5568918 5651110 5414824 5167603 5155462 5135966 4995878
5789 4995878 4611039 4898088 4970346 4547704 4576785 4577590 4636851 4484692 4882846 5186079 5340876
5778 5340876 5343973 4946016 4933966 4719107 4625643 4551682 4367082 4399337 4323976 3845870 3818405
5767 3818405 3658271 3541645 3461886 3417093 3454154 3121785 3398269 3425105 3341823 3692070
5757 3692070 4059484 4380947 4195892 3899785 3894580 3688184 3532165 3541032 3272904 2986894
5747 2986894 2809527 2815081 2499208 2648338 2503690 2321042 1918731 1987493 1969643 1819243
$$ packed form
5818A2346097p51099m24564k96319m67864o53179l79158k47456k51881p73803
5809H100774J9698l93622m47021q6489j95216k05385l44852J1020l2190l04177
5799F122540l41224K44597k81398j75597Q2192k36286k47221j2141j9496j40088
5789D995878l84839K87049P2258m22642K9081Q05N9261j52159L98154L03233J54797
5778E340876L097l97957j2050k14859r3464p3961j84600L2255p5361m78106k7465
5767C818405j60134j16626p9759m4793L7061l32369K76484K6836q3282L50247
5757C692070L67414L21463j85055k96107n205k06396j56019Q867k68128k86010
5747B986894j77367N554l15873J49130j44648j82648m02311O8762j7850j50400
$$ plain form
5737 1819243 2045992 2148657 2172644 1716954 1944170 2182904 1933706 1960610 1762477 1678272
5727 1678272 1640583 1640233 1941376 1808109 1814934 1542907 1582250 1729757 1717675 1739030 1477146
5716 1477146 1510224 1398967 1542164 1640706 1461720 1370723 1123306 1307738 1233407 1066218
5706 1066218 1195275 1417520 1323154 1097190 1241806 1568621 1526768 1162103 1441438 1409602
5696 1409602 1090410 1267403 1299354 1162926 1140276 1150414 1270865 1263051 1303423 1200666 1097202
5685 1097202 1227101 1093493 1070479 1091738 1133255 1405688 1008485 891265 1063236 510206
5675 510206 927838 918948 990179 1091837 740783 1033118 904639 885840 1010685 883645
5665 883645 1051732 880269 706698 1062335 1066170 1035450 990486 785509 846892 881633 717525
$$ packed form
5737A819243K26749J02665K3987m55690K27216K38734k49198K6904j98133q4205
5727A678272l7689l50L01143j33267O825k72027L9343J47507j2082K1355k61884
5716A477146L3078j11257J43197R8542j78986r0997k47417J84432p4331j67189
5706A066218J29057K22245r4366k25964J44616L26815m1853l64665K79335l1836
5696A409602l19192J76993L1951j36428k2650J0138J20451p814M0372j02757j03464
5685A097202J29899j33608k3014K1259M1517K72433l97203j17220J71971n53030
5675E10206M17632q890P1231J01658l51054K92335j28479j8799J24845j27040
5665H83645J68087j71463j73571L55637L835l0720m4964k04977O1383L4741j64108
$$ plain form
5654 717525 993179 1002452 819532 742536 839954 1087726 670360 708310 947769 741923 745382
5643 745382 824265 795100 696190 787621 923021 793708 680130 681321 572201 700902 797672
5632 797672 695468 848521 860509 769240 500235 541703 682019 707260 608799 745947 947490
5621 947490 759397 718995 809813 926530 1033188 689306 775913 826232 657724 881849
5611 881849 518958 926933 758089 573336 835908 945674 855606 593792 724758 857015
5601 857015 796502 405504 773230 568523 558872 478094 542216 891801 505747 350693 631685
5590 631685 356107 472425 477768 605429 493438 271665 544176 651046 779446 757368
5580 757368 646804 550693 567005 410896 670216 603718 749301 561309 593370 866311
$$ packed form
5654G17525K75654R273j82920p6996R7418K47772m17366L7950K39459k05846L459
5643G45382P8883k9165r8910R1431J35400j29313j13578J191j09120J28701R6770
5632G97672j02204J53053J1988r1269k69005M1468J40316K5241r8461J37148K01543
5621I47490j88093m0402R0818J16717J06658l43882Q6607N0319j68508K24125
5611H81849l62891M07975j68844j84753K62572J09766r0068k61814J30966J32257
5601H57015o0513l90998L67726k04707r651q0778O4122L49585l86054j55054K80992
5590F31685k75578J16318N343J27661j11991k21773K72511J06870J28400k2078
5580G57368j10564r6111J6312j56109K59320o6498J45583j87992L2061K72941
$$ plain form
5570 866311 640505 575339 608492 641935 519204 306245 533604 507460 512150 504716 682986
5559 682986 544108 484520 628920 513503 620281 641640 788399 717091 513648 426044
5549 426044 487578 547613 620710 536749 501248 569464 648936 491117 613877 695606 581665
5538 581665 532637 678553 866245 327031 386236 613122 623668 728384 539307 862704
5528 862704 972327 566599 963934 959857 1611454 1708696 1706362 1918966 2001453 1845626 1708465
5517 1708465 1784445 1553377 1261383 916581 1183899 1009474 960583 769221 882861 698406
5507 698406 358550 513305 831372 468516 557083 689339 822523 563796 499702 605847
5497 605847 658077 443953 546552 730041 623992 612604 423689 668559 347222 557156
$$ packed form
5570H66311k25806o5166L3153L3443j22731k12959K27359k6144M690p434J78270
5559F82986j38878n9588J44400j15417J06778K1359J46759p1308k03443q7604
5549D26044O1534O0035P3097q3961l5501O8216P9472j57819J22760Q1729j13941
5538E81665m9028J45916J87692n39214N9205K26886J0546J04716j89077L23397
5528H62704J09623m05728L97335m077O51597R7242k334K12604Q2487j55827j37161
5517A708465P5980k31068k91994l44802K67318j74425m8891j91362J13640j84455
5507F98406l39856J54755L18067l62856Q8567J32256J33184k58727o4094J06145
5497F05847N2230k14124J02599J83489j06049j1388j88915K44870l21337K09934
$$ plain form
5487 557156 358396 666036 713004 341032 423684 495362 602527 267467 492276 703394
5477 703394 296470 351786 382713 655005 503576 150915 629768 462301 484418 526033
5467 526033 565069 584633 390243 288720 422355 711691 619320 334195 346792 496812
5457 496812 344817 298921 557543 480160 482000 281847 326120 652183 201376 186259 513245
5446 513245 518997 263313 216789 404067 503578 101488 312308 208512 433661 307824
5436 307824 318237 514992 405405 418543 427440 188461 449923 466304 148809 577271 276776
5425 276776 454909 263524 441085 297268 325931 326523 439953 539118 524218 426176 340220
5414 340220 387503 567362 654962 475961 356415 360243 380784 314300 609290 555640 638610
$$ packed form
5487E57156j98760L07640M6968l71972Q2652P1678J07165l35060K24809K11118
5477G03394m06924N5316L0927K72292j51429l52661M78853j67467K2117M1615
5467E26033L9036J9564j94390j01523J33635K89336r2371k85125J2597J50020
5457D96812j51995m5896K58622p7383J840k00153M4273L26063m50807j5117L26986
5446E13245N752k55684m6524J87278R9511m02090K10820j03796K25149j25837
5436C07824J0413J96755j09587J3138Q897k38979K61462J6381l17495M28462l00495
5425B76776J78133j91385J77561j43817K8663N92J13430R9165j4900r8042q5956
5414C40220M7283J79859Q7600j79001j19546L828K0541o6484K94990n3650Q2970
$$ plain form
5403 638610 181127 304882 399510 367077 427940 579167 553272 81866 237423 505800
5393 505800 496131 473610 351950 363301 150959 204945 429663 531821 549620 120121 253122
5382 253122 310850 131980 169970 339821 311180 450126 325353 526606 464315 211389
5372 211389 367626 587921 523062 411824 459000 454775 230167 158602 397391 384804 488651
5361 488651 219613 265149 422345 261400 437646 343862 402423 465784 72185 317471
5351 317471 329219 423049 368226 190454 501668 340460 197897 210734 215408 314219 247541
5340 247541 275250 400414 21434 192856 485585 458224 337063 175773 429178 411440
5330 411440 141360 408381 543134 340154 168384 126125 442293 524726 201196 488703
$$ packed form
5403F38610m57483J23755R4628l2433O0863J51227k5895m71406J55557K68377
5393E05800r669k2521j21660J1351k12342N3986K24718J02158J7799m29499J33001
5382B53122N7728j78870L7990J69851k8641J38946j24773K01253o2291k52926
5372B11389J56237K20295o4859j11238M7176m225k24608p1565K38789j2587J03847
5361D88651k69038M5536J57196j60945J76246r3784N8561O3361l93599K45286
5351C17471J1748R3830n4823j77772L11214j61208j42563J2837M674R8811o6678
5340B47541K7709J25164l78980J71422K92729k7361j21161j61290K53405j7738
5330D11440k70080K67021J34753k02980j71770m2259L16168Q2433l23530K87507
$$ plain form
5320 488703 475282 168331 259431 242069 626977 332250 105203 323711 384615 595489
5310 595489 306677 505575 391911 339115 470629 385952 519592 87469 330529 327542
5300 327542 449245 307159 373265 311096 37587 353987 403895 584776 361577 248791
5290 248791 133392 182231 168440 433566 158470 267903 316749 11115 151781 -50633
5280 -50633 299986 568926 341975 118651 403599 196936 222197 237485 535700 442946
5270 442946 365764 290738 431661 252319 392423 422804 252561 338496 149292 522979
5260 522979 78007 368952 370948 274114 369346 68573 139520 179327 18185 299030 439637
5249 439637 213282 322127 -51543 235727 346569 405483 408962 274007 276902 -17608 293989
$$ packed form
5320D88703j3421l06951R1100j7362L84908k94727k27047K18508O0904K10874
5310E95489k88812J98898j13664n2796J31514q4677J33640m32123K43060k987
5300C27542J21703j42086O6106o2169k73509L16400M9908J80881k23199j12786
5290B48791j15399M8839j3791K65126k75096J09433M8846l05634J40666k02414
5280e0633L50619K68940k26951k23324K84948k06663K5261J5288K98215r2754
5270D42946p7182p5026J40923j79342J40104L0381j70243Q5935j89204L73687
5260E22979m44972K90945J996r6834R5232l00773P0947L9807j61142K80845J40607
5249D39637k26355J08845l73670K87270J10842N8914L479j34955K895k94510L11597
$$ plain form
5238 293989 307379 385190 210385 386540 312358 241203 242108 229964 462180 212292 666043
5227 666043 498554 279828 438203 350346 339354 434847 303997 386710 95189 114834 439520
5216 439520 344129 350230 361711 413022 237779 403523 523533 598402 171025 277791 349531
5205 349531 289518 289466 379632 302646 319140 365909 419933 722807 139584 237292 326212 329645
5193 329645 373759 195209 571998 191772 255399 121883 615813 557185 158075 265666
5183 265666 465328 513665 320805 592462 637023 432350 -54188 439382 757075 424145
5173 424145 212645 477716 273572 433180 183335 395257 798901 369332 390632 271385
5163 271385 609191 194711 282504 503112 715791 513085 174800 390475 575788 388581
$$ packed form
5238B93989J3390P7811j74805J76155p4182p1155R05j2144K32216k49888M53751
5227F66043j67489k18726J58375q7857j0992R5493j30850Q2713k91521J9645L24686
5216D39520r5391O101J1481N1311j75243J65744J20010P4869m27377J06766P1740
5205C49531o0013n2R0166p6986J6494M6769N4024L02874n83223R7708Q8920L433
5193C29645M4114j78550L76789l80226O3627j33516M93930n8628l99110J07591
5183B65666J99662M8337j92860K71657M4561k04673m86538M93570L17693l32930
5173D24145k11500K65071k04144J59608k49845K11922M03644m29569K1300j19247
5163B71385L37806m14480Q7793K20608K12679k02706l38285K15675J85313j87207
$$ plain form
5153 388581 533076 900954 697332 647489 241176 471987 404864 288551 382421 662285
5143 662285 662975 461810 493920 691329 759509 640047 686982 731657 542203 368207 471795
5132 471795 534649 495742 509839 520825 595762 247885 516388 679108 1025598 662955 515562
5121 515562 808319 683095 563399 686460 1165791 955481 674692 600420 965874 713383
5111 713383 592174 722034 1062996 827274 513975 592420 986515 723402 590271 870812
5101 870812 702351 820170 378623 685602 914043 674314 616590 737718 750381 648373
5091 648373 649170 884165 926589 770068 708332 624507 703369 676990 774443 669569 659608 715641
5079 715641 666437 570798 637142 524423 587482 707656 566665 723549 504537 414702 741688
$$ packed form
5153C88581J44495L67878k03622m9843m06313K30811o7123j16313R3870K79864
5143F62285O90k01165L2110J97409O8180j19462M6935M4675j89454j73996J03588
5132D71795O2854l8907J4097J0986P4937l47877K68503J62720L46490l62643j47393
5121E15562K92757j25224j19696J23061M79331k10310k80789p4272L65454k52491
5111G13383j21209J29860L40962k35722l13299P8445L94095k63113j33131K80541
5101H70812j68461J17819m41547L06979K28441k39729n7724J21128J2663j02008
5091F48373P97K34995M2424j56521o1736q3825P8862k6379R7453j04874r961N6033
5079G15641m9204r5639O6344j12719O3059J20174j40991J56884k19012q9835L26986
$$ plain form
5068 741688 795034 911102 497013 386925 383971 599960 720509 865283 744970 773388
5058 773388 578104 503878 862063 834495 1102429 753472 808738 789682 682986 859010
5048 859010 831151 740533 858453 677534 669135 791400 782672 644293 918762 994170 713909
5037 713909 782432 857730 1093570 677323 859182 1088000 1118241 942839 768248 1020359
5027 1020359 988324 1027202 1352429 1341237 1139196 869474 932967 1181297 1052843 1277222
5017 1277222 1238390 1074133 988994 1186292 1327034 1360993 1282684 1330189 1318997 1107448 1052331
5006 1052331 1111631 1240719 1325743 861202 1047069 1125995 996924 1117717 1360931 1445113
4996 1445113 820499 878932 1131395 886450 1013843 1262129 1242499 1097763 903180 1122067
$$ packed form
5068G41688N3346J16068m14089j10088k954K15989J20549J44774j20313K8418
5058G73388j95284p4226L58185k7568K67934l48957N5266j9056j06696J76024
5048H59010k7859r0618J17920j80919q399J22265q728j38379K74469P5408k80261
5037G13909O8523P5298K35840m16247J81859K28818L0241j75402j74591K52111
5027A020359l2035L8878L25227j1192k02041k69722O3493K48330j28454K24379
5017A277222l8832j64257q5139J97298J40742L3959p8309M7505j1192k11549n5117
5006A052331N9300J29088Q5024m64541J85867P8926j29071J20793K43214Q4182
4996A445113o24614N8433K52463k44945J27393K48286j9630j44736j94583K18887
$$ plain form
4986 1122067 1249902 1088023 1265065 1136109 1149222 1089847 864387 1144237 1183671 1254463
4976 1254463 1260577 1235134 1261797 1219795 1006929 1090600 1292373 1250153 1409160 1373800 1385029
4965 1385029 1311285 1170682 1657956 1593627 1477150 1490292 1402690 1364717 1160244 1477725
4955 1477725 1477347 1470719 1609279 1482660 1602905 1676099 1821182 1662739 1817288 1559128 1564333
4944 1564333 1607764 2002057 2107565 1714057 1964944 1967396 1706648 1681114 2012919 1847765
4934 1847765 1903243 1586498 2020222 2027691 1811643 2182592 2290184 2107512 1810316 2079096
4924 2079096 2282877 2269783 2220217 2536987 2510388 2580553 2354694 2802451 2757428 2455699
4914 2455699 2625582 2681573 2883200 2821867 2667781 2905931 3269648 2911363 3219719 3332513
$$ packed form
4986A122067J27835j61879J77042j28956J3113n9375k25460K79850L9434P0792
4976A254463O114k5443K6663m2002k12866Q3671K01773m2220J59007l5360J1229
4965A385029p3744j40603M87274o4329j16477J3142q7602l7973k04473L17481
4955A477725l78o628J38560j26619J20245P3194J45083j58443J54549k58160N205
4944A564333M3431L94293J05508l93508K50887K452k60748k5534L31805j65154
4934A847765N5478l16745M33724P469k16048L70949J07592j82672k97196K68780
4924B079096K03781j3094m9566L16770k6599P0165k25859M47757m5023l01729
4914B455699J69883N5991K01627o1333j54086K38150L63717l58285L08356J12794
$$ plain form
4904 3332513 3461856 3266827 3379171 3838082 3734226 3653028 3942443 4246425 3943091 3992800
4894 3992800 4463963 4732272 4553003 4586942 4949300 5198116 5184169 5247211 5701437 5871589
4884 5871589 5984447 6075329 6366206 6483107 6566268 6734056 7244199 7973969 7890750 8078278
4874 8078278 8417108 9319846 9405142 9716183 10386903 11170600 11280083 12084159 13076470 13736860
4864 13736860 14549712 15180168 16528940 17543188 18843489 19953960 21344381 22254495 23707443
4855 23707443 24423600 25332206 26140514 26938544 27901745 28664266 29576751 30386701 31220472
4846 31220472 31867834 32827674 33523211 34311834 34662256 35313731 35693612 36631203 37968748
4837 37968748 39271941 41367343 42971034 44613644 46544219 48424235 50007564 51630164
$$ packed form
4904C332513J29343j95029J12344M58911j03856q1198K89415L03982l03334M9709
4894C992800M71163K68309j79269L3939L62358K48816j3947O3042M54226J70152
4884E871589J12858R0882K90877J16901Q3161J67788N10143P29770q3219J87528
4874H078278L38830R02738Q5296L11041O70720P83697J09483Q04076R92311O60390
4864A3736860Q12852O30456J348772J014248J300301J110471J390421R10114J452948
4855B3707443P16157R08606Q08308P98030R63201P62521R12485Q09950Q33771
4846C1220472O47362R59840O95537P88623L50422O51475L79881R37591J337545
4837C7968748J303193K095402J603691J642610J930575J880016J583329J622600
$$ plain form
4829 51630164 52953753 54392900 55764922 57174188 58758324 60049692 60711107 60537780
4821 60537780 59954328 59189746 58283820 57546704 56818472 55944084 55077493 53833270 52823247
4812 52823247 51512620 50526204 49795495 48756802 48222851 47604570 47102442 46338138 45514648
4803 45514648 44489664 43645791 42672931 41361756 40408579 39309454 38504201 37077585 35873168
4794 35873168 34578735 33023520 31285332 29922727 28657184 27443788 26501843 25619157
4786 25619157 24945766 23918740 22817103 22354784 21706757 21059342 20558695 20143879 19956701
4777 19956701 19365474 19223400 19221443 19199879 19042753 19243610 19183971 19095415 19210605 19577855
4767 19577855 20106405 20496552 21074061 21365096 22223245 22910223 23468921 24363309 25029478
$$ packed form
4829E1630164J323589J439147J372022J409266J584136J291368O61415j73327
4821F0537780n83452p64582r05926p37116p28232q74388q66591j244223j010023
4812E2823247j310627r86416p30709j038693n33951o18281n02128p64304q23490
4803D5514648j024984q43873r72860j311175r53177j099125q05253j426616j204417
4794C5873168j294433j555215j738188j362605j265543j213396r41945q82686
4786B5619157o73391j027026j101637m62319o48027o47415n00647m14816j87178
4777A9956701n91227j42074j957k1564j57126K00857n9639q8556J15190L67250
4767A9577855N28550L90147N77509K91035Q58149O86978N58698Q94388O66169
$$ plain form
4758 25029478 26343954 27474055 28577889 30541700 31879319 33322395 34632042 35717840
4750 35717840 36799857 37629232 38545327 39735933 40704288 41639478 42944943 43772208 44536870
4741 44536870 45201328 45881450 46635788 47188649 48330969 49888359 51195914 52555097 53286863
4732 53286863 54323983 55162836 56101771 57364478 58498383 60079761 61003653 61163473 61332223
4723 61332223 60845023 59949712 59127099 58366384 57249470 56014713 54951255 53532505 51558844
4714 51558844 49787401 48259483 46214350 44164256 42334881 40897907 39130649 37917436
4706 37917436 37140111 36537218 35650188 34928973 34496502 33499026 32756886 32201146 31827013
4697 31827013 31209523 30304888 29742449 28871145 27907525 26794273 25472414 24586902 23073305
$$ packed form
4758B5029478J314476J130101J103834J963811J337619J443076J309647J085798
4750C5717840J082017Q29375R16095J190606R68355R35190J305465Q27265P64662
4741D4536870O64458O80122P54338N52861J142320J557390J307555J359183P31766
4732E3286863J037120Q38853R38935J262707J133905J581378R23892J59820J68750
4723F1332223m87200q95311q22613p60715j116914j234757j063458j418750j973661
4714E1558844j771443j527918k045133k050094j829375j436974j767258j213213
4706C7917436p77325o02893q87030p21215m32471r97476p42140n55740l74133
4697C1827013o17490r04635n62439q71304r63620j113252j321859q85512j513597
$$ plain form
4688 23073305 21607233 20057433 19082780 17945140 16579463 15434970 14713189 13851598 12470746
4679 12470746 11986497 11396874 11039273 10409287 9844019 9534442 8745540 8352305 8145102
4670 8145102 7662381 7509759 7063930 6881425 6669192 6447406 6076867 5815727 5727091 5678643
4660 5678643 5541958 5316926 5113887 5002637 4833318 4666049 4889505 4508895 4094801 4084513
4650 4084513 4010713 3880852 3821797 3901647 3928125 3663956 3620585 3536056 3447778 3138331 3324670
4639 3324670 3167100 2933220 2812594 2766684 2899392 2736205 2589670 2805088 2895824 2622257
4629 2622257 2619136 2422361 2503015 2245960 2133860 2313596 2284692 2099880 2202563 2280235
4619 2280235 2198258 1934389 2050589 2122709 1914397 1738093 1930164 1991715 2029053 1809782
$$ packed form
4688B3073305j466072j549800r74653j137640j365677j144493p21781q61591j380852
4679A2470746m84249n89623l57601o29986n65268l09577p88902l93235k07203
4670H145102m82721j52622m45829j82505k12233k21786l70539k61140q8636m8448
4660E678643j36685k25032k03039j11250j69319j67269K23456l80610m14094j0288
4650D084513p3800j29861n9055P9850K6478k64169m3371q4529q8278l09447J86339
4639C324670j57570k33880j20626m5910J32708j63187j46535K15418R0736k73567
4629B622257l121j96775Q0654k57055j12100J79736k8904j84812J02683P7672
4619B280235q1977k63869J16200P2120k08312j76304J92071O1551L7338k19271
$$ plain form
4609 1809782 1884213 1966592 1539091 1835954 1805036 1746652 1627569 1682425 1681396 1617780 1579967
4598 1579967 1744679 1619973 1630044 1608929 1643797 1588908 1511477 1581560 1531886 1409356 1622811
4587 1622811 1516916 1335088 1457591 1386613 1470324 1408713 1465986 1488390 1375783 1415333 1299277
4576 1299277 1159441 1240715 1130694 954965 950993 1030873 1014541 1061369 923152 1096835 1007268
4565 1007268 1106686 1187573 1153270 1065689 915654 955628 977128 1026784 1016578 1106296 1045227
4554 1045227 1228764 1120406 952596 995441 1026184 927998 963185 1001055 1128099 790742
4544 790742 967168 1113955 853801 782637 979373 1181193 892313 652748 976581 1019907
4534 1019907 793300 952032 809539 1090369 983056 972524 908877 914715 699261 864309
$$ packed form
4609A809782P4431Q2379m27501K96863l0918n8384j19083N4856j029o3616l7813
4598A579967J64712j24706J0071k1115L4868n4889p7431P0083m9674j22530K13455
4587A622811j05895j81828J22503p0978Q3711o1611N7273K2404j12607L9550j16056
4576A299277j39836Q1274j10021j75729l972P9880j6332M6828j38217J73683q9567
4565A007268R9418Q0887l4303q7581j50035L9974K1500M9656j0206Q9718o1069
4554A045227J83537j08358j67810M2845L0743r8186L5187L7870J27044l37357
4544G90742J76426J46787k60154p1164J96736K01820k88880k39565L23833M3326
4534A019907k26607J58732j42493K80830j07313j0532o3647N838k15454J65048
$$ plain form
4524 864309 1042445 1064453 997032 764461 934432 882335 919422 854741 984761 980973 647332
4513 647332 824527 935602 967471 956357 666024 748480 700429 522647 615760 520653 588608
4502 588608 654929 613412 717687 650485 634278 594360 627244 668930 788709 625803 621236
4491 621236 594658 677235 374087 606161 667439 650452 647517 412056 650862 463290 686265
4480 686265 381618 650379 591285 473449 533342 271598 442123 328734 301928 325737
4470 325737 383827 481825 292363 245927 389799 433135 328337 140608 392367 329519 417925
4459 417925 386164 333289 249307 151613 283707 304657 552734 391057 485662 484227 495198
4448 495198 527032 417482 528714 586885 548938 407644 591961 512977 930565 642352
$$ packed form
4524H64309J78136K2008o7421k32571J69971n2097L7087o4681J30020l788l33641
4513F47332J77195J11075L1869j1114k90333Q2456m8051j77782R3113r5107O7955
4502E88608O6321m1517J04275o7202j6207l9918L2884M1686J19779j62906m567
4491F21236k6578Q2577l03148K32074O1278j6987k935k35461K38806j87572K22975
4480F86265l04647K68761n9094j17836N9893k61744J70525j13389k6806K3809
4470C25737N8090R7998j89462m6436J43872M3336j04798j87729K51759o2848Q8406
4459D17925l1761n2875q3982r7694J32094K0950K48077j61677R4605j435J0971
4448D95198L1834j09550J11232N8171l7947j41294J84317p8984M17588k88213
$$ plain form
4438 642352 585143 683991 471180 781172 411162 797752 569589 665361 711542 600048
4428 600048 608030 546078 621126 653819 777102 654750 576431 755381 652540 494314 657491
4417 657491 592817 580609 273736 237398 311084 475977 285750 570970 705802 478964
4407 478964 679420 658037 533330 422973 480977 509954 557716 242926 445049 430960 442381
4396 442381 467066 547477 518583 437578 470637 231761 471780 317001 325697 238732 301735
4385 301735 291390 210019 354236 341677 441207 338943 548115 347031 68946 135436 515059
4374 515059 293532 322751 354228 316784 366793 220124 591075 464702 365195 105033 354592
4363 354592 216019 125316 140432 350394 302152 329704 158425 296832 202276 335496 407005
$$ packed form
4438F42352n7209R8848k12811L09992l70010L86590k28163R5772M6181j11494
4428F00048P982o1952P5048L2693J23283j22352p8319J78950j02841j58226J63177
4417F57491o4674j2208l06873l6338P3686J64893j90227K85220J34832k26838
4407D78964K00456k1383j24707j10357N8004K8977M7762l14790K02123j4089J1421
4396D42381K4685Q0411k8894q1005L3059k38876K40019j54779Q696q6965O3003
4385C01735j0345q1371J44217j2559R9530j02264K09172k01084k78085O6490L79623
4374E15059k21527K9219L1477l7444N0009j46669L70951j26373r9507k60162K49559
4363C54592j38573r0703J5116K09962m8242K7552j71279J38407r4556J33220P1509
$$ plain form
4352 407005 419337 588589 54037 423160 441182 661868 358627 495034 529951 297395
4342 297395 172787 145596 692179 340875 300888 441924 618995 423837 451507 534139
4332 534139 547330 434282 235239 376448 532526 485319 455511 359493 422029 673366 431733
4321 431733 508667 587986 415377 502129 540178 444169 498287 369718 504205 486686 391923
4310 391923 529119 474009 298397 131096 456135 671491 422187 386337 357451 533794
4300 533794 381516 589096 593672 742578 572364 364465 631074 544867 679779 447220
4290 447220 489326 555424 469600 459316 805571 552829 647705 523855 704233 604114 525646
4279 525646 698615 852897 1027812 688446 871705 690646 749764 464669 962657 788022
$$ packed form
4352D07005J2332J69252n34552L69123J8022K20686l03241J36407L4917k32556
4342B97395j24608k7191N46583l51304l9987J41036J77071j95158K7670Q2632
4332E34139J3191j13048j99043J41209J56078m7207k9808r6018O2536K51337k41633
4321D31733P6934P9319j72609Q6752L8049r6009N4118j28569J34487j7519r4763
4310C91923J37196n5110j75612j67301L25039K15356k49304l5850k8886J76343
4300E33794j52278K07580M576J48906j70214k07899K66609q6207J34912k32559
4290D47220M2106O6098q5824j0284L46255k52742R4876j23850J80378j00119p8468
4279E25646J72969J54282J74915l39366J83259j81059N9118k85095M97988j74635
$$ plain form
4269 788022 791978 781317 797101 709243 730014 732202 961743 751280 621903 952054 728431
4258 728431 882692 902879 1151250 849752 701604 877178 936161 950325 977913 767165
4248 767165 981988 925477 786519 854538 779028 990968 862549 885681 917312 862189 831973
4237 831973 730903 971883 789452 871401 612316 715585 840319 920085 1161638 957492
4227 957492 1217521 873965 1070237 982315 906264 979946 987424 849223 838635 822395 906010
4216 906010 988856 1220287 978042 731845 1013870 1042970 1099832 861532 1058110 891661
4206 891661 1048068 692373 923758 706057 1032576 1074693 900840 834537 1070631 1059259
4196 1059259 766354 925014 835027 1024198 575738 1148810 1102279 712445 849718 1035383
$$ packed form
4269G88022L956j0661J5784q7858K0771K188K29541k10463j29377L30151k23623
4258G28431J54261K0187K48371l01498j48148J75574N8983J4164K7588k10748
4248G67165K14823n6511j38958O8019p5510K11940j28419K3132L1631n5123l0216
4237H31973j01070K40980j82431Q1949k59085J03269J24734P9766K41553k04146
4227I57492K60029l43556J96272q7922p6051P3682P478j38201j0588j6240Q3615
4216I06010Q2846K31431k42245k46197K82025K9100N6862k38300J96578j66449
4206H91661J56407l55695K31385k17701L26519M2117j73853o6303K36094j1372
4196A059259k92905J58660q9987J89171m48460N73072m6531l89834J37273J85665
$$ plain form
4186 1035383 1105852 1023634 706093 939750 876865 1033769 1099305 1041888 981107 785203 1066912
4175 1066912 874946 867353 1030279 1125884 961682 859194 717758 1008743 936436 906634
4165 906634 1025134 974204 911043 877368 834759 1215356 1094667 945541 1278193 929670
4155 929670 735230 976673 1121770 1224011 894317 1053445 1239975 1045535 848683 936659
4145 936659 1261778 869976 873032 928642 1064094 969730 1151456 1215234 1201583 1140747 1197822
4134 1197822 1002586 883144 1075267 1186828 1022683 1214475 1473233 1275686 1314849 1253628
4124 1253628 1254757 1226931 1331008 1384342 1471440 1217201 1554701 1389818 1532490 1352689
4114 1352689 1170537 1337942 1572541 1608819 1445061 1585623 1521091 1468261 1473061 1770101
$$ packed form
4186A035383P0469q2218l17541K33657o2885J56904O5536n7417o0781j95904K81709
4175A066912j91966p593J62926R5605j64202j02488j41436K90985p2307k9802
4165I06634J18500n0930o3161l3675m2609L80597j20689j49126L32652l48523
4155I29670j94440K41443J45097J02241l29694J59128J86530j94440j96852Q7976
4145I36659L25119l91802L056N5610J35452r4364J81726O3778j3651o0836N7075
4134A197822j95236j19442J92123J11561j64145J91792K58758j97547L9163o1221
4124A253628J129k7826J04077N3334Q7098k54239L37500j64883J42672j79801
4114A352689j82152J67405K34599L6278j63758J40562o4532n2830M800K97040
$$ plain form
4104 1770101 1689213 1655176 1563194 1638930 1470558 1639844 1748610 1968602 1666164 1848996
4094 1848996 1825367 1659732 1861987 1840740 2012372 1823754 2065010 2290687 1991035 1854070
4084 1854070 2094473 2272902 2259585 2242978 2531582 2385820 2199513 2371065 2395589 2329214
4074 2329214 2269638 2550471 2550008 2293462 2525905 2611527 2472395 2622932 2684583 2613716 2546188
4063 2546188 2590471 2895935 2977248 2864764 3054471 2917186 2998048 3086321 3120725 3304820
4053 3304820 3542075 3402882 3596422 3787910 3594104 3574375 3794246 3968365 3994502 4002046
4043 4002046 4106251 4342514 4309856 4391677 4671344 4889607 4665502 4955934 5063896 5425248
4033 5425248 5398178 5776240 6143562 6056919 6162129 6575325 6814428 7076709 7529213 7780571
$$ packed form
4104A770101q0888l4037r1982P5736j68372J69286J08766K19992l02438J82832
4094A848996k3629j65635K02255k1247J71632j88618K41256K25677k99652j36965
4084A854070K40403J78429j3317j6607K88604j45762j86307J71552K4524o6375
4074B329214n9576K80833m63k56546K32443Q5622j39132J50537O1651p0867o7528
4063B546188M4283L05464Q1313j12484J89707j37285Q0862Q8273L4404J84095
4053C304820K37255j39193J93540J91488j93806j9729K19871J74119K6137P544
4043D002046J04205K36263l2658Q1821K79667K18263k24105K90432J07962L61352
4033E425248k7070L78062L67322q6643J05210M13196K39103K62281M52504K51358
$$ plain form
4023 7780571 8155522 8372989 8930163 9116649 9304044 9597775 9955774 10118998 10902158 11405749
4013 11405749 11763952 12439776 12806071 13207894 13390693 13938215 14453807 15075306 15367214
4004 15367214 15959225 16516128 16661973 16780954 17103793 17444238 17677479 17976059 18520614
3995 18520614 19035792 19366615 19935540 20803562 21660082 22457582 23618718 24662337 26205896
3986 26205896 27691075 29251040 31182504 32794053 34715552 37012568 39916326 42490834
3978 42490834 45237063 48361930 51101574 53345605 55168646 57175117 58491188 59573810
3970 59573810 60698247 62377628 63494208 65311923 67778634 70755985 74411273 79156713
3962 79156713 84387291 88505947 91230970 92447792 93080542 92880998 93052402 93561843 94707705
$$ packed form
4023G780571L74951K17467N57174J86486J87395K93731L57999J63224P83160N03591
4013A1405749L58203O75824L66295M01823J82799N47522N15592O21499K91908
4004A5367214N92011N56903J45845J18981L22839L40445K33241K98580N44555
3995A8520614N15178L30823N68925Q68022Q56520P97500J161136J043619J543559
3986B6205896J485179J559965J931464J611549J921499K297016K903758K574508
3978D2490834K746229L124867K739644K244031J823041K006471J316071J082622
3970E9573810J124437J679381J116580J817715K466711K977351L655288M745440
3962G9156713N230578M118656K725023J216822O32750j99544J71404N09441J145862
$$ plain form
3953 94707705 96365008 99302015 103139037 107399015 111193359 114623918 117240672 119066962
3945 119066962 119897298 119119244 117065490 113937632 110379864 106198281 102336492 98959555
3937 98959555 96091466 93841035 93093950 93444526 93883057 93265830 91582407 88488835 84596417
3928 84596417 80891880 76992354 73310398 69973643 67205201 64767004 62754045 61259370
3920 61259370 59729065 58426359 56839980 55476245 53364815 51434091 49439077 46960069
3912 46960069 44728592 42302457 40296260 37990504 36326490 34389282 32585607 30666260
3904 30666260 28948252 27478979 26030641 24822568 24033433 22995749 22066908 21719389 21217401
3895 21217401 20616753 20302661 20046871 19885626 19865513 19620505 19661237 19407468 19397990 19267592
$$ packed form
3953I4707705J657303K937007L837022M259978L794344L430559K616754J826290
3945A19066962Q30336p78054k053754l127858l557768m181583l861789l376937
3937I8959555k868089k250431p47085L50576M38531o17227j683423l093572l892418
3928H4596417l704537l899526l681956l336755k768442k438197k012959j494675
3920F1259370j530305j302706j586379j363735k111430j930724j995014k479008
3912D6960069k231477k426135k006197k305756j664014j937208j803675j919347
3904C0666260j718008j469273j448338j208073p89135j037684r28841l47519n01988
3895B1217401o00648l14092k55790j61245k0113k45008M0732k53769r478j30398
$$ plain form
3885 19267592 19402679 19076895 19115922 18990531 19220251 19530744 19769667 20025303 20057974 20300002
3875 20300002 20225404 20434862 20651835 20699854 20573882 20146196 19671474 19243362 18410294 17670555
3865 17670555 16664446 15870655 14608811 13854715 13108860 12568278 11852021 11076400 10465751
3856 10465751 10121694 9734335 8900410 8598018 8316150 8212518 7582777 7465834 7300083
3847 7300083 7105980 6427450 6311150 6381803 5925345 5837213 5587712 5339417 5175566 5102177
3837 5102177 5095877 4949080 4801593 4454613 4116087 4046682 4296433 4233101 3905045 3807296
3827 3807296 3738777 3513158 3359582 3479714 3384797 3297284 3264676 3240170 3189673 3143327 2829943
3816 2829943 2934475 2755338 2896122 2696704 2560791 2508860 2486004 2381415 2453613 2364515
$$ packed form
3885A9267592J35087l25784L9027j25391K29720L10493K38923K55636L2671K42028
3875B0300002p4598K09458K16973M8019j25972m27686m74722m28112q33068p39739
3865A7670555j006109p93791j261844p54096p45855n40582p16257p75621o10649
3856A0465751l44057l87359q33925l02392k81868j03632o29741j16943j65751
3847G300083j94103o78530j16300P0653m56458q8132k49501k48295j63851p3389
3837E102177o300j46797j47487l46980l38526o9405K49751o3332l28056r7749
3827C807296o8519k25619j53576J20132r4917q7513l2608k4506n0497m6346l13384
3816B829943J04532j79137J40784j99418j35913n1931k2856j04589P2198q9098
$$ plain form
3806 2364515 2302989 2203654 2121360 2401134 2203820 2416825 2014654 2149180 1900295 1765157
3796 1765157 1976613 1850141 1741945 1572326 1639125 1618026 1750879 1525356 1336469 1513233
3786 1513233 1678272 1454118 1402788 1515093 1673117 1302222 1217840 1426988 1371091 1204961
3776 1204961 1021671 1306402 1178714 1294059 1372659 1203563 1071376 1096549 1099332 1110124
3766 1110124 1146733 1037936 1051217 913469 916432 1084234 1058905 960673 921681 728362 713868
3755 713868 772084 902442 1116254 913426 925435 870823 884795 947665 789599 875510 981469
3744 981469 894703 859305 755475 971129 688877 768228 919616 894243 842188 513062 823780
3733 823780 621460 644655 712863 858267 756366 507208 719208 488538 738059 756683
$$ packed form
3806B364515o1526r9335q2294K79774j97314K13005m02171J34526k48885j35138
3796A765157K11456j26472j08196j69619O6799k1099J32853k25523j88887J76764
3786A513233J65039k24154n1330J12305J58024l70895q4382K09148n5897j66130
3776A204961j83290K84731j27688J15345P8600j69096j32187K5173K783J0792
3766A110124L6609j08797J3281j37748K963J67802k5329r8232l8992j93319j4494
3755G13868N8216J30358K13812k02828J2009n4612J3972O2870j58066Q5911J05959
3744I81469q6766l5398j03830K15654k82252P9351J51388k5373n2055l29126L10718
3733H23780k02320K3195O8208J45404j01901k49158K12000k30670K49521J8624
$$ plain form
3723 756683 672715 855504 749636 824278 726895 747804 853079 473392 627550 821878
3713 821878 699940 600368 695791 892960 603205 510487 701358 790824 586425 444014
3703 444014 541536 691515 448796 491528 563477 756197 518398 737684 920694 663296
3693 663296 793601 600792 905648 850673 793464 828183 790848 719129 650455 767324 974359
3682 974359 866039 792726 618426 755159 649913 735205 971274 793608 688721 716020
3672 716020 1005151 789607 876095 923034 976288 867027 876535 882631 870680 667603 749185
3661 749185 976790 993624 891352 557759 834019 729223 882390 644961 978339 1154494
3651 1154494 704688 774706 868861 1480334 1145799 916573 1105860 1047572 817062 998002
$$ packed form
3723G56683q3968J82789j05868P4642r7383K0909J05275l79687J54158J94328
3713H21878j21938r9572R5423J97169k89755r2718J90871Q9466k04399j42411
3703D44014R7522J49979k42719M2732P1949J92720k37799K19286J83010k57398
3693F63296J30305j92809L04856n4975n7209L4719l7335p1719o8674J16869K07035
3682I74359j08320p3313j74300J36733j05246Q5292K36069j77666j04887K7299
3672G16020K89131k15544Q6488M6939N3254j09261R508O096j1951k03077Q1582
3661G49185K27605J6834j02272l33593K76260j04796J53167k37429L33378J76155
3651A154494m49806P0018R4155O11473l34535k29226J89287n8288k30510J80940
$$ plain form
3641 998002 1349531 1352446 1110819 958955 1110333 1117758 1098925 1309837 1454842 1497920 1427889
3630 1427889 1362891 1815000 2136663 2396151 2620518 3273756 3519355 3239649 3084118 2985458
3620 2985458 2799407 2529520 2441916 2094036 1923328 1444383 1713586 1463748 1543376 1742464
3610 1742464 1399288 1330458 1108641 1393293 1397143 1351397 1466756 1510395 1401896 1496818 1708376
3599 1708376 1943970 1975068 2201969 2627286 3425271 4281545 5098770 6023654 5981909 5675567
3589 5675567 4986682 4270374 3922172 3391269 2896787 2713030 2369918 2066975 1671751 1615204
3579 1615204 1475985 1341152 1293139 1374518 1437336 1076922 1312949 1292764 1389731 1257674
3569 1257674 1397501 1375434 1403106 1779296 1565710 1983015 2007363 2420255 2764635 3138235
$$ packed form
3641I98002L51529K915k41627j51864J51378P425j8833K10912J45005M3078p0031
3630A427889o4998M52109L21663K59488K24367O53238K45599k79706j55531r8660
3620B985458j86051k69887q7604l47880j70708m78945K69203k49838P9628J99088
3610A742464l43176o8830k21817K84652L850m5746J15359M3639j08499R4922K11558
3599A708376K35594L1098K26901M25317P97985Q56274Q17225R24884m1745l06342
3589E675567o88885p16308l48202n30903m94482j83757l43112l02943l95224n6547
3579A615204j39219j34833m8013Q1379O2818l60414K36027k0185R6967j32057
3569A257674J39827k2067K7672L76190k13586M17305K4348M12892L44380L73600
$$ plain form
3559 3138235 3611327 3186215 3125795 2714004 2443200 2074789 2067692 1853650 1526960 1425923
3549 1425923 1362837 1283500 1122006 1141027 1104920 992095 868721 789454 1008466 669783
3539 669783 604684 704463 772614 672420 749381 872965 797938 637398 517807 699762 772586
3528 772586 877958 768404 641058 780973 692967 714623 846224 856925 772689 520477
3518 520477 681258 720114 905896 809163 883807 661029 623413 645124 736019 776265 925715
3507 925715 946931 1058425 956009 772217 966742 845848 1045080 917201 1269708 1034909
3497 1034909 1009202 1296065 989491 1339326 1321339 1235197 1198386 1147884 1371714 1408543 1545587
3486 1545587 1525298 1632146 1633811 1873036 1728187 1735849 2020602 1940745 2219602 1978692 2409555
$$ packed form
3559C138235M73092m25112o0420m11791k70804l68411p097k14042l26690j01037
3549A425923o3086p9337j61494J9021l6107j12825j23374p9267K19012l38683
3539F69783o5099R9779O8151j00194P6961J23584p5027j60540j19591J81955P2824
3528G72586J05372j09554j27346J39915q8006K1656J31601J0701q4236k52212
3518E20477J60781L8856J85782r6733P4644k22778l7616K1711R0895M0246J49450
3507I25715K1216J11494j02416j83792J94525j20894J99232j27879L52507k34799
3497A034909k5707K86863l06574L49835j7987q6142l6811n0502K23830L6829J37044
3486A545587k0289J06848J665K39225j44849P662K84753p9857K78857k40910M30863
$$ plain form
3475 2409555 2544337 2541711 2915679 2878255 2963973 2881450 3030335 3039864 2641597 2642213 2813643
3464 2813643 2739946 2311785 2279398 2189242 2171984 2144333 2212745 2021826 1792048 1783630 1465584
3453 1465584 1804555 1640617 1445674 1319776 1298847 1281542 1049560 1110725 1220242 1041645
3443 1041645 668748 887672 963679 669306 622761 787300 869079 723666 746579 783306
3433 783306 784181 654244 594941 643281 572112 570649 462015 482041 511577 687850 422016
3422 422016 566517 511505 119887 189043 527751 465450 328506 240300 151906 369006 252719
3411 252719 421688 745716 447532 414307 362631 355258 369027 150762 551564 210681 286020
3400 286020 165447 343662 307630 126122 417677 218307 404262 97889 130393 84481
$$ packed form
3475B409555J34782k626L73968l7424Q5718q2523J48885R529l98267O16J71430
3464B813643p3697m28161l2387r0156j7258k7651O8412j90919k29778q418l18046
3453A465584L38971j63938j94943j25898k0929j7305k31982O1165J09517j78597
3443A041645l72897K18924P6007k94373m6545J64539Q1779j45413K2913L6727
3433G83306Q75j29937n9303M8340p1169j463j08634K0026K9536J76273k65834
3422D22016J44501n5012l91618O9156L38708o2301j36944q8206q8394K17100j16287
3411B52719J68969L24028k98184l3225n1676p373J3769k18265M00802l40883P5339
3400B86020j20573J78215l6032j81508K91555j99370J85955l06373L2504m5912
$$ plain form
3390 84481 224776 120690 131318 345504 154069 157370 -53520 164682 274926 -28398
3380 -28398 181610 203468 92932 123486 250867 423561 223007 57650 214948 200823
3370 200823 -48028 168163 58713 192832 94023 141114 94177 163715 368398 90858
3360 90858 363023 325901 338292 221834 141184 431734 87084 95805 62469 331098 -98767
3349 -98767 -7547 219220 168351 266134 78857 54616 -146490 -207652 167747 287551 57565
3338 57565 498240 175753 17859 -47419 163387 168513 188392 220460 296916 235857 75737
3327 75737 165684 202652 249905 197053 71596 151933 191085 28557 122697 -5105 325317
3316 325317 -26942 13409 124627 199916 110606 105369 566735 167936 158452 179935 251432
$$ packed form
3390H4481J40295j04086J0628K14186j91435L301k10890K18202J10244l03324
3380b8398K10008K1858j10536L0554J27381J72694k00554j65357J57298j4125
3370B00823k48851K16191j09450J34119r8809M7091m6937O9538K04683k77540
3360I0858K72165l7122J2391j16458q0650K90550l44650Q721l3336K68629m29865
3349i8767R1220K26767n0869R7783j87277k4241k01106o1162L75399J19804k29986
3338E7565M40675l22487j57894o5278K10806N126J9879L2068P6456o1059j60120
3327G5737Q9947L6968M7253n2852j25457Q0337L9152j62528R4140j27802L30422
3316C25317l52259M0351J11218P5289q9310n237M61366l98799r484K1483P1497
$$ plain form
3305 251432 156281 46681 163321 216379 -13510 22485 311083 326277 197254 39018
3295 39018 173454 166068 251600 252948 214908 331407 111141 -32691 9151 259108 104024
3284 104024 2106 165307 302456 225803 26825 173360 -48674 -61518 136623 41986
3274 41986 91920 -38944 70474 182020 133523 241584 235996 243693 -22164 71467 41605
3263 41605 -68496 113520 33148 35620 -146286 -171854 158768 66109 90198 137949 18948
3252 18948 46804 139770 129095 102779 146259 1704 -180010 140720 90556 99272 152595
3241 152595 318879 274769 -24459 287371 110385 52696 65022 346638 252983 -184654
3231 -184654 -26757 74131 137734 -139706 176961 335960 34507 -50673 -8167 173649
$$ packed form
3305B51432r5151j09600J16640N3058k29889L5995K88598J5194j29023j58236
3295C9018J34436p386Q5532J348l8040J16499k20266j43832M1842K49957j55084
3284A04024j01918J63201J37149p6653j98978J46535k22034j2844J98141r4637
3274D1986M9934j30864J09418J11546m8497J08061n588P697k65857R3631k9862
3263D1605j10101J82016q0372K472j81906k5568L30622r2659K4089M7751j19001
3252A8948K7856R2966j0675k6316M3480j44555j81714L20730n0164Q716N3323
3241A52595J66284m4110k99228L11830j76986n7689J2326K81616r3655m37637
3231a84654J57897J00888O3603k77440L16667J58999l01453q5180M2506J81816
$$ plain form
3221 173649 155382 312273 366523 252463 77254 -185832 -94291 249824 17459 174083
3211 174083 -53174 148479 162380 -140294 106488 422573 65500 -10984 -114540 208726
3201 208726 173885 -54246 459786 166627 16797 -219680 248828 369402 261192 184841
3191 184841 84936 148007 43545 -41327 272608 630426 418425 156439 325190 378863
3181 378863 95011 83231 311317 404318 147836 337945 494389 409377 270233 285707
3171 285707 499815 305735 138336 406308 272892 396093 381350 733578 653556 273440
3161 273440 531239 586335 639022 459492 817423 868465 689863 560953 553754 912395 854196
3150 854196 790414 1047955 1096336 1044101 698994 1055709 1365923 1115480 771852 873243
$$ packed form
3221A73649j8267J56891N4250j14060j75209k63086R1541L44115k32365J56624
3211A74083k27257K01653J3901l02674K46782L16085l57073p6484j03556L23266
3201B08726l4841k28131N14032k93159j49830k36477M68508J20574j08210p6351
3191A84841r9905O3071j04462q4872L13935L57818k12001k61986J68751N3673
3181C78863k83852j1780K28086R3001k56482J90109J56444q5012j39144J5474
3171B85707K14108j94080j67399K67972j33416J23201j4743L52228q0022l80116
3161B73440K57799N5096N2687j79530L57931N1042j78602j28910p199L58641n8199
3150H54196o3782K57541M8381n2235l45107L56715L10214k50443l43628J01391
$$ plain form
3140 873243 859921 813669 709450 982331 1199374 951158 1098940 1002064 1090257 1167380 1073558
3129 1073558 1281059 1322647 1501764 1520845 1712219 1853580 1983103 1976857 1588327 1726823
3119 1726823 1430184 1458295 1253176 1342450 1353198 958001 1104795 632702 814593 786350
3109 786350 1010521 1059136 911819 880178 657251 579351 821783 873348 644128 764404
3099 764404 902581 882296 794675 763970 1091852 1107277 984339 906311 905437 930093 705403
3088 705403 692931 856163 1101835 715638 479686 456257 603053 418021 378839 735466
3078 735466 460450 291262 255339 356908 671647 310800 518779 397551 251970 154333
3068 154333 432608 319745 240600 307057 273493 141606 -28689 97444 147171 248304
$$ packed form
3140H73243j3322m6252j04219K72881K17043k48216J47782r6876Q8193P7123r3822
3129A073558K07501M1588J79117J9081J91374J41361J29523o246l88530J38496
3119A726823k96639K8111k05119Q9274J0748l95197J46794m72093J81891k8243
3109G86350K24171M8615j47317l1641k22927p7900K42432N1565k29220J20276
3099G64404J38177k0285q7621l0705L27882J5425j22938p8028q74K4656k24690
3088G05403j2472J63232K45672l86197k35952k3429J46796j85032l9182L56627
3078G35466k75016j69188l5923J01569L14739l60847K07979j21228j45581r7637
3068A54333K78275j12863p9145O6457l3564j31887j70295J26133M9727J01133
$$ plain form
3058 248304 176947 203991 -154746 65297 -6156 168412 148254 219401 302622 76956 448654
3047 448654 107676 141300 221960 139900 -43796 -110411 19452 49730 51292 440273 517461
3036 517461 108984 -31056 -9920 29654 223568 150300 245857 169689 -86489 79573 -38267
3025 -38267 29913 180215 125508 35340 -164152 -104097 211778 405787 350887 353423 162369
3014 162369 263389 85051 149721 195967 334250 539371 -205832 124482 28230 -28873
3004 -28873 -164831 103078 232168 57825 -90574 -127841 69654 78270 36443 177609 126273
2993 126273 -84397 16376 -26581 425836 283095 104919 49507 167383 -31520 -34925
2983 -34925 311666 252243 123592 -117959 83498 -85848 -162720 63597 331265 360050
$$ packed form
3058B48304p1357K7044l58737K20043p1453J74568k0158P1147Q3221k25666L71698
3047D48654l40978L3624Q0660q2060j83696o6615J29863L0278J562L88981P7188
3036E17461m08477j40040K1136L9574J93914p3268R5557p6168k56178J66062j17840
3025c8267O8180J50302n4707r0168j99492O0055L15875J94009n4900K536j91054
3014A62369J01020j78338O4670M6246J38283K05121p45203L30314r6252n7103
3004b8873j35958K67909J29090j74343j48399l7267J97495Q616m1827J41166n1336
2993A26273k10670J00773m2957M52417j42741j78176n5412J17876j98903l405
2983c4925L46591n9423j28651k41551K01457j69346p6872K26317K67668K8785
$$ plain form
2973 360050 -37378 127191 200673 32026 27130 -6947 313028 20922 -56919 173194 30007
2962 30007 131421 112045 406774 295218 -1644 51841 108074 213502 197426 264135 218640
2951 218640 111619 -253505 146615 139951 112830 -14053 -88853 347655 -141618 -65807 172227
2940 172227 375016 262310 -123817 95881 190279 38231 -20567 -6730 275233 157451
2930 157451 -86771 -32936 196828 136065 76065 151468 217600 153120 -72173 192903 128427
2919 128427 247177 -133408 60994 251139 -8950 23325 66002 318513 265559 42349
2909 42349 86535 182055 -59158 96409 18441 194733 -61235 -6393 109660 -113317 83117
2898 83117 -167546 120518 237241 -111619 -59195 -169049 89815 305798 83625 83840 105713
$$ packed form
2973C60050l97428J64569P3482j68647m896l4077L19975k92106p7841K30113j43187
2962C0007J01414j9376K94729j11556k96862N3485N6233J05428j6076O6709m5495
2951B18640j07021l65124M00120o664k7121j26883p4800M36508m89273P5811K38034
2940A72227K02789j12706l86127K19698R4398j52048n8798J3837K81963j17782
2930A57451k44222N3835K29764o0763o0000P5403O6132o4480k25293K65076o4476
2919A28427J18750l80585J94402J90145k60089L2275M2677K52511n2954k23210
2909D2349M4186R5520k41213J55567p7968J76292k55968N4842J16053k22977J96434
2898H3117k50663K88064J16723l48860N2424j09854K58864K15983k22173K15K1873
$$ plain form
2887 105713 -35284 194257 68712 276509 372073 136633 190308 -196055 -48817 116270
2877 116270 -15237 247483 7346 76327 125703 -32460 70918 -98590 236709 -28803
2867 -28803 147100 -38353 117685 145968 199599 277271 -31938 -72844 -299470 99343 -238633
2856 -238633 175463 42463 103532 142810 -186416 40348 -186302 110585 229808 -43786
2846 -43786 84777 136750 323925 105011 248979 360688 -118776 -148498 -170260 80046
2836 80046 199620 267345 185866 301083 86649 40887 -31490 -147442 303389 -35834 177528
2825 177528 59325 22632 118612 -212708 290254 26369 79589 95683 -109642 17348
2815 17348 -2481 27442 248411 52465 -27277 -3418 -89169 9112 -94403 126153 184503
$$ packed form
2887A05713j40997K29541j25545K07797R5564k35440N3675l86363J47238J65087
2877A16270j31507K62720k40137O8981M9376j58163J03378j69508L35299k65512
2867b8803J75903j85453J56038K8283N3631P7672l09209m0906k26626L98813l37976
2856b38633M14096j33000O1069L9278l29226K26764k26650K96887J19223k73594
2846d3786J28563N1973J87175k18914J43968J11709m79464k9722k1762K50306
2836H0046J19574O7725q1479J15217k14434m5762p2377j15952M50831l39223K13362
2825A77528j18203l6693R5980l31320N02962k63885N3220J6094k05325J26990
2815A7348j9829K9923K20969j95946p9742K3859q5751R8281j03515K20556N8350
$$ [...]
##END NTUPLES=NMR SPECTRUM
##END=
