##TITLE=1H_DE-80H_X3
 200.13MHz, d2o
 8 sc
 
 19ns.26.2.2025
##JCAMPDX= 6.0         $$ Bruker NMR JCAMP-DX V2.0
##DATA TYPE= NMR SPECTRUM
##DATA CLASS= NTUPLES
##ORIGIN= UXNMR, Bruker Analytische Messtechnik GmbH
##OWNER= pz
$$ XWIN-NMR		Version 3.5
$$ Fri Jul  3 11:11:19 2026 Russian Standard Time (UT+4h)  Yarkov@DPX200
##.OBSERVE FREQUENCY= 200.1313
##.OBSERVE NUCLEUS= ^1H
##.ACQUISITION MODE= SIMULTANEOUS
##.ACQUISITION SCHEME= undefined
##.AVERAGES= 8
##.DIGITISER RES= 18
##SPECTROMETER/DATA SYSTEM= spect
##.PULSE SEQUENCE= zg30
##.SOLVENT NAME= CDCl3
##.SHIFT REFERENCE= (INTERNAL, CDCl3, 0, 15.5023)
##AUDIT TRAIL= $$ (NUMBER, WHEN, WHO, WHERE, WHAT)
$$ ##TITLE= Audit trail, XWIN-NMR		Version 3.5
$$ ##JCAMPDX= 5.01
$$ ##ORIGIN= Bruker BioSpin GmbH
$$ ##OWNER= Yarkov
$$ C:/Bruker/XWIN-NMR/data/yarkov2/nmr/H-C/1/pdata/1/auditp.txt
$$ ##AUDIT TRAIL=  $$ (NUMBER, WHEN, WHO, WHERE, WHAT)
(   1,<2026-07-03 11:10:30.95 +0400>,<Yarkov>,<DPX200>,
      <created by zg, POWCHK disabled, PULCHK disabled
       configuration hash MD5:
       00 E9 B6 7A A2 85 ED C7 34 08 36 98 17 FE 4E 26
       data hash MD5: 16K
       3D 75 89 33 E6 01 56 C4 20 98 E6 3F 39 57 8D 26>)
(   2,<2026-07-03 11:10:36.70 +0400>,<Yarkov>,<DPX200>,
      <Start of raw data processing
       efp BC_mod = 2 LB = 0.25 FT_mod = 6 PKNL = 1 PHC0 = -6894.148 PHC1 = 6.42196 SI = 16K 
       data hash MD5: 16K
       0B B0 70 7A 74 6C CE 39 E5 30 3C 02 3A DC A0 54>)
$$ ##END=
$$ 
$$ hash MD5
$$ E3 BA 88 30 B0 74 07 0B CA 7E 50 E8 FB CB A0 7D
##$RELAX= 
##$RELAX= 
##$RELAX= 
##$RELAX= 
##$RELAX= 
##$RELAX= 
$$ Bruker specific parameters
$$ --------------------------
##$DU= <C:/Bruker/XWIN-NMR>
##$EXPNO= 1
##$NAME= <H-C>
##$PROCNO= 1
##$TYPE= <nmr>
##$USER= <yarkov2>
##$AMP= (0..31)
100 100 100 100 100 100 100 100 100 100 100 100 100 100 100 100 100 100 
100 100 100 100 100 100 100 100 100 100 100 100 100 100 
##$AQSEQ= 0
##$AQ_mod= 1
##$AUNM= <au_zg>
##$AUTOPOS= <>
##$BF1= 200.13
##$BF2= 200.13
##$BF3= 200.13
##$BF4= 200.13
##$BF5= 200.13
##$BF6= 200.13
##$BF7= 200.13
##$BF8= 200.13
##$BYTORDA= 1
##$CFDGTYP= 0
##$CFRGTYP= 5
##$CHEMSTR= <none>
##$CNST= (0..31)
1 1 145 1 1 1 1 1 1 1 1 1 1 1 1 1 1 1 1 1 1 1 1 1 1 1 1 1 1 1 1 1 
##$CPDPRG= <>
##$CPDPRG1= <>
##$CPDPRG2= <>
##$CPDPRG3= <>
##$CPDPRG4= <mlev>
##$CPDPRG5= <mlev>
##$CPDPRG6= <mlev>
##$CPDPRG7= <mlev>
##$CPDPRG8= <mlev>
##$CPDPRGB= <>
##$CPDPRGT= <>
##$D= (0..31)
0 0.7 0 0 0 0 0 0 0 0 0 0.03 0 0 0 0 0 0 0 0 0 0 0 0 0 0 0 0 0 0 0 0 
##$DATE= 1783062630
##$DBL= (0..7)
120 120 120 120 120 120 120 120 
##$DBP= (0..7)
150 150 150 150 150 150 150 150 
##$DBP07= 0
##$DBPNAM0= <>
##$DBPNAM1= <>
##$DBPNAM2= <>
##$DBPNAM3= <>
##$DBPNAM4= <>
##$DBPNAM5= <>
##$DBPNAM6= <>
##$DBPNAM7= <>
##$DBPOAL= (0..7)
0.5 0.5 0.5 0.5 0.5 0.5 0.5 0.5 
##$DBPOFFS= (0..7)
0 0 0 0 0 0 0 0 
##$DE= 6
##$DECBNUC= <off>
##$DECIM= 32
##$DECNUC= <off>
##$DECSTAT= 4
##$DIGMOD= 1
##$DIGTYP= 9
##$DL= (0..7)
0 120 120 120 120 120 120 120 
##$DP= (0..7)
$$ [...]
##$SUBNAM2= <"">
##$SUBNAM3= <"">
##$SUBNAM4= <"">
##$SUBNAM5= <"">
##$SUBNAM6= <"">
##$SUBNAM7= <"">
##$SUBNAM8= <"">
##$SUBNAM9= <"">
##$SW= 18.0517328524113
##$SWIBOX= (0..15)
0 0 2 0 0 0 0 0 0 0 0 0 0 0 0 0 
##$SW_h= 3612.71676300578
##$TD= 16384
##$TD0= 1
##$TE= 0
##$TE2= 300
##$TE3= 300
##$TEG= 300
##$TL= (0..7)
0 120 120 120 120 120 120 120 
##$TP= (0..7)
150 150 150 150 150 150 150 150 
##$TP07= 0
##$TPNAME0= <>
##$TPNAME1= <>
##$TPNAME2= <>
##$TPNAME3= <>
##$TPNAME4= <>
##$TPNAME5= <>
##$TPNAME6= <>
##$TPNAME7= <>
##$TPOAL= (0..7)
0.5 0.5 0.5 0.5 0.5 0.5 0.5 0.5 
##$TPOFFS= (0..7)
0 0 0 0 0 0 0 0 
##$TUNHIN= 0
##$TUNHOUT= 0
##$TUNXOUT= 0
##$USERA1= <user>
##$USERA2= <user>
##$USERA3= <user>
##$USERA4= <user>
##$USERA5= <user>
##$V9= 5
##$VALIST= <valist>
##$VCLIST= <CCCCCCCCCCCCCCC>
##$VD= 0
##$VDLIST= <DDDDDDDDDDDDDDD>
##$VPLIST= <PPPPPPPPPPPPPPP>
##$VTLIST= <TTTTTTTTTTTTTTT>
##$WBST= 1024
##$WBSW= 4
##$XGAIN= (0..3)
0 0 0 0 
##$XL= 0
##$YL= 0
##$YMAX_a= 39848
##$YMIN_a= -58764
##$ZGOPTNS= <>
##$ZL1= 120
##$ZL2= 120
##$ZL3= 120
##$ZL4= 120
##$ABSF1= 0
##$ABSF2= 0
##$ABSG= 0
##$ABSL= 0
##$ALPHA= 0
##$AQORDER= 0
##$ASSFAC= 0
##$ASSFACI= 0
##$ASSFACX= 0
##$ASSWID= 0
##$AUNMP= <proc_1d>
##$AZFE= 0.1
##$AZFW= 0.1
##$BCFW= 0
##$BC_mod= 2
##$BYTORDP= 0
##$COROFFS= 0
##$CY= -3
##$DATMOD= 1
##$DC= 0
##$DFILT= <>
##$DTYPP= 0
##$F1P= 0
##$F2P= 0
##$FCOR= 1
##$FTSIZE= 16384
##$FT_mod= 6
##$GAMMA= 0
##$GB= 0
##$INTBC= 1
##$INTSCL= 3.241238e-09
##$ISEN= 128
##$LB= 0.25
##$LEV0= 0
##$LPBIN= 0
##$MAXI= 10000
##$MC2= 0
##$MEAN= 0
##$ME_mod= 0
##$MI= 1.114404
##$NCOEF= 0
##$NC_proc= -8
##$NLEV= 6
##$NOISF1= 3.799351
##$NOISF2= 2.8
##$NSP= 0
##$NTH_PI= 0
##$NZP= 0
##$OFFSET= 15.50229
##$PC= 1
##$PHC0= -6894.148
##$PHC1= 6.42196
##$PH_mod= 1
##$PKNL= yes
##$PPARMOD= 0
##$PSCAL= 0
##$PSIGN= 0
##$REVERSE= no
##$SF= 200.130003884416
##$SI= 16384
##$SIGF1= 3
##$SIGF2= 2
##$SINO= 0.751879
##$SIOLD= 32768
##$SREGLST= <19F.Aceton>
##$SSB= 0
##$STSI= 16384
##$STSR= 0
##$SW_p= 3612.71676300578
##$SYMM= 0
##$S_DEV= 0
##$TDeff= 16384
##$TDoff= 0
##$TI= <>
##$TILT= no
##$TM1= 0
##$TM2= 0
##$TOPLEV= 0
##$USERP1= <user>
##$USERP2= <user>
##$USERP3= <user>
##$USERP4= <user>
##$USERP5= <user>
##$WDW= 1
##$XDIM= 16384
##$YMAX_p= 401541486
##$YMIN_p= -1657561
$$ End of Bruker specific parameters
$$ ---------------------------------
##NTUPLES= NMR SPECTRUM
##VAR_NAME=  FREQUENCY,     SPECTRUM/REAL,   SPECTRUM/IMAG
##SYMBOL=    X,             R,               I
##VAR_TYPE=  INDEPENDENT,   DEPENDENT,       DEPENDENT
##VAR_FORM=  AFFN,          ASDF,            ASDF
##VAR_DIM=   16384,         16384,           16384
##UNITS=     HZ,            ARBITRARY UNITS, ARBITRARY UNITS
##FACTOR=    0.220516191357247, 1,           1
##FIRST=     3102.47331229444, 0,            0
##LAST=      -510.243450711335, 0,           0
##MIN=       -510.243450711335, -1657561,    0
##MAX=       3102.47331229444, 401541486,    0
$$ Real data points
##PAGE= N=1
##DATA TABLE= (X++(R..R)), XYDATA
$$ [...]
9083D07552k8085k06971O1083J76418k43730Q9236n2249k1565k4445k9478K3857
$$ 407552 379467 172496 233579 409997 166267 255503 203254 181689 157244 127766 151623
9072A51623p8255m5943P3733L8686q0211Q67l6293m8338Q5007M8700K1496j06518
$$ 151623 73368 27425 101158 139844 59633 60500 24207 -24131 60876 109576 131072 24554
9060B4554L7397R2770Q9880j629j68414l4084N4803l093j15985j7606R6368J05548
$$ 24554 61951 154721 244601 242972 74558 40474 95277 92184 -23801 -41407 54961 160509
9048A60509L9286M8143J5482n5467k7034m8411m1399L3805o9705o1519M2398l8654
$$ 160509 199795 247938 263420 207953 180919 132508 91109 124914 55209 -6310 36088 -2566
9036b566J59518o0751O8564P8663J14274n0300r3546l6491Q7063N8735n4750j23413
$$ -2566 156952 96201 164765 243428 357702 307402 213856 177365 264428 323163 268413 145000
9024A45000j68204J36692K4095J85394J26594n0304k36323j0092K03317N8878
$$ 145000 -23204 113488 137583 322977 449571 399267 162944 152852 356169 415047
9014D15047l8188n8413k2486k8783R77j0529l3593K0922L7499M0948K227p9963
$$ 415047 376859 318446 295960 267177 268154 257625 224032 244954 282453 323401 325628 245665
9002B45665q9970K25404m359m491J1042L8123n812n796q8770j13379k0747P0478
$$ 245665 155695 381099 376740 372249 383291 421414 415602 409806 321036 207657 186910 257388
8990B57388J7254m4337m6083m3266Q9867m544j2999o8804r07J10136P4194Q0744
$$ 257388 274642 230305 184222 140956 230823 226279 213280 144476 143569 253705 327899 408643
8978D08643J18271m4715j4489l5939j81830R3103J81963q2447r5574J91802J948
$$ 408643 526914 482199 467710 431771 249941 343044 525007 442560 346986 538788 540736
8967E40736p9361K4578O8777M3018K1468P3915l3480Q3958O7235l1649M8095R4267
$$ 540736 461375 485953 554730 597748 619216 693131 659651 743609 810844 779195 827290 921557
8955I21557o5536j10028l034J96025j4582J15145K63837J1395j1452R1092J01772
$$ 921557 856021 745993 742959 938984 924402 1039547 1303384 1314779 1303327 1394419 1496191
8944A496191j6585m8638J20679J49233J11854K79457J88075K15594L09684K47936
$$ 1496191 1479606 1430968 1551647 1700880 1812734 2092191 2280266 2495860 2805544 3053480
8934C053480L84420N87403O34277J206650J891951K627557L642546M248724L741852
$$ 3053480 3437900 4025303 4659580 5866230 7758181 10385738 14028284 18277008 22018860
8925B2018860K354775R23771j61183r86271k649879l452610l217961k601844k201724
$$ 22018860 24373635 25297406 25136223 24149952 21500073 18047463 14829502 12227658 10025934
8916A0025934k059296j438129j234500q86094n42083l05643l40332l43550j84219
$$ 10025934 7966638 6528509 5294009 4407915 3865832 3560189 3219857 2876307 2692088
8907B692088l38930l34038k29949j20613K4912j12013J1878j8154j88776K5876
$$ 2692088 2353158 2019120 1789171 1668558 1693470 1581457 1593335 1575181 1386405 1412281
8897A412281j46217k8319l3443j30830j02103L6641J0870m7089n3382J2489J42216
$$ 1412281 1266064 1237745 1204302 1073472 971369 1008010 1018880 971791 918409 930898 1073114
8886A073114J69222l5500j54594n3464o5848n2418m9213K8598j04926P3632m9743
$$ 1073114 1242336 1206836 1052242 998778 932930 880512 831299 859897 754971 828603 778860
8875G78860m7543m976l65953k50026K81619K3584N1540l1174J1675m3493O3182
$$ 778860 731317 726341 360388 110362 391981 415565 467105 435931 447606 404113 467295
8864D67295n3418j04615J05372m892k6568j05086K3385P9966p9495N7847n6008
$$ 467295 413877 309262 414634 409742 383174 278088 301473 381439 301944 359791 303783
8853C03783j38703J17924J3032K4420j55578J11088k5363j16271R0814J85718
$$ 303783 165080 283004 296036 320456 164878 275966 250603 134332 225146 410864
8843D10864j42734m0041l3945N5072N745j71646L1216L6632K5737m0473R54K25172
$$ 410864 268130 228089 194144 249216 254961 83315 114531 151163 176900 136427 137381 362553
8831C62553k21650J8794P3306m7887P6234j27786M9656P8726m8847p4789l5370
$$ 362553 140903 159697 233003 185116 261350 133564 183220 261946 213099 138310 102940
8820A02940m796N7659K6639N9837n5690J14763j13542j1283R4059R349O2196j905
$$ 102940 98144 155803 182442 242279 186589 301352 187810 176527 270586 279935 342131 340226
8808C40226r8325j45542m889l2645Q5391J32256j6293j6431l4526j50517J69827
$$ 340226 241901 96359 91470 58825 144216 276472 260179 243748 209222 58705 228532
8797B28532Q5987q7581j86298P4817J40167m0787n100j15824Q5338P4002j27707
$$ 228532 314519 226938 40640 115457 255624 214837 209737 93913 179251 253253 125546
8786A25546M4185o2653L9805n3266q7636J33486p8447J2969Q6345L8372J4410
$$ 125546 169731 107078 146883 93617 5981 139467 61020 73989 160334 198706 213116
8775B13116j04087J20424j77031J6052J2922j4360J66758k5685k9448j1892Q2776
$$ 213116 109029 229453 52422 68474 81396 67036 233794 208109 178661 166769 249545
8764B49545k602l6719l4123j00530j215J42107o3680N3704q1598K8181l8862j31868
$$ 249545 246943 210224 176101 75571 74356 216463 152783 206487 124889 153070 114208 -17660
8752a7660K0336O0593l7253r518j30845J49291Q9473K2679J1216r0640K1474n0179
$$ -17660 2676 63269 26016 16498 -114347 34944 124417 147096 158312 67672 89146 38967
8740C8967N3253j5038J7071R3530l6671m2950o1275Q2174J2914K6263P6897j53797
$$ 38967 92220 77182 94253 187783 151112 108162 46887 129061 141975 168238 245135 91338
8728I1338j50574M3423K9677L7845q6657J68478K7539P0808K00911r3763j52516
$$ 91338 -59236 -15813 13864 51709 -34948 133530 161069 231877 432788 339025 186509
8717A86509m5042Q8485j8677l7102M5452o6528o4224J21804N5803m5129N4073
$$ 186509 141467 229952 211275 174173 219625 153097 88873 210677 266480 221351 275424
8706B75424L3391M6038j35121k2472j01985K3704J41804o5253J0925k9212J3044
$$ 275424 308815 354853 219732 197260 95275 118979 260783 195530 206455 177243 190287
8695A90287K9141P537K0291j15660r1782N6892O705J2816l4213J40261o1374m9400
$$ 190287 219428 226965 247256 131596 39814 96706 103411 116227 82014 222275 160901 111501
8683A11501J16011j16581L3011n7882J3753O445o4032P4266j36022l2704R7820
$$ 111501 227512 110931 143942 86060 99813 106258 42226 116492 -19530 -52234 45586
8672D5586N6920k0233J4727q424N9173k9191o3902j11428K14331N2261Q5180O1530
$$ 45586 102506 82273 97000 88576 147749 118558 54656 -56772 157559 209820 295000 356530
8660C56530j48721p9172l6186J0166j05268q9532J48089R8024j45677K8994O4277
$$ 356530 207809 128637 92451 102617 -2651 -92183 55906 153930 8253 37247 101524
8649A01524l170J9449n1015K2079m524o033L0955k5505m7413j21330L7106N970
$$ 101524 98354 117803 66788 88867 84343 78310 109265 83760 36347 -84983 -47877 -41907
8637d1907j18236R9413L3648N0862k5565M5455o3121P6679N0787j48244J29108
$$ -41907 -160143 -60730 -27082 23780 -1785 43670 -19451 57228 108015 -40229 88879
8626H8879j29002J46716l0232j27909J81172R984L609M0368M3343j48770o7282
$$ 88879 -40123 106593 76361 -51548 129624 139608 143217 183585 226928 78158 10876
8615A0876L0584R0090p6326N8049j43060J11224l4628m9237K17238p3109k4600
$$ 10876 41460 131550 55224 113273 -29787 81437 46809 -2428 214810 141701 117101
8604A17101L2463k0831j0832j7251O1723l2239o7011m135J39836N774o5613J00588
$$ 117101 149564 128733 117901 100650 162373 130134 63123 58988 198824 204598 138985 239573
8592B39573l9974P991q5043M5647J12822j8378o4053O0717L9696j35318J47643
$$ 239573 199599 207590 122547 168194 281016 262638 198585 259302 298998 163680 311323
8581C11323l84143l28907K08657J96149N0848K9945O1591q7607L4793j7365Q0266
$$ 311323 -72820 -401727 -193070 3079 53927 83872 145463 57856 92649 75284 155550
8570A55550j55374P7434P4052j06359K2458R5257j33399r1129L7890j3199l8860
$$ 155550 176 77610 151662 45303 67761 163018 29619 -61510 -23620 -36819 -75679
8559g5679J94131Q8055j03637O6740k7756j2381J9968L491n2990l1794N8686o7384
$$ -75679 118452 206507 102870 169610 141854 129473 149441 152932 99942 68148 126834 59450
8547E9450J09386J1189N7409k03189o464J1071l2700j08222J58325J0017j16304
$$ 59450 168836 180025 237434 34245 27781 38852 6152 -102070 56255 66272 -50032
8536e0032J62777L4957K0977P6854m9342j08439K5927P913m0227J7241l3128o130
$$ -50032 112745 147702 168679 245533 196191 87752 113679 121592 81365 98606 65478 59348
8524E9348J33975q13k5575r3590p3935K0364J26738o4442j15483K13194J33890
$$ 59348 193323 192510 166935 73345 -590 19774 146512 82070 -33413 179781 313671
8513C13671q8497j934P1767j0528q5751o7939K54936j08782q0106J9303j16900
$$ 313671 225174 223240 295007 284479 198728 130789 385725 276943 196837 216140 99240
8502I9240j0700m2130Q715J6799K7848K7235j2201j8052R6256p791j01913j34345
$$ 99240 88540 46410 55125 71924 99772 127007 114806 96754 193010 185219 83306 -51039
8490e1039j2964J40251P2781r9939M4229j379o7141o6417L6327K51583J03826
$$ -51039 -64003 76248 149029 49090 93319 91940 24799 -41618 -5291 246292 350118
8479C50118j88350o9650J9508J36652J9776r2504L172O5134N5001o7108k8529
$$ 350118 161768 92118 111626 248278 268054 175550 178722 243856 298857 231749 203220
8468B03220M2736p1261K6059k6401J14686l1925j20831j3597Q7664j45007j1496
$$ 203220 245956 174695 200754 174353 289039 257114 136283 122686 210350 65343 53847
8457E3847N4846R3793l4605O369n5411J768p179N8278J30155k4822J02682n5857
$$ 53847 108693 202486 167881 174250 118839 120607 113428 171706 301861 277039 379721 323864
8445C23864k7588l9224n7654l1525k16806o5324O1395J27757M7704r0488R3154
$$ 323864 296276 257052 199398 167873 -48933 -114257 -52862 74895 122599 32111 125265
8434A25265l593L9519j0880o9394K6606j0850j4441R4436J78335j09067j20528
$$ 125265 121672 161191 150311 80917 107523 96673 82232 176668 355003 245936 125408
8423A25408o4400r6978P1239J785P8755J00277m0014m502n0574j29580M1986K01176
$$ 125408 61008 -35970 35269 37054 115809 216086 176072 171570 120996 -8584 33402 234578
8411B34578q3549j12348P1051q4753K1617J5792M817j51496O4623J58954L4501
$$ 234578 151029 38681 109732 24979 46596 62388 67205 -84291 -19668 139286 173787
8400A73787j46218l7116J11378K6307N1438J936j98810n660J22716L6430j18765
$$ 173787 27569 -9547 101831 128138 179576 181512 -17298 -22958 99758 136188 17423
8389A7423k424J41132p4362Q6185q8500l7429J50625P8799l8378P6171k4119m0464
$$ 17423 14999 156131 81769 167954 79454 42025 192650 271449 233071 309242 285123 244659
8377B44659m4012j36639o8105M1081L0293J82580R2753j87735L7020P3728p9979
$$ 244659 200647 64008 -4097 36984 67277 249857 342610 154875 191895 265623 185644
8366A85644n1907M1269m6744l290m2604k1712p0351j6425m5296O7837K47884j3491
$$ 185644 133737 175006 128262 124972 82368 60656 -9695 -26120 -71416 -3579 244305 230814
8354B30814N1066n8138j00254L01L7461l6106q8419M2386p7148J36513j47123
$$ 230814 281880 223742 123488 123789 161250 125144 36725 79111 1963 138476 -8647
8343h647j1804q5825m9043J8712J35955J55892j39589Q9388J11734j55997o7915
$$ -8647 -20451 -106276 -155319 -136607 -652 155240 15651 105039 216773 60776 -7139
8332g139o8415N6944K5677J7302M0351N2839R6177r8911j10762k9349K7665J64932
$$ -7139 -75554 -18610 7067 24369 64720 117559 213736 114825 4063 -25286 2379 167311
8320A67311k1450k3460N4487m1308j09656O3228N9148l7772J46003o9947j5944
$$ 167311 145861 122401 176888 135580 25924 89152 148300 110528 256531 186584 170640
8309A70640j13766L5670Q4845j25417m6101J46356m7991L6747N334M3934p3264
$$ 170640 56874 92544 177389 51972 5871 152227 104236 140983 146317 190251 116987
8298A16987J1432J2435K4695o3980q5186L4419P593j38278P0702R9165p0624m7430
$$ 116987 128419 140854 165549 101569 16383 50802 58395 -79883 -9181 89984 19360 -28070
8286b8070o520Q7372P287J04664p5546o5880J57075O7866j1539l0703J8447P0428
$$ -28070 -34590 52782 60069 164733 89187 23307 180382 248248 236709 206006 224453 294881
8274B94881M276K5357j35599p4236R5802k8110q6130Q9508Q6992N3904o2096p3415
$$ 294881 299157 324514 188915 114679 210481 182371 96241 185749 272741 326645 264549 191134
8262A91134q332o5464K1566M8038N3710j02796j28614P5798l329J60966O4017
$$ 191134 182802 117338 138904 186942 240652 137856 9242 85040 81711 242677 306694
8251C06694j50645j10270J56811K8725j46246o1464K04084J47238j77455j33396
$$ 306694 156049 45779 202590 231315 85069 23605 227689 374927 197472 64076
8241F4076Q6821k5438J7409J89042l1226q3187m7944R176Q9774r580o2511j1739
$$ 64076 150897 125459 142868 331910 300684 217497 169553 178729 268503 258923 196412 184673
8229A84673j59058n384k480N7959P8526n4694O217r2728J0923K3775l663J09256
$$ 184673 25615 20231 17751 75710 154236 99542 105759 13031 23954 47729 44066 153322
8217A53322R240M830j02528J35824r8381P1415k9642m7038j25896J45061J10693
$$ 153322 162562 167392 64864 200688 102307 173722 144080 97042 -28854 116207 226900
8206B26900j6992j17273J265K3363J60735l223q4868J1624q9874n665R0778j8881
$$ 226900 209908 92635 93900 117263 277998 274775 189907 201531 111657 105992 196770 177889
8194A77889j25306j10512j599632P92666Q18668n4329J60078j61863J98401p8972
$$ 177889 52583 -57929 -1657561 -864895 -46227 -100556 59522 -102341 96060 17088
8184A7088o0085J3767J66900N799p1223r256m2521j66270j1377J14182O9922J7337
$$ 17088 -42997 -29230 137670 143469 72246 62990 20469 -145801 -157178 -42996 26926 44263
8172D4263M6614j42835J78302J42908p4997l6612o0413q4535M6439k4857J55257
$$ 44263 90877 -51958 126344 269252 194255 157643 97230 12695 59134 34277 189534
8161A89534M6080r6220j08119O1234k9267k6928L2298p7151K04433p300J719k1537
$$ 189534 235614 139394 31275 92509 63242 36314 68612 -8539 195894 188594 190313 168776
8149A68776q1221j00641j33460J70658M0481l9879J32003q9276n5344j8958J75633
$$ 168776 87555 -13086 -146546 24112 64593 24714 156717 67441 12097 -6861 168772
8138A68772l1565n3492m0845R0259q1266m5979J70022N0553n8988K9369J26628
$$ 168772 137207 83715 42870 133129 51863 5884 175906 226459 167471 196840 323468
8127C23468j8003q9008j38089k6041r7436l1285j5502N7842O9570r5571q6124
$$ 323468 305465 216457 78368 52327 -45109 -76394 -91896 -34054 35516 -60055 -146179
8116a46179J90464J62675j9171j48851o1718p7185J50577p1128r9901J24241O2380
$$ -146179 44285 206960 187789 38938 -22780 -99965 50612 -20516 -120417 3824 66204
8105F6204J2719J0895L7889N1K0575r710m3366Q2140J22045K885j65419L3237
$$ 66204 78923 89818 127707 127758 148333 138623 95257 177397 299442 302327 136908 170145
8093A70145J0313j24877o5605j60030J86777K1763p3066J13245k605Q9055K17203
$$ 170145 180458 55581 -10024 -170054 16723 38486 -34580 78665 76060 165115 382318
8082C82318j30600p5071J36608k0689O627J5998j15654L9335k6728J5858o0676
$$ 382318 251718 176647 313255 292566 299193 315191 199537 238872 212144 228002 167326
8071A67326K1679k8350P533j70978O8306J45111p7440K2358k3626J16767o0265
$$ 167326 189005 160655 168188 -2790 65516 210627 133187 155545 131919 248686 188421
8060A88421M7444j38125q7021J21386j6026L2216R2394k04888J3251L4449k8721
$$ 188421 235865 97740 10719 132105 116079 148295 240689 35801 49052 83501 54780
8049E4780L6156Q7430N5613r3489K5131l0551J2824O6257K4570m7228n0189L6301
$$ 54780 90936 178366 233979 140490 165621 135070 147894 214151 238721 191493 141304 177605
8037A77605o0504n0601R6567o7918l0830j6273k6325K8049k1913p9849J01569
$$ 177605 117101 66500 163067 95149 64319 48046 21721 49770 27857 -51992 49577
8026D9577J61100r1377k2190K4136K7604J339j10331R6887J42838k9666p6876
$$ 49577 210677 119300 97110 121246 148850 150189 39858 136745 279583 249917 173041
8015A73041J5214j76924r0297J28834Q6378J4050J7108P9861j86123N144o1526
$$ 173041 188255 11331 -78966 49868 136246 150296 167404 247265 61142 66286 4760
8004D760M972L5657J24309K4178q7519o6855O2246L9575O3748p4111q8448l3649
$$ 4760 9732 45389 169698 193876 106357 39502 101748 141323 205071 130960 42512 8863
7992H863p490R2705j0776l3776j28403l4411K03260k6394o6002R6926j702J5072
$$ 8863 1373 94078 83302 49526 -78877 -113288 89972 63578 -2424 94502 92800 107872
7980A07872O497K6064Q7363M314j47967n4481L9427J16497J02686o0224k17282
$$ 107872 114369 140433 227796 232110 84143 29662 69089 185586 288272 228048 10766
7969A0766N8756J19840j03379r3826R009J67504Q1425j32498j6677q9722m5967
$$ 10766 69522 189362 85983 -7843 1166 168670 250095 117597 100920 11198 -34769
7958c4769M1603J04217N071J45977q1652r4543Q2101J1775p4168J53206K0134
$$ -34769 6834 111051 116122 262099 180447 85904 168005 179780 105612 258818 278952
7947B78952j23788r4412L8867K0934k1958K6968r9374R598N7210L3478k2032K7690
$$ 278952 155164 60752 99619 120553 98595 125563 26189 35787 92997 126475 104443 132133
7935A32133o9937M8286L0367j7430p1784J5523p6745k0689Q0023R886P1026j7837
$$ 132133 62196 110482 140849 123419 51635 67158 -9587 -30276 49747 59633 130659 112822
7923A12822L9141M6503K8635p0151l2151P8889M6573j9797O6831k81368P1239
$$ 112822 151963 198466 227101 156950 124799 203688 250261 230464 297295 15927 87166
7912H7166j38L6174j7887n7916J98326J9300m7509k7509K7794K8138O0278k06795
$$ 87166 87028 123202 105315 47399 245725 265025 217516 190007 217801 245939 306217 99422
7900I9422M6865o7030O5598M6851J05340O2727j78549k2066n1676Q4165j5943
$$ 99422 146287 79257 144855 191706 297046 359773 181224 159158 107482 191647 175704
7889A75704k4479J86993K5910q6876j87716J003N6439N9986J32756j3301j30424
$$ 175704 151225 338218 364128 277252 89536 90539 146978 206964 339720 326419 195995
7878A95995L0887j04532O023m2866J1791N8043p3483L7035l5974m0494J46370
$$ 195995 226882 122350 128373 85507 97298 155341 81858 118893 82919 42425 188795
7867A88795q5174k8541R255Q7834J68026j53617L0207j54812r5791J6858J20123
$$ 188795 103621 75080 84335 172169 340195 186578 216785 61973 -33818 -16960 103163
7856A03163L9707j34296L2148O0499N3940Q4268K1014j35632k2840j21460K40281
$$ 103163 142870 8574 40722 101221 155161 239429 260443 124811 101971 -19489 220792
7845B20792J18458j69690k0860j25784l1922M6349k7333J1271L456J01027k053
$$ 220792 339250 169560 148700 22916 -9006 37343 10010 21281 24737 125764 123711
7834A23711q0563J34447J41333j44815j44506J9366Q3609Q6490j86300l0984J10789
$$ 123711 43148 177595 318928 174113 29607 48973 132582 219072 32772 1788 112577
7823A12577Q9469o0681J42002L7695n1837k75050J33269Q3225p199O3232r28R077
$$ 112577 202046 141365 283367 321062 269225 -5825 127444 210669 203470 266702 265774 274851
7811B74851o4833j09405N4724m8117J99949k940J77890q00686q23813J163805
$$ 274851 210018 100613 155337 107220 307169 304229 482119 -318567 -1142380 21425
7801B1425J89682P6846j16286j1486l2165L8932O8658L6871Q66K7483R2703j06379
$$ 21425 211107 287953 171667 160181 128016 166948 235606 272477 273343 300826 393529 287150
7789B87150j52726K2048O9431j861l8911k9872P9210j26102k9527J58315m0833
$$ 287150 134424 156472 225903 224042 185131 155259 234469 108367 78840 237155 196322
7778A96322L7383q5014J9542p2203m3788J10053r1955J27549J82959R4562q6801
$$ 196322 233705 148691 168233 96030 52242 162295 70340 197889 380848 475410 388609
7767C88609m7621p4089K4662l8386o6354J41114J38134r5961J0191M3817n0432
$$ 388609 340988 266899 291561 253175 186821 327935 466069 370108 380299 424116 373684
7756C73684J08185O833j00164l5065m0812J91391P2455m860l7666K3695n9158
$$ 373684 481869 488702 388538 353473 312661 504052 576507 571647 533981 557676 498518
7745D98518R1764l7983r6055J6922M6312j03636j6151R163R6050j04270P0136
$$ 498518 590282 552299 456244 473166 519478 415842 399691 408854 504904 400634 470770
7734D70770K04953R8265r0884Q4203q4234J2019j6477r2000m4605r7527J57499
$$ 470770 675723 773988 683104 767307 683073 695092 678615 586615 542010 444483 601982
7723F01982J9203m2294l6201j52174J39357N1549j93553J7144r489J1233q4914
$$ 601982 621185 578891 542690 390516 529873 581422 387869 405013 395524 406757 321843
7712C21843m1847j9426j3056K2648j4254O7300M9412J5821r651j14879O5530m6162
$$ 321843 279996 260570 247514 270162 255908 323208 372620 388441 378790 263911 329441 283279
7700B83279J02513k4021l3660K6549l0938j9214J1397m4743o5543p4512J68278
$$ 283279 385792 361771 328111 354660 323722 304508 315905 271162 205619 131107 299385
7689B99385N8116J5820k4660j9275j41610L5609j08711M5352J05319j31246N6738
$$ 299385 357501 373321 348661 329386 187776 223385 114674 160026 265345 134099 190837
7678A90837L1416q1657l9286J09754O5152j67595j7888K38826M536M3990k9298
$$ 190837 222253 140596 101310 211064 276216 108621 90733 329559 334095 378085 348787
7667C48787p5893j07294o3006N897k738M6328K4173O6146n9844L3956P886j07015
$$ 348787 272894 165600 102594 108491 105753 152081 176254 242400 182556 216512 224398 117383
7655A17383j05665q988R2259J03351N695j4474p6592N0272M0467m1306O4538Q8135
$$ 117383 11718 2730 94989 198340 204035 189561 112969 163241 203708 162402 226940 315075
7643C15075R4966j01071j34380K3000J26924N1727J9457j26688Q0793j04894m3021
$$ 315075 410041 308970 174590 197590 324514 376241 395698 269010 349803 244909 201888
7632B01888n2405j35861R0568r8190L6172J11146N1583Q5465Q1348j10102j00782
$$ 201888 149483 13622 104190 6000 42172 153318 204901 290366 371714 261612 160830
7621A60830k00543J31249P8687k0197p2164L2165Q5686o5697P6088K6976j1203
$$ 160830 -39713 91536 170223 150026 77862 110027 195713 130016 206104 233080 221877
7610B21877J7803q0278J38956j18771P1817l546p1691Q4220m444j5840Q8445j13284
$$ 221877 239680 159402 298358 179587 251404 247858 176167 260387 255943 240103 328548 215264
7598B15264K5945m7894k7011Q7804o5108M3079n4355J27613p649J4509j7022n2823
$$ 215264 241209 193315 166304 254108 189000 232079 177724 305337 297688 312197 295175 242352
7586B42352K2872j1707j87351J86582l8260J7043k6047l5922n8737r463j4395
$$ 242352 265224 253517 66166 252748 214488 231531 205484 169562 110825 101362 86967
7575H6967j7708n202Q2055J9201N1659p4091Q909m0438J16724m3376P465J6689
$$ 86967 69259 64057 146112 165313 216972 142881 151790 111352 228076 184700 192165 208854
7563B08854q8239j7850o6134j1523J45383l11L6543k259r5328O4497M2389j7460
$$ 208854 120615 102765 36631 25108 170491 170180 206723 204464 109136 173633 216022 198562
7551A98562J9177m538K4682q0163R8437J2252M2952O729o9552J8667j65368J1495
$$ 198562 217739 213201 237883 157720 256157 268409 311361 318090 248538 267205 101837 113332
7539A13332Q3184n6960k6008J03563l6723m2038j25769j0065N4728Q5326N1911
$$ 113332 196516 139556 113548 217111 180388 138350 12581 2516 57244 142570 194481
7528A94481r7376P954l9986K2664P9554n7658Q1086n5642Q958l6275J2109J38909
$$ 194481 97105 105059 65073 87737 167291 109633 190719 135077 144035 107760 119869 258778
7516B58778L7391j0113j49163n8157m7740j15201J17749R2783j514L2413p1292
$$ 258778 296169 286056 136893 78736 30996 -84205 33544 126327 124813 157226 85934
7505H5934k1197M7494K4873P7708n0547K1503j1077J14221m6781j9412o7714K4144
$$ 85934 64737 112231 137104 214812 164265 185768 174691 288912 242131 222719 155005 179149
7493A79149J02811K518q9600J01790k9681R4978p3305o1072M2066l2632j83j35552
$$ 179149 281960 284478 194878 296668 266987 361965 288660 227588 269654 237022 236839 101287
7481A01287J04725k2159o9089l3670r9829J30393m159q747k9503Q8159l1356j04319
$$ 101287 206012 183853 114764 81094 -18735 111658 107499 98752 69249 157408 126052 21733
7469B1733K13172J0959m1094M5056q4915n1095P0315J40739m065p3550j48115
$$ 21733 234905 245864 204770 249826 164911 113816 184131 324870 320805 247255 99140
7458I9140R979Q6572J47797l441p7422r4717j32485J36594J6343p2715O8963q5541
$$ 99140 109119 195691 343488 340047 262625 167908 35423 172017 188360 115645 184608 99067
7446I9067l8132J08493l9269R4630m349p9178K629Q3468p1165P5450m2879j5567
$$ 99067 60935 169428 130159 224789 220440 141262 143891 227359 156194 231644 188765 173198
7434A73198J20176l1786J25126p3118k40469K1242l0237J736o1273o3834k3358
$$ 173198 293374 261588 386714 313596 73127 94369 64132 65868 4595 -59239 -82597
7423h2597j3315K17802N2588o1511J25906m1325j52658m1718J47301k8968j15981
$$ -82597 -95912 121890 174478 112967 238873 197548 44890 3172 150473 121505 5524
7412E524J12963Q6747n1019q3718Q6748J03571j4737j1281J0395o9228j48158
$$ 5524 118487 205234 154215 70497 157245 260816 246079 234798 245193 175965 27807
7401B7807r652K7816L8091K21928L0761j78428J3587j48250m3577J15699N9204
$$ 27807 18155 45971 84062 305990 336751 158323 171910 23660 -19917 95782 154986
7390A54986j17978J81961J99882j50152l2025q8899M5701j5860m6901P9699j99687
$$ 154986 37008 218969 418851 268699 236674 147775 193476 177616 130715 210414 10727
7379A0727j64591J15205J26694O0576j34974n645k1R2200J02455M6071m3845k2358
$$ 10727 -153864 -38659 88035 148611 13637 7992 7971 100171 202626 248697 204852 182494
7367A82494j03831q6914J07961J04825l6303j4388O1046p2165Q3221m4260o3326
$$ 182494 78663 -8251 99710 204535 168232 153844 214890 142725 225946 181686 118360
7356A18360O4090m0624j99992J33342j2589L7006P8267p7606M5936o5327j16248
$$ 118360 182450 141826 -58166 75176 62587 99593 177860 100254 146190 80863 -35385
7345c5385K3271P4102J2734j2502N1938J5054M3069j08174k4602k5996j26412
$$ -35385 -12114 61988 74722 62220 114158 129212 172281 64107 39505 13509 -112903
7334a12903J11274P0133N2982k3254L169J91642n5699K2993l9436j0702r0340
$$ -112903 -1629 68504 121486 98232 101401 293043 237344 260337 220901 210199 119859
7323A19859Q6420j16462r1698R8446r7010K733J15026N6562j08590Q3925P4365
$$ 119859 206279 89817 -1881 96565 -445 2288 117314 173876 65286 149211 223576
7312B23576l996j02382K3453o6544R524O2526m9944K5722R198J40191n2429n8036
$$ 223576 219580 117198 140651 74107 83631 146157 96213 121935 131133 271324 218895 160859
7300A60859r6345o3095J32275j1881N9630J09426j07918j12232J8719L3696Q9078
$$ 160859 64514 1419 133694 121813 181443 290869 182951 70719 89438 123134 212212
7289B12212k1843n588P6481O4733n0826q8796j27090J09165k5595K5912k4583
$$ 212212 190369 184781 261262 325995 275169 186373 59283 168448 142853 168765 144182
7278A44182m0387j9278L9768j02693P0093O8908L4728o7142j03335m817K6328
$$ 144182 103795 84517 124285 21592 91685 160593 195321 128179 24844 20027 46355
7267D6355R8930J03407k435n9603l1355m0480l160L5522J04559l196n6654r2027
$$ 46355 145285 248692 246257 186654 155299 114819 111659 147181 251740 248544 191890 99863
7255I9863l0868L3721J09838p3049m2229O8604j6147M9150l8994P6976J7686j16210
$$ 99863 68995 102716 212554 139505 97276 165880 149733 198883 159889 236865 254551 138341
7243A38341q8318J72231N7397j26503n8676J99296J6487n3407o6628M5828p2400
$$ 138341 50023 222254 279651 153148 94472 293768 310255 256848 190220 236048 163648
7232A63648p5885k7539n9414J34052m796L5807K298O9329n0239K1026q5790n0540
$$ 163648 87763 60224 810 134862 130066 165873 168171 237500 187261 208287 122497 71957
7220G1957J69551j185M3056K0569j1294N3252j40558j16113J97398p0424j14279
$$ 71957 241508 240323 283379 303948 292654 345906 205348 89235 286633 216209 101930
7209A01930M015O6139P938K8380J50504j25742r1704J2676R6863N0907R8296k20664
$$ 101930 105945 172084 180022 208402 358906 233164 141460 154136 250999 301906 400202 179538
7197A79538J5044k8051J37693N2305j5314J5149L7443j20572j09235N9799j5729
$$ 179538 194582 166531 304224 356529 341215 356364 393807 273235 164000 223799 208070
7186B08070P6588M0781l6165M0109r5842j5539Q9551q5605m5190L1298K8310M4773
$$ 208070 284658 325439 289274 329383 233541 218002 307553 221948 176758 208056 236366 281139
7174B81139o443R0146l7201O6016k2904o680p913r1539m4549K7739J87n1096Q2986
$$ 281139 274696 364842 327641 393657 370753 364073 356160 264621 220072 247811 247998 196902 279888
7161B79888o372k0436L0842K1038J6449n6968o1428O2035j18734N4338R7344L8102
$$ 279888 273516 253080 283922 304960 321409 264441 203013 265048 146314 200652 297996 336098
7149C36098m0109M8011j03507P5158P0303L08107J11126O9260K16570K33642J76528
$$ 336098 295989 344000 240493 315651 385954 694061 805187 874447 1091017 1324659 1501187
7138A501187N3144n6612j87769r2515p0956r7552j89224p5516j17443q0537r2880
$$ 1501187 1554331 1497719 1309950 1217435 1146479 1048927 859703 784187 666744 586207 493327
7127D93327p9681m6393n717p1482J1618J84387M8304o6927N443j91720m5089p9649
$$ 493327 413646 367253 361536 290054 301672 486059 534363 467436 472879 281159 236070 156421
7115A56421K6597N1376n827K5591L3287N1127L1705P0376n1178j48700j13107
$$ 156421 183018 234394 228567 254158 287445 338572 370277 440653 389475 240775 127668
7104A27668R3962q9499P6966r1763N5136M9J5184O4128j59283M8925P4625m3437
$$ 127668 221630 132131 209097 117334 172470 172519 187703 251831 92548 141473 216098 172661
7092A72661J08362l0388k01888m7338K1950J38353P5645p8995j24422L7027M3903
$$ 172661 281023 250635 48747 1409 23359 161712 237357 158362 33940 70967 114870
7081A14870j15656j0356J43218M285M2518k4692J03339j5617k9852m9953M673
$$ 114870 -786 -11142 132076 136361 178879 154187 257526 241909 212057 162104 166777
7070A66777Q5187j43820J19834j44940P6054J60640j05091j7814j03702l9318
$$ 166777 251964 108144 227978 83038 159092 319732 214641 196827 93125 53807
7060E3807J47499o0362j52999J94735Q1944j1572L8988m8237n5624J03991p299
$$ 53807 201306 140944 -12055 182680 264624 253052 292040 243803 188179 292170 284871
7049B84871j5614p9168J26299j51736j2824J20180p6027r824P8450R45q3388p9409
$$ 284871 269257 190089 316388 164652 151828 272008 195981 186157 264607 265552 182164 102755
7037A02755K1533K4771j023j25n2734O3597J6804n2264K0236Q9221k9898P2890
$$ 102755 124288 149059 148036 147911 95177 158774 175578 123314 143550 232771 202873 275763
7025B75763K3204j47659L8884o6799j54201P9576Q1175J71780m7076p3438j4298
$$ 275763 298967 151308 190192 123393 -30808 48768 129943 301723 254647 181209 166911
7014A66911j6877J9856k9893m6235J2619P3790O8122K7423n9113M946j7462o6147
$$ 166911 150034 169890 139997 93762 106381 180171 248293 275716 216603 221549 204087 137940
7002A37940P3083r1739R0499k9691P7520q1287j0561J01390K502K7576O3176o1062
$$ 137940 211023 119284 209783 180092 257612 176325 165764 267154 269656 297232 360408 299346
6990B99346p5510J4010j11467Q7627n055l2752O4698L1584r7350N214J50952j19932
$$ 299346 223836 237846 126379 214006 208951 176199 240897 272481 175131 180345 331297 211365
6978B11365p4992J8397J7972J72224j39385J29231j90201r85J81098j59237l242
$$ 211365 136373 154770 172742 344966 205581 334812 144611 143626 324724 165487 162245
6967A62245n1950N8886p4574L418K4681L0710Q7916j68114M867J21034Q1501J17766
$$ 162245 110295 169181 94607 98025 122706 153416 241332 73218 78085 199119 280620 398386
6955C98386l2794p2423j14860L5466K4442o6713L8407J4055j3337K7822j46376
$$ 398386 365592 293169 178309 213775 238217 171504 209911 223966 210629 238451 92075
6944I2075P986J57120L2688l463r606m9143O2327J3589m9203j07263Q5162n274
$$ 92075 100061 257181 289869 286406 276800 227657 289984 303573 254370 147107 232269 226995
6932B26995K4590J10515j28165n1697J7942K8103q0823N0913J26795k1021j11074
$$ 226995 251585 362100 233935 182238 200180 228283 147460 198373 325168 304147 193073
6921A93073K4665J06268Q3244j30620q891K4468l5081l8490j9330L4123Q1989
$$ 193073 217738 324006 407250 276630 267739 292207 257126 218636 199306 233429 315418
6910C15418q6702p5196J76817n0979K5707j8031l5310L6461O6169N7261k4486
$$ 315418 228716 153520 330337 279358 305065 287034 251724 288185 354354 411615 387129
6899C87129q4602j05223J8891Q3916M1127J6152J455j09629J28005m7865j79762
$$ 387129 302527 197304 216195 300111 341238 357390 358845 249216 377221 329356 149594
6888A49594m8194J01660L9877Q0514m8573k239r4539R977J7023P0628r1235j0615
$$ 149594 101400 203060 242937 323451 274878 272639 178100 188077 205100 275728 184493 173878
6876A73878J61856l1698K839r3673J3893R150l2825L7133j7680k6270O2954j29675
$$ 173878 335734 304036 306875 213202 227095 236245 203420 240553 222873 196603 259557 129882
6864A29882J56601P5363q7249Q2569Q777M7969l2838l8659P1485q010j24173J09776
$$ 129882 286483 361846 274597 357166 365943 413912 381074 342415 413900 405890 281717 391493
6852C91493N5428j19496R0788o1455M4682o5507j88184q9N6393J05494j00564
$$ 391493 446921 327425 418213 356758 401440 335933 147749 147660 204053 309547 208983
6841B08983N5632J02953n6654J15691R4745q3777j71245R224J02858r5924j2137
$$ 208983 264615 367568 310914 426605 521350 437573 266328 275552 378410 282486 270349
6830B70349m603L9116q8273j29734P3924K2688l0543j2135Q7093l3127M1593Q0264
$$ 270349 265746 304862 216589 86855 160779 183467 152924 140789 227882 194755 236348 316612
6818C16612j03391J2918n1014j4429P9012n8830R4226P9770l0697Q87j25908L4438
$$ 316612 213221 226139 175125 160696 239708 180878 275104 354874 324177 325064 199156 233594
6806B33594j0010l2269Q5356N7237R54k5576K571J0901O1960p326m9331o3220
$$ 233594 223584 191315 276671 333908 334862 309286 311857 322758 384718 377392 328061 264841
6794B64841m203j15785M0283r6289O7539P1287N9937K7145N678N3405l4023k7341
$$ 264841 260638 144853 185136 88847 156386 227673 287610 314755 320433 373838 339815 312474
6782C12474J03973j3395L1187r2183n2438M0882O1222L079r413m8667m4017j38293
$$ 312474 416447 403052 434239 342056 289618 330500 391722 394801 385388 336721 292704 154411
6770A54411j16342R7335J66475l8754J00042Q878q4077J09405j39659J3947r7797
$$ 154411 38069 135404 301879 263125 363167 372045 287968 397373 257714 271661 173864
6759A73864M0033P1009k8998n1879K613O4798j1982k6945M7257p441R8091N2752
$$ 173864 213897 284906 255908 204029 206642 271440 259458 232513 279770 272329 370420 423172
6747D23172j07810q5350N3138q920p0138o4057O4750J63804j33490j79392R1137
$$ 423172 315362 230012 283150 274230 204092 140035 204785 368589 235099 55707 146844
6736A46844J44217o3793o9940J84755j26850P9841J22953L7198M4376j21361O9663
$$ 146844 291061 227268 157328 342083 215233 295074 418027 455225 499601 378240 447903
6725D47903k1766k6695Q2264Q6531j81880q4459O2268j1010j33560R8839N4271
$$ 447903 426137 399442 481706 568237 386357 301898 364166 353156 219596 318435 372706
6714C72706P770n9401l9819J56430q921J1814O497k8436o9667o8848j65126J7653
$$ 372706 380476 321075 281256 437686 428765 440579 447076 418640 348973 280125 114999 132652
6702A32652m0926M1706L5836r0751n142J83222J8117K5028o2256n3789J2226j5338
$$ 132652 91726 133432 169268 78517 73375 256597 274714 299742 237486 183697 195923 180585
6690A80585J9951L0998K8416k6991O1114R0941K44k42660J4836K20541J3312K9943
$$ 180585 200536 231534 259950 232959 294073 385014 385258 142598 157434 377975 391287 421230
6678D21230j53429N7414J4792p6422R8482n1718o101n4284K4052Q6009L8139n4624
$$ 421230 267801 325215 340007 263585 362067 310349 304248 249964 274016 360025 398164 343540
6666C43540r846M0845M4823o7438n5105M2333o8326Q1613l6133n8716N9493j73085
$$ 343540 333694 374539 419362 351924 296819 339152 270826 352439 316306 257590 317083 143998
6654A43998O4510M1596J4711J58340l6437r1044n7436Q7819Q6981Q1780q9283
$$ 143998 208508 250104 264815 423155 386718 295674 238238 326057 413038 494818 405535
6643D05535j07152Q0322l3113J09470N249P0910r1771j31926l5745N1798J8405
$$ 405535 298383 378705 345592 455062 460311 531221 439450 307524 271779 323577 341982
6632C41982L4162J14171j09437J3954j7534L3645k1991j3063p6495R1670J03163
$$ 341982 376144 490315 380878 394832 377298 410943 388952 375889 299394 391064 494227
6621D94227K962j50919o9988l4102P3938O3036K7359M8708o3681n407k965N3335
$$ 494227 497189 346270 276282 242180 316118 379154 406513 455221 391540 386133 383168 436503
6609D36503P1742n0610k5149J20464p0341p1382L2273L7493p2182j19254L7806
$$ 436503 508245 457635 432486 552950 482609 411227 443500 480993 408811 289557 327363
6598C27363j2239j79581J91613N1938n6397L2254o9166L1550L7537J22897Q1432
$$ 327363 315124 135543 327156 379094 322697 354951 285785 317335 354872 477769 559201
6587E59201j70753j01111m4717p096O542K1782j04623J11581n921j5673N4631
$$ 559201 388448 287337 242620 235524 242066 263848 159225 270806 264885 249212 303843
6576C03843J48803j05206j28193N3124j1420M8551l194N016j5020P4096O2430
$$ 303843 452646 347440 219247 272371 260951 309502 306308 311324 296304 370400 432830
6565D32830J06339j9892q473M81j59343p7246J14350L5752M2128N1240j95270
$$ 432830 539169 519277 510804 511285 351942 274696 389046 424798 466926 518166 322896
6554C22896R4808p7830l0675J46899R3900j31882m0684M748J31568J73199j68394
$$ 322896 417704 339874 309199 456098 549998 418116 377432 382180 513748 686947 518553
6543E18553j43182l0801L9186j54408P0560J41959l0399j85867Q0987L6505K8484
$$ 518553 375371 344570 383756 229348 299908 441867 411468 225601 306588 343093 371577
6532C71577q89J6021L606q0980K4146J25116j61233m0417L1619O1983l6601n3552
$$ 371577 370688 386709 390315 309335 333481 458597 297364 256947 288566 350549 313948 260396
6520B60396K6958J27932J7109r2289K712J76147k7487l4665J01276k0950J5966
$$ 260396 287354 415286 432395 340106 342818 518965 491478 456813 558089 537139 553105
6509E53105q486Q4621q3416Q214L9847j2704m5593J01049J8469j35911J75562
$$ 553105 544619 629240 545824 554038 593885 581181 535588 636637 655106 519195 694757
6498F94757J24308Q9726Q3279K5549K94073J19405J33048J8948J03248P0903j61589
$$ 694757 819065 908791 992070 1017619 1311692 1431097 1564145 1583093 1686341 1757244 1595655
6487A595655j64464p5069j27945o593j50084j13991o3191k2289N803k17407m4114
$$ 1595655 1431191 1356122 1228177 1221584 1071500 957509 894318 872029 877832 660425 616311
6476F16311j0454m7225o724m6188O6268M1583O868p5138j1273J27891L4687j1760
$$ 616311 605857 558632 551908 505720 571988 613571 620439 545301 534028 661919 696606 684846
6464F84846k520j8712K2684j44510j13124J79149K17n7338j07858J63582o8316
$$ 684846 682326 663614 686298 541788 428664 607813 608030 550692 442834 606416 538100
6453E38100K572o9819o6605J29674M0189j2161j54530j20025J63201J96251j27993
$$ 538100 540672 470853 404248 533922 574111 561950 407420 287395 450596 646847 518854
6442E18854o2879J8627M503K4307r0882o5998J26251n3872p9755J2356M8106M5258
$$ 518854 455975 474602 479105 503412 412530 346532 472783 418911 339156 351512 399618 444876
6430D44876m8695J04992P7128j21329O8739Q122j6202N8636J8121N0671J0764
$$ 444876 396181 501173 578301 456972 525711 533833 517631 576267 594388 645059 655823
6419F55823m3332p1424n9316l5094J28322j01590m3798j8056Q2589J6262k2696
$$ 655823 612491 541067 481751 446657 574979 473389 429591 411535 494124 510386 487690
6408D87690J0645q8639M3557J39308m7701L2099j17323l3062P9469L7346j54179
$$ 487690 498335 409696 453253 592561 544860 576959 459636 426574 506043 543389 389210
6397C89210L8640O179l3140J48881j5023M3384m3492R8506J3913j32393j2671
$$ 389210 427850 434029 400889 549770 534747 578131 534639 633145 647058 514665 501994
6386E01994J18139R790j16933O9528R9428q848Q263P7496N6076j28706K2808P8210
$$ 501994 620133 629923 512990 582518 681946 673098 681361 758857 814933 686227 709035 787245
6374G87245N1017l1989q506M2099j4947L2272J06533Q8811j10043j67564L3043
$$ 787245 838262 806273 797767 839866 824919 857191 963724 1052535 942492 774928 807971
6363H07971K6905J7413O2002K8684j32262J21182N4448M3946j48145P5606j36583
$$ 807971 834876 852289 914291 942975 810713 931895 986343 1030289 882144 957750 821167
6352H21167R4270R4127j18421j17608J34852J43183Q9940J5742o3699J03518j34487
$$ 821167 915437 1009564 891143 773535 908387 1051570 1141510 1157252 1093553 1197071 1062584
6341A062584P531q286N9007Q8884m8228J57903J73731j7647J24137p817J62277
$$ 1062584 1070115 1061829 1120836 1209720 1161492 1319395 1493126 1475479 1599616 1591799 1754076
6330A754076J48393R9770P9526L6650M8922j01015j14697k22209M5866R1614o4638
$$ 1754076 1902469 2002239 2081765 2118415 2167337 2066322 1951625 1729416 1775282 1866896 1802258
6319A802258o3501k0201P9590j08041j740l686m5063N8705Q9905N6990N1671J4143
$$ 1802258 1738757 1718556 1798146 1690105 1688365 1684679 1639616 1698321 1788226 1845216 1896887 1911030
6307A911030R8574N5152K02424K01153K58275O40309M45961K67459K81462K50647
$$ 1911030 2009604 2064756 2267180 2468333 2726608 3366917 3812878 4080337 4361799 4612446
6297D612446M1904j04747p4883j93045k31737m21703m25053j37876j48492j44818
$$ 4612446 4654350 4549603 4474720 4281675 4049938 3628235 3203182 3065306 2916814 2771996
6287B771996k06764j44682M9729J7256n4564N4409q2842M5651J62974k9060k3640
$$ 2771996 2565232 2420550 2470279 2487535 2432971 2487380 2404538 2450189 2613163 2584103 2560463
6276B560463q7564J74633J9447P1184K35020M81970L59353M96537M39719L53393
$$ 2560463 2472899 2647532 2666979 2738163 2973183 3455153 3814506 4311043 4750762 5104155
6266E104155J92668J46215M4566j11905l60054k45740k59499l53839j46859k84887
$$ 5104155 5296823 5443038 5487604 5375699 5015645 4769905 4510406 4156567 4009708 3724821
6256C724821r9470k10498k09480q2659Q9410O1700j27301j10952J65409Q3233
$$ 3724821 3625351 3414853 3205373 3122714 3212124 3273824 3146523 3035571 3200980 3284213
6246C284213O2070m032N432J52648j08453J99038J76995L2311K62604J14559K87287
$$ 3284213 3346283 3342251 3347683 3500331 3391878 3590916 3767911 3800222 4062826 4177385 4464672
6235D464672K01666O3044J57410N1165p3506r400j0397m3792j98427j59232n1782
$$ 4464672 4666338 4729382 4886792 4937957 4864451 4855051 4844654 4800862 4602435 4443203 4391421
6224D391421N1772j0599J41048J13297L4520K48768J76519J42040J43637M1472
$$ 4391421 4443193 4432594 4573642 4686939 4721459 4970227 5146746 5288786 5432423 5473895
6214E473895J4550J34874L13859K01875J49548K32593J39987L38437K81090K48461
$$ 5473895 5488445 5623319 5937178 6139053 6288601 6521194 6661181 6999618 7280708 7529169
6204G529169L85541M52239K69315L48943L54945M56791O24274N63805N78115O62570
$$ 7529169 7914710 8366949 8636264 8985207 9340152 9796943 10421217 10985022 11563137 12225707
6194A2225707Q11339N48275P31075Q57613Q83216P95150Q54191R19102Q52734
$$ 12225707 13037046 13585321 14316396 15174009 16057225 16852375 17706566 18625668 19478402
6185A9478402J204191J513722J478199J829888K219102K529973K750938L166513
$$ 19478402 20682593 22196315 23674514 25504402 27723504 30253477 33004415 36170928
6177C6170928M011680N333943O715147Q808313J1924255J6367913K2357910K8424498
$$ 36170928 40182608 45516551 52231698 61040011 72964266 89332179 111690089 140114587
6169A40114587L2426713L1970951K6199327J6486970O185452l745842j3581879
$$ 140114587 172541300 204512251 230711578 247198548 253384000 249638158 236056279
6162B36056279k2345463k6979520k6594565k4629911k2123850j8959884j5152626
$$ 236056279 213710816 186731296 160136731 135506820 113382970 94423086 79270460
6155G9270460j1945306r426565p352755o064363m916070m230662l559113l185865
$$ 79270460 67325154 57898589 50545834 44481471 39565401 35334739 31775626 28589761
6147B8589761k749217k290234j982110j516258j481433j324052j169160r02463
$$ 28589761 25840544 23550310 21568200 20051942 18570509 17246457 16077297 15174834
6139A5174834p93616q04185o53348n27830m59608p70830m18482k64987l70388
$$ 15174834 14381218 13577033 12923685 12395855 11936247 11165417 10746935 10481948 10111560
6130A0111560l94658l06397k45727j06088k98363k67954k17587j95480l06504
$$ 10111560 9716902 9410505 9164778 9058690 8760327 8492373 8274786 8079306 7772802
6121G772802k11005k41260k82263j54191j64047k59459k35448k57795l43444j08938
$$ 7772802 7561797 7320537 7038274 6884083 6720036 6460577 6225129 5967334 5623890 5514952
6111E514952j2389j02477k15682j12267j48232j89922j10061k32813k53619q1552
$$ 5514952 5502563 5400086 5184404 5072137 4923905 4733983 4623922 4391109 4137490 4055938
6101D055938Q6980k94243k96778j80159j12984m7617n8649j25401j00047J02130
$$ 4055938 4142918 3848675 3551897 3371738 3258754 3211137 3152488 3027087 2927040 3029170
6091C029170j1849n6853L3544k09892l2887k9277o626P8966k53482n6423j8349
$$ 3029170 3017321 2960468 2994012 2784120 2751233 2721956 2715330 2794296 2540814 2484391 2466042
6080B466042L3343k9079N0900j71340j52941R4522m9822L7089J27131p000k32221
$$ 2466042 2499385 2470306 2521206 2349866 2196925 2291447 2241625 2278714 2405845 2398845 2166624
6069B166624j01966K8500J6220J02675k0522r912k499n8979p7096J00748l4762
$$ 2166624 2064658 2093158 2109378 2212053 2191531 2181619 2179120 2120141 2043045 2143793 2109031
6058B109031J7430o5628k6006j11807r055K5006j09768l7950N0831j58585O4086
$$ 2109031 2126461 2060833 2034827 1923020 1913965 1938971 1829203 1791253 1842084 1683499 1747585
6047A747585k9460J1807n4674l635P3313j12904J55053L07j11627J34173O19n9493
$$ 1747585 1718125 1729932 1675258 1671623 1744936 1632032 1787085 1787392 1675765 1809938 1810557 1751064
6035A751064r2413k5079R0413r9583q9635M9307J81471M5231o1685j3517m0798
$$ 1751064 1658651 1633572 1723985 1624402 1534767 1584074 1765545 1810776 1749091 1735574 1694776
6024A694776J19637o9321J25507o6623p8881J97057J49717J9962k2037r9839l3522
$$ 1694776 1814413 1745092 1870599 1803976 1725095 1922152 2071869 2091831 2069794 1969955 1936433
6013A936433J06225L1967N7042j48317j3099q977n347p7172p3254N3614J93605
$$ 1936433 2042658 2074625 2131667 1983350 1970251 1961274 1955927 1878755 1805501 1859115 2052720
6002B052720P3123M6300j64554J02935O8296l8183p363Q3562M8925j21924L7576
$$ 2052720 2125843 2172143 2007589 2110524 2178820 2140637 2133274 2216836 2265761 2143837 2181413
5991B181413l3433J3407N9749m0355J07775M5612k7479l0928J59986K88350j70321
$$ 2181413 2147980 2161387 2221136 2180781 2288556 2334168 2306689 2275761 2435747 2724097 2553776
5980B553776j00007J5224J49248J51583r7211j08846r7133K4635J30689O183j48384
$$ 2553776 2453769 2468993 2618241 2769824 2672613 2563767 2466634 2491269 2621958 2628141 2479757
5969B479757K04786k3098n6247j7650j6200R4948Q1127p9694N6079P5952M5772
$$ 2479757 2684543 2661445 2605198 2587548 2571348 2666296 2747423 2667729 2723808 2799760 2845532
5958B845532Q2440J62964K7390J61224J6896j07892J83049P5618k5J03416r6168
$$ 2845532 2927972 3090936 3118326 3279550 3296446 3188554 3371603 3447221 3447196 3550612 3454444
5947C454444J113J61446l3919K8294K21731j35798o0831J05803K62905J43618
$$ 3454444 3455557 3617003 3583084 3611378 3833109 3697311 3636480 3742283 4005188 4148806
5937D148806K46645K59686p1685j18768Q4384J79044n5958j0641J10798N2965
$$ 4148806 4395451 4655137 4583452 4464684 4549068 4728112 4672154 4661513 4772311 4825276
5927D825276J33538J49853J46913m7678m4222J38934J37232m3263L7391K19186
$$ 4825276 4958814 5108667 5255580 5207902 5163680 5302614 5439846 5396583 5433974 5653160
5917E653160J85820J5824l7572K37947J23273J69632J99934J89487J68901K38776
$$ 5653160 5838980 5854804 5817232 6055179 6178452 6348084 6548018 6737505 6906406 7145182
5907G145182K69482K81650K49384K08170J64499J97142K77346K93858L24088K61281
$$ 7145182 7414664 7696314 7945698 8153868 8318367 8515509 8792855 9086713 9410801 9672082
5897I672082M45320N55526N03847N09768N56980P26818O99555O91215N55435O59918
$$ 9672082 10117402 10672928 11176775 11686543 12243523 12970341 13669896 14361111 14916546 15576464
5887A5576464L93813N72656O85216P28444Q24521R89296J124817J398814J495212
$$ 15576464 15970277 16542933 17228149 17956593 18781114 19770410 20895227 22294041 23789253
5878B3789253J726881J969189K080826K304840K758043K921902L324159L881259
$$ 23789253 25516134 27485323 29566149 31870989 34629032 37550934 40875093 44756352
5870D4756352M723329N873926P587307R673702J3427304J8516684K6844036L9525008
$$ 44756352 49479681 55353607 62940914 72614616 86041920 104558604 131402640 170927648
5862A70927648N2682602N8840917N7399491L9791964J9906719J992145j5379229
$$ 170927648 223610250 282451167 339850658 379642622 399549341 401541486 386162257
5855C86162257l0773593m6097763m9079392m3158141l6617350l3024778k7003970
$$ 386162257 355388664 309290901 260211509 217053368 180436018 147411240 120407270
5848A20407270k0605242j5574388j1846624r229382p358125o136663n280283m487893
$$ 120407270 99802028 84227640 72381016 63151634 55793509 49656846 44376563 39888670
5840C9888670l796569l065206k712366k110254j890054j477805j366575j290505
$$ 39888670 36092101 33026895 30314529 28204275 26314221 24836416 23469841 22179336
5832B2179336j180006r63186j060421q49814q17401q14152p65195o17024o09533
$$ 22179336 20999330 20036144 18975723 18125909 17308508 16494356 15729161 15112137 14502604
5823A4502604l51219m40514m23330m51650m29246l01127l73340l54138k39591
$$ 14502604 14151385 13710871 13287541 12835891 12406645 12105518 11732178 11378040 11138449
5814A1138449l15659m18829l82292k12422l02201j79235l98268l59450l26008
$$ 11138449 10822790 10403961 10021669 9809247 9507046 9327811 8929543 8570093 8244085
5805H244085j40655k15083j42091k30821l17432j73594k42100k30089k38380k75405
$$ 8244085 8103430 7888347 7746256 7515435 7198003 7024409 6782309 6552220 6313840 6038435
5795F038435j88037j85574k63380k95346j75048n3527m1515j00049j52733p3696
$$ 6038435 5850398 5664824 5401444 5106098 4931050 4877523 4836008 4735959 4583226 4509530
5785D509530k04867O5300P5268m6316K2498j39421j48987K0200J05886l0524j42615
$$ 4509530 4304663 4369963 4445231 4398915 4421413 4281992 4133005 4153205 4259091 4228567 4085952
5774D085952o7459j76405m6525r4076K6971j36027l1322L3725p1877r3496J02154
$$ 4085952 4018493 3842088 3795563 3701487 3728458 3592431 3561109 3594834 3522957 3429461 3531615
5763C531615O4987J89346L01262L70164K73494N34284L27746J06024j47372q6644
$$ 3531615 3596602 3785948 4087210 4457374 4730868 5265152 5592898 5698922 5551550 5464906
5753E464906l58105m02638m66760m41855m36673k25190j58930o6700l0843k00405
$$ 5464906 5106801 4704163 4237403 3795548 3358875 3133685 2974755 2908055 2877212 2676807
5743B676807j50563j99174j31864k14506p7222J01329m5162m4517N9892n5468
$$ 2676807 2526244 2327070 2195206 1980700 1903478 2004807 1959645 1915128 1975020 1919552
5733A919552Q1229p5493j41593o0307r5671J5013M7654n6374J17467K2404n8617
$$ 1919552 2000781 1925288 1783695 1723388 1627717 1642730 1690384 1634010 1751477 1773881 1715264
5722A715264r1346K6659n4222K977k5676K8632o7631o5228q1750n5907r078l1537
$$ 1715264 1623918 1650577 1596355 1599332 1573656 1602288 1534657 1469429 1387679 1331772 1322694 1291157
5710A291157K1017o5821q2211p6105r964j18739j92539O29J09948J31024l4373
$$ 1291157 1312174 1246353 1164142 1088037 1078073 959334 766795 767424 877372 1008396 974023
5699I74023r763J07364Q5056M1346J28207j8653j53226K25795p308l08977M7204
$$ 974023 964260 1071624 1156680 1198026 1326233 1307580 1154354 1380149 1372841 1063864 1111068
5688A111068N5604m1202K0435o5044O1262j05439n2462L5993K188O0180M3813
$$ 1111068 1166672 1125470 1145905 1080861 1142123 1036684 984222 1020215 1022403 1082583 1126396
5677A126396L1031o2232Q002j00488J7530j1090n0138l3449P5331r726q8885L6357
$$ 1126396 1157427 1095195 1103197 1002709 1020239 1009149 959011 925562 1000893 991167 902282 938639
5665I38639k2146j35777j03884l9982P6053M5032j22579l5754P07J48851k5308
$$ 938639 916493 780716 676832 636850 712903 757935 635356 599602 600309 749160 723852
5654G23852n8664J43555j85537p2873J18744l2631o0157J18652J03500j14858
$$ 723852 665188 808743 623206 550333 669077 636446 576289 694941 798441 683583
5644F83583N9021J7471k5299N1494P1011j23483M4662k273m2824N8368J35458
$$ 683583 742604 760075 734776 786270 857281 733798 778460 776187 733363 791731 927189
5633I27189n7251J111J62472p2137q2583J03406j4727j31603J27880K7840L7551
$$ 927189 869938 871049 1033521 961384 878801 982207 967480 835877 963757 991597 1029148
5622A029148O2540m1539J8578o8175L3616n242j11410M7355J5511q7171j63938
$$ 1029148 1091688 1050149 1068727 1000552 1034168 1028926 917516 964871 980382 893211 729273
5611G29273o3597P4240k0096k9733n7911j53632J33781J02771j03876O2981o4690
$$ 729273 665676 739916 719820 690087 632176 478544 612325 715096 611220 674201 609511
5600F09511o5774k0016L9062n0938P2956M6048j44931k4475M2260J8173P7855
$$ 609511 543737 523721 562783 511845 584801 630849 485918 461443 503703 521876 599731
5589E99731n0528J4189K4152K174J27767l1020j88918n1518m8748J75311M4168
$$ 599731 549203 563392 587544 589718 717485 686465 497547 446029 397281 572592 616760
5578F16760j9220p4298m5321O0444j89128R4286j03557J33287J02344o0045l9500
$$ 616760 597540 523242 477921 538365 349237 443523 339966 473253 575597 515552 476052
5567D76052N8771J00483L8939N0940p432o5641Q1242R1725r0364j93627K50062
$$ 476052 534823 635306 674245 725185 717753 652112 733354 825079 734715 541088 791150
5556G91150N9041r0689m2572p3940k18606k24949p1203J43991K70837R612M5674
$$ 791150 850191 759502 716930 642990 424384 199435 128232 272223 543060 552672 598346
5545E98346M8211M3844J58035k8169M1547M4928o8869o693J6135l9404p591M7647
$$ 598346 646557 690401 848436 820267 861814 906742 837873 831180 847315 807911 800320 847967
5533H47967l9525m5987L4192l6726P1843J23280J76889K95117K54956K87613L41784
$$ 847967 808442 762455 796647 759921 831764 955044 1131933 1427050 1682006 1969619 2311403
5522B311403J41708j04199j5659n7156j61226k37520k57860o0897k44645l02971
$$ 2311403 2453111 2348912 2333253 2276097 2114871 1877351 1619491 1558594 1313949 1010978
5512A010978j7409p9576j36793o7526k0356j01626O5313o5010N6165J11670M4215
$$ 1010978 993569 913993 777200 709674 689318 587692 653005 587995 644160 755830 800045
5501H00045j19480O1997L4862l2026j96697J09298J2417j05572N2900M2532o0313
$$ 800045 680565 742562 777424 745398 548701 657999 670416 564844 617744 660276 599963
5490E99963j93009O7388n1072J29210O1829j19039J2623M0035L7563l7012j4485
$$ 599963 406954 474342 423270 552480 614309 495270 507893 547928 585491 548479 533994
5479E33994j06189r096K7824m6041L7454j42991R6205p5561O1757J03961R7952
$$ 533994 427805 418709 446533 400492 437946 294955 391160 315599 377356 481317 579269
5468E79269J56413p6468q5549l8992j907m1702J76701q7408r4951k8416P9789
$$ 579269 735682 659214 573665 534673 532766 491064 667765 580357 485406 456990 536779
5457E36779J07788k7865K888j19476j00521n6515k9582L8673k5052l0530O7946
$$ 536779 644567 616702 619590 500114 399593 343078 313496 352169 327117 296587 364533
5446C64533j02238J01035J47939m4918o9892k060J9950q2606m7230O9118m6591
$$ 364533 262295 363330 511269 466351 396459 394399 414349 331743 284513 353631 307040
5435C07040m0238J8462Q4623M8162r5271j39382K7922J62563L3409q9967O3553
$$ 307040 266802 285264 369887 418049 322778 183396 211318 373881 407290 317323 380876
5424C80876Q3409q0488j17932K0501J04233K3915n905r2884M2391j05507j64893
$$ 380876 464285 383797 265865 286366 390599 414514 408609 315725 358116 252609 87716
5413H7716R7619J58479L1881K4274n0401p381k2554l0754K8734M609j10165J41656
$$ 87716 185335 343814 375695 399969 349568 342187 319633 288879 317613 322222 212057 353713
5401C53713J15608l6794M6541J142j6233k01195j37939J38691J37795P7780r5181
$$ 353713 469321 432527 479068 480210 463977 262782 124843 263534 401329 479109 383928
5390C83928r7975J10412j27678j9844N3530m5307Q3248L0207l8592l8549j02633
$$ 383928 285953 396365 268687 248843 302373 257066 340314 370521 331929 293380 190747
5379A90747Q9325R0030J2854p4562k168M3577q6550L5980J16688R8856o2747o4575
$$ 190747 280072 370102 382956 308394 306226 349803 263253 299233 415921 514777 452030 387455
5367C87455r2544p24l8829O9516K0451k0559M3541r3221l7129m4910J10115k86
$$ 387455 294911 294187 255358 324874 345325 324766 368307 275086 237957 193047 303162 302876
5355C02876J7161R935o2624J1633k7896k6801o3342J06543O5548K3430l1460N2365
$$ 302876 320037 329972 267348 278981 251085 224284 160942 267485 333033 356463 325003 377368
5343C77368o9037l456Q6736l8072j38514J9315O9044J704O3817q9577n663m458
$$ 377368 308331 304875 391611 353539 215025 234340 303384 305088 368905 279328 273665 269207
5331B69207l5250n2082Q0724L4143R7545M9254j50848o9725J29174N4449j86250
$$ 269207 233957 181875 262599 296742 394287 443541 292693 222968 352142 406591 220341
5320B20341K4039K20838j03745J0765J0746j21M5281J9990k19979k1737K7965
$$ 220341 244380 465218 361473 372238 382984 382863 428144 448134 228155 206418 234383
5309B34383Q4478M3426o5992N0172P2909N8972M7313p1507o3551n3788j84628
$$ 234383 318861 362287 296295 346467 419376 478348 525661 454154 390603 336815 152187
5298A52187Q5540J41970j5486J87737K9229j09382p3722j2725k576J01143j66757
$$ 152187 237727 379697 364211 551948 581177 471795 398073 385348 382772 483915 317158
5287C17158j0393J00315J2975R8184J751q3699k4070M3826j06384k4256n6938
$$ 317158 306765 407080 420055 518239 519990 436291 412221 456047 349663 325407 268469
5276B68469J01065R674J0643l7841J26536o5154L1324r9418q015j8820o5174L4324
$$ 268469 369534 379208 389851 352010 478546 413392 444716 345298 337283 318463 253289 287613
5264B87613P3070j08407j29930L999J03035J2818K01219o0887o2073M9712j35463
$$ 287613 360683 252276 122346 126345 229380 242198 443417 382530 320457 370169 234706
5253B34706O8708K1718j6216J01226J20730Q839Q0214q7928k3658k6136J29489
$$ 234706 303414 325132 308916 410142 530872 539711 619925 531997 508339 482203 611692
5242F11692J05193q1708K1599q5126j33630l4114O6110j16462j68651k6073Q1852
$$ 611692 716885 635177 656776 571650 438020 403906 470016 353554 184903 158830 240682
5231B40682P4429M1720j3930j13131o302J30672R3726J53255j26780k68529J34929
$$ 240682 315111 356831 342901 229770 223468 354140 447866 601121 474341 205812 340741
5220C40741L6089L0889m4304R1598J07416k00428j8492m209J07426R165j73902
$$ 340741 376830 407719 363415 455013 562429 362001 343509 339300 446726 455891 281989
5209B81989q5323K0221P5746K1430O6792k8372j21730J27561K8648j9992L9140
$$ 281989 196666 216887 292633 314063 380855 352483 230753 358314 386962 366970 406110
5198D06110J2926J51421p4826j00196R894Q4221l5288l5867m5629J23348p6363
$$ 406110 419036 570457 495631 395435 405329 489550 454262 418395 372766 496114 419751
5187D19751P404K9129n1270l0730K3923n7659j1149N7850O6944P2890k6790p2026
$$ 419751 427155 456284 405014 374284 398207 340548 329399 387249 454193 527083 500293 428267
5175D28267K3747L9722J0325j3388r9598J90417l7994m2080m62J9889J4862k9009
$$ 428267 452014 491736 502061 488673 389075 579492 541498 499418 498956 518845 533707 504698
5163E04698r7867k8284K61838m0555k7200k3546k3151O8131P172q8816P9666l0486
$$ 504698 406831 378547 640385 599830 572630 549084 525933 594064 601236 512420 592086 561600
5151E61600J0699M2864M0995J8060o8033n5762O9739R6560M4397o4439K9291M3811
$$ 561600 572299 615163 656158 674218 606185 550423 620162 716722 761119 696680 725971 769782
5139G69782L7571M2283n3734P0364J26985M6698r5913j51626J9637K0441l9634
$$ 769782 807353 849636 795902 866266 993251 1039949 944036 792410 812047 832488 792854
5128G92854k8760p5892J26176o2892K44957p402Q2911j1090r2221j01871k0914
$$ 792854 764094 688202 814378 751486 996443 989041 1071952 1060862 968641 866770 845856
5117H45856Q4436P7600N1371J22787j0060p5740n1130j45330O0047k84j14344
$$ 845856 930292 1007892 1059263 1182050 1171990 1096250 1045120 899790 959837 959553 845209
5106H45209l9Q4697J07096M4756j52633l0100O6218L2200n8103p1422q7184j0555
$$ 845209 845170 929867 1036963 1081719 929086 898986 965204 997404 939301 867879 780695 770140
5094G70140L2588l0400j7271j2352j062K4316k1055K5734J21198P9271N3747j77556
$$ 770140 802728 772328 755057 742705 741643 765959 744904 770638 891836 971107 1024854 847298
5082H47298j67481R127Q4117r6688m2658N4596J08433p3541J7550k8338k7150
$$ 847298 679817 688944 773061 676373 633715 688311 796744 723203 740753 712415 685265
5071F85265L8426m6989K2466n9837M710k8666R4466L5427O0061J3859O7980p3576
$$ 685265 723691 676702 699168 639331 644041 615375 709841 745268 805329 819188 887168 813592
5059H13592m8727R850M9633o6418N1792N7386O7037K8774P8470L239M035k7426
$$ 813592 764865 774715 824348 757930 809722 867108 934145 962919 1041389 1044628 1048663 1021237
5047A021237j04154O4741l8841J34766O5427r783N6471n0996k7256K4608m096
$$ 1021237 917083 981824 942983 1077749 1143176 1133393 1189864 1138868 1111612 1136220 1132124
5036A132124J70087M2809j23189n7176l3803P4349O2927Q2758M6000p1505M1597
$$ 1132124 1302211 1345020 1221831 1164655 1130852 1205201 1268128 1350886 1396886 1325381 1366978
5025A366978R5109q4409n8877o287J7333J1770k5216p2892J29747M5006P2900
$$ 1366978 1462087 1377678 1318801 1312514 1329847 1341617 1316401 1243509 1373256 1418262 1491162
5014A491162J08816O5445J11369j21003k1822L8064L860k11222p913J67684M1353
$$ 1491162 1599978 1665423 1776792 1655789 1633967 1672031 1675891 1464669 1456756 1624440 1665793
5003A665793j07471j73515l9250J84000n8857N6843J60741m6266o5013k18164
$$ 1665793 1558322 1384807 1345557 1529557 1470700 1527543 1688284 1642018 1577005 1358841
4993A358841Q2973R1768J20823l8976k48466k2933J68891J47651l9958k0983l3190
$$ 1358841 1441814 1533582 1654405 1615429 1366963 1344030 1512921 1660572 1620614 1599631 1566441
4982A566441K3580r1153J10292Q2860n3880N0222r5409J05108J13993j20219p7306
$$ 1566441 1590021 1498868 1609160 1692020 1638140 1688362 1592953 1698061 1812054 1691835 1614529
4971A614529Q1343j13083q302L4934L5303M2754M5502N3580n2400k0260M0859
$$ 1614529 1695872 1582789 1574487 1609421 1644724 1687478 1732980 1786560 1734160 1713900 1754759
4960A754759J35711m7220j69525O8836J99441N1676O7964J02977P7437P858m460
$$ 1754759 1890470 1843250 1673725 1742561 1942002 1993678 2061642 2164619 2242056 2249914 2245454
4949B245454O774j02746M1740J58597P9237n3441N9706m0001m1019R7724J44857
$$ 2245454 2252228 2149482 2191222 2349819 2429056 2375615 2435321 2395320 2354301 2452025 2596882
4938B596882L6510p8031l815o7382l9971O6773Q6728K21828n1947n4575K49492
$$ 2596882 2633392 2555361 2551546 2484164 2444193 2510966 2597694 2819522 2767575 2713000 2962492
4927B962492m2264j45168J42000J05935J01247p5226R0649J42516K6170O5415
$$ 2962492 2920228 2775060 2917060 3022995 3124242 3049016 3139665 3282181 3308351 3373766
4917C373766M5516k1270J44500Q5022R3907J28704L648L9074J7831K5660O4674
$$ 3373766 3419282 3398012 3542512 3627534 3721441 3850145 3853793 3892867 3910698 3936358 4001032
4906D001032K34809P0656J22941K7253J90337K23528J9602L2771J09085J84094
$$ 4001032 4235841 4306497 4429438 4456691 4647028 4870556 4890158 4922929 5032014 5216108
4896E216108J86926N9617J52248J00893L00759J35277K47847K85411K13244P1557
$$ 5216108 5403034 5462651 5614899 5715792 6016551 6151828 6399675 6685086 6898330 6969887
4886F969887J74849J55849K13489K67446L19935L25317L70769M16321M75740L45213
$$ 6969887 7144736 7300585 7514074 7781520 8101455 8426772 8797541 9213862 9689602 10034815
4876A0034815N30467O78205L52447O30521O22822N89887P02602Q75000J105623
$$ 10034815 10565282 11243487 11595934 12226455 12849277 13439164 14141766 15016766 16122389
4867A6122389J152469J192604J525297J522217J605989J694535J733029J767762
$$ 16122389 17274858 18467462 19992759 21514976 23120965 24815500 26548529 28316291
4859B8316291J472089J575288J465654J085999J214998J321277J047544J081215
$$ 28316291 29788380 31363668 32829322 33915321 35130319 36451596 37499140 38580355
4851C8580355J009111J120554J142747J043953Q83814Q56686Q84486R89785Q20154
$$ 38580355 39589466 40710020 41852767 42896720 43780534 44637220 45521706 46511491 47331645
4842D7331645J031402J519195J818907K029369K283722K697917K671512K636177
$$ 47331645 48363047 49882242 51701149 53730518 56014240 58712157 61383669 64019846
4834F4019846K511457K428398K286897K145599K205068K203136K114770J897304
$$ 64019846 66531303 68959701 71246598 73392197 75597265 77800401 79915171 81812475
4826H1812475J199945P74024P3724m82115j001327j172807j257045j317104j398322
$$ 81812475 83012420 83786444 83860168 83378053 82376726 81203919 79946874 78629770 77231448
4817G7231448j604710j661491j545516j633891j542129j239403j013593j193256
$$ 77231448 75626738 73965247 72419731 70785840 69243711 68004308 66990715 65797459
4809F5797459r64230j007245j149358j099398j363899j401381j418946j502354
$$ 65797459 64833229 63825984 62676626 61577228 60213329 58811948 57393002 55890648
4801E5890648j471188j560276j685059j792085k055697j931743k099257k276076
$$ 55890648 54419460 52859184 51174125 49382040 47326343 45394600 43295343 41019267
4793D1019267k018169k017543j748431j496302j373724j481389j237041j047021
$$ 41019267 39001098 36983555 35235124 33738822 32365098 30883709 29646668 28599647
4785B8599647r34675q59276q76301q23536n67097m08987l26462k12572l68776
$$ 28599647 27664972 26805696 25929395 25105859 24538762 24129775 23803313 23590741 23221965
4776B3221965j62536J33590j18534k3272J44847L06283L77226M93253N31431O23202
$$ 23221965 23059429 23193019 23074485 23051213 23196060 23502343 23879569 24372822 24904253 25527455
4766B5527455P04654P96287J039685J050440J240185J325283J644382J634783
$$ 25527455 26232109 27028396 28068081 29118521 30358706 31683989 33328371 34963154
4758C4963154J924976K043273J978587K039331J923637J845414J553860J554701
$$ 34963154 36888130 38931403 40909990 42949321 44872958 46718372 48272232 49826933
4750D9826933J558293J592040J380465J388906J255880J196350J308662J060656
$$ 49826933 51385226 52977266 54357731 55746637 57002517 58198867 59507529 60568185
4742F0568185R83556J175047J263067J408053J697160J805532J669903J671634
$$ 60568185 61551741 62726788 63989855 65397908 67095068 68900600 70570503 72242137
4734G2242137J650200J489676J631377J743274J790933J667159R96115P93531
$$ 72242137 73892337 75382013 77013390 78756664 80547597 82214756 83210871 84004402
4726H4004402L45199l29020o06923j105500j340703j492870j775251j926218k119605
$$ 84004402 84349601 84020581 83413658 82308158 80967455 79474585 77699334 75773116 73653511
4717G3653511k431615k501796k859225k683978k849362k620655k490393k032454
$$ 73653511 71221896 68720100 65860875 63176897 60327535 57706880 55216487 53184033
4709E3184033j743639j542533j250311j176529q98753j041796r64126o45796q51141
$$ 53184033 51440394 49897861 48647550 47471021 46572268 45530472 44566346 43920550 43069409
4700D3069409p96906p89968r58749j048124j319642j292839j344642j733578j674578
$$ 43069409 42272503 41482535 40523786 39475662 38156020 36863181 35518539 33784961 32110383
4691C2110383j687262j916837j922945j859660j874924j590974j541533j502757
$$ 32110383 30423121 28506284 26583339 24723679 22848755 21257781 19716248 18213491
4683A8213491j378547r42958r05388j069259j045455o56968p65825p39831n32290
$$ 18213491 16834944 15891986 14986598 13917339 12871884 12214916 11449091 10709260 10176970
4674A0176970m54558n60859n19270n07193k02504j55531j73897m80394k80837
$$ 10176970 9722412 9161553 8642283 8135090 7932586 7777055 7603158 7122764 6841927
4665F841927o2902l06371k64438j66341q5108j94177j59017k85983j29815q7008
$$ 6841927 6779025 6472654 6208216 6041875 5956767 5762590 5603573 5317590 5187775 5100767
4655E100767k08583j50088j67369k09969n1681R907k07245j41873M5129k45601
$$ 5100767 4892184 4742096 4574727 4364758 4313077 4322984 4115739 3973866 4018995 3773394
4645C773394q7068j48280j90532r6680k5841r5485k5881j81994l7016j28290J5426
$$ 3773394 3686326 3538046 3347514 3250834 3224993 3129508 3103627 2921633 2884617 2756327 2771753
4634B771753p5150j69639q2219K74775n5583p6413j9910j56344j26675l7423p901
$$ 2771753 2696603 2526964 2444745 2719520 2663937 2587524 2567614 2411270 2284595 2247172 2239271
4623B239271l376n6610k8448r46Q6380p7874l7740r2595j21977L7588J26144q0533
$$ 2239271 2235895 2179285 2150837 2149891 2236271 2158397 2120657 2028062 1906085 1943673 2069817 1989284
4611A989284j02821p8734J5812l766n0090P899J2007M3035k5903o0417l2954L7377
$$ 1989284 1886463 1807729 1823541 1819775 1769685 1777584 1789591 1832626 1806723 1746306 1713352 1750729
4599A750729j04288j4470Q4046l8944M3381L0661r3460l5298M0301K5281p12j1598
$$ 1750729 1646441 1631971 1716017 1677073 1720454 1751115 1657655 1622357 1662658 1687939 1687227 1675629
4587A675629M9929O120n0905J62183o1430j30696K256p7489r1916J6144L4718
$$ 1675629 1725558 1731678 1680773 1842956 1781526 1650830 1653086 1575597 1483681 1499825 1534543
4576A534543P461r0586m5493q8326k7896R7595j14071n1575O9790J7282l5177
$$ 1534543 1542004 1451418 1405925 1317599 1289703 1387298 1273227 1221652 1291442 1308724 1273547
4565A273547j14786j25680L7412Q94j553J93154M4714q7268q5129r8393k0907
$$ 1273547 1158761 1033081 1070493 1071387 1069834 1262988 1307702 1220434 1135305 1036912 1016005
4554A016005j9985J36796R62j234J10200n2985O5358n3365q1288j13055J04049
$$ 1016005 996020 1132816 1133778 1132544 1242744 1189759 1255117 1201752 1120464 1007409 1111458
4543A111458n6999O388L7351m0935p7476M0425J6834J15415p4388J396j5461N6376
$$ 1111458 1054459 1060847 1098198 1057263 979787 1020212 1037046 1152461 1078073 1079469 1064008 1120384
4531A120384L9894p1748p750l7609J0073k4722k7590n626O8176k31144P0745R268
$$ 1120384 1160278 1088530 1080780 1043171 1053244 1028522 1000932 995306 1063482 832338 903083 912351
4519I12351j24881N6887P2808k1671n6900p8822k9565R905J17400k2575n5500
$$ 912351 787470 844357 917165 895494 838594 759772 730207 740112 857512 834937 779437
4508G79437K8044l769p7127r5780L2932J87620K0734j76842Q1231J1912j04352
$$ 779437 807481 803712 726585 630805 663737 851357 872091 695249 776480 788392 684040
4497F84040L0202M0233n7684j06453N7291P4349m0552k8303k3116P4319l1362
$$ 684040 714242 754475 696791 590338 647629 721978 681426 653123 630007 704326 672964
4486F72964n8795p9687o2942j21741J46618o9103J40950Q0639J7211j00909m2338
$$ 672964 614169 534482 471540 349799 496417 427314 568264 648903 666114 565205 522867
4475E22867J489J2819j9080l6581J335L620J14224j3843J8949n9163M6457P7952
$$ 522867 524356 537175 518095 481514 482849 486469 600693 586850 605799 546636 593093 671045
4463F71045L2429l1364K4527j9016l0673J89352j29468j55589J6685M9886m9217
$$ 671045 703474 672110 696637 677621 646948 836300 706832 551243 567928 617814 568597
4452E68597j46116J62004J39677J2915r3913o4222K9736J35730p101l153N5097
$$ 568597 422481 584485 724162 737077 643164 578942 608678 744408 737307 734154 789251
4441G89251M111m7545n1852o2421r0059q0134J57739Q8931Q2228Q9690m974j36030
$$ 789251 793362 745817 693965 631544 541485 461351 619090 708021 790249 879939 874965 738935
4429G38935m9417O5896L1882J28426r9324j43296P8935j20518K9142K4195M6613
$$ 738935 689518 755414 787296 915722 816398 673102 752037 631519 660661 684856 731469
4418G31469N0694n2084K5568L3679o5039N663m9151k1885n1200p859O7174L5997
$$ 731469 782163 730079 755647 789326 724287 729950 680799 658914 607714 599855 667029 703026
4406G03026L3870j87398o7709J74129J29623l8617j66892j21402J839K3096j1053
$$ 703026 736896 549498 481789 655918 785541 746924 580032 458630 460469 483565 472512
4395D72512J6403L9488J1435p7546l7927q9062J50402j6067n2926o092j139K143
$$ 472512 488915 528403 539838 462292 424365 335303 485705 469638 416712 410620 409481 411624
4383D11624k6245J8319k7052R6524M7604p2981j3895l5714n2160j6736J25880
$$ 411624 385379 403698 376646 473170 520774 447793 433898 398184 346024 329288 455168
4372D55168J01402n1380j16602m5374J02775n0364j07227R289J98817p3950j0987
$$ 455168 556570 505190 388588 343214 445989 395625 288398 297687 496504 422554 411567
4361D11567o2781P7535K5223j40455P3305p1089j17728N3616Q2512p596j3208
$$ 411567 348786 426321 451544 311089 384394 313305 195577 249193 331705 324109 310901
4350C10901k3600J24945K569j37406P3508M757j1646q0573K4830K1680m8299L6357
$$ 310901 287301 412246 414815 277409 350917 355674 344028 263455 288285 309965 261666 298023
4338B98023O3476M0317P495O954J43270k2743L3769q9539r5123O3187n1939K7915
$$ 298023 361499 401816 409311 416265 559535 536792 570561 481022 385899 449086 397147 425062
4326D25062j715N1372j25210J528J60037l4176n0957n5037R9276L0322p6750o5865
$$ 425062 423347 474719 349509 351037 511074 476898 425941 370904 470180 500502 423752 357887
4314C57887j46092J47029M2138q941l3673R4053R3774m1710O2311J09893J9667
$$ 357887 211795 358824 400962 392021 358348 452401 546175 504465 566776 676669 696336
4303F96336J42109L113J5433m4201j08764J16947J04995r7398J0989J6745j00993
$$ 696336 838445 841558 856991 812790 704026 820973 925968 828570 839559 856304 755311
4292G55311n6193k4924Q132j63600j0377k7145K73674P5156M3962M4041j299k7822
$$ 755311 699118 674194 682326 518726 508349 481204 754878 830034 873996 918037 916738 888916
4280H88916m7089j17635l9692N3444J11221J11467l4626l0620l8452j5163p8449
$$ 888916 841827 724192 684500 737944 849165 960632 926006 895386 856934 841771 763322
4269G63322k6362P7721J00619p0463K8377Q4643j49469q678Q2374m2062M6472
$$ 763322 736960 814681 915300 844837 873214 957857 808388 799710 882084 840022 886494
4258H86494P3655O4533P3195m8612l0554k9152k8123J1042J31791L987J1625J62031
$$ 886494 960149 1024682 1097877 1049265 1018711 989559 961436 972478 1104269 1108256 1119881 1281912
4246A281912m320n3220j13584K0956q7622K8974q3349J10784K6101K8821J6872
$$ 1281912 1277592 1224372 1110788 1131744 1044122 1073096 989747 1100531 1126632 1155453 1172325
4235A172325j19644K4089k9449n846O44J39504J04042R1854j21428l6266o0581
$$ 1172325 1052681 1076770 1047321 1041475 1042119 1181623 1285665 1377519 1256091 1219825 1159244
4224A159244K5624R1809J10918O9091o2616j44690k4676L7289j5403k8802n4204
$$ 1159244 1184868 1276677 1387595 1456686 1394070 1249380 1224704 1261993 1246590 1217788 1163584
4213A163584o5320k2343J25725L4312j36842p4898O5329j4235j43620R673N0328
$$ 1163584 1098264 1075921 1201646 1235958 1099116 1024218 1089547 1075312 931692 941365 991693
4202I91693P6276j55834o160J37918N9923L3062l8091k0884K7861R859p0407n5358
$$ 991693 1067969 912135 905975 1043893 1103816 1136878 1098787 1077903 1105764 1115623 1045216 989858
4190I89858j7681o0232K8898J38238J4994p441j48346k0540p5570M0305P5035
$$ 989858 972177 911945 940843 1079081 1094075 1086634 938288 917748 842178 882483 957518
4179I57518k2234J73454j60548r4229O3422o0861j35207K25523O7896L9739K6020
$$ 957518 935284 1108738 948190 853961 917383 856522 721315 946838 1014734 1054473 1080493
4168A080493j35441J82790O0270j5856l530O0553j14703J27973k993j15847J6899
$$ 1080493 945052 1127842 1188112 1172256 1168726 1229279 1114576 1242549 1239556 1123709 1140608
4157A140608L4022M5007N4480m4003M529j099P0684j4801j28241j02134J35839
$$ 1140608 1174630 1219637 1274117 1230114 1234643 1233544 1304228 1289427 1161186 1059052 1194891
4146A194891J521O7791K235R8278K127j32208Q9923O3374n5320K7K615l5928K62670
$$ 1194891 1196412 1264203 1266438 1364716 1366843 1234635 1324558 1387932 1332612 1332639 1335254 1299326 1561996
4133A561996J45921j07266J5571n6157N1565J9029K3241k0267q8187J75017L8618
$$ 1561996 1707917 1600651 1616222 1560065 1611630 1630659 1653900 1633633 1545446 1720463 1759081
4122A759081M1885j30031J05026Q8611n9358j6396q0491J03175J9207L4529O8086
$$ 1759081 1800966 1670935 1775961 1864572 1805214 1788818 1708327 1811502 1830709 1865238 1933324
4111A933324m5342K5047J27367l8110Q0969O5345M7704l4493l2517J56841j842
$$ 1933324 1887982 1913029 2040396 2002286 2083255 2148600 2196304 2161811 2129294 2286135 2284293
4100B284293m1503Q0109K7404Q2295p8547j20448L7577K01148R4651j46544R9185
$$ 2284293 2242790 2322899 2350303 2432598 2354051 2233603 2271180 2472328 2566979 2420435 2519620
4089B519620L1819J17657j9458M6028J78384l1364J4968O498R5836K5085R3164
$$ 2519620 2551439 2669096 2649638 2695666 2874050 2842686 2857654 2864152 2959988 2985073 3078237
4078C078237L7312J5172n4463J07971J56997j0713J68097Q0791J12520j06000
$$ 3078237 3115549 3130721 3076258 3184229 3341226 3330513 3498610 3579401 3691921 3585921
4068C585921L6819l9539Q6667L8836P2117J39705k2142P3286R3370Q2113P2288
$$ 3585921 3622740 3583201 3669868 3708704 3780821 3920526 3898384 3971670 4065040 4147153 4219441
4057D219441J2525J26825J1011R8940l0789O4759J73058N5244J33248J65868l004
$$ 4219441 4231966 4358791 4369802 4468742 4437953 4502712 4675770 4731014 4864262 5030130 5027126
4046E027126J21245J00260J72304P0097J77201J38001r192K81831K37235K00688
$$ 5027126 5148371 5248631 5420935 5491032 5668233 5806234 5797042 6078873 6316108 6516796
4036F516796R4702J51466J57676J18638M02634L60532L07531L12906L82801M45062
$$ 6516796 6611498 6762964 6920640 7039278 7441912 7802444 8109975 8422881 8805682 9250744
4026I250744M15417M49432M93219M22235K31925M16892K78131M43309L70733N66789
$$ 9250744 9666161 10115593 10608812 11031047 11262972 11679864 11957995 12401304 12772037 13338826
4016A3338826Q22291N39001O66094N03987O59925O26219M69666O16868N85863
$$ 13338826 14161117 14700118 15366212 15870199 16530124 17156343 17626009 18242877 18828740
4007A8828740N52160M62662M39083L81849M24357N46058L27829K31094N32940
$$ 18828740 19380900 19843562 20282645 20664494 21088851 21634909 21962738 22193832 22726772
3998B2726772K44254M30785N52469P02777Q15701Q95706J240652J379191J614676
$$ 22726772 22971026 23401811 23954280 24657057 25472758 26368464 27609116 28988307 30602983
3989C0602983J943600K104496K076857K251106K406653K909266L312660L484912
$$ 30602983 32546583 34651079 36727936 38979042 41385695 44294961 47607621 51092533
3981E1092533L689647L772967L814616L818316L576830L069917K617937K234448
$$ 51092533 54782180 58555147 62369763 66188079 69764909 72834826 75452763 77687211
3973G7687211J816210J688205J904754J856308K328645L186224L961414M966244
$$ 77687211 79503421 81191626 83096380 84952688 87281333 90467557 94428971 99395215
3965I9395215N818694N953590N459666M655200L531083K105438J233536O85133
$$ 99395215 105213909 111167499 116627165 121282365 124813448 126918886 128152422 128837555
3957A28837555M96673J248815K203616L302381M303579N022840N382887N258930
$$ 128837555 129334228 130583043 132786659 136089040 140392619 145415459 150798346 156057276
3949A56057276M672379L534592J873989R6380j742564l177859m513030n363570
$$ 156057276 160729655 164264247 166138236 166234616 164492052 161314193 156801163 151437593
3941A51437593n492632n278775m412004l353924j963953j357975p26619j009841
$$ 151437593 145944961 140666186 136254182 132900258 130936305 129578330 128851711 127841870
3933A27841870j841372k777478l859015m675446n238745n473902n207893m555242
$$ 127841870 126000498 123223020 119364005 114688559 109449814 103975912 98768019 94212777
3925I4212777m059384l333515k781749k162598j901379j767939j759208k236640
$$ 94212777 90153393 86819878 84038129 81875531 79974152 78206213 76447005 74210365
3917G4210365k411257k803725l146067l226394l279319l236430k875760k856500
$$ 74210365 71799108 68995383 65849316 62622922 59343603 56107173 53231413 50374913
3909E0374913k645065k601127k432658k218324k056718j916659j799842j307135
$$ 50374913 47729848 45128721 42696063 40477739 38421021 36504362 34704520 33397385
3901C3397385j272916j034623p54562o06179o42426m05716k59488k05008n6509
$$ 33397385 32124469 31089846 30335284 29729105 29086679 28680963 28421475 28216467 28159958
3892B8159958j87305l10636l157j36367k86413k45082l80312k73821l95779m25920
$$ 28159958 27972653 27662017 27658860 27522493 27236080 26990998 26610686 26336865 25941086 25515166
3882B5515166m90788l97250n00147o91527o75040n45243o50620p47490n84044
$$ 25515166 25024378 24627128 24126981 23435454 22760414 22215171 21564551 20817061 20233017
3873B0233017m34619n96906o40086n84954n66891m86345o50006n85521n24413
$$ 20233017 19798398 19201492 18561406 17976452 17409561 16923216 16273210 15687689 15163276
3864A5163276o64723n77002m98134o62453m52702m56361m92631n08795k82058
$$ 15163276 14498553 13921551 13423417 12760964 12308262 11851901 11359270 10850475 10568417
3855A0568417m72820m13535l08959j90015k48603k98710k73561l95837j90403
$$ 10568417 10095597 9682062 9373103 9183088 8934485 8635775 8362214 7966377 7775974
3846G775974l30267j19975l17822j83192n7158k14958j39378k51420k00601j44742
$$ 7775974 7445707 7325732 7007910 6824718 6767560 6552602 6413224 6161804 5961203 5816461
3836E816461L6684m10587j41834j79311p2685j4160j56111j30653j4708j95372
$$ 5816461 5853145 5442558 5300724 5121413 5048728 5034568 4878457 4747804 4733096 4537724
3826D537724j4459q9128j01644j47497j19724j08480j68753q1764M7870j90843
$$ 4537724 4523265 4434137 4332493 4184996 4065272 3956792 3788039 3706275 3754145 3563302
3816C563302p7109p6427j90357l3977n4365R6778j67623J27756j67364j7207j71461
$$ 3563302 3486193 3409766 3219409 3185432 3131067 3227845 3060222 3187978 3020614 3003407 2831946
3805B831946k33285P1786o1095r4678q8673n8663P0547j24070p2462j33530q7685
$$ 2831946 2598661 2670447 2609352 2514674 2426001 2367338 2437885 2313815 2241353 2107823 2020138
3794B020138J23252j0739j15866O4772n3727j29871q9040P2289p4727O0594j6894
$$ 2020138 2143390 2132651 2016785 2081557 2027830 1897959 1808919 1881208 1806481 1867075 1850181
3783A850181K2965P2721k62131j51982J18814O9563p7721N836p1808o1285q9939
$$ 1850181 1873146 1945867 1683736 1531754 1650568 1720131 1642410 1648246 1576438 1515153 1425214
3772A425214m7357j35045J10719K02190m9313o3297m1525q8759j11681p0932Q0983
$$ 1425214 1377857 1242812 1353531 1555721 1506408 1443111 1401586 1312827 1201146 1130214 1211197
3761A211197p8113L3449J15736l2361j8736r521L3207n9878j57586j60125q7553
$$ 1211197 1133084 1166533 1282269 1249908 1231172 1221651 1254858 1194980 1037394 877269 789716
3750G89716Q4416O0495P294J22684J10079j42321k6821O1402j64102n6095j19805
$$ 789716 874132 934627 941921 1064605 1174684 1032363 1005542 1066944 902842 846747 726942
3739G26942P2893N5335j2528L3536K05586m4389n6522P4181q6842o0381j85369
$$ 726942 799835 855170 842642 876178 1081764 1037375 980853 1055034 968192 907811 722442
3728G22442M1427j20620k8958J47033n0848j7535o8695R4019P1123o5118j8938
$$ 722442 763869 643249 614291 761324 710476 692941 624246 718265 789388 724270 705332
3717G05332L367Q1880Q9610J6217o2286J8629j5712J3709o1290j21528J74140
$$ 705332 708699 790579 880189 896406 834120 852749 837037 850746 789456 667928 842068
3706H42068N3469q3568j3935R4008l2547M811m5164L2053k5816J4070K19679j00109
$$ 842068 895537 811969 798034 892042 859495 864306 819142 851195 825379 839449 1059128 959019
3694I59019p9503N3899j5262m3576P9710M4969j02302N1742J33626o60N1918j31780
$$ 959019 879516 933415 918153 874577 954287 999256 896954 948696 1082322 1081662 1133580 1001800
3682A001800j36585J53436j9724j53176q5758J44622j0857J9081m674q8537K6690
$$ 1001800 865215 1018651 998927 845751 759993 904615 893758 912839 908165 819628 846318
3671H46318J36649P4323p3630K9775N2412K5576j5813m158j12671M0085Q165N5529
$$ 846318 982967 1057290 983660 1013435 1065847 1091423 1075610 1071452 958781 998866 1007031 1062560
3659A062560j24350j300k0090M7170K1290j14767k0398K4361O8879R6549Q0868
$$ 1062560 938210 936910 916820 963990 985280 870513 850115 874476 943355 1039904 1120772
3648A120772m0863k9352M9799Q4381m0328J36623j12710p3629J45629K01091R0493
$$ 1120772 1079909 1050557 1100356 1184737 1144409 1281032 1168322 1094693 1240322 1441413 1531906
3637A531906j3626p3002P4438l3369J56230K47571J0300K86779L88076N01702
$$ 1531906 1518280 1445278 1519716 1486347 1642577 1890148 1900448 2187227 2575303 3077005
3627C077005M09862M30210J68401J01360m3950k29553l84211m07558k96843k89237
$$ 3077005 3486867 3917077 4085478 4186838 4142888 3913335 3529124 3121566 2824723 2535486
3617B535486l02567k42956k69134n2923q1069j22667q2924L4947k8205K1322O9938
$$ 2535486 2232919 1989963 1720829 1667906 1586837 1464170 1381246 1416193 1387988 1409310 1479248
3606A479248M9025N9206j3747K4038J17518K25633J78108M17764M22797O06904
$$ 1479248 1528273 1587479 1573732 1597770 1715288 1940921 2119029 2536793 2959590 3566494
3596C566494Q35250R35037Q37449N20897K23785M103l43562m89518p58642p45888
$$ 3566494 4401744 5336781 6174230 6695127 6918912 6923015 6579453 6089935 5331293 4585405
3586D585405o17792n63256m87315n15542k66093k06040j58309o4347j39088j1076
$$ 4585405 3967613 3404357 2917042 2401500 2135407 1929367 1771058 1706711 1567623 1556547
3576A556547j432k1338k4293l1316k337l4308j1091N5943J47811L1468J54351
$$ 1556547 1555115 1533777 1509484 1478168 1475831 1441523 1430432 1486375 1634186 1665654 1820005
3565A820005K80425L92407L65381L64924L47042K42114N540L544k13865n50000
$$ 1820005 2100430 2492837 2858218 3223142 3570184 3812298 3817838 3821382 3607517 3057517
3555C057517k64003j77123k75538m73492k02300K7946j86923j15074n5913j39446
$$ 3057517 2793514 2616391 2340853 1867361 1665061 1693007 1506084 1391010 1335097 1195651
3545A195651L3515Q7067j23188j04751l2020L4125k1030r867K9154K6364j05693
$$ 1195651 1229166 1316233 1193045 1088294 1056274 1090399 1069369 1059502 1088656 1115020 1009327
3534A009327j9861K1252j6256N2515N6166p9254O5382O088j8896J48161n7892
$$ 1009327 989466 1010718 994462 1046977 1103143 1023889 1089271 1095359 1076463 1224624 1166732
3523A166732K4477N8797J6705J5250R3676q60j22712P3381J83491o3130J62789
$$ 1166732 1191209 1250006 1266711 1281961 1375637 1374777 1252065 1325446 1508937 1445807 1608596
3512A608596N0064N0918k271j01836J05571k8945o7919N1617Q4739J06242J24381
$$ 1608596 1658660 1709578 1707307 1605471 1711042 1682097 1614178 1665795 1750534 1856776 1981157
3501A981157J00948O9171L753K7353N1345J55033J52167R3629J0908P2935J14763
$$ 1981157 2082105 2151276 2155029 2182382 2233727 2388760 2540927 2634556 2645464 2718399 2833162
3490B833162n2824K48854J56892L2300p077J74044J55158J36050L10857L89780
$$ 2833162 2780338 3029192 3186084 3218384 3211307 3385351 3540509 3676559 3987416 4377196
3480D377196L11196M35673M28199J97555K98998K82247M00407K02644J42630J60223
$$ 4377196 4688392 5124065 5552264 5749819 6048817 6331064 6731471 6934115 7076745 7236968
3470G236968P0583k68080o5459j20358l34298k86219k93438j34224k64030k94565
$$ 7236968 7307551 7039471 6974012 6853654 6519356 6233137 5939699 5805475 5541445 5246880
3460E246880q0917j92272l25352k55182l00601k87532k31217j60827k38468j19394
$$ 5246880 5165963 4973691 4648339 4393157 4092556 3805024 3573807 3412980 3174512 3055118
3450C055118k34960j70653k35673j20449k36869j11754r3366j75212o6624j26894
$$ 3055118 2820158 2649505 2413832 2293383 2056514 1944760 1851394 1676182 1609558 1482664
3440A482664p305m4306j10831r4199j37019r4357k5981M2629q2534m3038K0673
$$ 1482664 1475359 1431053 1320222 1226023 1089004 994647 968666 1011295 928761 885723 906396
3429I06396j56259J405L4769L0157P5030O609j56959J17388o7510q4259j05659
$$ 906396 750137 751542 786311 816468 891498 898107 741148 858536 791026 706767 601108
3418F01108J4161n0398j08423L9944J775N0167j2861r902Q8175j15195m0908K5630
$$ 601108 615269 564871 456448 496392 498167 548334 535473 525571 613746 498551 457643 483273
3406D83273r4854k8599l6584m7903K4633J179k9690k2050m6465l6550j230Q2708
$$ 483273 388419 359820 323236 275333 299966 301145 271455 249405 202940 166390 165160 247868
3394B47868k3201K0084o851q7022n884L4125J4024J6753J20146j43162m2677P2135
$$ 247868 224667 244751 237900 150878 144994 179119 193143 209896 330042 186880 144203 216338
3382B16338J0261M5954M8637j21229p8730K1177L670J5603m0808p8150J89289
$$ 216338 226599 272553 321190 199961 121231 142408 146078 161681 120873 42723 232012
3371B32012K5464j9489O60j12463j01413J31428K8683j3944R6241j22142K0300
$$ 232012 257476 237987 238647 126184 24771 156199 184882 170938 267179 145037 165337
3360A65337j1435o8309L166n1013j2759L4957M8735M3692r533O0650m911M2429
$$ 165337 153902 85593 88759 37746 24987 59944 108679 152371 142838 203488 198577 241006
3348B41006l4607j19926j2346J9766r3527R3901Q1054R535j42976N952l4315M3044
$$ 241006 206399 86473 74127 93893 366 94267 175321 184856 41880 47832 13517 56561
3336E6561R5168n6987p8329J42832O836P230r0101j47836J32062J0928m1975J0159
$$ 56561 151729 94742 16413 159245 166081 173311 83210 -64626 67436 78364 36389 46548
3324D6548q1302p2809O1693m9073O8189J11288l5003m9734o7528m1709J29292
$$ 46548 -34754 -107563 -45870 -94943 -26754 84534 49531 -203 -67731 -109440 19852
3313A9852M6006k5139O3238p4984J02621m0130p1432P3230J07945L1564o4408
$$ 19852 65858 40719 103957 28973 131594 91464 20032 93262 201207 232771 168363
3302A68363L4044m2170r5418O1495m2060k5337J5574L6027k09362l5602J81306
$$ 168363 202407 160237 64819 126314 84254 58917 74491 110518 -98844 -134446 46860
3291D6860l663k6700m2267P0275O9687O1061m5003N9920o0422o1555r3367P2734
$$ 46860 43197 16497 -25770 44505 114192 175253 130250 190170 129748 68193 -25174 47560
3279D7560j31966J0171J50441n1120p3574J54516J05630q506l9687k1780N8708
$$ 47560 -84406 -74235 76206 25086 -48488 106028 211658 203152 163465 141685 200393
3268B00393o0621j19202j42262J40004J36765p127r5965L526J0543L2315k8806
$$ 200393 139772 20570 -121692 18312 155077 147950 51985 55511 66054 98369 69563
3257F9563p3191k8256o6240m4380J96486P7912j11221m34n7445k0345Q2042L3147
$$ 69563 -3628 -31884 -98124 -142504 53982 131894 20673 20239 -37206 -57551 24491 57638
3245E7638n7568O2722l1590P67j3461o1924p7449L9377K30411p4047l5677J83949
$$ 57638 70 62792 31202 31969 18508 -43416 -120865 -81488 148923 74876 39199 223148
3233B23148l0550j31031o473Q1686q330Q3014j52038j0491j7097P4568P3579O785
$$ 223148 192598 61567 55094 136780 128450 211464 59426 48935 31838 106406 179985 186770
3221A86770K7726q7341m0741J32900O1455p6361j02131j09729l3959Q5377J55247
$$ 186770 214496 127155 86414 219314 280769 204408 102277 -7452 -41411 43966 199213
3210A99213M2286p0758J1691Q4909j4586J991n0694J75664m6140l2292j7990l3596
$$ 199213 241499 170741 182432 267341 252755 254746 204052 379716 333576 301284 283294 249698
3198B49698J9970K6466m5365l2648k6447l6549j9779J77702N3569k6606j5416
$$ 249698 269668 296134 250769 218121 191674 155125 135346 313048 366617 340011 324595
3187C24595M6631N9268N6726j53431J5122m5819j4414J15292k2132J18329O85
$$ 324595 371226 430494 487220 333789 348911 303092 288678 403970 381838 500167 500852
3176E00852M8548p8931N7874J07210J595o6277Q3450Q3143n7998N1596J36319
$$ 500852 549400 470469 528343 635553 637148 570871 654321 737464 679466 731062 867381
3165H67381J33890m8717L4147J34577M8269P0814J79602J44038R6990J21673J13096
$$ 867381 1001271 952554 986701 1121278 1169547 1240361 1419963 1564001 1660991 1782664 1895760
3154A895760J69289J58004L6580K8978j03009p4268J58269J09675j6161R59R278
$$ 1895760 2065049 2223053 2259633 2288611 2185602 2111334 2269603 2379278 2363117 2364076 2373354
3143B373354k6377M3137o9226l1505r6459o309O3961Q3997J49633J3550M0075
$$ 2373354 2346977 2390114 2320888 2289383 2192924 2186615 2250576 2334573 2484206 2497756 2537831
3132B537831J79509K38883K51481K99411L57046L93709L17211L04329K36643K9381
$$ 2537831 2717340 2956223 3207704 3507115 3864161 4257870 4575081 4879410 5116053 5145434
3122E145434j14775l81560j93375l32007n89168k70842l90276k44148k04733j06455
$$ 5145434 5030659 4649099 4455724 4123717 3534549 3263707 2873431 2629283 2424550 2318095
3112B318095q0510k07668k1321n352l9289j29964m4673k7407j685k4560M1540
$$ 2318095 2237585 2029917 2008596 2003244 1963955 1833991 1789318 1761911 1760226 1735666 1777206
3101A777206M5080N6115O3897J53280M760j9947m496K942l6372J60195J6541j56943
$$ 1777206 1822286 1878401 1942298 2095578 2100338 2080391 2075895 2078837 2042465 2202660 2219201 2062258
3089B062258m4836k31850k12505n2452p4383j27594j77715k07855P7118j8591
$$ 2062258 2017422 1785572 1573067 1520615 1446232 1318638 1140923 933068 1010186 991595
3079I91595k60886j31473J0370j5684n0043P1448j5187j06597j2029p0866K468
$$ 991595 730709 599236 609606 593922 543879 615327 600140 493543 481514 410648 413116
3068D13116j0365L1665p6610Q763L8595j10906L2743p4928p9852P8305l888p7820
$$ 413116 402751 434416 357806 366569 405164 294258 327001 252073 172221 250526 246638 168818
3056A68818K2148J7432j8773j25993J10871N621j01051K5845R1661O8748n1709
$$ 168818 190966 208398 189625 63632 174503 180124 79073 104918 196579 265327 213618
3045B13618j49624j10316Q2526R1587N0239q2553l0678j06463O5151J23557q100
$$ 213618 63994 -46322 36204 127791 178030 95477 64799 -41664 23487 147044 138944
3034A38944k9010O5843J0556j1293j45936N1183p841M9636q1274k9224R1901K6005
$$ 138944 109934 175777 186333 175040 29104 80287 72446 122082 40808 11584 103485 129490
3022A29490M3698Q7680j96809q873m7093j13949J23552m1048O2183m1535q8064
$$ 129490 173188 260868 64059 55186 8093 -105856 17696 -23352 38831 -2704 -90768
3011i0768n0302K8785m2032J89744L5084m0180n2447O7583o180P7062j07801k1761
$$ -90768 -141070 -112285 -154317 35427 70511 30331 -22116 45467 39287 116349 8548 -13213
2999a3213P3459j35805Q5518N954o1557N7488M1164r8437Q9733m650L1758K3206
$$ -13213 60246 -75559 9959 15913 -45644 11844 53008 -45429 44304 39654 71412 94618
2987I4618J5019j07176M6793J04966j29476j5066o7669j03739J48137J50899j70031
$$ 94618 109637 2461 49254 154220 24744 9678 -57991 -161730 -13593 137306 -32725
2976c2725J549M6637K3318m100N0720N2349o6384j10697J4999J27878j11523J47142
$$ -32725 -31176 15461 38779 34679 85399 137748 71364 -39333 -24334 103544 -7979 139163
2964A39163M1884p0378r5680N9937N7840j39659O451j949l0580m5427J2073K7373
$$ 139163 181047 110669 14989 74926 132766 -6893 -442 -2391 -32971 -78398 -66325 -38952
2952c8952N9048j07440k9693r7477N6626J1089J00438J09365J13201p2448j87029
$$ -38952 20096 -87344 -117037 -214514 -157888 -146799 -46361 63004 176205 103757 -83272
2941h3272R1901J07144o9706j17634N7491n2516q1460M8200O5198m5992J0294
$$ -83272 8629 115773 46067 -71567 -14076 -66592 -148052 -99852 -34654 -80646 -70352
2930g0352l1584N1799R649L5394l5329k7754J15963n0349q5225J60355r1680l6120
$$ -70352 -101936 -50137 -40488 -5094 -40423 -68177 47786 -2563 -87788 72567 -19113 -55233
2918e5233O2484l258l5031l3190J6158r0773J1125J44874K5502p380J6007K0875
$$ -55233 7251 3993 -31038 -64228 -48070 -138843 -127718 17156 42658 35278 51285 72160
2906G2160J4961q1565O9025j06865L5412J7275p2039p4357K6248q342o3971O9425
$$ 72160 87121 5556 74581 -32284 3128 20403 -51636 -125993 -99745 -108087 -172058 -102633
2894a02633R6612m7382q2310o521J6709O2073q4331k3662J13466J06461N6981
$$ -102633 -6021 -53403 -135713 -142234 -125525 -63452 -147783 -171445 -57979 48482 105463
2883A05463j10757Q2738n7402l3649m3846o9541q200j2086L2554Q1950M6385r5855
$$ 105463 -5294 77444 20042 -13607 -57453 -126994 -135194 -147280 -114726 -32776 13609 -82246
2871h2246J55081q6312j34074J24658L9665r6565Q9989L1156R5193j721j44073
$$ -82246 72835 -13477 -147551 -22893 16772 -79793 10196 41352 136545 134824 -9249
2860i249k9540r4993P9042Q7059L4010m3261j14899j627k51505O1887J09661J06768
$$ -9249 -38789 -133782 -54740 32319 66329 23068 -91831 -93458 -344963 -283076 -173415 -66647
2848f6647K7470q7519R2456J270L4558p6222l2228J35715J7145p8268j3613n5714
$$ -66647 -39177 -126696 -34240 -32970 1588 -74634 -106862 28853 45998 -32270 -45883 -101597
2836a01597o0454K445Q5659R2967J19409l1127m4567o9409j10296j39370L3668
$$ -101597 -162051 -159606 -73947 19020 138429 107302 62735 -6674 -116970 -256340 -222672
2825b22672J55498J54430n0227j07998K6202n4848J76656M7912L560q3463j62950
$$ -222672 -67174 87256 37029 -70969 -44767 -99615 77041 124953 128513 45050 -117900
2814a17900L1918R6459r980j9432n263K7382j22002R3523M0004l0679q6961j18068
$$ -117900 -85982 10477 497 -18935 -24198 3184 -118818 -25295 14709 -15970 -102931 -220999
2802b20999N5521N7489K5993Q7465l7717p0725J93487l2349r3361q8929j9908
$$ -220999 -165478 -107989 -81996 5469 -32248 -102973 90514 58165 -35196 -124125 -144033
2791a44033Q2189R8435r0352J6318n1631l9734J28284R0042j83868K2322P5619
$$ -144033 -61844 36591 -53761 -37443 -89074 -128808 -524 89518 -94350 -72028 3591
2780C591p1045j6982j6664Q7610k3901l8116J29562j91066j05349O3592J11636
$$ 3591 -67454 -84436 -101100 -13490 -37391 -75507 54055 -137011 -242360 -178768 -67132
2769f7132M408J8135R0745r2568q9063J2356n873J4497O4893K3481p1876o0397
$$ -67132 -62724 -44589 46156 -46412 -135475 -123119 -128992 -114495 -49602 -26121 -97997 -158394
2757a58394J2868n196K74956r5246k10936q1996O3262R4076L3629N2804L1541
$$ -158394 -145526 -150722 124234 28988 -181948 -263944 -200682 -106606 -72977 -20173 11368
$$ [...]
##END NTUPLES=NMR SPECTRUM
##END=
