##TITLE=1H_DE-80H_X3
 200.13MHz, d2o
 8 sc
 
 19ns.26.2.2025
##JCAMPDX= 6.0         $$ Bruker NMR JCAMP-DX V2.0
##DATA TYPE= NMR SPECTRUM
##DATA CLASS= NTUPLES
##ORIGIN= UXNMR, Bruker Analytische Messtechnik GmbH
##OWNER= pz
$$ XWIN-NMR		Version 3.5
$$ Wed Jul  1 10:05:04 2026 Russian Standard Time (UT+4h)  Yarkov@DPX200
##.OBSERVE FREQUENCY= 200.1313
##.OBSERVE NUCLEUS= ^1H
##.ACQUISITION MODE= SIMULTANEOUS
##.ACQUISITION SCHEME= undefined
##.AVERAGES= 8
##.DIGITISER RES= 18
##SPECTROMETER/DATA SYSTEM= spect
##.PULSE SEQUENCE= zg30
##.SOLVENT NAME= CDCl3
##.SHIFT REFERENCE= (INTERNAL, CDCl3, 0, 15.4946)
##AUDIT TRAIL= $$ (NUMBER, WHEN, WHO, WHERE, WHAT)
$$ ##TITLE= Audit trail, XWIN-NMR		Version 3.5
$$ ##JCAMPDX= 5.01
$$ ##ORIGIN= Bruker BioSpin GmbH
$$ ##OWNER= Yarkov
$$ C:/Bruker/XWIN-NMR/data/yarkov2/nmr/H-C/1/pdata/1/auditp.txt
$$ ##AUDIT TRAIL=  $$ (NUMBER, WHEN, WHO, WHERE, WHAT)
(   1,<2026-07-01 10:04:19.39 +0400>,<Yarkov>,<DPX200>,
      <created by zg, POWCHK disabled, PULCHK disabled
       configuration hash MD5:
       00 E9 B6 7A A2 85 ED C7 34 08 36 98 17 FE 4E 26
       data hash MD5: 16K
       65 B4 67 26 E6 90 BC E1 E7 96 1A F4 53 E9 5B B5>)
(   2,<2026-07-01 10:04:24.12 +0400>,<Yarkov>,<DPX200>,
      <Start of raw data processing
       efp BC_mod = 2 LB = 0.25 FT_mod = 6 PKNL = 1 PHC0 = -6900.419 PHC1 = 13.42196 SI = 16K 
       data hash MD5: 16K
       EA BC B9 84 3F 3F 91 A7 7D 95 03 F6 42 1D 28 B9>)
(   3,<2026-07-01 10:04:32.65 +0400>,<Yarkov>,<DPX200>,
      <abs ABSG = 5 
       data hash MD5: 16K
       68 07 2C 97 CC E1 D6 4B 30 BF 6C F2 80 08 7D A1>)
$$ ##END=
$$ 
$$ hash MD5
$$ BF 19 E4 3F E7 3F 2B 9B 31 C8 E1 D9 51 15 01 04
##$RELAX= 
##$RELAX= 
##$RELAX= 
##$RELAX= 
##$RELAX= 
##$RELAX= 
$$ Bruker specific parameters
$$ --------------------------
##$DU= <C:/Bruker/XWIN-NMR>
##$EXPNO= 1
##$NAME= <H-C>
##$PROCNO= 1
##$TYPE= <nmr>
##$USER= <yarkov2>
##$AMP= (0..31)
100 100 100 100 100 100 100 100 100 100 100 100 100 100 100 100 100 100 
100 100 100 100 100 100 100 100 100 100 100 100 100 100 
##$AQSEQ= 0
##$AQ_mod= 1
##$AUNM= <au_zg>
##$AUTOPOS= <>
##$BF1= 200.13
##$BF2= 200.13
##$BF3= 200.13
##$BF4= 200.13
##$BF5= 200.13
##$BF6= 200.13
##$BF7= 200.13
##$BF8= 200.13
##$BYTORDA= 1
##$CFDGTYP= 0
##$CFRGTYP= 5
##$CHEMSTR= <none>
##$CNST= (0..31)
1 1 145 1 1 1 1 1 1 1 1 1 1 1 1 1 1 1 1 1 1 1 1 1 1 1 1 1 1 1 1 1 
##$CPDPRG= <>
##$CPDPRG1= <>
##$CPDPRG2= <>
##$CPDPRG3= <>
##$CPDPRG4= <mlev>
##$CPDPRG5= <mlev>
##$CPDPRG6= <mlev>
##$CPDPRG7= <mlev>
##$CPDPRG8= <mlev>
##$CPDPRGB= <>
##$CPDPRGT= <>
##$D= (0..31)
0 0.7 0 0 0 0 0 0 0 0 0 0.03 0 0 0 0 0 0 0 0 0 0 0 0 0 0 0 0 0 0 0 0 
##$DATE= 1782885858
##$DBL= (0..7)
120 120 120 120 120 120 120 120 
##$DBP= (0..7)
150 150 150 150 150 150 150 150 
##$DBP07= 0
##$DBPNAM0= <>
##$DBPNAM1= <>
##$DBPNAM2= <>
##$DBPNAM3= <>
##$DBPNAM4= <>
##$DBPNAM5= <>
##$DBPNAM6= <>
##$DBPNAM7= <>
##$DBPOAL= (0..7)
0.5 0.5 0.5 0.5 0.5 0.5 0.5 0.5 
##$DBPOFFS= (0..7)
0 0 0 0 0 0 0 0 
##$DE= 6
$$ [...]
##$SUBNAM3= <"">
##$SUBNAM4= <"">
##$SUBNAM5= <"">
##$SUBNAM6= <"">
##$SUBNAM7= <"">
##$SUBNAM8= <"">
##$SUBNAM9= <"">
##$SW= 18.0517328524113
##$SWIBOX= (0..15)
0 0 2 0 0 0 0 0 0 0 0 0 0 0 0 0 
##$SW_h= 3612.71676300578
##$TD= 16384
##$TD0= 1
##$TE= 0
##$TE2= 300
##$TE3= 300
##$TEG= 300
##$TL= (0..7)
0 120 120 120 120 120 120 120 
##$TP= (0..7)
150 150 150 150 150 150 150 150 
##$TP07= 0
##$TPNAME0= <>
##$TPNAME1= <>
##$TPNAME2= <>
##$TPNAME3= <>
##$TPNAME4= <>
##$TPNAME5= <>
##$TPNAME6= <>
##$TPNAME7= <>
##$TPOAL= (0..7)
0.5 0.5 0.5 0.5 0.5 0.5 0.5 0.5 
##$TPOFFS= (0..7)
0 0 0 0 0 0 0 0 
##$TUNHIN= 0
##$TUNHOUT= 0
##$TUNXOUT= 0
##$USERA1= <user>
##$USERA2= <user>
##$USERA3= <user>
##$USERA4= <user>
##$USERA5= <user>
##$V9= 5
##$VALIST= <valist>
##$VCLIST= <CCCCCCCCCCCCCCC>
##$VD= 0
##$VDLIST= <DDDDDDDDDDDDDDD>
##$VPLIST= <PPPPPPPPPPPPPPP>
##$VTLIST= <TTTTTTTTTTTTTTT>
##$WBST= 1024
##$WBSW= 4
##$XGAIN= (0..3)
0 0 0 0 
##$XL= 0
##$YL= 0
##$YMAX_a= 48065
##$YMIN_a= -75736
##$ZGOPTNS= <>
##$ZL1= 120
##$ZL2= 120
##$ZL3= 120
##$ZL4= 120
##$ABSF1= 15.51331
##$ABSF2= -2.538539
##$ABSG= 5
##$ABSL= 3
##$ALPHA= 0
##$AQORDER= 0
##$ASSFAC= 0
##$ASSFACI= 0
##$ASSFACX= 0
##$ASSWID= 0
##$AUNMP= <proc_1d>
##$AZFE= 0.1
##$AZFW= 0.1
##$BCFW= 0
##$BC_mod= 2
##$BYTORDP= 0
##$COROFFS= 0
##$CY= -3
##$DATMOD= 1
##$DC= 0
##$DFILT= <>
##$DTYPP= 0
##$F1P= 0
##$F2P= 0
##$FCOR= 1
##$FTSIZE= 16384
##$FT_mod= 6
##$GAMMA= 0
##$GB= 0
##$INTBC= 1
##$INTSCL= 3.241238e-09
##$ISEN= 128
##$LB= 0.25
##$LEV0= 0
##$LPBIN= 0
##$MAXI= 10000
##$MC2= 0
##$MEAN= 0
##$ME_mod= 0
##$MI= 1.114404
##$NCOEF= 0
##$NC_proc= -7
##$NLEV= 6
##$NOISF1= 3.799351
##$NOISF2= 2.8
##$NSP= 0
##$NTH_PI= 0
##$NZP= 0
##$OFFSET= 15.49458
##$PC= 1
##$PHC0= -6900.419
##$PHC1= 13.42196
##$PH_mod= 1
##$PKNL= yes
##$PPARMOD= 0
##$PSCAL= 0
##$PSIGN= 0
##$REVERSE= no
##$SF= 200.130005429229
##$SI= 16384
##$SIGF1= 3
##$SIGF2= 2
##$SINO= 0.751879
##$SIOLD= 32768
##$SREGLST= <19F.Aceton>
##$SSB= 0
##$STSI= 16384
##$STSR= 0
##$SW_p= 3612.71676300578
##$SYMM= 0
##$S_DEV= 0
##$TDeff= 16384
##$TDoff= 0
##$TI= <>
##$TILT= no
##$TM1= 0
##$TM2= 0
##$TOPLEV= 0
##$USERP1= <user>
##$USERP2= <user>
##$USERP3= <user>
##$USERP4= <user>
##$USERP5= <user>
##$WDW= 1
##$XDIM= 16384
##$YMAX_p= 269698844
##$YMIN_p= -226444
$$ End of Bruker specific parameters
$$ ---------------------------------
##NTUPLES= NMR SPECTRUM
##VAR_NAME=  FREQUENCY,     SPECTRUM/REAL,   SPECTRUM/IMAG
##SYMBOL=    X,             R,               I
##VAR_TYPE=  INDEPENDENT,   DEPENDENT,       DEPENDENT
##VAR_FORM=  AFFN,          ASDF,            ASDF
##VAR_DIM=   16384,         16384,           16384
##UNITS=     HZ,            ARBITRARY UNITS, ARBITRARY UNITS
##FACTOR=    0.220516191357247, 1,           1
##FIRST=     3100.93043333055, 0,            0
##LAST=      -511.786329675232, 0,           0
##MIN=       -511.786329675232, -226444,     0
##MAX=       3100.93043333055, 269698844,    0
$$ Real data points
##PAGE= N=1
##DATA TABLE= (X++(R..R)), XYDATA
$$ [...]
9262E1683r753j531p5662m0392L290O4758j7373l074K2848L7035j541k0545k069
9249G674M0052n1844M678j9956k5601l8164j437L7245K8069K804O3115q190l7761
9236F84K6135m3814q675k8281K6502K7535n149k6086N135l8309L1068L6415n3644
9223e0484k4030K3044J7973j7608j0466K2219L8935j249K3275l0132J2764n6961
9211e2720N1840j04293j8068M5165J852N1752R9009o0998r9005N8606O0113p1174
9199c7921Q741m1229P527r705K7672L0614q1910K1732O5105k0507k2840O0988
9187H267J4513o834j3456N406R142k398o3460M2421J0816J6093j0706q1305J25099
9174E3598O962q0953k2465L2168K9708m5307R138L7622N1085k1781Q779J7496
$$ plain form
9262 51683 41930 40399 -35263 -75655 -72365 -7607 -24980 -28054 -5206 31829 30288 9743 7674
9249 7674 47726 -4118 560 -19396 -44997 -83161 -84598 -47353 -19284 -16480 46635 38445 684
9236 684 26819 -16995 -25670 -53951 -27449 86 -5063 -31149 -26014 -64323 -33255 3160 -50484
9223 -50484 -74514 -51470 -33497 -51105 -61571 -39352 -417 -1666 21609 -8523 4241 -52720
9211 -52720 -880 -105173 -123241 -78076 -76224 -24472 74537 13539 -85466 -26860 33253 -37921
9199 -37921 -29180 -70409 -62882 -72587 -44915 -14301 -96211 -74479 -9374 -29881 -52721 8267
9187 8267 22780 15946 2490 7896 17038 14640 -48820 -6399 4417 20510 9804 -71501 53598
9174 53598 60560 -20393 -42858 -10690 19018 -26289 -17151 20471 71556 49775 58554 76050
9162G6050m778p4440M440m4663O8969m9969k0875K4585j0309q1912k0957k3053
9150a56912j050P9591n3623J5673K7605j7242O8288K1631q143n9045N6426P626
9138a9175M0322k6476o0084K4716N1003K7827r411M1019q6985K5689n848L2317
9126C4914l0002m0105l3008J5022M329J3018L5218k985p241K305J8847q898K7937
9113B9351j9753k9335r2032K3554J05664M5710m0311k9011K0351q631M4382k3058
9101B6881j4466R742L0626n4377m8749l5517K0836J0263q230j2628k8871P7634
9089b6856J9916l6485J9747N9226J3919l2585K4075L8849k3046j8083k0381L5119
9077E3415l5020J3667K5064R460L1797p5858p8545L730O0545R911l9283M7624
$$ plain form
9162 76050 71272 -3168 1272 -43391 25578 -24391 -45266 -20681 -30990 -112902 -133859 -156912
9150 -156912 -157962 -78371 -131994 -116321 -88716 -105958 -37670 -16039 -24182 -83227 -26801 -19175
9138 -19175 21147 -5329 -65413 -40697 10306 38133 28722 69741 -17244 8445 2597 34914
9126 34914 4912 -35193 -68201 -53179 -48850 -35832 -614 -3599 -10840 -8535 10312 1414 29351
9113 29351 9598 -19737 -111769 -88215 17449 63159 22848 -6163 14188 5557 49939 26881
9101 26881 12415 22157 52783 -1594 -50343 -85860 -65024 -54761 -62991 -75619 -104490 -26856
9089 -26856 -6940 -43425 -23678 35548 49467 16882 40957 79806 56760 38677 18296 53415
9077 53415 18395 32062 57126 66586 98383 22525 -56020 -52290 8255 18166 -21117 26507
9065B6507n7463L3933L6537n250n1142R0890M5617m6612l1206m9918M6138K6706
9053F4737m2847o8799L9863N448N1327m935l3045l2586L9953L7409L1742m8759
9041C9508n803M567m1982P4720M704p3016K5606J6534J0415l6798N8695O014l9950
9028D3214Q932J3622n517O415N7769P03n6081j7557L0632j4569n7866q1408P3760
9015B049N6514r855J8765r164n656k8024l4229j2827M6286O7657M0L596L5622
9002A30774j3252j9179j2987O1698K4857l796j2085l8250P432K1142k4997j19728
8990A629N6414J26416O382o9388l381J12341J3143m0153l5676L9525j9752n9300
8978A28200K5463j6892K8651O151l922m22O8653j3076k4333N6063M005P88n3675
$$ plain form
9065 26507 -30956 2977 39514 34264 -16878 74012 119629 73017 41811 -8107 38031 64737
9053 64737 21890 -46909 -7046 -1598 49729 44794 11749 -20837 19116 56525 88267 39508
9041 39508 33705 38272 -3710 71010 75714 2698 28304 44838 55253 18455 77150 83164 43214
9028 43214 52146 65768 60251 66666 124435 125138 69057 51500 82132 67563 9697 -71711 2049
9015 2049 58563 48708 67473 58309 52653 24629 -9600 -22427 23859 91516 91556 95152 130774
9002 130774 117522 98343 85356 147054 171911 168115 156030 117780 125212 146354 121357 1629
8990 1629 58043 184459 190841 121453 118072 230413 243556 203403 167727 207252 187500 128200
8978 128200 153663 136771 165422 171573 167651 167229 235882 222806 198473 254536 258541 259329 205654
8965B05654k7631P195J30492O2686r2433q7835K443M6510M3110K9941M8006O6384
8953D34522m9295n837K0969K3183K402L1977O4524M9625P7607q30j6974N8028
8941F89901R7604O5902N0921J96081J47209J05454K23523K50593K69290L97005
8931B493483O42321P86196J043812J504262J891622K126789J727718O41688m36768
8922A2421123j039782j369102j691916j536252j296954j177044q97415o75019
8914B737639n50992l93030j62926j57861j53447j60823j39822q9742n6482j02345
8904G70169o6706o4541o3215j9774M6327K0957j14588p9652o3289j2641J540M8429
8892D03016l1868J658q8153l5579O0124n394K0804j8232k4680j8843l1640j3843
$$ plain form
8965 205654 178023 185218 315710 378396 285963 198128 200571 247081 290191 320132 368138 434522
8953 434522 385227 379390 400359 423542 425944 457921 522445 572070 649677 648847 631873 689901
8941 689901 787505 853407 904328 1100409 1247618 1353072 1576595 1827188 2096478 2493483
8931 2493483 3135804 3922000 4965812 6470074 8361696 10488485 12216203 12857891 12421123
8922 12421123 11381341 10012239 8320323 6784071 5487117 4310073 3412658 2737639
8914 2737639 2186647 1793617 1630691 1472830 1319383 1158560 1018738 928996 872514 770169
8904 770169 703463 638922 575707 555933 602260 623217 508629 428977 365688 353047 354587 403016
8892 403016 371148 372806 284653 249074 309198 303804 324608 306376 281696 262853 231213 217370
8880B17370P3750l6213l7404m916R276J2966m3420q4438P81P7417j8912o5105
8868A01152m2491O1953j6952j13449j4718N2449R1555M9040m6166o7720J3356
8857F8009K4680r456l8449J01770M4732o9286q5394L4347o13m9959q5477O9137
8845D041N6857O5293n0297j06994n50M5654K6902o6434R2436j5782Q040m5418
8833A3748j868N0920L0831K482l6112l4124L9032q529k6987o4340O1535P7859
8821A04447k1458o9023M9243P3714L7664j11876p772O7314k5628o1111o1577L7623
8809A1560O3121q4905k1304J13495j447J5173o5436N763N024l0813p8860k2141
8797i0770N3731O5930J01200r7440M365J0519M078j5713j18179M4713J07748l9918
$$ plain form
8880 217370 291120 254907 217503 212587 221863 234829 191409 106971 107752 185169 166257 101152
8868 101152 58661 120614 103662 -9787 -24505 27944 119499 168539 122373 54653 68009
8857 68009 92689 83233 44784 146554 191286 122000 36606 70953 70340 20381 -65096 4041
8845 4041 60898 126191 75894 -31100 -31650 14004 40906 -25528 66908 51126 59166 13748
8833 13748 11880 62800 93631 96113 60001 25877 64909 56380 29393 -34947 26588 104447
8821 104447 82989 13966 63209 136923 174587 62711 54939 122253 96625 35514 -26063 11560
8809 11560 74681 -10224 -31528 81967 80520 95693 30257 36020 41044 10231 -68629 -90770
8797 -90770 -37039 28891 130091 32651 37016 47535 51613 35900 -82279 -37566 70182 30264
8785C0264l6124k7807K0208K0458n3396l2227M6231N9424o1577l8124Q5374M7665
8773F0369m6476k8835N139M6950J496p9968l7037N5698L3599k3838n3712P9284
8761A2669k1K8526j08773j7191J26932P5610p3671n5413O1554M0254m8842p8042
8749c6408p4082R2971O6516r4228n6985R2683P2966m7938o5585J3836P3345k2054
8737A5037k7919k3693l7848L0790l3509l3280N4086J01546l5479j07397O7832
8726b9834P3556j1816p1330J5550P4390K7487q5975m6629L9828P8279J0484r1709
8714a7719p1009O6799Q0450l6210j24075P176J23778j5798j06344m388O1076J17341
8702H1077j15753q8340L4980J03262J2837j26307L2144N8780M9925l4964j43905
$$ plain form
8785 30264 -5860 -33667 -13459 6999 -46397 -78624 -32393 27031 -34546 -72670 12704 60369
8773 60369 13893 -14942 -9803 37147 38643 -41325 -78362 -22664 10935 -12903 -66615 12669
8761 12669 12648 41174 -67599 -84790 42142 117752 44081 -11332 50222 90476 41634 -36408
8749 -36408 -110490 -17519 48997 -45231 -102216 -9533 63433 15495 -50090 -36254 37091 15037
8737 15037 -12882 -36575 -74423 -43633 -77142 -110422 -56336 45210 9731 -97666 -29834
8726 -29834 43722 31906 -39424 -23874 50516 78003 -7972 -54601 -14773 63506 73990 -17719
8714 -17719 -88728 -21929 58521 22311 -101764 -94588 29190 13392 -92952 -97340 -36264 81077
8702 81077 -34676 -123016 -88036 15226 28063 -98244 -66100 -7320 42605 7641 -136264
8691a36264K6922R3218m0063m4632R5119N9052m1355r4112j1986O7027N055q8907
8679a10926j6120Q4469N2081l2042r818M4211o1018K4062M4336l7859K8596J02108
8667A12080p9045p7684r773Q2048J8246r1873n3052M9538Q2339p9532p6122O3203
8655e9627J22544K6324o6861n2477Q7473q903p5974o8233J8336M0887K3892k3254
8643c5873k9367M4982L6776r098l0618R051M5869p095n9981l8094O7952M5224
8631C9728n7661j9107O6650m3235o0651M3561k025J25262m8197r0131p386K6071
8619b7121K0212j8844m1883l4304J8703O869o0200N2033M260O537j0828O8785
8607a5781M6970o218K9784n5437l3294k1559N1809J6749o0671p7716L4996L6847
$$ plain form
8691 -136264 -109342 -16124 -56187 -100819 -5700 53352 11997 -82115 -94101 -27074 -22019 -110926
8679 -110926 -127046 -42577 9504 -22538 -32356 11855 -49163 -25101 19235 -18624 9972 112080
8667 112080 33035 -44649 -54422 27626 45872 -46001 -99053 -49515 32824 -46708 -122830 -59627
8655 -59627 62917 89241 22380 -30097 57376 48473 -27501 -95734 -77398 -36511 -12619 -35873
8643 -35873 -65240 -20258 16518 7420 -23198 -14147 31722 24627 -35354 -73448 -5496 39728
8631 39728 -17933 -37040 29610 -13625 -74276 -30715 -32740 92522 44325 -45806 -53192 -27121
8619 -27121 -6909 -25753 -67636 -101940 -83237 -76368 -136568 -84535 -80275 -73738 -84566 -15781
8607 -15781 31189 24971 54755 -682 -33976 -55535 -3726 13023 -47648 -125364 -90368 -53521
8595e3521m5303O6073N710p8357M9867J02567j1779l4168P3522n364n0654k8373
8583i780j5900k6105m681Q8111l1044j28199R0213K01299J6875k30401n0975Q72
8571i9715J6928k464O1089P1723j21972k6388J8555L2652P6322o3520j0900M2669
8559e021L4877J0457k7351p9661J3779O1801q325j0309K3k6366k4291R965Q783
8546d1639M2032m4240L1201M6025J6363p2098J838K6625k0156L2258O099n6557
8534c2249m0731K9510M9824o63p3591j0609M5866J8296l1146j251M424o2357N2375
8521e2302k0558L5444M3889j4450j3431K9336R1124k3643j24292k2243J0873Q2472
8509B2219k505l0840Q797K1640p929q722L2268m8823j0730N2647k5655K5515l2750
$$ plain form
8595 -53521 -98824 -32751 -27041 -105398 -55531 47036 35257 1089 74611 69247 18593 -9780
8583 -9780 -25680 -51785 -56466 31645 601 -127598 -37385 163914 180789 -49612 -100587 -99715
8571 -99715 -82787 -85251 -24162 47561 -74411 -100799 -82244 -49592 26730 -36790 -47690 -5021
8559 -5021 29856 40313 12962 -66699 -52920 8881 556 -9753 -9730 -36096 -60387 -50422 -41639
8546 -41639 393 -43847 -12646 33379 49742 -22356 -20518 6107 -14049 18209 24308 -32249
8534 -32249 -72980 -43470 6354 5691 -67900 -78509 -32643 -14347 -45493 -46744 -42320 -104677 -52302
8521 -52302 -72860 -37416 6473 -7977 -21408 7928 99052 75409 -48883 -71126 -60253 22219
8509 22219 19714 -11126 -2329 19311 11382 2660 34928 -13895 -24625 28022 2367 27882 -4868
8496d868k5164o008O9575j8887r8069K88m8185J25581m1346L0172n0854o7944
8484a35709K7119O6991K2057O4807l2861k5422n857k7962M8459p53j1381K7077
8472A6565j5050K0513o247j1375k2091M750J8099j4064l7556m4706J8295L7654
8460c5213M7864k1343k4752P5317n686l4891j4675P1835p55r0589q138J07413
8448F6387M1295K0965m0180j09451L4979J4959L2268j3545M5970J5688j02064
8437G271j3083m0634k208N4083n5922q166L1971J6198m1967n536N6607L6484k6542
8424H556r4522p293J4500K4725K1201l528R6241J894k4631n6019K8560n2498j7273
8411f0087N8614L6928l6368j489r222l8355K0536J6491j466j5874J357M7682N911
$$ plain form
8496 -4868 -30032 -36040 33535 14648 -83421 -83133 -131318 -5737 -47083 -16911 -67765 -135709
8484 -135709 -108590 -41599 -19542 45265 12404 -13018 -18875 -46837 1622 869 -10512 16565
8472 16565 1515 22028 15781 4406 -17685 -12935 5164 -8900 -46456 -91162 -72867 -35213
8460 -35213 12651 -8692 -33444 41873 36187 1296 -13379 58456 57701 -32888 -41026 66387
8448 66387 107682 128647 88467 -20984 13995 28954 61222 47677 93647 109335 7271
8437 7271 -5812 -46446 -48654 5429 -50493 -58659 -26688 -10490 -52457 -57993 -1386 35098 8556
8424 8556 -85966 -93259 -78759 -54034 -32833 -36361 59880 61774 37143 -18876 9684 -42814 -60087
8411 -60087 -1473 35455 -913 -2402 -11624 -49979 -29443 -12952 -14418 -30292 -28935 18747 24658
8398B4658q4831o6632Q0947Q1981k0052q1591R6315m5639k6154k0827J1884Q6820
8386C6879m2249j8308r251Q319O296M9316n4255p9740M2859M4233J3338k6464
8374b9027j8620j7544l7617k1133Q716J07616J6938n8670J2309P1715n2763j3516
8362c1596p7957J0158K8767k283j9329N0596N939o1793n279Q6119J7913k1339
8350b0084M6710l2791r9958K5730O3544p5886J0958l4421J05118L872l1218j8708
8338e7134P734N7590p6159N276P3410o532N3987m0594k287q315p1964j3608k9589
8325a08185J22402n4700j4874j8248N3570N9146L8073n121l1511O648J0959k479
8313E5680n8313j3419p223J6742L4816r7498M8441O0381m0882n7157K660L8435
$$ plain form
8398 24658 -60173 -126805 -45858 36123 16071 -65520 30795 -14844 -40998 -61825 -49941 36879
8386 36879 -5370 -23678 -32929 -24610 -18314 31002 -23253 -102993 -60134 -15901 -2563 -29027
8374 -29027 -47647 -65191 -102808 -123941 -115225 -7609 9329 -49341 -37032 34683 -18080 -31596
8362 -31596 -109553 -99395 -70628 -72911 -92240 -41644 -35705 -97498 -102777 -16658 1255 -20084
8350 -20084 26626 -6165 -106123 -80393 -16849 -92735 -81777 -116198 -11080 -7208 -38426 -57134
8338 -57134 -49400 8190 -67969 -62693 10717 4185 58172 17578 15291 6976 -64988 -78596 -108185
8325 -108185 14217 -40483 -55357 -73605 -20035 39111 77184 72063 40552 47200 58159 55680
8313 55680 -2633 -16052 -23275 -6533 28283 -69215 -20774 39607 -1275 -58432 -55772 -17337
8301a7337m9469m8902Q8107P7848n9343m0657j6685P6027k9747j5887K6399N3530
8289D3884k5796n7400J1175k567m2514M76N0176N627J9855j2467l9010L300m4460
8276h9721K9620N1088k813j9559L785M786N7860J6039L9484j28212r5323R3845
8264c9121j3748K8355n9071M5399M3898j2360O2429k1843n574n8024L5328m3154
8252c7486k9555M3099q5102N6630L0591m0371J7627O0751l3432l8004O161M2888
8240f203j7572k0079N3974j4930M848J6487k7324R525O3548l4077l8623n9812
8228g0238J1299L0407l0639j6842K2362K0118K2869M2535k8700N7020n1968j12966
8216a04743j083J38064J5339m413M666K8173p5421m7868k6988O9871j448M0232
$$ plain form
8301 -17337 -66806 -115708 -27601 50247 -9096 -49753 -66438 9589 -20158 -36045 -9646 43884
8289 43884 18088 -39312 -28137 -30704 -73218 -72742 -22566 -16939 2916 -9551 -48561 -45261 -89721
8276 -89721 -60101 -9013 -11826 -31385 -27600 -22814 35046 51085 90569 -37643 -132966 -39121
8264 -39121 -52869 -24514 -83585 -38186 5712 -6648 55781 33938 28364 -29660 5668 -37486
8252 -37486 -67041 -23942 -109044 -52414 -21823 -62194 -44567 16184 -17248 -55252 -49091 -6203
8240 -6203 -23775 -43854 10120 -4810 38 16525 -10799 -1274 62274 28197 -10426 -70238
8228 -70238 -58939 -28532 -59171 -76013 -53651 -33533 -10664 31871 3171 60191 8223 -104743
8216 -104743 -105826 32238 47577 43164 47830 76003 582 -47286 -74274 -4403 -5851 34381
8204C4381n2337m2989N4889O2621L17k6176N009N3074R4546m2279m8772L17510
8192D09794L71494o40948k26400o4744r962M917k5795M9041L3165M3945l7985
8181i3478o2707k5298J16755M2379k3271j4792K9860L3970L0168m4931O154q143
8169a3334K967o1158o5918P3454j884l2088j9012O5563K1351l4445K6047P9334
8157D0877m1363n7602p187Q8001k7664M043j3289p1833N6687l5057m2191L208
8145a03370J11571K8683k9203j28927J8411P3684R6n9821L4891M5970M8112p2896
8133c2799k390N4207n7708q620J07J5594J1298k8751l2848n3164N0826Q5301K7671
8120B8724K6307r650M730j5661k3962P366J1081K1039p429r101n2963O4534O8879
$$ plain form
8204 34381 -17956 -60945 -6056 56565 56882 30706 35715 88789 183335 141056 92284 409794
8192 409794 781288 140340 -86060 -150804 -160766 -155849 -181644 -132603 -99438 -55493 -93478
8181 -93478 -156185 -181483 -64728 -22349 -45620 -60412 -30552 3418 33586 -11345 -5191 -13334
8169 -13334 -10367 -71525 -137443 -63989 -65873 -97961 -116973 -51410 -30059 -64504 -38457 40877
8157 40877 -486 -58088 -65275 22726 -4938 -895 -14184 -86017 -29330 -64387 -106578 -103370
8145 -103370 8201 36884 7681 -121246 -102835 -29151 -29055 -88876 -53985 -8015 40097 -32799
8133 -32799 -35189 19018 -38690 -47310 -47203 -31609 -20311 -49062 -81910 -135074 -84248 1053 28724
8120 28724 55031 45381 50111 34450 10488 17854 28935 49974 42545 33444 -19519 45015 113894
8107A13894p1921p1223M9561K1609o5951M1109j7353J3899p818k8212j1968M1506
8095G132k268m614M8446J5969r0477P2809N4639p8380q7063l7071L7005j6669
8083h0542O4989j1418J1597l9633P526J916M3082K3589r0947M8857N3542K026
8071C4584p2932p374K9856l3240k993N1523M5675j4160n7443K92M9473K6183k2168
8058B7276k9188n2056N9508N1813k6775r604r9300O4028N3477r5075q468J1338
8046e3026K7584l62K0785O0847m7678N4181L8309q521o1744M8386k049q8440K3296
8033A1568K4803M7037K5626o4649k993K0117m8280p729k4998l3398P8776o0003
8021c4123l0413J10674O2924l2958r0448j9929O8421O1911p3542l3534L5613l8830
$$ plain form
8107 113894 41973 -29250 20311 41920 -24031 17078 -275 13624 5806 -22406 -34374 7132
8095 7132 4864 250 48696 64665 -25812 46997 101636 23256 -63807 -100878 -63873 -80542
8083 -80542 -15553 -26971 -15374 -55007 -47481 -45565 -2483 21106 -69841 -20984 32558 34584
8071 34584 -38348 -45722 -15866 -49106 -52099 -576 45099 30939 -26504 -26212 23261 49444 27276
8058 27276 -1912 -53968 5540 57353 30578 20974 -78326 -14298 39179 -55896 -64364 -53026
8046 -53026 -25442 -25804 -5019 55828 8150 62331 100640 92119 30375 78761 76712 -11728 11568
8033 11568 36371 83408 109034 44385 41392 61509 13229 5500 -19498 -52896 25880 -34123
8021 -34123 -64536 46138 109062 76104 -14344 -34273 34148 96059 22517 -11017 24596 -14234
8009a4234J1907j3026J0967M3855o2927j1541J7446k1690P180M0274q3356J25749
7997E0604N4534p2632j18184J0852R2918L3057k8818n8314j2667M8371L1551q074
7985B3198K3855k2894L5671J5614q0744O2266M7719j0814j4781k0838J9249k9666
7973D7835k6474m3374N7879Q5108n3737r9507P321J38852N3495p0653m6508P4972
7961A25209M1711j41177n7602M6326J18813k4740j01610N6060M8266J9821j53895
7950b2818J434O3644J03290m3764o0177N690M3657n7066j06078j1411O5366Q2316
7938F4083k3227j4621o430L1869K8684k847K1825K3102o8560l1639k8469L8560
7926C2330J05235m4760o9440Q8171M4854l8476o1202n9J9464N6373K0365j1734
$$ plain form
8009 -14234 -2327 -15353 -4386 39469 -23458 -34999 -17553 -39243 -32063 8211 -75145 50604
7997 50604 105138 32506 -85678 -74826 18092 51149 22331 -35983 -48650 -279 31272 23198
7985 23198 47053 24159 59830 75444 -5300 56966 104685 93871 79090 58252 77501 47835
7973 47835 21361 -22013 35866 120974 67237 -32270 -24949 113903 167398 96745 50237 125209
7961 125209 166920 25743 -31859 14467 133280 108540 6930 62990 111256 131077 -22818
7950 -22818 -21384 42260 145550 101786 41609 47299 90956 33890 -72188 -83599 -18233 64083
7938 64083 40856 26235 19805 51674 80358 77511 99336 122438 53878 22239 -6230 32330
7926 32330 137565 92805 23365 111536 156390 117914 56712 56653 76117 132490 152855 141121
7914A41121j1677k8939J0831j6859k1679M4719J578M3238o1866J7843P7312K8720
7902B24342p1297L448p531j0340n7132p845N2754J28409o4552j15154M4823m0827
7890G9098K8402j3138k6333P9102L3685n6192o0936N6217L0238j2416k2336L1126
7878A46517O2718N0305k531j11927k1846N7942j5329J0390j7336j152q56K9126
7866A86021N448m0572N1149l2855p4020N1015M0215j6787m8845L2326L8906n660
7854A86341K4941n8921K381O3686k8174Q08K5528J5708l5200o6008L0896O264
7842A68250O8343L1242j3370m279K5291L8573p3294l8275O6589J5355k5724O225
7830B64926J8359n3105J7869l0583L9714L1640j0275R785M5741K9979L3046n3419
$$ plain form
7914 141121 129444 100505 111336 94477 72798 117517 119095 162333 100467 118310 195622 224342
7902 224342 153045 156493 148962 138622 81490 73645 126399 254808 190256 75102 119925 79098
7890 79098 107500 94362 68029 147131 180816 124624 63688 119905 150143 137727 115391 146517
7878 146517 209235 259540 257009 145082 123236 181178 165849 176239 158903 157751 156895 186021
7866 186021 191469 150897 202046 169191 95171 146186 186401 169614 120769 153095 192001 186341
7854 186341 211282 152361 154742 218428 190254 191062 216590 232298 197098 131090 161986 168250
7842 168250 236593 267835 254465 250186 275477 314050 240756 202481 269070 284425 258701 264926
7830 264926 283285 230180 248049 217466 257180 288820 278545 288330 334071 364050 397096 343677
7818C43677L2725M3723k7747K465Q0552k8623M5222l9164K2507k16765R6380r1869
7806B63083j05478K34135n3850M8846J6052l2605K2919R3979l5276q1131O8975
7795D39649N5269K4828J7486j7177Q8146M9557k1305m6754L2114L3609P8745q2339
7783F51828L2077K5361J0602j371L6421k4143N2928R0665p798j479J6398L1023
7771I12512J8912n829R2965P972k7800l2086J278J07922m960m5664M5202P3760
7759A144184Q7417j1789j3789N4927m6249j9892M0706L8033K988j038L6472M7227
7747A359197K0311l8179J513L4800k0578M9778o337j3039P553K7060k4762q0313
7735A317004n1873P5949Q6147l8582j18884l7624P9788K7738m9969k3935j2082
$$ plain form
7818 343677 376402 420125 392378 394843 475395 446772 491994 452830 475337 258572 354952 263083
7806 263083 157605 391740 337890 386736 402788 370183 393102 487081 451805 370674 439649
7795 439649 494918 519746 537232 520055 608201 657758 636453 589699 621813 655422 734167 651828
7783 651828 683905 709266 719868 718497 754918 730775 783703 874368 866570 865091 881489 912512
7771 912512 931424 925595 1018560 1026532 998732 966646 967924 1075846 1070886 1025222 1070424 1144184
7759 1144184 1231601 1219812 1206023 1260950 1214701 1194809 1235515 1273548 1276536 1275498 1311970 1359197
7747 1359197 1379508 1341329 1342842 1377642 1357064 1406842 1400505 1387466 1395019 1422079 1397317 1317004
7735 1317004 1265131 1341080 1427227 1388645 1269761 1232137 1311925 1339663 1289694 1265759 1253677
7724A253677M5155m9026q4529k6858j1348p412l5635J0527q4907Q8965n5204j03629
7712I39776p803P5480n8599m1659q4088L5673o009n6307L519j0039N1570n7319
7700G84195k4648o4603J14268k6261j09882J7419Q300q9942P986m5904N9166j6009
7688F14085k4182p0382k0103N7001O0395j7255j05446k3177L0392M8173q4454
7677D65047J749R1003M477j36590k9498J6491O1907l7298j21869l2355M0694N8573
7665C82331n370o5443N9356O669j7192q9324J0788K0030L9712n3634P889O628
7653C02440J6853R974p6687L894J2907J2362j33264O837P6205N3072k6421k1799
7641B36373O639K6128l6725n5275l8359L8438J00704m1898k7586M3143n6658j11824
$$ plain form
7724 1253677 1298832 1249806 1165277 1138419 1127071 1119659 1084024 1094551 1009644 1098609 1043405 939776
7712 939776 931973 1007453 948854 907195 823107 858780 852771 796464 799983 789944 841514 784195
7700 784195 759547 694944 809212 782951 673069 690488 698788 608846 616832 570928 630094 614085
7688 614085 589903 519521 499418 556419 616814 599559 494113 470936 501328 549501 465047
7677 465047 466796 557799 562276 425686 396188 412679 474586 437288 315419 283064 323758 382331
7665 382331 376961 311518 370874 377543 360351 271027 281815 301845 341557 287923 295812 302440
7653 302440 319293 329267 252580 256474 269381 281743 148479 155316 231521 284593 258172 236373
7641 236373 243012 269140 232415 177140 138781 177219 277923 236025 208439 251582 194924 83100
7629H3100P891P9205J9738K771p0657Q055n745N0949J5345o4228K8997Q3232k8006
7616B10647n8604k343N8783j0821o0374m6462O2568K1013j4328k9872L6721O0755
7604B27683j4339n8342o6584P1346Q983p5816k3189P0473J2341q1281K9960K4783
7592A26018N3587j3935R597m143k5214o6217n5739L2701M1459L46K2647p2285
7580D8822k720O7881K4058m7265n0478Q635M0685k4097q0190P5896j0686j2498
7568C8043q697K0731k5162J05645k0506l40l2918M3327k2416J7360L9089n7825
7556I6331K564l8135k918K8199k3251P265j00638o8913Q4104K4807m316p3766
7544f8667J05749M4211r7323J0995N6576K4154J7717j0015o9708M1833M3221l880
$$ plain form
7629 83100 90991 170196 189934 192705 122048 130103 124358 175307 190652 126424 155421 238653 210647
7616 210647 152043 149700 208483 197662 137288 90826 153394 174407 160079 130207 166928 227683
7604 227683 213344 155002 88418 159764 168747 92931 69742 140215 152556 71275 101235 126018
7592 126018 179605 165670 175267 171124 145910 79693 23954 56655 98114 98460 121107 48822
7580 48822 46102 113983 138041 90776 40298 48933 89618 65521 -14669 61227 50541 38043
7568 38043 29346 50077 24915 130560 110054 109714 76796 120123 97707 115067 154156 96331
7556 96331 98895 60760 57842 86041 62790 70055 -30583 -99496 -15392 9415 5099 -68667
7544 -68667 37082 81293 -16030 -5035 51541 75695 93412 83397 13689 55522 98743 94863
7532I4863k8820k048j6753l4062P370O7394q6743m2946K0462L2739J10223k148
7520A19531l2447n9128m3915N6175O0778q1492O3999R4144o1184q5032j0523J01177
7508A22083M375k1948q3119j7116R9978j2412n1816n8623N8390M4859o9465k860
7496A2326K7273M4434N085p214k8750m62J1537R804l8237j4819O7276k7450q22
7483E9981K9177J474m8534M5592m328n198O130k5716M1457J9960K6003k1174j39334
7470a4510n7146P6838K0605n7730l0036P9049P7569o7135l5315L4726L4808m4495
7458A7228j9242L612J2405N6141k4635R418N346j9287k3158J0842q5650J3333
7446d3647L5631o2885k8502J00091K7820l8413l0723J1645N1169q5336J0886j0143
$$ plain form
7532 94863 66043 63995 47242 13180 20550 87944 1201 -41745 -21283 11456 121679 119531
7520 119531 87084 27956 -15959 40216 100994 19502 83501 177645 116461 31429 20906 122083
7508 122083 126458 104510 21391 4275 104253 91841 40025 -18598 39792 84651 15186 12326
7496 12326 39599 84033 89118 81904 53154 52692 64229 74033 35796 20977 88253 60803 59981
7483 59981 89158 90632 42098 87690 83362 78164 84294 58578 100035 119995 145998 124824 -14510
7470 -14510 -71656 5182 25787 -31943 -61979 17070 94639 27504 -7811 26915 61723 17228
7458 17228 -2014 1598 14003 70144 45509 54927 60273 40986 17828 28670 -56980 -43647
7446 -43647 -8016 -70901 -99403 688 28508 -9905 -40628 -28983 22186 -63150 -52264 -62407
7434f2407N1156N4935k7118r1575O5964O0748r2296l4679j2660J599K6942k1921
7422h1312K9409J01134J9133o9055k8925j6137M1276N7918j484p1031k2699L4257
7410g516K7220j7114K0527n567k8992m4251Q1846M6258l9628n570P6235n6123
7398D7325p540n00j2516J9076n662o495l0609K9131L067J0479j7962k9001j7378
7385a8585K5173R278K549Q3076o3658n4251j9344N5484K9915l0889o0579K0456
7373b1375M8409N0205Q323j11425O2626r939j7544k2814O3044k7016k1111k8975
7361b7592j767m088p778J2635N2054m3741n04J5868K1707m5130M1415L7580j1638
7348C9021j29411O3157P0823j4758j3287k0660p039N8860j7474j3571m9402j7154
$$ plain form
7434 -62407 -11251 43684 16566 -75009 -9045 51703 -40593 -75272 -87932 -86333 -59391 -81312
7422 -81312 -51903 49231 68364 -691 -29616 -45753 -4477 53441 51957 -19074 -41773 -7516
7410 -7516 19704 2590 23117 17550 -11442 -55693 26153 72411 32783 27213 103448 47325
7398 47325 39785 39285 26769 45845 40183 33688 3079 32210 35277 45756 27794 -1207 -18585
7385 -18585 6588 15866 18415 101491 37833 -16418 -35762 19722 49637 18748 -41831 -21375
7373 -21375 27034 77239 85562 -25863 36763 26824 9280 -13534 49510 22494 1383 -27592
7361 -27592 -29359 -33447 -41225 -28590 23464 -20277 -20781 -4913 16794 -28336 13079 50659 39021
7348 39021 -90390 -27233 43590 28832 15545 -5115 -12154 46706 29232 15661 -33741 -50895
7336e0895o003P1694K7964j881k4843m2377k7827P0443R0298q5034K5068N1494
7324I8101K7228q1101l2224l7701J9227N0406k4523n3107L6522P970j2798l5888
7312c7888M0981P4999K8819j26092n128O0856p3823p9004R8445N2366N3252o4244
7300B3539j4128k1944O2087j3565l1590M8329N7966m4143o0187O1622M13K7208
7288I5607m9382l610o6698L6653o617r5066K0467Q5006K1145o4099j7981m5613
7276i0188L2383Q7582l2871k4195O1224N8432m3560o8575R828K1459p0395q033
7264f6909Q169N8801O1284o7332j5495K6606R9429o39l8796j003O4277o5352q7234
7251b4194l9335M5131L0695l6812k703M5666R808j763n9865o2735Q7907M5944
$$ plain form
7336 -50895 -56898 14796 42760 40879 16036 -26341 -54168 16275 106573 21539 46607 98101
7324 98101 125329 44228 12004 -25697 -6470 43936 19413 -33694 2828 10798 -2000 -37888
7312 -37888 3093 78092 106911 -19181 -24309 36547 -37276 -116280 -17835 34531 87783 23539
7300 23539 9411 -12533 49554 35989 4399 52728 110694 66551 6364 67986 68399 95607
7288 95607 46225 42615 -24083 12570 5953 -89113 -68646 16360 37505 -26594 -44575 -90188
7276 -90188 -57805 29777 -3094 -27289 33935 92367 48807 -19768 -9940 11519 -58876 -66909
7264 -66909 -58740 61 61345 -5987 -21482 5124 104553 103914 65118 64115 128392 63040 -24194
7251 -24194 -63529 -18398 12297 -24515 -27218 18448 28256 26493 -33372 -96107 -8200 37744
7239C7744m2092M430l8043L0532J9131j3590m771m0064K1686l8873J3588M2219
7227h103J805p5952L5517M5533N7784J4795r0229j1066J6667N0136L9367o0278
7215A5976K7151R2122l7603n9361K0400L1839p8708K1255N3514J2688l144p7771
7203A8358J1277q6700r158K2442n1436N8067N8671N4949J1032o4113j2984r2481
7191h2076M4066N2307j2982p451N9774j8215l9908J9052Q0390l8480l6274K9179
7179D9382j9121n605j0897l0996m3556M1254L9250O8315o1129m8731K3549m4536
7167d2821J4868J3462K600n8750O1067J8825j6494N7849J0405j5609K3193l34
7155F8261j7154j7468j0803r85K4317n5322k3395M5491j8537L9779L4472O5512
$$ plain form
7239 37744 -4348 82 -37961 -7429 11702 -1888 -6659 -46723 -25037 -63910 -50322 -8103
7227 -8103 -6298 -82250 -46733 -1200 56584 71379 -18850 -29916 -13249 36887 76254 15976
7215 15976 43127 135249 97646 38285 58685 90524 11816 33071 86585 99273 96129 18358
7203 18358 29635 -57065 -66223 -43781 -95217 -37150 21521 76470 87502 23389 10405 -82076
7191 -82076 -38010 14297 1315 -6136 53638 35423 -4485 14567 94957 56477 20203 49382
7179 49382 30261 24656 13759 -17237 -60793 -19539 19711 88026 26897 -21834 1715 -42821
7167 -42821 -27953 -14491 -11891 -70641 -9574 9251 -7243 50606 61011 45402 68595 68261
7155 68261 51107 33639 22836 21851 46168 -9154 -32549 12942 -5595 34184 68656 134168
7143A34168J3795j8445j7923J8348M9454J27485r019k1269M4746j1520j12344
7132A97476L8387p360k8523m5336K0849p5082l8078K3838j76K1347k3313l754
7120H0275r0943K0973J2916l0822K9549j7223n7827j121N6913O7021r883N582
7108F5410l815k7984N3757n0042n1126L6114M681m0108j8347P282N7872J6786
7096E0480m3400l8804L4520K7282p2203k8636J4689N1172n2152O435Q1053J95
7084C0631k4089K520o442p845l3301L1746M8936O143k1304O5083j1211o4719L5544
7071E1692K4411r5672n8463R8241L8956j2126k4373p6855L4439K6822q385r816
7059a1129N567O9576j0663r3713K9937N3519Q822m6217o2557R5979L4463k8979
$$ plain form
7143 134168 147963 129518 111595 129943 179397 306882 297863 276594 321340 309820 197476
7132 197476 235863 228503 199980 154644 175493 100411 62333 86171 85995 107342 84029 80275
7120 80275 -10668 10305 23221 -7601 21948 4725 -53102 -54223 2690 69711 59828 65410
7108 65410 61595 33611 87368 37326 -13800 22314 26995 -13113 -31460 -24178 33694 50480
7096 50480 7080 -31724 2796 30078 -42125 -70761 -56072 -4900 -57052 -50617 30436 30631
7084 30631 6542 9062 2620 -5225 -38526 -6780 42156 48299 26995 92078 80867 16148 51692
7071 51692 76103 -19569 -78032 20209 59165 47039 22666 -54189 -19750 7072 -1313 -11129
7059 -11129 -5562 64014 53351 -40362 -10425 43094 51916 5699 -56858 39121 73584 44605
7047D4605k4149m122N8212L9280n0949L6355k8607q536J1790j31949N3509M1233
7035C6672k1489L098k4644P5750M5658o4717n4750m8823M2621M0733m7496j1756
7023b9143L3301k2453m9189N0072J4906j672K3487Q100J1194K5504l7608k8630
7011b131J0119j3253O3978n9022j6203L4264k300r542m8799k4518R155L7859k8072
6998d8465P343Q1919J6054q2817o472L8542j143K9602n0703o6219M5224P6085
6986C8950R666j7502j305J9995L6707p585o4987L3833M304p1272j8297Q875P0061
6973D1443j8711k3489O936O8046k7714j9709m1031J4438Q4300o559r0415M4876
6961C2411M713K0519L1632r5845k7104M5990j1764o08L7820J2225j8401k4349
$$ plain form
7047 44605 20456 16334 74546 113826 62877 99232 70625 62089 73879 -58070 -4561 36672
7035 36672 15183 18281 -6363 69387 115045 50328 -4422 -53245 -10624 30109 -17387 -29143
7023 -29143 4158 -18295 -67484 -17412 -2506 -4178 19309 27409 38603 64107 26499 -2131
7011 -2131 7988 -5265 58713 -309 -16512 17752 15452 5910 -42889 -67407 -58252 -20393 -48465
6998 -48465 -41122 40797 56851 -25966 -32438 6104 4961 34563 -16140 -82359 -37135 38950
6986 38950 48616 31114 29809 49804 86511 78926 13939 47772 52076 -19196 -37493 -28618 41443
6973 41443 22732 -757 6179 74225 46511 26802 -14229 209 84509 77950 -12465 32411
6961 32411 37124 57643 89275 -6570 -33674 12316 552 -56 37764 49989 31588 7239
6949G239N0118J3256k98O483l1307L0262P2289q5254l7750n9027L3245O8582k1760
6936D6078l1477J4922J2506l3987J5386L0742K4596J8230m8391m8327J5921L164
6924A9363o1120K6654J5887l5175m17K890K5115J9498L5439l8166n8984P1092
6912B2076L3033j258N8634N9562p7794j092J7080n5714N5418J44474M4450n5378
6900B43491N9952O8846N5844N7444J32634n2603r8224n1153n0608r164o933n3225
6888B96301n9824j6662R051o4045r7284L6121O9750m1219l4816K322q752k5900
6876F5043j09913L3564N8168O1489k9360k276m4376K3043M9006k7653m7381K2055
6864E1409M1043m2026j696j765N2692M4344n4074j3265l9511n3192l851m0618
$$ plain form
6949 7239 57357 70613 70315 76798 45491 75753 148042 62788 25038 -33989 -744 67838 46078
6936 46078 14601 29523 42029 8042 23428 54170 78766 96996 48605 278 16199 19363
6924 19363 -41757 -15103 784 -34391 -34808 -31918 -6803 12695 48134 9968 -49016 22076
6912 22076 55109 53851 112485 172047 94253 93161 110241 54527 109945 254419 298869 243491
6900 243491 303443 372289 428133 485577 618211 565608 467384 416231 365623 356459 349526 296301
6888 296301 236477 219815 228866 164821 67537 103658 173408 132189 97373 99695 90943 65043
6876 65043 -44870 -11306 46862 108351 78991 76715 32339 55382 104388 76735 29354 51409
6864 51409 92452 50426 48730 46965 99657 144001 89927 76662 37151 -16041 -19892 -60510
6852f0510M4979K7239P472k3937M9300J6993n6048K2908r051K4450K3152j4846
6840E2101l5001K2401M7757k9488q1943k98N1729P049j7327J3238K8471J3643
6828G2332L8326r862r4464N084M7465l6571l6228K0056K3400J1368l3597l9065
6816c1756N2397L2350p1235m4741O1810N8885l5440q3760L9422N5105K8753n106
6804E6684l3483K4271O2873p4549L0593N0532k6619K9584p9876m5459N1798K4866
6792G1215L0433p1663l4617m2343M6455m375N0564j2069q991J7928k1671M3162
6780F4028o202J2370J6428m150n6088K5579J7203n7031Q4494m1515m4203J9796
6768C0709P7927K1299j29421J4326k5027M6299J8493N5793m5779q771j4285k8863
$$ plain form
6852 -60510 -15531 11708 19180 -4757 44543 61536 5488 28396 19345 43795 66947 52101
6840 52101 17100 39501 87258 57770 -24173 -24471 27258 34307 16980 30218 58689 72332
6828 72332 110658 100796 6332 11416 58881 22310 -13918 6138 29538 40906 7309 -31756
6816 -31756 20641 52991 -18244 -62985 -1175 57710 22270 -61490 -22068 33037 61790 56684
6804 56684 23201 47472 110345 35796 66389 116921 90302 119886 40010 -5449 46349 71215
6792 71215 101648 29985 -4632 -46975 -520 -4895 45669 33600 24609 42537 20866 64028
6780 64028 57826 70196 86624 82474 26386 51965 69168 12137 96631 55116 10913 30709
6768 30709 108636 129935 514 14840 -10187 36112 54605 110398 64619 55848 41563 12700
6756A2700J1450j3091Q8949N3267k110j0191j11206n1313M152J2056K986M011
6744A660J5874Q445r678L2376k0839m7152L8017j5028P6869k4852k8894j393k0802
6731D603k3239N4414J2906K4810m943q7396j8335N0076P8283n8292p6160O2568
6719A9295P1650k856K4284k4391k6527k7958L0441k270K7637j6091l7687k2037
6707A3490J7719l6846m0760N4121K5625k2646o1040J7970P6738J01946j9768p285
6695A19264N699r2809N8987J9545l2286l9039j2639n635J134J6894N7971k9439
6683F7647l3665m0044N9893J4439k9874j6742J3825J0765m7617L7733O2224q642
6671H9942m1093P687j2748M2139J0625k7904l2316J9881p935J8438k3618K0314
$$ plain form
6756 12700 24150 11059 100008 153275 151165 140974 29768 -21545 -17393 -5337 -2351 1660
6744 1660 17534 25979 16301 48677 27838 -19314 18703 3675 80544 55692 26798 25405 4603
6731 4603 -18636 35778 48684 73494 68551 -18845 -37180 12896 91179 32887 -43273 19295
6719 19295 90945 88089 112373 87982 61455 33497 63938 61668 89305 73214 35527 13490
6707 13490 31209 -5637 -46397 7724 33349 10703 -50337 -32367 44371 146317 126549 119264
6695 119264 124963 32154 91141 110686 78400 39361 26722 21087 22221 39115 97086 67647
6683 67647 33982 -6062 53831 68270 38396 21654 35479 46244 -1373 36360 98584 89942
6671 89942 48849 56536 43788 85927 96552 68648 36332 56213 48278 66716 43098 63412
6659F3412k6091l9325n0154O7387R4387K2091k6767n2180k3441L721M8745k3863
6647E7922j0827M8700m334j5221m942P4574j324l7815k3178n9940N7266M5008
6635A25889m8504k2253N2370O3649m770P937j7144l4711J8996j758n3849j5347
6623G0505L5194q259m491n5228Q7952N8809o6172o4738k2119J2455O097L4540
6611H4545L0700k620q6498m1131M1287N6696L3547K8237r7896K6219O3748q9489
6599D7345J5561L5435J9006L8360r3412k8512J12260K6133o6963l1438P7286O716
6587A57777q691l1472m863J7610j8878M4409k1795N2292J2645m214j8424l6512
6575A39884J7438m27j3870o5524l9130P7628L8666o838L874N2809o6949J0129
$$ plain form
6659 63412 37321 -2004 -52158 15229 109616 131707 104940 52760 29319 33040 81785 57922
6647 57922 47095 95795 91461 76240 71298 145872 144548 106733 83555 23615 80881 125889
6635 125889 77385 55132 107502 171151 166381 174318 157174 122463 141459 139701 85852 70505
6623 70505 105699 97440 92949 37721 125673 184482 118310 53572 31453 43908 50005 84545
6611 84545 115245 112625 26127 -15004 26283 82979 116526 144763 46867 73086 136834 47345
6599 47345 62906 98341 117347 155707 62295 33783 146043 172176 105213 73775 151061 157777
6587 157777 149086 117614 112751 130361 111483 155892 134097 186389 199034 194820 176396 139884
6575 139884 157322 156895 143025 77501 38371 115999 154665 147827 151701 204510 137561 147690
6563A47690l579O1770N0865j7004k2989j3164R1159l1334m14J7915J6838n8416
6551B39337L6319N0057J2125l1215k515m3237M7699J22760J36843J14063K0206
6540G02442J53260J89691M4499n3690N781K4542j70365j14650j18236j06647j26612
6529D30015l8703l9909p043k6324j5749N3422P523l3338o1707N373N0965P764
6517C32289K47m3606r3789j11315N2828k5058n571N63M3380j0048L0657O4868
6505B35445L0822M470o3768K84J3009O8727o5499O7858m5807q1168k7761K0351
6493A56963m052J0108p304L124J1843O908J8348L6221J3592Q531Q760j9109J8587
6480B62520J2141k9128K9712j09510L0092O8079l069J2206K810N689K9928m2974
$$ plain form
6563 147690 144111 205881 256746 239742 216753 203589 294748 263414 263000 280915 297753 239337
6551 239337 275656 325713 337838 306623 304108 260871 308570 431330 568173 682236 702442
6540 702442 855702 1045393 1089892 1036202 1041983 1066525 896160 781510 663274 556627 430015
6529 430015 391312 351403 344360 318036 302287 355709 363232 329894 268187 273560 324525 332289
6517 332289 332536 288930 195141 83826 136654 111596 106025 106588 149968 139920 170577 235445
6505 235445 266267 270737 206969 207253 220262 288989 223490 291348 245541 164373 136612 156963
6493 156963 152911 163019 155715 158839 170682 177590 195938 232159 245751 254282 263042 243933 262520
6480 262520 274661 245533 275245 165735 195827 263906 260837 273043 275853 281542 311470 268496
6468B68496q196J3174K972q203J5753k1044J8573p1040n3289P8935m140l7144
6456A94847m3849M7985J4933P3139j2474j163l8070M7850L3301k6556J3657n345
6444B98255N7889p403l4706j0490k1332l8282n2876J9281K6202m1427l464l250
6432A88397k893J2155M5428n3849p863Q2387M1401j3067M3658m8624N545n4032
6420B38643L369J31463O6027n317R063l3630M982O6558k3890k1758N1570Q1238
6408E68318n4477j422k9522J13660l817n0841J7457m3968J587J2830n1804m0030
6396D37971j7608k7661k7358J5758R8936L4023j43485j4251R462R2111L5851Q433
6384E02182o8167j3127P7791l4133j1507L8710j2351J1693j1854j9870J4199J9795
$$ plain form
6468 268496 260300 273474 276446 268243 283996 262952 281525 210485 157196 236131 231991 194847
6456 194847 150998 198983 213916 287055 274581 273418 235348 283198 316499 289943 303600 298255
6444 298255 356144 348741 314035 303545 282213 243931 191055 210336 236538 195111 191647 188397
6432 188397 185504 197659 243087 189238 181375 263762 305163 292096 335754 287130 292675 238643
6420 238643 242012 373475 439502 434185 443248 409618 414600 481158 457268 435510 487080 568318
6408 568318 513841 512419 482897 596557 592740 541899 559356 515388 516975 529805 478001 437971
6396 437971 420363 392702 365344 381102 480038 514061 370576 356325 365787 457898 493749 502182
6384 502182 434015 420888 498679 464546 453039 491749 479398 491091 479237 459367 473566 493361
6372D93361m8496o1812K3950P0576m8412j5340k1077Q0385N7665k875l8701j5597
6360D73627N4157J5382l9422M8429P8033k45K4633m9060R2526K0377o1027r589
6348F47821J25036J32459j6867J5793J88986P2142k2080j9743L578L7604N6879
6337A221608j1115P0400J27886J10026J21665N9770Q2606J44171J1114j36127
6327A802004j63850m6635n2063n3411j73168o6354L3739j6123p1300j5857P5782
6316A252764R9613n2364j3865K4397Q4324P3831Q696M2610J22146J34344J11459
6305A887955J49401K10786K69854K86040K96300M40691N66601K35934o3216j67911
6295D112435k05534j94928l31376m24423k46850j15517k03534j96250n2101l2782
$$ plain form
6372 493361 444865 383053 407003 477579 429167 413827 392750 473135 530800 527925 489224 473627
6360 473627 527784 543166 503744 552173 630206 629961 654594 605534 698060 718437 657410 647821
6348 647821 772857 905316 888449 904242 1093228 1165370 1143290 1123547 1127125 1164729 1221608
6337 1221608 1210493 1280893 1408779 1518805 1640470 1700240 1782846 1927017 1938131 1802004
6327 1802004 1638154 1591519 1539456 1486045 1312877 1246523 1280262 1264139 1192839 1176982 1252764
6316 1252764 1352377 1300013 1286148 1310545 1394869 1468700 1477396 1520006 1642152 1776496 1887955
6305 1887955 2037356 2248142 2517996 2804036 3100336 3541027 4107628 4343562 4280346 4112435
6295 4112435 3906901 3711973 3380597 2956174 2709324 2593807 2390273 2194023 2141922 2109140
6285B109140J0730J279q0531K084R5143M6424J01562M5204J21660J01967J37771
6274B692433K17085K02729K86905J79174K04279L43471N52389M49744J59243n864
6264E281588q341q8573j95434l29732l10547j99137k28945j62617j58849m7854
6254C551559n1103q0695j09581N1768L9868l642j506K5345P7580N7981o1988N7841
6242C553427J97021J64549P7076R8094K14258J97626K50893K63922K06149K22502
6232E445517J77882N1403k7831P5862N0379L4729Q0182J81435K11407K57959K18209
6221F757133K60123L11450L95718L59080K79905M51554N22745M71006N31055P34686
6211A1074455R55653J071194J202782J379421J675684K129567K545074K897589
$$ plain form
6285 2109140 2119870 2121149 2040618 2042702 2137845 2184269 2285831 2331035 2452695 2554662 2692433
6274 2692433 2909518 3112247 3399152 3578326 3782605 4126076 4678465 5128209 5287452 5281588
6264 5281588 5273247 5184674 4989240 4659508 4348961 4149824 3920879 3758262 3599413 3551559
6254 3551559 3500456 3419761 3310180 3361948 3401816 3398174 3396668 3422013 3499593 3557574 3495586 3553427
6242 3553427 3750448 3914997 3992073 4090167 4304425 4502051 4752944 5016866 5223015 5445517
6232 5445517 5623399 5674802 5646971 5722833 5773212 5807941 5888123 6069558 6280965 6538924 6757133
6221 6757133 7017256 7328706 7724424 8083504 8363409 8814963 9337708 9808714 10339769 11074455
6211 11074455 12030108 13101302 14304084 15683505 17359189 19488756 22033830 24931419
6203B4931419L371228M336845N466687P222004R824374J3539226J7891813K2472602
6195A09056198K6411284K6777617J8667592M182025p202587j3354473j8130526
6188A46407130k1009666k0704142j8658177j6067263j3358930j0427450p604630
6181C8576872n437068m058961l431985l036509k607431k076824j563979j396949
6173A4967166j301808j211398p76689n86731o29137n89159n07697m20928n35146
6164H408473m34026m07335l11814k97512l55813l21710k82949j77184j55175k31667
6154E433288k37687j82219j22641k69253j81862q0093j30464j00704j87034r6148
6144C845183J8732j83904j14159o6872p0528m7136j04684j01134r9701q0710j65335
$$ plain form
6203 24931419 28302647 32639492 38106179 45328183 55152557 68691783 86583596 109056198
6195 109056198 135467482 162245099 180912691 185094716 177892129 164537656 146407130
6188 146407130 125397464 104693322 86035145 69967882 56608952 46181502 38576872
6181 38576872 33139804 29080843 25648858 22612349 20004918 17928094 16364115 14967166
6173 14967166 13665358 12453960 11677271 11090540 10461403 9872244 9364547 8943619 8408473
6164 8408473 7974447 7567112 7255298 6957786 6601973 6280263 5997314 5820130 5664955 5433288
6154 5433288 5195601 5013382 4890741 4621488 4439626 4359533 4229069 4128365 3941331 3845183
6144 3845183 3863915 3680011 3565852 3498980 3428452 3381316 3276632 3175498 3075797 2995087 2829752
6133B829752j84501j34400r3349r2648j39554j32322p8497k8347k2060m8837j1550
6122A863687O6185m8602j34104n2333j6354M3482o5029j5203P4580m0735q6012
6111A589562r0520j12660J9719j2742j8044r325J9339k2677n7611J2408n6555
6100A260894n0256j2880p7869q6687N5846J5775j5046m9411l2554L9995l9954
6089A007853j4017k5007Q1529M3675M8533o812p529M0222o295m5795o5400M331
6077A055288N3910j18695k9062j9292j11540j0389K8428J3689J1383N5924k0847
6066I08797q0591l2019l7357j1173P651q2668n5932r271L347M0882Q7821K7319
6054G66806K2097k7484l4556o2913Q857K7590n4078m9454r14O422J05143o0049
$$ plain form
6133 2829752 2645251 2510851 2417502 2324854 2185300 2052978 1974481 1946134 1924074 1875237 1863687
6122 1863687 1929872 1881270 1747166 1694833 1678479 1721961 1656932 1641729 1716309 1675574 1589562
6111 1589562 1499042 1386382 1406101 1393359 1375315 1365990 1385329 1362652 1305041 1317449 1260894
6100 1260894 1210638 1197758 1119889 1033202 1089048 1104823 1089777 1040366 1007812 1047807 1007853
6089 1007853 993836 968829 1050358 1094033 1142566 1135754 1128225 1168447 1162152 1116357 1050957 1055288
6077 1055288 1109198 990503 961441 942149 830609 820220 848648 862337 873720 929644 908797
6066 908797 828206 796187 758830 747657 755308 672640 616708 607437 610784 651666 739487 766806
6054 766806 788903 761419 726863 663950 672807 700397 646319 596865 595951 602373 707516 647467
6042F47467r2664M4397J7007n859O5504j3000K9585o7907l5854M8572J8473N4268
6030G09989M026q6818K804L692K3464R0971O6481L2616k5780n8030N1281J94468
6018A009164J12740l9559n8455J7602J5169J1184m0558O0227L7955l0774j20000
6007I74695L7618J69722n3597j08279m3534M4104J17323m995m0410o2545l5J1552
5995A041619k3699l1933L1205J41559J0717J683L1035R622M1768q8327n6226O13
5983A109636O4666J4693k5464M2513N0164O7174p7735j00563P2937J00775j0536
5972A308260k8751K9326O6738n8015k9125O0077O5971l7189J2512J33312J51274
5961A674390K7414k4084p1072j0658J45900O2910J725n4558L2340L8212J9628
$$ plain form
6042 647467 554803 599200 616207 610348 675852 662852 692437 624530 588676 637248 655721 709989
6030 709989 714015 627197 630001 633693 657157 748128 814609 847225 821445 763415 814696 1009164
6018 1009164 1121904 1082345 1023890 1041492 1056661 1067845 1027287 1087514 1125469 1094695 974695
6007 974695 1012313 1182035 1128438 1020159 976625 1020729 1138052 1133057 1092647 1030102 1030067 1041619
5995 1041619 1017920 985987 1017192 1158751 1169468 1171151 1202186 1211808 1253576 1165249 1109023 1109636
5983 1109636 1174302 1188995 1163531 1206044 1256208 1323382 1245647 1145084 1218021 1318796 1308260
5972 1308260 1279509 1308835 1375573 1317558 1288433 1348510 1414481 1377292 1389804 1523116 1674390
5961 1674390 1701804 1677720 1606648 1595990 1741890 1804800 1806525 1751967 1784307 1822519 1842147
5950A842147K575O4063N9649j7551j12334L9302R8430Q1685q0224j17562R3521
5939A953701J46011L7945J1703J3824J20103P5101O9581l708J26533O5668L6468
5928B652930O8628O4577J67483Q3243N8224M4046J70929J76467Q0725m7343Q9549
5917C609458J42754m5248p0395r806O3906J36835N1006Q4276J39458J03701J95311
5906D401256J13646Q4821J10959J43763Q3751J01025L21176K44747J95173J82320
5896E982637K38991K67689K71663J83477R9230K22588K52187L62925L79699N00063
5886H761149M64336L83956L66039N46219O41348M85653N66130O35281P96679J004864
5876A4651654J078122J297203J541246J820510K129352K418737K989444L651230
$$ plain form
5950 1842147 1844722 1908785 1968434 1950883 1838549 1877851 1976281 2057966 1977742 1860180 1953701
5939 1953701 2099712 2137657 2149360 2163184 2283287 2358388 2427969 2424261 2550794 2616462 2652930
5928 2652930 2721558 2786135 2953618 3036861 3095085 3139131 3310060 3486527 3567252 3519909 3609458
5917 3609458 3752212 3706964 3636569 3626763 3690669 3827504 3878510 3962786 4102244 4205945 4401256
5906 4401256 4514902 4599723 4710682 4854445 4938196 5039221 5360397 5605144 5800317 5982637
5896 5982637 6221628 6489317 6760980 6944457 7043687 7266275 7518462 7881387 8261086 8761149
5886 8761149 9225485 9609441 9975480 10521699 11163047 11648700 12214830 12850111 13646790 14651654
5876 14651654 15729776 17026979 18568225 20388735 22518087 24936824 27926268 31577498
5868C1577498M467043N232709O528227P976504J0773708J4615423K0238947K6799649
5860A28209708L4023057M0218960M0777963K5569128R00028j5630613k2998919
5853B31069312k9104246l1838252k9640603k6102272k1715829j7870497j3706594
5846F1091019r811067o761571n058167m274532m096213l530039k923496k118197
5838B2517737j842331j799378j454084j166522r50286q44753q36709p11222o36016
5829A2276436o72825n72987m72193m85821m02841m22007m26748l29924k41035
5820H250055l41033l04533k85379l16899k38858k59956j92391j07386j62749k37594
5810E803277k08264j37474j38708j33269j48833j86458k14108n0549p2775r3757
$$ plain form
5868 31577498 36044541 41277250 47805477 55781981 66555689 81171112 101410059 128209708
5860 128209708 162232765 202451725 243229688 268798816 269698844 254068231 231069312
5853 231069312 201965066 170126814 140486211 114383939 92668110 74797613 61091019
5846 61091019 51279952 44518381 39460214 35185682 31089469 27559430 24635934 22517737
5838 22517737 20675406 18876028 17421944 16255422 15305136 14460383 13623674 12912452 12276436
5829 12276436 11603611 11030624 10558431 10072610 9669769 9247762 8821014 8491090 8250055
5820 8250055 7909022 7604489 7319110 7002211 6763353 6503397 6311006 6203620 6040871 5803277
5810 5803277 5595013 5457539 5318831 5185562 5036729 4850271 4636163 4585614 4512839 4419082
5800D419082j68826j08838j07654k12179k56536j47012q5781r7303j47374j06878
5790B980701k9972K9043m97j06744J2974n3083m3791m8970J4016P1886M760o3300
5778B767023n9409k3950L0998K1446l1043M3985K1222O0414P2739O6048J19935
5767C089408J81341J92142L16684L13271L94777N58470P10153R85944J478082
5758H220272J870168K391145K864062K711848J267175n10079j272388j722942
5750A5819261k053867k066848k020550j685353j352016j080371q41292o62405
5742D056559l93386l89718l62714k95909k76069j45888q4878k03068l1813N463
5732A878579l668j55535j58137r5776q4596m4111m063n9324p2645p4940r3639
$$ plain form
5800 4419082 4250256 4141418 4033764 3821585 3565049 3418037 3332256 3234953 3087579 2980701
5790 2980701 2950729 2979772 2979275 2872531 2885505 2832422 2788631 2739661 2753677 2825563 2830323 2767023
5778 2767023 2707614 2683664 2714662 2736108 2705065 2749050 2770272 2830686 2903425 2969473 3089408
5767 3089408 3270749 3462891 3779575 4092846 4487623 5046093 5756246 6742190 8220272
5758 8220272 10090440 12481585 15345647 18057495 19324670 18814591 17542203 15819261
5750 15819261 13765394 11698546 9677996 7992643 6640627 5560256 4718964 4056559
5742 4056559 3663173 3273455 2910741 2614832 2338763 2192875 2107997 1904929 1873116 1878579
5732 1878579 1874911 1719376 1561239 1465463 1380867 1336756 1332693 1273369 1200724 1125784 1032145
5721A032145p0609J3912k9579k0424l7959o6985k4990P21q7715N5787L104q1568
5709F85840m8879q273L248p4590P3800j5381j2772K4251q548l0154L9528m3546
5697E84524m1954j874k8008Q1903j0032p2713l2372K5315q448K8236q7207K275
5685D39645N8451R287j5463M2104N5469o866l1489p8541k2647J6510j4829j0170
5673D41461m3294j3722m9651j9006n9786P488M2260j8793J6872p9496p279k0743
5661A96311L351n130k759M1312m3584m4131L8279P4930p790m3376K2665l4028
5649A96050P527m859j1552m2646J2807m617o36M2537n0943m7379M0340J1838o8992
5636G9475l017k703M506L6151P0408R279q4734k9384j8324M4754n505r570J5481
$$ plain form
5721 1032145 961536 975448 945869 925445 887486 820501 795511 796232 708517 764304 767408 685840
5709 685840 636961 628688 631936 557346 631146 615765 602993 627244 618696 588542 628070 584524
5697 584524 542570 540696 512688 594591 584559 511846 479474 504789 496341 524577 437370 439645
5685 439645 498096 507383 491920 534024 589493 582627 551138 472597 449950 466460 451631 441461
5673 441461 398167 384445 334794 315788 256002 263490 305750 286957 303829 224333 217054 196311
5661 196311 199662 194532 191773 233085 189501 145370 183649 258579 250789 207413 230078 196050
5649 196050 203577 198718 187166 144520 157327 152710 152074 194611 143668 96289 136629 148467 79475
5636 79475 76458 73755 78261 114412 184820 194099 109365 79981 61657 106411 100906 91336 106817
5623A06817J7298K7124j9181K3392K3251l0092l9563m514K0161l3509K2987J03108
5611B17279l6036l3312p4410K9903K9672k0969l4200r9393J0189L9577R964n825
5599C2439Q0946o5681J0614Q2598l1438m7969Q3672N6851j15893m0739L5387l747
5587G7040L5457J030l4582k3927j6113k6945O0907n1739l3705K4456M3125L5801
5575I0805J8892l9674o2841L6624K8978m960m208J5571L881K8736m1518J6292
5563H6578O2172L308P22p378n4608K0541O0437k6676m4322k8150K9637K0925j3303
5550A09883k4978K8679m3360m0390M2715P2377M7287M226m9721J3121k8977k24
5538A30638q463N0510L6408l6943O9128J03434O1380L5403J25507L3642j2128
$$ plain form
5623 106817 124115 151239 132058 155450 178701 148609 109046 104532 124693 91184 114171 217279
5611 217279 181243 147931 73521 103424 133096 112127 77927 -21466 -11277 28300 38264 32439
5599 32439 113385 47704 58318 140916 109478 61509 145181 202032 86139 45400 80787 77040
5587 77040 112497 113527 78945 55018 38905 11960 72867 21128 -12577 11879 55004 90805
5575 90805 109697 70023 7182 43806 72784 67824 63616 79187 83068 111804 70286 86578
5563 86578 148750 152058 152780 145402 90794 111335 171772 145096 100774 72624 102261 123186 109883
5550 109883 84905 113584 70224 29834 72549 144926 192213 196439 146718 159839 130862 130638
5538 130638 122175 172685 209093 172150 241278 344712 406092 441495 567002 600644 588516
5527E88516L2394J47612R1635P4386J62058J66622J62379J08772O7139j7150j50642
5516A433721j42725j15103o9729k7080j17053j69999k8964k8386J313m3544l0678
5505F61773j197R1207J3680N0973J16458J17913J53151J42494K34515L34953M82665
5494B398585N70467O81987Q08841J042730J063426P13970J29460l36530n49524
5485F523412p40136p93011q10041p17591o05700n23333m34817k75558k22338j40298
5475A260589j67847j29318j05872j11706l6674p0117k1482O497j15585q4624J02943
5464E26804j263j43249L1163n1395J465n317o6716J5984k8903m6349J9335k6042
5452B25517M4892K3901n2160m5316K887O0m1767l7211L0224l2888J6396K0515
$$ plain form
5527 588516 620910 768522 860157 934543 1096601 1263223 1425602 1534374 1601513 1584363 1433721
5516 1433721 1290996 1175893 1106164 1079084 962031 792032 763068 734682 735995 692451 661773
5505 661773 660576 751783 765463 816436 932894 1050807 1203958 1346452 1580967 1915920 2398585
5494 2398585 2969052 3651039 4459880 5502610 6566036 7280006 7409466 7072936 6523412
5485 6523412 5783276 4990265 4180224 3462633 2856933 2333600 1898783 1623225 1400887 1260589
5475 1260589 1092742 963424 857552 745846 709172 639055 617573 624070 508485 423861 526804
5464 526804 525541 382292 413455 362060 363525 358208 291492 307476 278573 232224 251559 225517
5452 225517 270409 294310 242150 196834 199721 199781 158014 120803 151027 118139 134535 155050
5440A55050M4306m843m639j0543n8083j7885n396R7817N952l5457q6210Q575J7300
5427A05944K1023r453L1482k0326M289L2819J6741L2335R306r7090l5459J9989
5415A11600J9702m9884M8997l0701n823l0109k9729l7615L0857j1903j4180Q6208
5403H7420m9514m903J3433j9143l0997j6472M4428q728R054k904K5170n9674l6556
5390d9386N1395N3736l3736l1552J0476O6953j6815j1038J8214K6178l5369j07921
5378e8865R0989J4753L02O1252K9969o7185k4270K3730M640n6278j9100L4342
5366C4279q873L3363q9969m4782N081J7335N146J8814P6780K0263j1185p1763
5354a5511J2630l336K893J3239J4146L1470K7152m1349M4913n384J5075p372j05105
$$ plain form
5440 155050 199356 194513 189874 179331 121248 103363 97967 195784 201736 166279 80069 88644 105944
5427 105944 126967 117514 148996 128670 132959 165778 182519 214854 224160 127070 91611 111600
5415 111600 131302 81418 130415 99714 93891 63782 34053 -3562 27295 15392 1212 87420
5403 87420 37906 33003 46436 27293 -3704 -20176 24252 15524 24578 21674 46844 -12830 -49386
5390 -49386 2009 55745 22009 -9543 933 67886 51071 40033 58247 84425 49056 -58865
5378 -58865 32124 46877 47179 108431 138400 71215 46945 70675 75315 19037 -63 34279
5366 34279 25406 58769 -31200 -75982 -70901 -53566 -48420 -29606 47174 67437 56252 -15511
5354 -15511 -2881 -6217 -3324 9915 24061 55531 82683 41334 86247 80863 95938 88566 -16539
5341a6539R51O7389Q5957o8475j04045O2820N9771n1829m6873P1742M2275m1422
5329F1722l2183J5401J7695K7753J275p2167n7356N1660J7491K3305j7571l9505
5317b480M291m0331j8885J3736L7950L642m2301N320L7727K7100m0651j8043L792
5304b9133J0333J539J4287O6462K7598n6692o8207m0041N6000J9035J3165l4011
5292a9665K6218m0048m0693K1577j825N0361J7703j1502L640J5753l1941m2204
5280e2626J9219J0315J2232J4916n5799P5222J5521p2751L0954J6335K7018J6794
5268E7350k297J6168n0356L4045r838p7992N0133l2668j0384K1910M8273J7148
5256F1492l6118m3879k6584j5028N8728N4887K7286l0571o4519L7283k720M6690
$$ plain form
5341 -16539 -15588 51801 137758 69283 -34762 28058 87829 36000 -10873 60869 103144 61722
5329 61722 29539 44940 62635 90388 91663 19496 -37860 13800 31291 54596 37025 -2480
5317 -2480 1811 -38520 -57405 -43669 -5719 -2077 -44378 -39058 -1331 25769 -14882 -32925 -29133
5304 -29133 -18800 -17261 -2974 63488 91086 34394 -33813 -73854 -17854 1181 14346 -19665
5292 -19665 6553 -33495 -74188 -52611 -54436 -4075 13628 2126 5766 21519 -10422 -52626
5280 -52626 -33407 -23092 -10860 4056 -51743 23479 39000 -33751 -2797 13538 40556 57350
5268 57350 55053 71221 20865 54910 45072 -32920 17213 -15455 -25839 -3929 44344 61492
5256 61492 25374 -18505 -45089 -60117 -1389 53498 80784 50213 -14306 22977 20257 66947
5244F6947n0495o8525l0930M8973N5164Q2942L4844J0218k732j1328n5768n3753
5232B5557L308M226m0782M281P1499m4812N0753M6981p1167m8572J8928J3764
5220C3964j185l7223o7516Q0383K8192P626l967m0669L49L7190M8593l2728q2058
5207b9049J02290J3174K439j08636L2738L4285J8186M6382p8892l7950K0324M7418
5195F2709L5058j2550m8711l2437n9148J04591O6708J04424m5598K2506j6808
5184A80744l3360J268q258J3622j00885k4084K4372L7734K0882p6457J6183k1343
5172C0418r162J1130N2113L2506L1243K9446M258M9064K7502K9895k3782n4500
5160B10131J0349M9920m5658k7487l1196J7137m3280N7812Q3574M7899m167l5196
$$ plain form
5244 66947 16452 -52073 -83003 -34030 21134 104076 138920 149138 146406 135078 79310 25557
5232 25557 28865 33091 -7691 -3410 68089 23277 74030 121011 49844 1272 20200 33964
5220 33964 32779 -4444 -71960 8423 36615 44241 40274 -395 -46 37144 85737 53009 -29049
5207 -29049 73241 86415 88854 -19782 12956 47241 65427 111809 32917 -5033 15291 62709
5195 62709 97767 85217 36506 4069 -55079 49512 116220 220644 175046 197552 180744
5184 180744 147384 148652 140394 154016 53131 29047 53419 91153 112035 35578 51761 30418
5172 30418 21256 32386 84499 117005 148248 177694 181952 231016 258518 288413 264631 210131
5160 210131 220480 270400 224742 197255 166059 183196 139916 197728 281302 329201 325034 289838
5148B89838n831k5509m3657M4726K8850o127j1794j06235J7549J16293j6643n2592
5136B28868R194N085J09830L816p1851K7139L4762L2750J6830k3850P9428J3360
5124D65361j18391k0433J06225J27082k8499r4060k2521K569K8104j5908j8320
5113D11209p9259M0640j0021j2867k810K2630j0161r1665L8720j0682M6497P4652
5101D16883l5160k6207O6265m9258m5134N8686m703l7674p804j349K1437K7356
5089C83338L2769p9899o2741k5061J4183K2600j4132N1686K9770j1425m6178l9539
5077B55371o37L8195n7820j7628J7132q717J38626J7411j47246M8999J20826l3238
5065C71274o1617N8454J0416j12582K497P5390L8140M4175j1963k5469n1551J8704
$$ plain form
5148 289838 284007 258498 214841 259567 288417 282290 270496 164261 181810 298103 281460 228868
5136 228868 238062 243147 352977 356793 284942 312081 346843 379593 396423 372573 452001 465361
5124 465361 346970 326537 432762 559844 531345 437285 414764 417333 445437 429529 411209
5113 411209 331950 372590 362569 349702 346892 369522 359361 267696 306416 295734 342231 416883
5101 416883 381723 355516 421781 372523 327389 386075 381372 343698 335894 334545 355982 383338
5089 383338 416107 336208 273467 248406 262589 285189 271057 322743 352513 341088 294910 255371
5077 255371 254734 292929 235109 217481 234613 225896 364522 381933 234687 283686 404512 371274
5065 371274 309657 368111 378527 265945 268442 343832 381972 426147 414184 388715 337164 355868
5053C55868M8318L935O496J7015N3666m8714l1985K8005L9331L9393l9154m4223
5041D27951M6640P1670N6473k9092R762k6368K1947O5254K1842l8142l4891q8883
5029E04163j9090R3803N2043J9553o4286K814M0534N814o9129J2995N3522R626
5017F42362n4756j1164J31493L4225n1578L2212k7375m1739m2804R622j3914J8823
5005F25407k2829N411r50Q0930K3336j5659K97n3163K9210M1778P580n2060J6881
4992F86169M823P5839Q194j8260J3721m2543o6191p5330R5846P9325k7924n8186
4980F75483j6646R674N096P7060J9270N390m2001J6786O9581N584M5281l87m5079
4967H25092l8205K3938Q6695K9219J1328n4604m497n420O5945Q8828l9477j5022
$$ plain form
5053 355868 404186 408121 414617 431632 485298 436584 404599 432604 471935 511328 472174 427951
5041 427951 474591 546261 602734 573642 583404 557036 578983 644237 666079 627937 593046 504163
5029 504163 485073 578876 630919 650472 586186 589000 629534 635348 566219 579214 632736 642362
5017 642362 587606 576442 707935 742160 690582 722794 695419 653680 610876 620498 606584 625407
5005 625407 602578 607989 607039 687969 711305 695646 695943 642780 671990 713768 721348 669288 686169
4992 686169 690992 766831 775025 756765 770486 727943 661752 586422 682268 761593 733669 675483
4980 675483 658837 668511 673607 750667 769937 775327 733326 750112 819693 825277 870558 870171 825092
4967 825092 786887 810825 897520 926739 938067 883463 878966 873546 939491 1028319 988842 973820
4955I73820J2941N5186K4089m0426K3486O0385j0329m3145R5464L8782j1001m9852
4943A129400K5858J7203k5154K6125P0782O8493K2710k3141j699P2253J5503K4194
4931A422527k6925j1241J75007O6935k6711P6912k6384l9791R431K4103M9426
4920A693289Q5941Q1331l1164O2877O2092j498Q3837K891O5025O1309r776J03439
4908B259593P7879R2875J7862l668Q6179R9445J08116Q4308N8044J11951Q9439
4897C082023Q7825J28566P5123J43853N5633P6438Q3356J74613K42491M5282L0379
4886D225582J49710K31839K02330K01198K46498L25221K85287K99982L67348M08873
4876F943868L86167L98103M06381N20916N27395O40263P22827P28667R29495R29234
$$ plain form
4955 973820 986761 1041947 1066036 1025610 1049096 1109481 1099152 1056007 1151471 1190253 1179252 1129400
4943 1129400 1155258 1172461 1147307 1173432 1244214 1312707 1335417 1312276 1310577 1382830 1398333 1422527
4931 1422527 1395602 1384361 1559368 1626303 1599592 1676504 1650120 1610329 1619760 1643863 1693289
4920 1693289 1779230 1860561 1829397 1892274 1954366 1952868 2036705 2039596 2104621 2165930 2156154 2259593
4908 2259593 2337472 2430347 2448209 2444541 2530720 2630165 2738281 2822589 2880633 2992584 3082023
4897 3082023 3169848 3298414 3373537 3517390 3573023 3649461 3732817 3907430 4149921 4195203 4225582
4886 4225582 4375292 4607131 4809461 5010659 5257157 5582378 5867665 6167647 6534995 6943868
4876 6943868 7330035 7728138 8134519 8655435 9182830 9823093 10545920 11274587 12204082 13133316
4866A3133316J017550J070481J159236J086267J118247R19770Q28114Q92255Q01013
4857B2026249P09103O34071O56028O81647P11994P93439P38348O05818O17551
4848B8174248N67400M99642N00822O69164Q22282J016285J265120J483195J798460
4839C6796618J823077J857412J745234J588343J436741J313577J226968J241379
4831D9029349J372228J277594J145916P21470J14802l70113p84405q37349q44610
4822E0824882q17158q58373q91923r95072j157690j034334j066649r55785q51955
4813D2195943o34585n34959m75519n30603p19935p17432q22636j050524j069239
4804C5640511r21768r49405r97873j112452j253203j289201j377881j502284j374421
$$ plain form
4866 13133316 14150866 15221347 16380583 17466850 18585097 19504867 20332981 21225236 22026249
4857 22026249 22735352 23369423 24025451 24707098 25419092 26212531 26950879 27556697 28174248
4848 28174248 28741648 29241290 29742112 30411276 31233558 32249843 33514963 34998158 36796618
4839 36796618 38619695 40477107 42222341 43810684 45247425 46561002 47787970 49029349
4831 49029349 50401577 51679171 52825087 53546557 53661359 53291246 52506841 51669492 50824882
4822 50824882 50007724 49149351 48257428 47262356 46104666 45070332 44003683 43047898 42195943
4813 42195943 41561358 41026399 40550880 40020277 39300342 38582910 37760274 36709750 35640511
4804 35640511 34718743 33769338 32771465 31659013 30405810 29116609 27738728 26236444 24862023
4795B4862023j195179j160303j086678r69683q04077p07631o37291n46663n85895
4786A7168623n11587l74117l70845k19809k07406k04798k23078j20621R7090J07655
4776A5141107N7396J55939K53712L25345L87059L24244M02038N14237N57405N56315
4766A8674797O69361P06972Q41335J010437J156199J303144J477908J588982J577708
4757B9006843J399217J291821J212713J035773R86600J016727R99244R41490J034746
4748C8925174Q24727P18754O94013O19278N89166O66608Q60681J058695J170079
4739D6127175J162294J076291J063576P81382P66129J023401J086421J067900
4731E4154569R97434O52073K51516k34752n07764p65413r63064r68984j156975
$$ plain form
4795 24862023 23666844 22506541 21419863 20450180 19646103 18938472 18301181 17754518 17168623
4786 17168623 16657036 16282919 15912074 15692265 15484859 15280061 15056983 14936362 15033452 15141107
4776 15141107 15198503 15354442 15608154 15933499 16320558 16644802 17046840 17561077 18118482 18674797
4766 18674797 19344158 20051130 20892465 21902902 23059101 24362245 25840153 27429135 29006843
4757 29006843 30406060 31697881 32910594 33946367 34932967 35949694 36948938 37890428 38925174
4748 38925174 39749901 40468655 41162668 41781946 42371112 43037720 43898401 44957096 46127175
4739 46127175 47289469 48365760 49429336 50210718 50976847 52000248 53086669 54154569
4731 54154569 55152003 55804076 56055592 55820840 55313076 54547663 53584599 52615615 51458640
4722E1458640j272508j366140j575706j740131j930693j970927j910474j885441
4714C7806620j701509j505301j281885r46956o65286p00668o54102n73598n92101
4705B9185214o30564o01168m47630m58743o54337p66662p74468q17775r20617
4696B3113250j002968j139345j186178j231527j233117j266423j304267j096741
4688A3652684r85846j013892q06881p45621n88661o04380o24326n64448m59344
4679G259285l94618l82563l90518k27889k22098k76597k22094j41980j83007j68827
4669D649094j51590k19888j71637o3406j14924j88843r0532p3886p7262j57539
4659C339587j58412m0729l5439r9711j37718j55043k1762j0733j26750m8557k0515
$$ plain form
4722 51458640 50186132 48819992 47244286 45504155 43573462 41602535 39692061 37806620
4714 37806620 36105111 34599810 33317925 32370969 31705683 31005015 30350913 29777315 29185214
4705 29185214 28554650 27953482 27505852 27047109 26392772 25626110 24851642 24033867 23113250
4696 23113250 22110282 20970937 19784759 18553232 17320115 16053692 14749425 13652684
4688 13652684 12666838 11652946 10846065 10100444 9511783 8907403 8283077 7718629 7259285
4679 7259285 6864667 6482104 6091586 5863697 5641599 5365002 5142908 5000928 4817921 4649094
4669 4649094 4497504 4277616 4105979 4042573 3927649 3738806 3648274 3574388 3497126 3339587
4659 3339587 3181175 3140446 3105007 3005296 2867578 2712535 2690773 2680040 2553290 2504733 2484218
4648B484218j06746j04422o8445q1459j6399m2464j30425m112L2358r164r4850
4637A858090q6985K6272K3336o2545p6859p9707o153o0526n4177R9775P2726l7467
4625A615780m4256K2464K3042J3455L8117m5505M3832P0764N3420L2866J4047
4614A838026J27435Q7313j7516P715Q5900J97254J22114M6539K4223J21128Q9259
4603B729390n9239K2215J37045P1552j7185j17908p2549M7087J28836O6473J8558
4592B954275M2720J38760J15692N7190O5738Q3506J9673N9049P8140R7867R085
4581C721695o4083M3977j2807n775k1397j08071j07765J3155m4798k35991k14376
4570B963764o3084j06103j23024j90186n0043l4825O366n8878j23790p668O8167
$$ plain form
4648 2484218 2377472 2273050 2204605 2123146 2106747 2064283 1933858 1929746 1962104 1952940 1858090
4637 1858090 1771105 1797377 1820713 1758168 1681309 1601602 1595449 1534923 1480746 1580521 1653247 1615780
4625 1615780 1571524 1593988 1617030 1630485 1668602 1623097 1666929 1737693 1791113 1823979 1838026
4614 1838026 1965461 2052774 2035258 2042973 2128873 2326127 2448241 2494780 2519003 2640131 2729390
4603 2729390 2670151 2692366 2829411 2900963 2883778 2765870 2693321 2740408 2869244 2935717 2954275
4592 2954275 2996995 3135755 3251447 3308637 3374375 3457881 3477554 3536603 3614743 3712610 3721695
4581 3721695 3657612 3701589 3688782 3683007 3661610 3553539 3445774 3458929 3414131 3178140 2963764
4570 2963764 2900680 2794577 2671553 2481367 2431324 2396499 2402865 2343987 2220197 2212529 2280696
4559B280696O812p5879m4738M8858j2252q1180o5737m4928l3318j37302n1749
4548A789283k5704p1410q6221j19149n1655n8498p4773q9095p5123p3003m2427
4537A022225r6058l6047n0311q383K6759m5435q1975n7517N9967n238l5643l5907
4525F56437k4192M292l9242p5318k929K6209l4210J1468m8162M9743L0375p7369
4513D77102j3334J1407m7451p4309j3551J4064N1538k7979j13929p0769O2327
4502B55116l6820p021l2179j6929P3063M4590J2346k4967Q942J6081o1805o0726
4490A69691K8555j6159l7818p2886k8427L6171N8309k2358j8837O8750K7353M9021
4478B41365n5373o370N4062m8064r4651N9493M7792L999o426n9181K0818P9048
$$ plain form
4559 2280696 2287508 2211629 2166891 2215749 2203497 2122317 2056580 2011652 1978334 1841032 1789283
4548 1789283 1763579 1692169 1605948 1486799 1435144 1376646 1301873 1212778 1137655 1064652 1022225
4537 1022225 926167 890120 839809 831426 858185 812750 730775 673258 733225 727987 692344 656437
4525 656437 632245 636537 597295 521977 519048 545257 511047 522515 474353 524096 554471 477102
4513 477102 463768 475175 427724 353415 339864 353928 405466 377487 263558 192789 255116
4502 255116 218296 211275 179096 162167 235230 279820 292166 267199 276141 292222 230417 169691
4490 169691 198246 182087 144269 71383 42956 79127 137436 115078 96241 164991 192344 241365
4478 241365 185992 179622 233684 185620 90969 150462 198254 202253 195827 136646 157464 236512
4466B36512m0240l2657k9849O2622l300k8542k6105Q0685O0462o3214j24648L5046
4454A26772O2753q7269L8513M7149K0951l753M0085k3120K730P7314k5515n2487
4442B24123k5912K6738K1266o0364l926j2089O0150K8296R090k480K9074O4852
4430C58818o7620o0158M9434P7376p7796q9650L2740Q5531o7688j12966k5648
4419A02373M0135L1085n8778l619Q9233M2737o6621q7460O206R2692K659N1363
4407B42005q8783N394J465k629p9342J1574K2813K8196K482o1504M529P2829l5605
4394A23424p4171J8150M6181m93n4420J9334k0593p633l774l4752k3748N3984
4382D1489M8391M792l4406M1625R612k5408r2156l8153O5193k906K5466j3823
$$ plain form
4466 236512 196272 163615 133766 196388 193088 164546 138441 219126 279588 216374 91726 126772
4454 126772 189525 102256 140769 187918 208869 205116 245201 222081 224811 302125 276610 224123
4442 224123 198211 224949 246215 185851 181925 169836 229986 258282 267372 264892 293966 358818
4430 358818 291198 231040 280474 357850 280054 190404 223144 308675 240987 128021 102373
4419 102373 142508 173593 114815 111196 200429 243166 176545 89085 95291 187983 190642 242005
4407 242005 153222 158616 160081 157452 78110 89684 112497 140693 143175 81671 86200 159029 123424
4394 123424 49253 67403 113584 113091 58671 78005 57412 49779 46005 11253 -12495 41489
4382 41489 89880 94672 60266 101891 111503 86095 -6061 -44214 20979 18073 43539 29716
4370B9716J6882r818l567q0267k3572J21403M584L6648j8802l1469j6498P0711
4358I5951l9618Q729P0373J0259k9071L3843L267r9932m8365j0809J3201M1276
4346D9104P025k131l0191L0228n254l4433N7733M9338m3020l638o4915K7413K894
4333D0153K0265r81n7143L3954m3361K7830M0223N6882l0434K2801n6496j0179
4321D3514L5199L9837J4650n7705l2417J8655L0951L7661l6338l2713k287Q051
4309F7058P1165j17M0773M613j13088P7602J05356j5685m5800k8504j5680m6971
4297A00722N590Q9735N8481j9118J3830J676k7072K7141K3635J1710l0618n1114
4285B04598K9130M4869R4220L1402l7275j6189m172j1017J23334J7944l9945l3809
$$ plain form
4370 29716 46598 36780 33213 -47054 -70626 50777 55361 92009 73207 41738 25240 95951
4358 95951 56333 65062 135435 145694 116623 150466 153733 53801 5436 -5373 7828 49104
4346 49104 56129 53998 23807 54035 48781 14348 72081 121419 78399 74761 9846 37259 40153
4333 40153 60418 59437 2294 36248 -7113 20717 60940 117822 87388 110189 53693 43514
4321 43514 78713 118550 133200 75495 43078 61733 92684 130345 94007 61294 59007 67058
4309 67058 138223 138106 178879 183492 70404 148006 253362 237677 191877 163373 147693 100722
4297 100722 106312 196047 254528 235410 249240 250916 223844 250985 274620 286330 255712 204598
4285 204598 233728 278597 372817 404219 366944 350755 346583 335566 458900 476844 436899 403090
4273D03090m39L1239l5298L819J9202N295k3719p2857P042N1664l133O764K1244
4260D13913q8126K8590R1324J3536K1443m8652J8128N7172J07463q49o3416q3120
4248D67406L3405M2337k1656r114m6610n1800l5529J3463O8962L936j5864J844
4236D50780j4661M0269R7152K0481k4346P7893k6129l6457j0373J8333K8957k4190
4224E97709l8338N0441N4961j1985o6750o2425o609N2385k0565m3954J7610R237
4212E31717L7379l5937J0299M3557Q109l0742j7977O5976M2943k3433r5612j4630
4200E21649J7769K5847K689J5379N1664K6738o5305r0887L7458O412j0327m2260
4188D96826r6673q497N4047l9439L8744L6799l676q904R212m5467L1988L9010
$$ plain form
4273 403090 402651 433890 398592 402411 421613 426908 403189 330332 337374 389038 385905 392669 413913
4260 413913 325787 354377 445701 459237 480680 432028 450156 507328 614791 613942 550526 467406
4248 467406 500811 543148 521492 512378 465768 413968 378439 391902 460864 464800 448936 450780
4236 450780 436119 476388 573540 594021 569675 647568 621439 584982 574609 592942 621899 597709
4224 597709 559371 609812 664773 652788 586038 523613 517004 569389 548824 504870 522480 531717
4212 531717 569096 533159 543458 587015 595124 564382 546405 612381 655324 631891 536279 521649
4200 521649 539418 565265 567954 583333 634997 661735 596430 505543 543001 549413 539086 496826
4188 496826 400153 391656 445703 406264 445008 481807 478131 469227 478439 432972 464960 503970
4176E03970j7520j4035L0072K0750k5192m8188k7078N9216l8536Q9599j9229k5510
4164D88319P1397J2867J8355o2738P867l2893q3726r560M9963O2580j7780l4892
4152D69759l5657M4678Q4045j00086j4267P1422L2495L8377l893j6205M5676K4096
4140F40440o5595m9379k2635R8587M6280o4572n731K0084O9091q7432M728J17938
4128G01804N3751j07268n5405N7339M1109J958J4409J00530K9003m0930n4103
4117G42197J6723K6607Q3199L9111k5845r0761M7690J06500J1144K2284Q244k0568
4105I66525J07911P708m7854p700K6120k3422R628J2464R4438L3642K6320M6052
4093A251832J4069j9805O1252J15655K4918l2742l7324N6481J5234L922P9793
$$ plain form
4176 503970 486450 472415 502487 523237 498045 449857 422779 481995 443459 533058 513829 488319
4164 488319 559716 572583 590938 528200 536067 503174 419448 409888 459851 522431 504651 469759
4152 469759 434102 478780 562825 462739 448472 519894 552389 590766 586873 570668 616344 640440
4140 640440 574845 525466 502831 601418 647698 583126 577395 597479 666570 579138 583866 701804
4128 701804 755555 648287 592882 650221 691330 693288 707697 808227 837230 796300 742197
4117 742197 758920 785527 868726 907837 881992 791231 838921 945421 956565 978849 987093 966525
4105 966525 1074436 1082144 1034290 1026590 1052710 1029288 1038916 1051380 1145818 1179460 1205780 1251832
4093 1251832 1265901 1246096 1307348 1423003 1447921 1415179 1377855 1434336 1449570 1453492 1533285
4082A533285R8728o6570j0321J06569P009j1858L9045M4707R728k9767J05904
4071A826459M2186N7783l4765n2477N2528J07275M4551l3739M3297P3575N2651
4060B179324Q4348K061R293j177O9512J1760l814J50476J12227J4540L6390P5209
4048B740149R6750O0555J6710J3773J31994O1603J9141R0244J16590J15692M4755
4037C507956J09142J71755J21610O5254J21773J91304K18696J88000K32337K79352
4027E207179K75203K97158L11801J90120K75429K17484L10862L03370J58621K25579
4017G772806L75412M25128M46675M08086L91199L63839K97719K91989L44944L40243
4007A1458040L42152L61998L07335L29314K80677J26472J55896J65643J91670
$$ plain form
4082 1533285 1632013 1565443 1555122 1661691 1668700 1656842 1695887 1740594 1750322 1720555 1826459
4071 1826459 1868645 1926428 1891663 1839186 1891714 1998989 2043540 2009801 2053098 2126673 2179324
4060 2179324 2263672 2265733 2275026 2273849 2343361 2355121 2351307 2501783 2614010 2628550 2664940 2740149
4048 2740149 2836899 2897454 2914164 2927937 3059931 3121534 3140675 3230919 3347509 3463201 3507956
4037 3507956 3617098 3788853 3910463 3975717 4097490 4288794 4507490 4695490 4927827 5207179
4027 5207179 5482382 5779540 6091341 6281461 6556890 6774374 7085236 7388606 7547227 7772806
4017 7772806 8148218 8573346 9020021 9428107 9819306 10183145 10480864 10772853 11117797 11458040
4007 11458040 11800192 12162190 12469525 12798839 13079516 13205988 13361884 13527527 13719197
3998A3719197K80290K85806L11314L72510M99499O67865Q26237R48266J133169
3989A9044153J237653J264479J363237J542065J603400J726430J941592K179710
3981C1902719K392181K509745K547340K447964K282168J885631J626144J485580
3973D9079472J242405J125121R79546J127342J507478J868562K464429L124916
3965F2519271L727711M102053M162355L502829K389381J275716N24302J66671
3957H2370289J97718O55881J271758K071584K829582L510008L745738L680634
3949A00333192L149277K350239J379000K95434r46538k186369l002619l525636
3941I7845980l617268l520119l071026k269122j485584n51630R986J43604o07272
$$ plain form
3998 13719197 13999487 14285293 14596607 14969117 15468616 16136481 16962718 17910984 19044153
3989 19044153 20281806 21546285 22909522 24451587 26054987 27781417 29723009 31902719
3981 31902719 34294900 36804645 39351985 41799949 44082117 45967748 47593892 49079472
3973 49079472 50321877 51446998 52426544 53553886 55061364 56929926 59394355 62519271
3965 62519271 66246982 70349035 74511390 78014219 80403600 81679316 82203618 82370289
3957 82370289 82568007 83223888 84495646 86567230 89396812 92906820 96652558 100333192
3949 100333192 103482469 105832708 107211708 107507142 106560604 104374235 101371616 97845980
3941 97845980 94228712 90708593 87637567 85368445 83882861 83331231 83341217 83484821 82877549
3932H2877549j678346k580712l265176l539118l421601l131519k780953k233062
3924F0247062j859996j522957j247969j148625j100620j124084j348638j615996
3916D9278177j793053j826505j950272k064587k026957j919748j848611j767635
3908C4080809j614771j556413j504208j477392j420383j299168j134657q76200
3900B3197617p63191o27932m37032k82056k26515k84978l28271l27679k90010
3891A9629953l94412m81887m05878m96793n13521m08639l58996l68319l38539
3882A5862969k84035l49851l70732l67860l88234m22489m33601l43233l01357
3873A2601577l10069k64408k88342l25280k96768l58620l47180k91444l00746
$$ plain form
3932 82877549 81199203 78618491 75353315 71814197 68392596 65261077 62480124 60247062
3924 60247062 58387066 56864109 55616140 54467515 53366895 52242811 50894173 49278177
3916 49278177 47485124 45658619 43708347 41643760 39616803 37697055 35848444 34080809
3908 34080809 32466038 30909625 29405417 27928025 26507642 25208474 24073817 23197617
3900 23197617 22434426 21806494 21369462 21087406 20860891 20575913 20247642 19919963 19629953
3891 19629953 19235541 18753654 18347776 17850983 17337462 16928823 16569827 16201508 15862969
3882 15862969 15578934 15229083 14858351 14490491 14102257 13679768 13246167 12902934 12601577
3873 12601577 12291508 12027100 11738758 11413478 11116710 10758090 10410910 10119466 9818720
3864I818720l28184l10467k87926k56026l31019l65093k25897k55719k71145k38840
3854F948404j93907k34862k37888j05733k37803j84683l8044j30790j14604q7509
3844E382581j99206j63785p2357j61462j55331j41200q0918j02642j62872q1822
3834D060986j12779j61487j09284j11477r2914o4940j50649j15492l3776r378
3824C098810n0110j13308j28629o8362j11102q5192p4090r6313k9475p4207o9732
3813B198290j2881N604m8703K1214o5236j13593n17j33776j07131N902q664n652
3801A734857o0519j28847P844N3839m1062m2880p2777O1805Q367j46930r0125
3790A283572l2072M0442L2342o3559k9337P031l2124j7482n458l5315M6862J5372
$$ plain form
3864 9818720 9490536 9180069 8892143 8636117 8305098 7940005 7714108 7458389 7187244 6948404
3854 6948404 6754497 6519635 6281747 6176014 5938211 5753528 5715484 5584694 5470090 5382581
3844 5382581 5183375 5019590 4947233 4785771 4630440 4489240 4408322 4305680 4142808 4060986
3834 4060986 3948207 3786720 3677436 3565959 3473045 3408105 3257456 3141964 3108188 3098810
3824 3098810 3048700 2935392 2806763 2738401 2627299 2542107 2468017 2371704 2342229 2268022 2198290
3813 2198290 2185409 2191013 2142310 2163524 2098288 1984695 1984178 1850402 1743271 1749173 1740509 1734857
3801 1734857 1674338 1545491 1553335 1607174 1566112 1523232 1450455 1512260 1520627 1373697 1283572
3790 1283572 1251500 1291942 1324284 1260725 1231388 1238419 1206295 1188813 1183355 1148040 1194902 1210274
3778A210274n2491j08252l8672k6794m2134j4296M1344L3254p3622K8135o7438
3767H89308p256M2783k9613o4435k1903M9672L7305o8953j0005K8064l0644p6705
3755G37618k9409M5877M2385m3267q1536j832J2629o6318m8000M3314N4453j7761
3743F48153r2728n768Q6994m5453o8779k6387P8966l1367r6217K4985L5658j015
3731E07042j7893N168j7390J3736L7474J4069j00421n0429O8166J00114p2707
3720D86929o7241j8890P2729j8755r4169j1957J05725j9885j12425M1204Q9264
3709D52529L4891l0414K5842j2360K4172m79o3587j4448M8864J6038m9263K7119
3697D58904N2743N4584q955j01770J3671O5938M3515o1092l3559K5120J23701
$$ plain form
3778 1210274 1157783 1049531 1010859 984065 941931 927635 968979 1002233 928611 956746 889308
3767 889308 882052 924835 895222 830787 808884 858556 895861 826908 816903 844967 814323 737618
3755 737618 708209 754086 796471 753204 671668 669836 682465 616147 568147 611461 665914 648153
3743 648153 555425 549657 636651 591198 522419 496032 574998 543631 447414 472399 508057 507042
3731 507042 489149 494317 476927 490663 528137 542206 441785 391356 459522 559636 486929
3720 486929 419688 400798 473527 454772 360603 348646 454371 434486 322061 363265 452529
3709 452529 487420 457006 482848 470488 494660 494181 430594 416146 465010 481048 431785 458904
3697 458904 511647 566231 557276 455506 469177 535115 578630 517538 483979 509099 632800
3686F32800n2260j55165r907M5123J0366p3003R7383M3005j5349m9135k3930J6162
3674D66090N1847Q1981m4633l2198J7296K4088K2242j9962M2229J2085N606r2317
3662E34354l3250L0629P9145o6407N86L8461K4779m8627p7160O4917R150K2275
3650E78852q0170k0743J08316M60n7042J9469L8996J21887j8391K5306p0200J0449
3638F57189K8140j0830M2236j0558l517k1360O8095M3269J02333J22730m2911
3627I74816k9862J09829P5339J65351J99036K52862M42873M10606L44071M71164
3617C416085K07876n9870k27555k44529l03198l98798k96565k93302j77727j94123
3607A428294j05671j01962j02555j134M0115m1597o7324P1182j4416M3622M0030
$$ plain form
3686 632800 580540 425375 415468 460591 470957 397954 495337 538342 522993 473858 449928 466090
3674 466090 517937 599918 555285 523087 540383 564471 586713 566751 608980 621065 626671 534354
3662 534354 501104 531733 610878 544471 545057 583518 608297 559670 482510 547427 556577 578852
3650 578852 498682 477939 586255 586715 529673 549142 588138 710025 691634 716940 646740 657189
3638 657189 685329 674499 716735 706177 702660 681300 749395 792664 894997 1017727 974816
3627 974816 944954 1054783 1130122 1295473 1494509 1747371 2190244 2600850 2944921 3416085
3617 3416085 3623961 3564091 3336536 3092007 2788809 2390011 2093446 1800144 1622417 1428294
3607 1428294 1322623 1220661 1118106 1116972 1157087 1115490 1048166 1119348 1104932 1148554 1188584
3596A188584k8482R5310J92190J64459K00271M36513M61314N54499P40628R41579
3586D946865R16919N44506n1866l43659m88268o47471p34118o61661n75197m81179
3576B424871m35390k65864j70542j86724j08770q8163o5109q4321l2495k4047
3566I63446O729J9147q7R7079j8392L0272J09135J52349J54092J23392L55203
3555A992365M36976M69280K24376M5545m1129j73035k91140l64700k89334k56063
3545A753141k57948k64173j41092j18429j95401j14244k6895l5121n9809o2295
3535D77734O2300j9856l4238N8790n4006m8895N1212k659j01673r8981p8308L9730
3523B51150M3379m4358k2227L0361n334r4483Q0494Q8254j9812J5761N3147l5076
$$ plain form
3596 1188584 1160102 1255412 1447602 1612061 1812332 2248845 2710159 3264658 4005286 4946865
3586 4946865 5863784 6408290 6356424 6012765 5524497 4877026 4142908 3481247 2906050 2424871
3576 2424871 1989481 1723617 1553075 1366351 1257581 1169418 1104309 1019988 987493 963446
3566 963446 970175 989322 989235 1086314 1067922 1098194 1207329 1359678 1513770 1637162 1992365
3555 1992365 2429341 2898621 3122997 3168542 3127413 2954378 2663238 2298538 2009204 1753141
3545 1753141 1495193 1231020 1089928 971499 776098 661854 634959 599838 540029 477734
3535 477734 540034 520178 485940 544730 490724 441829 493041 490382 388709 289728 211420 251150
3523 251150 294529 250171 227944 258305 252971 158488 238982 327236 307424 323185 376332 341256
3511C41256M488J2279j6347l7332m4954o2966M3N5281K0424K8454j9540p9551
3499B01535j5954J5338Q900K8978j06959N7015J3950j1741j6336Q671m8539N5701
3487A90559j2587j3986N6650l7893j0821Q0407j9447n9137Q7336J4409j1552l1844
3475B32094r1874m6175O8497j1661J8174L2941m7011P7062k6436J3478l5678k327
3463A81084Q7162N0754m8500Q011R8004K8821p4448o4791k7782M1675k2602m6426
3451B10962p1338L8799m8191m0894O0284M783l7898m6372J8062n0255M9234m567
3439H2609o4090L543K1154J7310k5799J7072O5650j5741j1777n216M438K1626
3427A10779l896o5720K8049P2970M4148q1113r4093j1004K652q8203O3562O8585
$$ plain form
3511 341256 345744 358023 341676 304344 259390 196424 196467 251748 272172 300626 281086 201535
3499 201535 185581 200919 209819 238797 131838 188853 202803 191062 174726 183397 134858 190559
3487 190559 177972 163986 220636 182743 171922 252329 232882 173745 261081 275490 263938 232094
3475 232094 140220 94045 162542 150881 169055 201996 154985 232047 205611 219089 183411 181084
3463 181084 268246 319000 270500 278511 376515 405336 330888 266097 238315 279990 257388 210962
3451 210962 139624 178423 130232 89338 149622 154405 116507 70135 88197 37942 87176 82609
3439 82609 18519 22062 43216 60526 34727 51799 117449 101708 89931 84715 89153 110779
3427 110779 106883 41163 69212 142182 186330 105217 11124 120 2772 -85431 -21869 46716
3415D6716K0238J459o3244l5566O0440k0708j3241J0052K1642Q1k8201j5426N9745
3402D3987m1073j7812m5777L4055R839N4739N5140q5401j9730L4704M9143o7825
3390C989m3707L5880K0943o5654j4965M9688J13415l4487p7286P4002J5838o2749
3378A4907L9582O103j06307J6081Q4045k5263k6163M333O9656N67j17958M8528
3366H111L6324l0665j5591n3473M9019R8740r49o2782l7384K0252J4009p0036
3354d4425r173J8491K8140l9814N409J3282K6115M1544l2935M729L4637j3945
3342C2055K372M8774m3405L7214p0264l1514M7839k9828r194o531l8113L1373
3330b9222P7413o0862Q65M5032k248K1109j10491M8456M0700k9674k9083J5801
$$ plain form
3415 46716 66954 68413 5169 -30397 30043 9335 -3906 6146 27788 27869 -332 -15758 43987
3402 43987 2914 -14898 -60675 -26620 -16781 37958 93098 7697 -12033 22671 71814 3989
3390 3989 -39718 -3838 17105 -48549 -63514 -13826 99589 65102 -12184 61818 77656 14907
3378 14907 54489 60592 -45715 -29634 54411 29148 2985 7318 76974 77541 -40417 8111
3366 8111 44435 13770 -1821 -55294 -6275 92465 91516 28734 -8650 11602 25611 -44425
3354 -44425 -53598 -35107 -6967 -46781 -41372 -28090 -1975 39569 6634 11363 46000 32055
3342 32055 34427 83201 39796 77010 6746 -24768 23071 -6757 -15951 -22482 -60595 -29222
3330 -29222 48191 -12671 -11806 33226 30978 52087 -58404 -9948 30752 1078 -28005 -12204
3318a2204R1245K6538n2664q621j7964M9490J2712n4112M9137n20m2783j05213
3306f4959o4153N5814J11123m8305p4555K3342R5608J0805k7207J9920K9584J9332
3294H6349j3908l2655M9479L9379p2114j32084K1573O1145M4147m3276j4862k7174
3282c4001m8934M111P5652j7570k1237j5416r063J8176l1532K1881L6912q055
3270b9076r0265j0715N0207K5616O0958J298J8191K6503J2899k2342o716J0209
3258D6767m7575O974L5254n69l4418r0441M3323j0439J142j7825L8086m77L520
3245b6678n0204p751P0215N4392K9737m6287m5911q418k3767l9563L4326K2762
3233c7147K7733o9002m6979Q5369J03643n5633r3548J4548M3663J978j4357k7554
$$ plain form
3318 -12204 79041 105579 52915 44294 26330 75820 88532 34420 83557 83037 40254 -64959
3306 -64959 -129112 -73298 37825 -10480 -85035 -61693 33915 44720 17513 37433 67017 86349
3294 86349 72441 39786 89265 128644 56530 -75554 -53981 7164 51311 8035 -6827 -34001
3282 -34001 -82935 -78824 -3172 -20742 -41979 -57395 -66458 -48282 -79814 -57933 -21021 -29076
3270 -29076 -119341 -130056 -79849 -54233 6725 8023 26214 52717 65616 43274 36558 46767
3258 46767 -808 6166 41420 40851 6433 -84008 -40685 -51124 -49982 -67807 -29721 -30198 -26678
3245 -26678 -76882 -84633 -14418 39974 69711 23424 -22487 -30905 -54672 -94235 -59909 -37147
3233 -37147 -9414 -78416 -125395 -40026 63617 7984 -85564 -71016 -27353 -25375 -39732 -67286
3221f7286M0508k8819k7687L7009P1410K0363J4323N405p8620k8147K0728o0129
3209h0942J3027J2147L3974J2910l7088n9476R4481J1265p4096j1168K2907Q7614
3197B5555m937j03815j4934L8289K5531n5043m39J778L4015K2430m4267J8861
3185e6976J5162k2210n091J4150K796N7333K6455q8817K126P1798j1626j5879
3173a0779m0466l4635N6571l5735J1007j3930L2694l3715l9698K7510J00812l4246
3161a4610k9286O7758j03946p8198L2118k5893M553P759K0397L5209P3474j1239
3149b1904R7037J0624j22219k6013K8000J4323n5603l288L2833K6629j07917L8301
3137h9197J2986M8683r157l6195P4574L015k7022K517m1536M4213k2563l2609
$$ plain form
3221 -67286 -26778 -55597 -83284 -46275 25135 45498 59821 65226 -13394 -41541 -20813 -80942
3209 -80942 -67915 -55768 -21794 -8884 -45972 -105448 -10967 298 -73798 -84966 -62059 25555
3197 25555 20618 -83197 -98131 -59842 -34311 -89354 -89793 -88015 -54000 -31570 -75837 -56976
3185 -56976 -41814 -64024 -69115 -54965 -52169 5164 31619 -57198 -55072 16726 5100 -10779
3173 -10779 -51245 -85880 -29309 -65044 -54037 -67967 -35273 -68988 -108686 -81176 19636 -14610
3161 -14610 -43896 23862 -80084 -158282 -126164 -152057 -147504 -139745 -119348 -84139 -10665 -21904
3149 -21904 75133 85757 -36462 -62475 -34475 -20152 -75755 -79043 -46210 -19581 -127498 -89197
3137 -89197 -76211 -27528 -36685 -72880 1694 4709 -22313 -19796 -61332 -17119 -39682 -72291
3125g2291q683P1126j7364L0634l5065j3777M7633J21153n8229L38l1399j1041
3113B3035q883l2510j3632L4414N9539m0334m4280K980M7697n1876k40L993K1539
3100A442L445q464L7719J5818p1070p0236O5061J7050k4250K1423j1036n2554
3088g5652r810R3402J4168l8622m3475M5500n1048m3698k2935J13166Q7057r879
3076E8174l7375L0181m732n4654P373p2700j196K6523O343R9160l9196q8285k2565
3063i2949K0339K3020j792l3530L5490l4105m6561M8046o0086J3395P26J2910
3051a15097l3998P2367L401K7048R930l952M3951k6803M3141P760m4456o1592
3039g8300L6176K8056J7351k7609j3022l7682O0742n0945n5056M9458N1843K9830
$$ plain form
3125 -72291 -80974 -9848 -27212 3422 -31643 -45420 2213 123366 65137 65475 34076 23035
3113 23035 14152 -18358 -31990 2424 61963 21629 -22651 -19671 28026 -23850 -24090 -20097 1442
3100 1442 4887 -3577 34142 49960 -21110 -91346 -26285 -9235 -33485 -12062 -23098 -75652
3088 -75652 -85462 7940 22108 -16514 -59989 -14489 -65537 -109235 -132170 -19004 68053 58174
3076 58174 20799 50980 46248 -8406 -1033 -73733 -74929 -48406 -42063 57097 17901 -70384 -92949
3063 -92949 -72610 -49590 -51382 -84912 -49422 -83527 -130088 -82042 -142128 -128733 -128007 -115097
3051 -115097 -149095 -76728 -73327 -46279 -36349 -40301 3650 -23153 19988 27748 -16708 -78300
3039 -78300 -42124 -14068 3283 -24326 -37348 -75030 -14288 -65233 -120289 -70831 -18988 10842
3027A0842k9177n3753J7647K7471m0488J1435P319p808N131N1417k9962O490j7078
3014d0514r966J4393k4136j269N3780q911p7928j2329N9960L0543k558q685l3351
3001f0971k2084l814p9882K719O7606R955K8793R983k468M5440k5456l0529q61
2988f1569Q9016k0103m3588p0019K0591j5941j7241K9581q076K7531m3021K761
2976a10078J7656L2757L3850K5457q8221l5207L7734k5464o4746M7763L0175J22835
2964B4511o3173n7853M4461N58m4746l7629O8165J07958r1051n4414J1838L3822
2952e7553J479n9355L2152M2846M9559l8119l0589n9138K1684K6672k328o8424
2940a41114K3477N6970N840k4157m368O6064o726m9870J7008K3297k8269k6521
$$ plain form
3027 10842 -18335 -72088 -54441 -26970 -67458 -56023 -48704 -56512 -51381 36 -29926 -23436 -40514
3014 -40514 -50480 -36087 -60223 -61492 -7712 -16623 -94551 -106880 -46920 -16377 -18935 -27620 -60971
3001 -60971 -83055 -86869 -166751 -164032 -96426 -86471 -57678 -47695 -50163 -4723 -30179 -60708 -61569
2988 -61569 27447 7344 -36244 -106263 -85672 -101613 -118854 -89273 -97349 -69818 -112839 -110078
2976 -110078 -92422 -59665 -25815 -358 -88579 -123786 -86052 -111516 -176262 -128499 -98324 24511
2964 24511 -38662 -96515 -52054 -51496 -96242 -133871 -65706 42252 -48799 -103213 -91375 -57553
2952 -57553 -56074 -115429 -83277 -40431 9128 -28991 -59580 -118718 -97034 -70362 -72690 -141114
2940 -141114 -117637 -60667 -54827 -78984 -83352 -17288 -24014 -73884 -56876 -33579 -61848 -88369
2928h8369p427Q0546L315n9881r608q930M391o6236p4245N5868o29L1718m4324
2915a83811j9758N8572J13790j5788j00983k2110J11847J7669k2624K0578K2607
2904b0011M5861m1491n3543N0446L5477n4058n5573O500O5797N1745k2205q7902
2892g8957P31J3558R609m18P5548j488j5476m9317l75j0301j8042N6490j5411
2879c3849L0836L1482j5241o3482j11624N1977J02635j6691p8045J2039O8570
2868b1393N3490m4560l7746P6118p0704j10467K2331J01002L2546o1606m3175
2857a04164J3879O1307k6826q162p3048N5017L0190m0316q231r1594K9454J12288
2845e0206m4233j1549O7582L7801j4479r3640L307L0682k2219l4139M2354M3499
$$ plain form
2928 -88369 -95796 -15250 -11935 -71816 -81424 -90354 -85963 -152199 -226444 -170576 -171205 -139487 -183811
2915 -183811 -203569 -144997 -31207 -46995 -147978 -170088 -58241 -40572 -63196 -42618 -20011
2904 -20011 25850 -15641 -69184 -18738 16739 -37319 -92892 -86392 -20595 31150 8945 -78957
2892 -78957 -78226 -64668 -55059 -55477 20071 18583 3107 -46210 -46585 -56886 -74928 -18438 -33849
2879 -33849 -3013 28469 13228 -50254 -161878 -109901 -7266 -23957 -102002 -89963 -21393
2868 -21393 32097 -12463 -50209 25909 -44795 -155262 -132931 -31929 617 -60989 -104164
2857 -104164 -90285 -28978 -55804 -63966 -137014 -81997 -51807 -92123 -100354 -191948 -162494 -50206
2845 -50206 -94439 -105988 -38406 -605 -15084 -108724 -105417 -74735 -96954 -131093 -88739 -45240
2833d5240k4980M2409m1421O5514N9818r8313o3073Q6836l1362j4942P1884n1573
2821d4443L2054J5979l4794o1301M1380P8834j0630o5541o4816j3569J9389O1039
2809d6419k8631J8532L6303j17l4225k316l5794L1086m9509j057J04238J8344
2797A0435l6543k9501K6596m2666P310O56o732k1613M2799Q847L9639m6477K2517
2784b4733k6127l7144R802L9361q403J515k9863m6177Q2774l5019K04J5947L7181
2771b0682k7088r8928N2820J40983j1604p6230j522k8705j6745J9511l5895l0829
2759a34914K7088l8562J12279m1030j4907O9831l1248n2045m7710J7847L2953
2748a00418J2268P396l1052M7504L5756L8897K5126n4227L8702l1793p6571P5623
$$ plain form
2833 -45240 -70220 -27811 -69232 -3718 56100 -42213 -105286 -18450 -49812 -64754 7130 -44443
2821 -44443 -12389 3590 -31204 -92505 -51125 27709 17079 -48462 -113278 -126847 -107458 -46419
2809 -46419 -75050 -56518 -20215 -20332 -54557 -56873 -92667 -61581 -111090 -112147 -7909 10435
2797 10435 -26108 -55609 -29013 -71679 -64369 -63713 -70445 -92058 -49259 -40412 -773 -47250 -24733
2784 -24733 -50860 -88004 -78202 -38841 -47244 -45729 -75592 -121769 -38995 -74014 -73810 -57863 -20682
2771 -20682 -47770 -146698 -93878 47105 35501 -40729 -42251 -70956 -87701 -68190 -104085 -134914
2759 -134914 -107826 -146388 -34109 -75139 -90046 -20215 -51463 -103508 -151218 -133371 -100418
2748 -100418 -88150 -80754 -111806 -64302 -28546 10351 35477 -18750 19952 -11841 -88412 -12789
2736a2789M3089k4960n2371J7899j2323o2839m7416K9462Q7332m4779n1356Q8358
2724d2693M79j6933J0716m2988L8868J6144j9076k3583m8016M5221M6279P977
2712b7605j3491n5580L2952J3696k0805J0027m5215j2474N3314p5319M0130N5225
2700d5145r479l6169R129N5541Q3117o8782k3317K450K8926o7573q9803J9419
2688a41686M7616M2928k0240K5396l794J2030N5210o2556o1387Q8019J1556q3496
2676i0404K7881l3463l2369L1059Q590L9243j2055q487J4214M526J5019m925J0204
2663c0967L4958k1654j4776N651J2736k5240N0511J4648L2680k2851o1989J0147
2651a6146J5142k5456J4027L7806n6428j6453m4492O4614J2649l9560j25188M944
$$ plain form
2736 -12789 30300 5340 -47031 -29132 -41455 -104294 -151710 -122248 -34916 -79695 -131051 -42693
2724 -42693 -42214 -59147 -48431 -91419 -52551 -36407 -55483 -79066 -127082 -81861 -35582 -27605
2712 -27605 -41096 -96676 -63724 -50028 -70833 -60806 -106021 -118495 -65181 -140500 -100370 -45145
2700 -45145 -54624 -90793 -81664 -26123 56994 -11788 -35105 -32655 -3729 -71302 -161105 -141686
2688 -141686 -94070 -51142 -71382 -45986 -49780 -37750 17460 -45096 -106483 -18464 -6908 -90404
2676 -90404 -62523 -95986 -128355 -97296 -88706 -49463 -61518 -70005 -55791 -51265 -36246 -41171 -30967
2663 -30967 3991 -17663 -32439 -26788 -14052 -39292 11219 25867 58547 35696 -26293 -16146
2651 -16146 -1004 -26460 -12433 25373 -31055 -47508 -92000 -27386 -14737 -54297 -179485 -174541
2639a74541J27068M7412Q477J3430o9253l387K2070J4466L361r925M0475J3253
2627C2906N193m4911p9691m388j8152k5174J57522j4178r0619j1880Q4224m3540
2615e2688l5478q879O2406J7806l9611J6009M1147k2860k2114O321J9652P762
2603a0527P4369R641n3985K536P206M9653k2947J1723j5292P2395J6211p9315
2591F1668j0528P9965K6531q2520N8333K6146r324l3103p7836L1608k63j7079
$$ plain form
2639 -174541 -47473 -61 8416 21846 -47407 -50794 -28724 -14258 -10897 -20822 19653 32906
2627 32906 38099 -6812 -86503 -90891 -109043 -134217 23305 9127 -81492 -93372 -9148 -52688
2615 -52688 -88166 -97045 -34639 -16833 -56444 -40435 712 -22148 -44262 -37941 -18289 -10527
2603 -10527 63842 73483 19498 22034 29240 78893 55946 67669 52377 124772 140983 61668
2591 61668 51140 131105 157636 75116 133449 159595 150271 117168 39332 70940 70677 53598
$$ [...]
##END NTUPLES=NMR SPECTRUM
##END=
