##TITLE=1H_DE-80H_X3
 200.13MHz, d2o
 8 sc
 
 19ns.26.2.2025
##JCAMPDX= 6.0         $$ Bruker NMR JCAMP-DX V2.0
##DATA TYPE= NMR SPECTRUM
##DATA CLASS= NTUPLES
##ORIGIN= UXNMR, Bruker Analytische Messtechnik GmbH
##OWNER= pz
$$ XWIN-NMR		Version 3.5
$$ Wed Jul  1 10:11:25 2026 Russian Standard Time (UT+4h)  Yarkov@DPX200
##.OBSERVE FREQUENCY= 200.1313
##.OBSERVE NUCLEUS= ^1H
##.ACQUISITION MODE= SIMULTANEOUS
##.ACQUISITION SCHEME= undefined
##.AVERAGES= 8
##.DIGITISER RES= 18
##SPECTROMETER/DATA SYSTEM= spect
##.PULSE SEQUENCE= zg30
##.SOLVENT NAME= DMSO
##.SHIFT REFERENCE= (INTERNAL, DMSO, 0, 15.5001)
##AUDIT TRAIL= $$ (NUMBER, WHEN, WHO, WHERE, WHAT)
$$ ##TITLE= Audit trail, XWIN-NMR		Version 3.5
$$ ##JCAMPDX= 5.01
$$ ##ORIGIN= Bruker BioSpin GmbH
$$ ##OWNER= Yarkov
$$ C:/Bruker/XWIN-NMR/data/yarkov2/nmr/H-C/1/pdata/1/auditp.txt
$$ ##AUDIT TRAIL=  $$ (NUMBER, WHEN, WHO, WHERE, WHAT)
(   1,<2026-07-01 10:10:12.89 +0400>,<Yarkov>,<DPX200>,
      <created by zg, POWCHK disabled, PULCHK disabled
       configuration hash MD5:
       00 E9 B6 7A A2 85 ED C7 34 08 36 98 17 FE 4E 26
       data hash MD5: 16K
       A4 44 E2 51 DD EC 59 0E 21 7D 13 D8 24 A5 7E EB>)
(   2,<2026-07-01 10:10:18.60 +0400>,<Yarkov>,<DPX200>,
      <Start of raw data processing
       efp BC_mod = 2 LB = 0.25 FT_mod = 6 PKNL = 1 PHC0 = -6900.419 PHC1 = 13.42196 SI = 16K 
       data hash MD5: 16K
       8A E7 B8 8B 4A CF F5 D0 18 1A A1 9A 69 A3 8D C2>)
(   3,<2026-07-01 10:10:40.15 +0400>,<Yarkov>,<DPX200>,
      <pk PHC0 = 1.670655 PHC1 = -7 
       data hash MD5: 16K
       6C FC 9F 42 4E 91 6D FF EE 6E 80 8F A7 52 C7 6A>)
$$ ##END=
$$ 
$$ hash MD5
$$ 7E EC C4 41 DB B1 23 B1 56 4A 0C 98 C6 6D CA 4C
##$RELAX= 
##$RELAX= 
##$RELAX= 
##$RELAX= 
##$RELAX= 
##$RELAX= 
$$ Bruker specific parameters
$$ --------------------------
##$DU= <C:/Bruker/XWIN-NMR>
##$EXPNO= 1
##$NAME= <H-C>
##$PROCNO= 1
##$TYPE= <nmr>
##$USER= <yarkov2>
##$AMP= (0..31)
100 100 100 100 100 100 100 100 100 100 100 100 100 100 100 100 100 100 
100 100 100 100 100 100 100 100 100 100 100 100 100 100 
##$AQSEQ= 0
##$AQ_mod= 1
##$AUNM= <au_zg>
##$AUTOPOS= <>
##$BF1= 200.13
##$BF2= 200.13
##$BF3= 200.13
##$BF4= 200.13
##$BF5= 200.13
##$BF6= 200.13
##$BF7= 200.13
##$BF8= 200.13
##$BYTORDA= 1
##$CFDGTYP= 0
##$CFRGTYP= 5
##$CHEMSTR= <none>
##$CNST= (0..31)
1 1 145 1 1 1 1 1 1 1 1 1 1 1 1 1 1 1 1 1 1 1 1 1 1 1 1 1 1 1 1 1 
##$CPDPRG= <>
##$CPDPRG1= <>
##$CPDPRG2= <>
##$CPDPRG3= <>
##$CPDPRG4= <mlev>
##$CPDPRG5= <mlev>
##$CPDPRG6= <mlev>
##$CPDPRG7= <mlev>
##$CPDPRG8= <mlev>
##$CPDPRGB= <>
##$CPDPRGT= <>
##$D= (0..31)
0 0.7 0 0 0 0 0 0 0 0 0 0.03 0 0 0 0 0 0 0 0 0 0 0 0 0 0 0 0 0 0 0 0 
##$DATE= 1782886212
##$DBL= (0..7)
120 120 120 120 120 120 120 120 
##$DBP= (0..7)
150 150 150 150 150 150 150 150 
##$DBP07= 0
##$DBPNAM0= <>
##$DBPNAM1= <>
##$DBPNAM2= <>
##$DBPNAM3= <>
##$DBPNAM4= <>
##$DBPNAM5= <>
##$DBPNAM6= <>
##$DBPNAM7= <>
##$DBPOAL= (0..7)
0.5 0.5 0.5 0.5 0.5 0.5 0.5 0.5 
##$DBPOFFS= (0..7)
0 0 0 0 0 0 0 0 
$$ [...]
##$SUBNAM2= <"">
##$SUBNAM3= <"">
##$SUBNAM4= <"">
##$SUBNAM5= <"">
##$SUBNAM6= <"">
##$SUBNAM7= <"">
##$SUBNAM8= <"">
##$SUBNAM9= <"">
##$SW= 18.0517328524113
##$SWIBOX= (0..15)
0 0 2 0 0 0 0 0 0 0 0 0 0 0 0 0 
##$SW_h= 3612.71676300578
##$TD= 16384
##$TD0= 1
##$TE= 0
##$TE2= 300
##$TE3= 300
##$TEG= 300
##$TL= (0..7)
0 120 120 120 120 120 120 120 
##$TP= (0..7)
150 150 150 150 150 150 150 150 
##$TP07= 0
##$TPNAME0= <>
##$TPNAME1= <>
##$TPNAME2= <>
##$TPNAME3= <>
##$TPNAME4= <>
##$TPNAME5= <>
##$TPNAME6= <>
##$TPNAME7= <>
##$TPOAL= (0..7)
0.5 0.5 0.5 0.5 0.5 0.5 0.5 0.5 
##$TPOFFS= (0..7)
0 0 0 0 0 0 0 0 
##$TUNHIN= 0
##$TUNHOUT= 0
##$TUNXOUT= 0
##$USERA1= <user>
##$USERA2= <user>
##$USERA3= <user>
##$USERA4= <user>
##$USERA5= <user>
##$V9= 5
##$VALIST= <valist>
##$VCLIST= <CCCCCCCCCCCCCCC>
##$VD= 0
##$VDLIST= <DDDDDDDDDDDDDDD>
##$VPLIST= <PPPPPPPPPPPPPPP>
##$VTLIST= <TTTTTTTTTTTTTTT>
##$WBST= 1024
##$WBSW= 4
##$XGAIN= (0..3)
0 0 0 0 
##$XL= 0
##$YL= 0
##$YMAX_a= 77110
##$YMIN_a= -91774
##$ZGOPTNS= <>
##$ZL1= 120
##$ZL2= 120
##$ZL3= 120
##$ZL4= 120
##$ABSF1= 0
##$ABSF2= 0
##$ABSG= 0
##$ABSL= 0
##$ALPHA= 0
##$AQORDER= 0
##$ASSFAC= 0
##$ASSFACI= 0
##$ASSFACX= 0
##$ASSWID= 0
##$AUNMP= <proc_1d>
##$AZFE= 0.1
##$AZFW= 0.1
##$BCFW= 0
##$BC_mod= 2
##$BYTORDP= 0
##$COROFFS= 0
##$CY= -3
##$DATMOD= 1
##$DC= 0
##$DFILT= <>
##$DTYPP= 0
##$F1P= 0
##$F2P= 0
##$FCOR= 1
##$FTSIZE= 16384
##$FT_mod= 6
##$GAMMA= 0
##$GB= 0
##$INTBC= 1
##$INTSCL= 3.241238e-09
##$ISEN= 128
##$LB= 0.25
##$LEV0= 0
##$LPBIN= 0
##$MAXI= 10000
##$MC2= 0
##$MEAN= 0
##$ME_mod= 0
##$MI= 1.114404
##$NCOEF= 0
##$NC_proc= -6
##$NLEV= 6
##$NOISF1= 3.799351
##$NOISF2= 2.8
##$NSP= 0
##$NTH_PI= 0
##$NZP= 0
##$OFFSET= 15.50011
##$PC= 1
##$PHC0= -6898.748
##$PHC1= 6.42196
##$PH_mod= 1
##$PKNL= yes
##$PPARMOD= 0
##$PSCAL= 0
##$PSIGN= 0
##$REVERSE= no
##$SF= 200.130004320816
##$SI= 16384
##$SIGF1= 3
##$SIGF2= 2
##$SINO= 0.751879
##$SIOLD= 32768
##$SREGLST= <19F.Aceton>
##$SSB= 0
##$STSI= 16384
##$STSR= 0
##$SW_p= 3612.71676300578
##$SYMM= 0
##$S_DEV= 0
##$TDeff= 16384
##$TDoff= 0
##$TI= <>
##$TILT= no
##$TM1= 0
##$TM2= 0
##$TOPLEV= 0
##$USERP1= <user>
##$USERP2= <user>
##$USERP3= <user>
##$USERP4= <user>
##$USERP5= <user>
##$WDW= 1
##$XDIM= 16384
##$YMAX_p= 290200236
##$YMIN_p= -462130
$$ End of Bruker specific parameters
$$ ---------------------------------
##NTUPLES= NMR SPECTRUM
##VAR_NAME=  FREQUENCY,     SPECTRUM/REAL,   SPECTRUM/IMAG
##SYMBOL=    X,             R,               I
##VAR_TYPE=  INDEPENDENT,   DEPENDENT,       DEPENDENT
##VAR_FORM=  AFFN,          ASDF,            ASDF
##VAR_DIM=   16384,         16384,           16384
##UNITS=     HZ,            ARBITRARY UNITS, ARBITRARY UNITS
##FACTOR=    0.220516191357247, 1,           1
##FIRST=     3102.03701573983, 0,            0
##LAST=      -510.67974726595, 0,            0
##MIN=       -510.67974726595, -462130,      0
##MAX=       3102.03701573983, 290200236,    0
$$ Real data points
##PAGE= N=1
##DATA TABLE= (X++(R..R)), XYDATA
$$ [...]
$$ plain form
9099 -13323 -18942 -2472 1978 15065 5457 16143 4515 4677 20229 21553 1530 3582 -1060
9086 -1060 -42932 -38632 11126 17879 -20956 -29546 -19995 -30625 -4857 33484 21812 -2397 29413
9073 29413 17391 -16919 -17372 -61367 -39556 -20006 -17415 -10559 -22652 -12142 -6408 6902 23358
9060 23358 -4953 -22137 -4378 13759 -11933 35807 36990 411 11032 17588 16966 18300 20077
9047 20077 28554 -878 -15932 5686 21081 30828 34620 -17070 -16513 -5555 14184 15130 22010
9034 22010 31027 25938 -6649 -18334 -1457 10492 8495 -12057 -24444 -37388 -1674 13555
9022 13555 -6986 -13009 6859 16072 38607 23903 -1335 -154 28847 11898 -17221 -14844 6270
9009 6270 15208 32850 56580 20098 9039 23432 14252 20786 -16325 -1311 3922 -12270 -32983
$$ packed form
9099a3323n619J6470M450J3087r608J0686j1628J62J5552J324k0023K052m642
9086a060m1872M300M9758O753l8835q590R551j0630K5768L8341j1672k4209L1810
9073B9413j2022l4310m53m3995K1811J9550K591O856j2093J0510N734J3310J6456
9060B3358k8311j7184J7759J8137k5692M7740J183l6579J0621O556o22J334J777
9047B0077Q477k9432j5054K1618J5395R747L792n1690N57J0958J9739R46O880
9034B2010R017n089l2587j1685J6877J1949j997k0552j2387j2944L5714J5229
9022A3555k0541o023J9868R213K2535j4704k5238J181K9001j6949k9119K377K1114
9009F270Q938J7642K3730l6482j1059J4393r180O534l7111J5014N233j6192k0713
$$ plain form
8996 -32983 -41825 -16132 -17434 3228 17785 12862 -12214 -7140 2853 -2692 17221 29303 8600
8983 8600 -2737 -609 -4360 17060 16586 847 -24106 -29132 -19709 29952 25811 6729 3459 -9027
8969 -9027 -8261 -16261 46861 13002 -29771 1694 20303 19720 271 -7684 -43407 -36385 -14672
8956 -14672 -8458 -33109 -38553 -29644 -43881 -24125 -21544 -4724 10604 -12011 -44511 -59758 -18484
8943 -18484 -21776 -10136 23177 -20110 -28909 -14396 2876 -17514 -46145 -22495 -4639 -4925 -18179
8930 -18179 -20582 3564 -806 3695 -4487 -5924 -30898 -35047 -6249 15577 8915 -22098 -14613
8917 -14613 -5844 8879 -9109 4759 33413 15144 8836 14977 6491 -38197 -20681 -6887 -2659
8904 -2659 20552 9756 49326 21287 -17626 -22508 -36534 -28362 11404 27876 32170 4373 -19977
$$ packed form
8996c2983q842K5693j302K0662J4557m923k5076N074R993n545J9913J2082k0703
8983H600j1337K128l751K1420m74j5739k4953n026R423M9661m141j9082l270j2486
8969i027P66q000O3122l3859m2773L1465J8609n83j9449p955l5723P022K1713
8956a4672O214k4651n444Q909j4237J9756K581J6820J5328k2615l2500j5247M1274
8943a8484l292J1640L3313m3287q799J4513J7272k0390k8631K3650J7856k86j3254
8930a8179k403K4146m370M501q182j437k4974m149K8798K1826o662l1013P485
8917a4613Q769J4723j7988J3868K8654j8269o308O141q486m4688J7516J3794M228
8904b659K3211j0796L9570k8039l8913m882j4026Q172L9766J6472M294k7797k4350
$$ plain form
8891 -19977 -10049 -13778 -8231 -36897 -20793 -24692 -17447 -16072 3456 27744 10230 -1244 20761
8878 20761 -1648 -43836 -32179 -9658 -14727 -30062 3881 11289 -9280 -29586 13726 27711
8866 27711 26513 30262 -5242 -46481 -19861 -19649 -35992 -31447 2261 30261 13582 46811 -297
8853 -297 -15114 -6018 -10912 -23288 -52407 -40698 -10305 12684 -17420 -9283 -13430 9906 -133
8840 -133 21695 21782 16139 -17089 -7134 -7747 -4157 -1662 -46368 -44878 -84363 -40700 17952 -15261
8826 -15261 -15511 -6174 430 12415 -11245 -8755 6040 8714 -1350 -27088 -56280 -46982 -32583
8813 -32583 26925 4818 -9115 -16744 -31949 -3067 14 -17606 -2277 -5988 -10323 -35637 -32765
8800 -32765 5143 16167 34569 25784 6730 -22309 -7551 14747 14100 15963 12724 25373 -657
$$ packed form
8891a9977R928l729N547k8666J6104l899P245J375J9528K4288j7514j1474K2005
8878B0761k2409m2188J1657K2521n069j5335L3943P408k0569k0306M3312J3985
8866B7711j198L749l5504m1239K6620K12j6343M545L3708K8000j6679L3229m7108
8853b97j4817R096m894j2376k9119J1709L0393K2989l0104Q137m147K3336j0039
8840a33K1828Q7n643l3228R955o13L590K495m4706J490l9485M3663N8652l3213
8826a5261k50R337O604J1985k3660K490J4795K674j0064k5738k9192R298J4399
8813c2583N9508k2107j3933p629j5205K8882L081j7620J5329l711m335k5314K872
8800c2765L7908J1024J8402q785j9054k9039J4758K2298o47J863l239J2649k6030
$$ plain form
8787 -657 5598 3603 -3742 17488 38660 7304 -17658 -6469 19654 -8409 -23569 19905 32916
8774 32916 2142 -37862 -53482 -55467 -58917 -41170 -18122 23016 38508 10397 -2116 -29882
8762 -29882 -8803 -9679 -24525 -5832 17691 -5902 -19269 -17522 -25547 -23797 -9599 -13590 -19027
8749 -19027 -38246 -25632 -6629 11290 43717 -6640 2126 4019 -26851 -5061 -640 -13026
8737 -13026 -18827 -11232 -16606 -20114 4796 8047 -20498 -7185 -22058 -28623 -21681 -27628 -11032
8724 -11032 -22714 -49641 -70074 -48389 -19730 -32453 -40989 -42722 -37353 -46271 -20394 15889 26023
8711 26023 26687 -24142 -36526 -15515 -32932 -5457 -8724 -17602 -5751 5083 18801 2496 6678
8698 6678 -2131 6087 13498 6122 12402 3260 -8476 4136 -24227 -15408 -4885 497 47962 11792
$$ packed form
8787f57O255j995p345K1230K1172l1356k4962J1189K6123k8063j5160M3474J3011
8774C2916l0774m0004j5620j985l450J7747K3048M1138J5492k8111j2513k7766
8762b9882K1079q76j4846J8693K3523k3593j3367J747q025J750J4198l991n437
8749a9027j9219J2614J9003J7919L2427n0357Q766J893l0870K1790M421j2386
8737a3026n801P595n374l508K4910L251k8545J3313j4873o565O942n947J6596
8724a1032j1682k6927k0433K1685K8659j2723q536j733N369q918K5877L6283J0134
8711B6023O64n0829j2384K1011j7417K7475l267q878J1851J0834J3718j6305M182
8698F678q809Q218P411p376O280r142j1736J2612k8363Q819J0523N382M7465l6170
$$ plain form
8684 11792 13429 -7268 -60617 -25294 6456 1585 -89316 -68515 -13321 -20631 -29528 -47447 -27130
8671 -27130 -27443 -31274 -36016 -13892 2770 -20343 -32607 1633 -14321 -25326 -15465 -20038 11559
8658 11559 14768 -1668 -11070 -19386 -6376 -16200 -2464 8188 7492 4500 -3254 -14944 -1288
8645 -1288 11873 952 -24324 5 -16840 -16551 5366 6097 7428 20327 35784 -6847 -45051
8632 -45051 -38203 -39629 -16060 5731 -24812 -26033 7113 5178 8442 -5125 -23151 -26895 2049
8619 2049 -124 -12875 408 -21985 -11722 -20038 6671 11530 20377 38943 -9452 -14163 -3049
8606 -3049 7812 1673 -8773 1018 -1345 2614 1516 -9985 -17716 -13956 26930 42236 20560
8593 20560 22962 28742 17105 -5234 -3542 -6400 -11440 -16211 13875 12674 30588 15082 2931
$$ packed form
8684A1792J637k0697n3349L5323L1750m871r0901K0801N5194p310q897j7919K0317
8671b7130l13l831m742K2124J6662k3113j2264L4240j5954j1005R861m573L1597
8658A1559L209j6436r402q316J3010r824J3736J0652o96k992p754j1690J3656
8645a288J3161j0921k5276K4329j6845K89K1917P31J331J2899J5457m2631l8204
8632d5051O848j426K3569K1791l0543j221L3146j935L264j3567j8026l744K8944
8619B049k173j2751J3283k2393J0263q316K6709M859Q847J8566m8395m711J1114
8606c049J0861o139j0446R791k363L959j098j1501p731L760M0886J5306k1676
8593B0560K402N780j1637k2339J692k858n040m771L0086j201J7914j5506j2151
$$ plain form
8580 2931 21127 82738 -95793 -116522 -86103 -76198 -65491 -44911 -36689 -48954 -43075 -73052
8568 -73052 -34587 -3073 -939 -57201 -60557 -39271 -29332 -40872 -27332 -2419 6562 -1654 -18814
8555 -18814 -1650 32566 42641 55619 25925 6848 -21428 -7303 18871 2057 -22852 -13541
8543 -13541 -9272 2482 -40210 -27017 6114 -2389 -15190 -31598 -16659 9109 -13365 -15351
8531 -15351 -6698 -9711 2765 -12164 -24270 -4568 -7655 11207 20122 -3703 -180 16835 -10391
8518 -10391 489 -13090 -14111 -17296 360 10500 -23971 -19587 -19379 -34005 6474 -15105 -41457
8505 -41457 -5772 -21085 -18782 -37912 -5435 10296 333 -9982 -22998 -43397 -38949 -31608 -15099
8492 -15099 -28313 -38910 -17692 -16858 -26151 -39273 -19512 -11577 -1799 27217 -3565 -57150 -22405
$$ packed form
8580B931J8196O1611j78531k0729L0419R905J0707K0580Q222j2265N879k9977
8568g3052L8465L1514K134n6262l356K1286R939j1540J3540K4913Q981q216j7160
8555a8814J7164L4216J0075J2978k9694j9077k8276J4125K6174j6814k4909R311
8543a3541M269J1754m2692J3193L3131q503j2801j6408J4939K5768k2474j986
8531a5351Q653l013J2476j4929j2106J9702l087J8862Q915k3825L523J7015k7226
8518a0391J0880j3579j021l185J7656J0140l4471M384K08j4626M0479k1579k6352
8505d1457L5685j5313K303j9130L2477J5731r963j0315j3016k0399M448P341J6509
8492a5099j3214j0597K1218Q34r293j3122J9761P935R778K9016l0782n3585L4745
$$ plain form
8479 -22405 -10094 -19611 18200 23369 -24395 -55402 -47461 -10485 -22767 -30264 -19689 -423 -7084
8466 -7084 -32800 -2868 7575 -14981 -27188 -36529 -20235 -10670 31573 28191 643 -17714 -35182
8453 -35182 -28904 18503 16840 10318 3799 -13103 4430 -20568 919 -3814 -26071 -30876 -20761
8440 -20761 -38640 -63017 -47388 -22568 -26934 -34008 -50420 -26680 -22828 -12189 -12095 -34383 -43923
8427 -43923 -30319 -17821 7763 -10432 -33480 -70453 -13943 28370 -1596 -15284 581 15700
8415 15700 6840 30637 -296 -33121 -37181 -39638 -29046 -10045 -24043 -3144 -8950 -18731 -20877
8402 -20877 -24874 -27847 -17405 2 8769 4940 15875 16055 -3334 -29271 -47240 -38231 -41511
8389 -41511 -41842 -23408 -10546 83 -36596 -48110 9111 -6507 -24551 -42533 -27636 -6916
$$ packed form
8479b2405J2311r517L7811N169m7764l1007P941L6976j2282p497J0575J9266o661
8466g084k5716K9932J0443k2556j2207r341J6294R565M2243l382k7548j8357j7468
8453c5182O278M7407j663o522o519j6902J7533k4998K1487m733k2257m805J0115
8440b0761j7879k4377J5629K4820m366p074j6412K3740L852J0639R4k2288r540
8427d3923J3604J2498K5584j8195k3048l6973N6510M2313k9966j3688J5865J5119
8415A5700q860K3797l0933l2825m060k457J0592J9001j3998K0899n806r781k146
8402b0877l997k973J0442J7407Q767l829J0935J80j9389k5937j7969R009l280
8389d1511l31J8434J2862J0629l6679j1514N7221j5618j8044j7982J4897K0720
$$ plain form
8377 -6916 -60482 -29215 -1067 -7437 16705 -20673 -3661 1227 -17410 -26354 -7267 10247 -94
8364 -94 -6757 -12717 -20700 6395 9541 -34535 -34265 -27707 -37809 -177 4820 -27337 4218 40887
8350 40887 13543 -31152 -16221 -15522 -17058 -36509 -24068 8072 -11086 -27952 15072 -25611
8338 -25611 -59559 -49145 -32474 -26053 -16718 -8211 -9558 -31151 -30680 -21889 -33069 -12907 -27414
8325 -27414 -33338 -6546 11966 -3320 15392 25148 -16318 -31928 -23198 -16061 -44025 -50337 -24153
8312 -24153 11238 -13880 -38592 -29739 -45762 -27527 -34228 -33298 -51031 -61032 -35591 -17060 -4899
8299 -4899 -4893 -8107 -5005 -5713 -33189 -24357 29181 33745 -1129 -9814 -66283 -53610 -23522 -23199 -25254
8284 -25254 -21345 -54678 -58247 -45187 -61274 -30364 -23865 -42034 -43686 -11881 -4390 -8307 -210
$$ packed form
8377f916n3566L1267K8148o370K4142l7378J7012M888j8637q944J9087J7514j0341
8364i4o663n960p983K7095L146m4076K70O558j0102L7632M997l2157L1555L6669
8350D0887k7344m4695J4931O99j536j9451J2441L2140j9158j6866M3024m0683
8338b5611l3948J0414J6671O421R335Q507j347k1593M71Q791j1180K0162j4507
8325b7414n924K6792J8512j5286J8712R756m1466j5610Q730P137k7964o312K6184
8312b4153L5391k5118k4712Q853j6023J8235o701R30j7733j0001K5441J8531J2161
8299d899Ol214L102p08k7476Q832N3538M564l4874q685n6469J2673L0088L23k055
8284b5254L909l3333l569J3060j6087L0910O499j8169j652L1805P491l917Q097
$$ plain form
8271 -210 -26777 -49826 14411 15521 -9938 -23216 -37345 -44129 -45168 -50671 -12830 -21966 -27394
8258 -27394 -34418 -66363 -52006 -5606 -10197 7596 424 -7830 3997 28470 6415 -10612 -37706
8245 -37706 -46175 -3781 -16783 -32523 -27149 -38166 -40670 -13042 -16834 -14822 -28305 -28061 -13620
8232 -13620 -45211 -41380 -22936 -29649 -11288 -20696 -16765 -8295 -5234 -28770 -30621 -35885 -19635
8219 -19635 -53035 -64887 -36520 -17858 2459 5875 -46277 -69604 -30121 -25744 -53937 -32097
8207 -32097 -34902 -7140 -46372 -26366 -16677 -4875 -15595 -37538 -59710 20673 37773 49549
8195 49549 -43135 -50858 -191185 -462130 -146492 -6795 45691 38918 -785 -32117 20407
8184 20407 36345 22337 5440 -52565 -25115 8920 -22192 -15351 -29968 -27277 2447 9101
$$ packed form
8271b10k6567k3049O4237J110k5459j3278j4129o784j039n503L7841r136n428
8258b7394p024l1945J4357M6400m591J7793p172q254J1827K4473k2055j7027k7094
8245c7706q469M2394j3002j5740N374j1017k504K7628l792K012j3483K44J4441
8232a3620l1591L831J8444o713J8361r408L931Q470L061k3536j851n264J6250
8219a9635l3400j1852K8367J8662K0317L416n2152k3327L9483M377k8193K1840
8207c2097k805K7762l9232K0006R689J1802j0720k1943k2172Q0383J7100J1776
8195D9549r2684p723j40327k70945L15638J39697N2486o773l9703l1332N2524
8184B0407J5938j4008j6897n8005K7450L4035l1112O841j4617K691K9724O654
$$ plain form
8172 9101 -15502 -22728 -6235 -23311 -13158 -11948 3766 -24771 -24804 -806 -3085 -14577 -15168 -4140
8158 -4140 -1311 -13861 30670 25303 -11839 -9677 -28183 -42517 -25162 -2833 -961 -11623 6990
8145 6990 28101 15450 24711 19160 2379 -32650 -28400 -13783 -46996 -49552 -43927 -44072 -35517 7026
8131 7026 -5599 28046 5275 -4441 -11965 -33236 -27568 2931 -4961 -46313 -37616 -41600 -39851
8118 -39851 -32023 -700 -34804 -56479 -23400 37301 21142 -2747 -6397 -20030 3646 4369 1672
8105 1672 -19995 -22752 11912 12208 -6989 10247 30169 -8668 -880 10040 10727 -1479 6640
8092 6640 19545 -8042 -66028 -31409 -24616 -39884 -3647 -10403 11471 37721 26023 13500
8080 13500 -12361 4661 -29267 -23516 13378 -14494 -1121 1550 -5711 -13150 -11512 -24437 1711
$$ packed form
8172I101k4603p226J6493j7076J0153J210J5714k8537l3K3998k279j1492n91J1028
8158d140K829j2550M4531n367l7142K162j8506j4334J7355K2329J872j0662J8613
8145F990K1111j2651R261n551j6781l5029M250J4617l3213k556N625j45Q555M2543
8131G026j2625L3645k2771r716p524k1271N668L0499p892m1352Q697l984J749
8118c9851P828L1323l4104k1675L3079O0701j6159k3889l650j3633K3676P23k697
8105A672k1667k757L4664K96j9197J7236J9922l8837P788J0920O87j2206Q119
8092F640J2905k7587n7986L4619O793j5268L6237o756K1874K6250j1698j2523
8080A3500k5861J7022l3928N751L6894k7872J3373K671p261p439J638j2925K6148
$$ plain form
8067 1711 7712 5054 -12862 -16412 -9074 -10065 -14718 -10016 -2101 -4643 -11082 -406 19944 34531
8053 34531 22909 -20249 -52032 -13676 23771 10822 5137 29707 3137 -8091 19138 17554
8041 17554 3202 -4576 13137 -11324 6232 -1081 -27855 -14812 -16007 -16236 -22753 15381 14395
8028 14395 -5426 -5305 -9367 7760 -15381 -7394 -8149 -9675 35023 39603 -3357 6850 7161 17080
8014 17080 4909 -1204 5620 8039 2428 20368 -8303 -39738 12198 -7853 -17332 -25939 -37783
8001 -37783 -50272 -32246 -29121 -37187 -59747 -50373 -23762 -50772 -27596 -29450 -10368 10721 -9213
7988 -9213 -7992 -31020 -43897 -21893 -10050 -41722 -9892 -13561 3864 2114 15960 18925 -588
7975 -588 -24651 -27846 -11890 -21236 -29255 -17477 -6234 -6604 -5439 1658 8275 19566 11056 14051
$$ packed form
8067A711O001k658j7916l550P338r91m653M702P915k542o439J0676K0350J4587
8053C4531j1622m3158l1783L8356L7447j2949n685K4570k6570j1228K7229j584
8041A7554j4352p778J7713k4461J7556p313k6774J3043j195k29o517L8134r86
8028A4395j9821J21m062J7127k3141P987p55j526M4698M580m2960J0207L11R919
8014A7080j2171o113O824K419n611J7940k8671l1435N1936k0051r479q607j1844
8001c7783j2489J8026L125q066k2560R374K6611k7010K3176j854J9082K1089j9934
7988i213J221k3028j2877K2004J1843l1672L1830l669J7425j750J3846K965j9513
7975e88k4063l195J5956r346q019J1778J1243l70J165P097O617J1291q510K995
$$ plain form
7961 14051 20085 11451 31438 34251 -4952 -38781 -15577 -16537 -39310 8667 7431 -15923 1790
7948 1790 -10269 -12931 -19587 -2353 11543 6289 -24891 -15634 -19616 -32820 -54228 -56855 -64861
7935 -64861 -41569 -46003 -16580 -34559 -49413 -39655 12818 4495 -26882 -26304 -36101 -26300 -12019
7922 -12019 12152 12219 50460 34910 -19150 -18968 -28116 16642 19962 16550 38815 26203 -1795
7909 -1795 10961 11695 2728 21291 28741 10406 -30899 -9149 47334 40621 -7692 -9290 -9865 -20475
7895 -20475 -49565 -57082 -36286 -3112 -6701 -6395 -14118 -28282 -58818 -16599 19187 14657 -7599
7882 -7599 -10027 -1694 -15542 -14833 -22027 -14085 -19712 -45488 -14435 -16912 -26073 -18116 -13559 -16534
7868 -16534 -16159 -16483 -35831 -22407 -53 -34499 -32251 -24895 -21134 -27479 -36396 -70784 -87539 -29062
$$ packed form
7961A4051O034q634J9987K813l9203l3829K3204r60k2773M7977j236k3354J7713
7948A790j2059k662o656J7234J3896n254l1180R257l982j3204k1408k627q006
7935f4861K3292m434K9423j7979j4854R758N2473q323l1377N78r797R801J4281
7922a2019K4171O7L8241j5550n4060J82r148M4758L320l412K2265j2612k7998
7909a795J2756P34q967J8563P450j8335m1305K1750N6483o713m8313j598n75j0610
7895b0475k9090p517K0796L3174l589L06p723j4164l0536M2219L5786m530k2256
7882g599k428Q333j3848P09p194P942n627k5776L1053k477r161P957M557k975
7868a6534L75l24j9348J3424K2354l4446K248P356L761o345q917l4388j6755N8477
$$ plain form
7854 -29062 1571 -13093 -7136 -32849 -34158 527 16801 10540 7579 20755 37331 17629 -6816
7841 -6816 14224 28314 -6201 25128 10615 551 -6 -2288 1030 -3148 13610 -14190 -18417
7828 -18417 -62 8674 -10889 -10123 -1476 -13724 -10324 -14880 -48350 -21965 -9040 -18419 6970
7815 6970 1236 -3484 -838 10876 383 -38886 -28673 -35301 -40549 -75645 114362 125928 56527
7802 56527 19128 13292 1501 -27051 -25637 -21687 -37315 -41496 -21939 -1596 12902 -44120 -45441
7789 -45441 -33822 -36451 -22583 -2315 17903 -4624 -12109 21972 27164 17042 -12664 -22470 -26959
7776 -26959 -18247 4024 -13087 -15279 -28135 1238 21880 31204 19532 22138 23740 25090 16107
7763 16107 -13454 -25746 -24727 -4312 -5832 10484 -19580 -21953 -25419 3564 -784 10681 1641
$$ packed form
7854b9062L0633j4664N957k5713j309L4685J6274o261k961J3176J6576j9702k4445
7841f816K1040J4090l4515L1329j4513j0064n57k282L318m178J6758k7800m227
7828a8417J8355Q736j9563P66Q647j2248L400m556l3470K6385J2925r379K5389
7815F970n734m720K646J1714j0493l9269J0213o628n248l5096J90007J1566o9401
7802E6527l7399n836j1791k8552J414L950j5628m181J9557K0343J4498n7022j321
7789d5441J1619k629J3868K0268K0218k2527p485L4081N192j0122k9706r806m489
7776b6959Q712K2271j7111k192j2856K9373K0642R324j1672K606J602J350q983
7763A6107k9561j2292J019K0415j520J6316l0064k373l466K8983m348J1465r040
$$ plain form
7750 1641 -12350 -27598 -1258 -23105 -49427 -42876 -26397 -22600 12536 -20944 -8989 3105
7738 3105 -21872 -40985 -21556 -20529 -19577 10938 9368 24917 15142 2220 -18543 -6126 23403
7725 23403 -4590 -32446 -46051 -26151 -58 -6529 13427 17524 -10179 11032 -3395 30555
7713 30555 10986 -6040 -2481 -48029 -43511 -13272 7489 -15068 -12252 -22026 24376 4577 16370
7700 16370 7234 -27768 -35769 -22140 -9615 -34956 -80023 -38693 -77060 -52044 -16859 -38112
7688 -38112 -22983 -45815 -28133 -40126 -39187 -14784 -5712 -2972 25838 54164 18704 -4126 16590
7675 16590 9332 16465 43011 13612 11864 2799 968 701 -9655 5815 1819 -19588 -9901 -8892
7661 -8892 -28957 2433 -19209 -38158 -51074 -59151 -10375 -3019 -10189 -47901 -28203 -48985 -32683
$$ packed form
7750A641j3991j5248K6340k1847k6322O551J6479L797L5136l3480J1955J2094
7738C105k4977j9113J9429J027R52L0515j570J5549r775j2922k0763J2417K9529
7725B3403k7993k7856j3605J9900K6093o471J9956M097k7703K1211j4427L3950
7713C0555j9569j7026L559m5548M518L0239K0761k2557K816r774M6402j9799J1793
7700A6370r136l5002q001J3629J2525k5341m5067M1330l8367K5016L5185k1253
7688c8112J5129k2832J7682j1993R39K4403R072K740K8810K8326l5460k2830K0716
7675A6590p258P133K6546k9399j748r065j831k67j0356J5470l996k1407R687J009
7661h892k0065L1390k1642j8949j2916q077M8776P356p170l7712J9698k0782J6302
$$ plain form
7648 -32683 -35756 -43896 -11752 -35844 -33279 -16554 -13881 -6661 11852 -3407 -25094 -34897 -56087
7635 -56087 -59650 -18973 -29268 -39121 3493 1508 9378 24869 15269 1469 -22469 7093 -28492
7622 -28492 -18564 -833 -23026 -29276 -9371 -13065 4710 -5355 -3477 -21785 -13710 -17363 -14453
7609 -14453 -21872 8221 -17550 -16516 -5435 -8242 -8201 5045 31823 19480 -16028 -39762 -6952
7596 -6952 -9829 -4102 -32798 -14175 6166 14956 18903 5542 6068 34008 -25227 -16393 3916
7583 3916 30246 25729 20167 41224 6254 17063 22525 -19498 -5693 -49145 -29383 22055 -1491
7570 -1491 18975 8620 4522 -14634 -364 46394 2877 9070 10616 -3258 -14922 -17037 -520
7557 -520 -19000 -26441 -13134 -21818 2093 33201 27203 12006 34826 38374 41708 56314 61240
$$ packed form
7648c2683l073q140L2144k4092K565J6725K673P220J8513j5259k1687r803k1190
7635e6087l563M0677j0295r853M2614j985P870J5491r600j3800k3938K9562l5585
7622b8492R928J7731k2193o250J9905l694J7775j0065J878j8308Q075l653K910
7609a4453p419L0093k5771J034J1081k807M1J3246K6778j2343l5508k3734L2810
7596f952k877N727k8696J8623K0341Q790L947j3361N26K7940n9235Q834K0309
7583C916K6330m517n562K1057l4970J0809N462m2023J3805m3452J9762N1438k3546
7570a491K0466j0355m098j9156J4270M6758m3517O193J546j3874j1664k115J6517
7557e20j8480p441J3307q684K3911L1108n998j5197K2820L548L334J4606M926
$$ plain form
7544 61240 46120 49893 51459 70901 79859 79442 119753 116774 130642 112974 172707 212221 183724
7531 183724 196932 198427 171703 137297 136957 160308 177452 172007 110067 105009 118753 112694 92858
7518 92858 67990 55648 65643 37239 51446 58933 59385 62742 49338 28857 28947 43714 70413
7505 70413 58581 70380 65278 17115 -9733 -36986 9953 13120 5492 -19780 -25720 -4343 -2286
7492 -2286 -8891 -33353 -33803 10932 4456 -634 16935 14277 -7829 -25919 -550 11589 -3494
7479 -3494 -41928 -39584 18427 25139 24768 14082 -17470 -7640 6753 43755 29013 16572 9334
7466 9334 -19451 -7244 2250 -1534 -18026 -18027 -6163 33085 39216 -9332 8137 -1955 -11623 2533
7452 2533 -3524 788 -30402 -31929 308 9338 -14940 -32211 -28136 -3646 13330 -5569 -27546
$$ packed form
7544F1240j5120L773J566J9442Q958m17M0311k979J3868j7668N9733L9514k8497
7531A83724J3208J495k6724l4406l40K3351J7144n445o1940n058J3744o059j9836
7518I2858k4868j2342R995k8404J4207P487M52L357j3404k0481R0J4767K6699
7505G0413j1832J1799n102m8163k6848k7253M6939L167p628k5272n940K1377K057
7492b286o605k4462m50M4735o476n090J7569k658k2106j8090K5369J2139j5083
7479c494l8434K344N8011O712l71j0686l1552R830J4393L7002j4742j2441p238
7466I334k8785J2207R494l784j6492jJ1864L9248O131m8548J7469j0092r668J4156
7452B533o057M312l1190j527L2237R030k4278j7271M075K4490J6976j8899k1977
$$ plain form
7439 -27546 -30525 1149 -43698 -44983 -15250 3626 -4292 -27664 -14329 -9903 -14959 -7949 3650
7426 3650 -27159 -20851 1281 4943 17046 15368 -11595 -11511 -10790 -26504 -11214 613 -25666 -6021
7412 -6021 -31273 -55322 -15280 -551 -316 -7893 -17363 -7788 -18678 -10326 -14373 1297 4933 -4559
7398 -4559 -1817 -15387 -10963 -11008 -5859 5229 -3271 -15482 -16953 18570 25762 1175 6141 1818
7384 1818 8656 11645 1558 -13946 -14652 6847 661 -6177 17093 19596 -26 2939 -27979 -67771
7370 -67771 -33161 1960 -27782 -2055 -17988 -19036 -37343 -1678 48157 11262 21437 13159
7358 13159 -11473 7342 12651 37390 51976 12678 3336 621 23822 54024 47213 43954 24776
7345 24776 -5330 -17229 8576 -5321 -5295 -15669 -19551 -3646 -6077 -30015 -27637 -18512 -9819
$$ packed form
7439b7546k979L1674m4847j285K9733J8876p918k3372J3335M426n056P010J1599
7426C650l0809O308K2132L662J2103j678k6963Q4P21j5714J5290J1827k6279J9645
7412f021k5252k4049M0042J4729K35p577r470R575j0890Q352m047J5670L636r492
7398d559K742j3570M424m5N149J1088q500j2211j471L5523P192k4587M966m323
7384A818O838K989j0087j5504p06K1499o186o838K3270K503j9622K965l0918l9792
7370f7771L4610L5121k9742K5727j5933j048j8307L5665M9835l6895J0175q278
7358A3159k4632J8815N309K4739J4586l9298r342k715K3201L0202o811l259j9178
7345B4776l0106j1899K5805j3897K6j0374l882J5905k431k3938K378R125Q693
$$ plain form
7332 -9819 30814 -1969 1157 -18424 -11694 4770 -37767 -34761 -1586 -23943 -17832 -16395 15537
7319 15537 7372 15320 24338 36093 45258 27468 -11970 -8879 23521 17577 -32555 -26071 -19319
7306 -19319 -25170 -24993 -46122 -56061 -16446 -1952 -7878 -22361 -16506 28978 39127 33474 43118
7293 43118 -1968 4227 10838 11819 -31691 -20943 -9868 -32711 -28261 -6404 -9329 -37905 -49751
7280 -49751 -56621 -11271 -1110 8601 -38661 -24936 -3839 12747 13263 3165 -16275 7371 2513
7267 2513 3242 -3415 -7824 -50963 -46162 -365 36959 38169 16443 -16492 10314 5395 -13588
7254 -13588 22759 4757 -13433 -1766 12193 -5853 4763 40500 32879 -10120 -4021 10398
7242 10398 13950 -2621 -14519 -10341 -15259 -32221 -40068 -19653 -457 -1006 5355 -17058 -16589 -10527
$$ packed form
7332i819M0633l2783L126j9581O730J6464m2537L006L3175k2357O111J437L1932
7319A5537q165P948R018J1755R165j7790l9438L091L2400n944n0132O484O752
7306a9319n851J77k1129r939L9615J4494n926j4483N855M5484J0149n653R644
7293D3118m5086O195O611R81m3510J0748J1075k2843M450K1857k925k8576j1846
7280d9751o870M5350J0161R711m7262J3725K1097J6586N16j0098j9440K3646m858
7267B513P29o657m409m3139M801M5797L7324J210k1726l2935K6806m919j8983
7254a3588L6347j8002j8190J1667J3959j8046J0616L5737p621m2999O099J4419
7242A0398L552j6571j1898M178m918j6962p847K0415J9196n49O361k2413M69O062
$$ plain form
7228 -10527 -4261 -25853 -47917 -39611 -60774 -34914 -25447 -5663 -21697 -5198 15366 17041 5005
7215 5005 11715 15436 4873 -18406 -4535 26301 16621 22027 12949 -3588 -25510 11092 16472
7202 16472 17998 16537 5295 -1374 11399 6465 17535 57 -12743 32612 44626 49784 39042
7189 39042 26171 25470 1191 -9609 -22617 -4477 16849 7267 -8094 -46881 -40681 -1834 -4105
7176 -4105 -17889 -4899 -27162 -52520 -29371 3007 17518 21076 24316 43218 24371 16414 -13931
7163 -13931 -18755 10890 -27823 -26678 6489 23341 28155 29139 38467 14480 21766 26709 13786
7150 13786 -14152 -17436 13439 19381 12782 1714 -21456 -35269 -21517 -13849 -7145 -16571 -40867
7137 -40867 -42862 -20790 -15765 8386 -7900 -6511 -25911 -33604 -33743 -8347 18603 -2470 4140
$$ packed form
7228a0527O266k1592k2064Q306k1163K5860R467J9784j6034J6499K0564J675j2036
7215E005O710L721j0563k3279J3871L0836r680N406r078j6537k1922L6602N380
7202A6472J526j461j1242o669J2773m934J1070j7478j2800M5355J2014N158j0742
7189C9042j2871p01k4279j0800j3008J8140K1326r582j5361l8787O200L8847k271
7176d105j3784J2990k2263k5358K3149L2378J4511L558L240J8902j8847p957l0345
7163a3931m824K9645l8713J145L3167J6852M814R84R328k3987P286M943j2923
7150A3786k7938l284L0875N942o599j1068k3170j3813J3752P668O704r426k4296
7137d0867j995K2072N025K4151j6286J389j9400p693j39K5396K6950k1073O610
$$ plain form
7124 4140 2143 -18212 23979 55982 21306 -3919 23542 23381 18370 38572 2910 -32419 -13059
7111 -13059 -9364 -8922 46933 31472 8896 22733 33576 18903 -21599 -45278 -42227 -6024 19655
7098 19655 -19930 -29538 9400 591 25238 42587 33578 21055 1438 16799 18460 -4924 4538
7085 4538 13051 38781 31871 24057 15665 -44956 -2363 -3079 -29753 -22722 -31980 -24397 -36294 -16462
7071 -16462 -22526 -42305 -10974 -30015 -25844 -8386 -4558 4234 -16662 24928 35730 33949 27633
7058 27633 6749 19585 19203 20204 25577 35454 23135 1480 12243 24074 17893 24707 8769
7045 8769 9640 3856 -7220 8265 4365 -9479 -18075 -16746 -28037 -31284 -12440 13186 31979
7032 31979 13950 6459 11815 -25442 -22488 16824 10275 35886 32315 8854 -8703 -32622 2454
$$ packed form
7124D140j997k0355M2191L2003l4676k5225K7461j61n011K0202l5662l5329J9360
7111a3059L695M42N5855j5461k2576J3837J0843j4673m0502k3679L051L6203K5679
7098A9655l9585r608L8938q809K4647J7349r009j2523j9617J5361J661k3384R462
7085D538Q513K5730o910p814q392o0621M2593p16k6674P031r258P583j1897J9832
7071a6462o064j9779L1331j9041M171J7458L828Q792k0896M1590J0802j781o316
7058B7633k0884J2836l82J001N373R877j2319k1655J0763J1831o181O814j5938
7045H769Q71n784j1076J5485l900j3844q596J329j1291l247J8844K5626J8793
7032C1979j8029p491N356l7257K954L9312o549K5611l571k3461j7557k3919L5076
$$ plain form
7019 2454 -8500 -11932 -7688 -20532 13953 -30887 -32996 -4220 -750 -1462 20339 4185 9904
7006 9904 41351 29550 20434 -4291 15343 -2429 -18332 -39480 -9421 8399 8700 2746 -2490
6993 -2490 -9516 -14435 5421 -9615 -3629 -7410 178 -22281 -27740 13648 9681 -9887 17685
6980 17685 15487 34862 -183 -39469 -10018 41809 34705 14172 -4062 -9848 759 26230
6968 26230 43731 14775 53897 41163 56813 50530 33913 5416 23845 34466 21947 9836
6956 9836 23819 6741 -2509 -10546 -41615 -14543 -12433 -17794 -14683 -8453 3349 10245 -26245
6943 -26245 -43853 -25840 2275 9185 -16786 -14154 10285 11922 20096 -23905 1817 -2476 -31620
6930 -31620 -38873 -12654 -20712 -1467 325 -22691 -16656 8995 -2103 22872 30547 30860 28751
$$ packed form
7019B454j0954l432M244j2844L4485m4840k109K8776L470p12K1801j6154N719
7006I904L1447j1801r116k4725J9634j7772j5903k1148L0059J7820L01n954n236
6993b490p026m919J9856j5036N986l781P588k2459n459M1388l967j9568K7572
6980A7685k198J9375l5045l9286K9451N1827p104k0533j8234n786J0607K5471
6968B6230J7501k8956L9122j2734J5650o283j6617k8497J8429J0621j2519j2111
6956I836J3983j7078r250q037l1069K7072K110n361L111O230J1802O896l6490
6943b6245j7608J8013K8115O910k5971K632K4439J637Q174m4001K5722m293k9144
6930c1620p253K6219q058J9245J792k3016O035K5651j1098K4975P675L13k109
$$ plain form
6917 28751 -1273 6678 -19238 -5354 -18942 -1768 -15717 -12748 -2256 3407 32061 39137 22627
6904 22627 35540 23594 23507 37682 20929 -18254 -2494 -2933 4520 29024 13891 28407 20177
6891 20177 37327 54237 19760 7696 9460 -3738 -17509 -11876 -23499 -7035 -5556 -31952
6879 -31952 -14916 -24582 -2892 31258 36123 35646 18147 21219 -2056 15528 43236 31479 24410
6866 24410 10885 -7659 13359 10449 10301 15158 3726 -24356 -35561 -2617 25702 -1436 -7481
6853 -7481 14847 48577 45180 39339 14732 -16201 6253 871 5783 8743 3760 -26835 -17613
6840 -17613 -9056 -5187 1311 5190 12274 39268 33049 36599 3051 -15833 15006 28414 18087
6827 18087 4980 -891 -8064 -6603 -32333 -35931 -32757 -24281 -16253 2881 -6271 -11394 21560 26248
$$ packed form
6917B8751l0024P951k5916J3884j3588J7174j3949K969J0492N663K8654P076j6510
6904B2627J2913j1946q7J4175j6753l9183J5760m39P453K4504j5133J4516q230
6891B0177J7150J6910l4477j2064J764j3198j3771N633j1623J6464J479k6396
6879c1952J7036r666K1690L4150M865m77j7499L072k3275J7584K7708j1757p069
6866B4410j3525j8544K1018k910j48M857j1432k8082j1205L2944K8319k7138o045
6853g481K2328L3730l397n841k4607l0933K2454n382M912K960m983l0595R222
6840a7613Q557L869O498L879P084K6994o219L550l3548j8884L0839J3408j0327
6827A8087j3107n871p173J461k5730l598L174Q476Q028J9134r152n123L2954M688
$$ plain form
6813 26248 41555 48122 43944 -9959 29481 31828 12433 29880 25441 30746 13338 13349 38715
6800 38715 14155 36056 44151 -750 12272 28273 36718 35928 19060 13222 15732 6807 44735
6787 44735 17125 -1955 30079 50664 35476 1032 -20686 5251 4115 23016 33723 30741
6775 30741 38775 48530 13135 -24998 -14470 28506 33221 3920 30463 12660 -4945 -15475
6763 -15475 2095 -34924 -2644 13388 28042 -15505 -20639 21210 -10782 -20780 -18930 -5891
6751 -5891 193 8611 -2560 7539 18080 30191 4902 -12868 -13524 10486 -13597 -8917 20422
6738 20422 19860 28650 -5975 11651 23556 1484 -11029 -6425 11428 -5383 -2912 4371 17477
6725 17477 -351 -14863 8881 24536 -2175 18028 16649 -10166 -16090 22399 73660 80326
$$ packed form
6813B6248J5307O567m178n3903L9440K347j9395J7447m439N305j7408J1K5366
6800C8715k4560K1901Q095m4901J3022J6001Q445p90j6868n838K510q925L7928
6787D4735k7610j9080L2034K0585j5188l4444k1718K5937j136J8901J0707k982
6775C0741Q034R755l5395l8133J0528M2976M715k9301K6543j7803j7605j0530
6763a5475J7570l7019L2280J6032J4654m3547n134M1849l1992r998J850J3039
6751e891O084Q418j1171J0099J0541J2111k5289j7770o56K4010k4083M680K9339
6738B0422n62Q790l4625J7626J1905k2072j2513M604J7853j6811K471P283J3106
6725A7477j7828j4512K3744J5655k6711K0203j379k6815n924L8489N1261O666
$$ plain form
6713 80326 51405 28984 6526 -9027 -21609 -40762 -13023 6914 17403 38581 5424 -10695
6701 -10695 4706 23195 30697 -18439 -51430 -40076 -14198 10725 31564 -1521 -13531 -5890
6689 -5890 -25102 -13143 27681 20396 -8586 -3208 2544 5130 -2080 19259 38987 6003 3699
6676 3699 21794 54654 55395 42994 23611 -1526 -13666 19803 48157 10349 10608 9426 -3507
6663 -3507 2677 24452 30440 33933 43389 36795 36581 35818 5145 -14068 -6784 3527 -9726 13132
6649 13132 60407 30905 29333 38745 6834 9249 51380 21011 6367 10553 6294 25688 24196
6636 24196 34835 34653 41676 36488 6932 -19515 -4895 2987 -7062 31199 11254 7614 24744
6623 24744 25795 44723 7549 20848 21494 13142 -22994 -2219 16704 15029 35626 43688 70552
$$ packed form
6713H0326k8921k2421k2458j5553j2582j9153K7739J9937J0489K1178l3157j6119
6701a0695J5401J8489P502m9136l2991J1354K5878K4923K0839l3085j2010P641
6689e890j9212J1959M0824p285k8982N378N752K586p210K1339J9728l2984k304
6676C699J8095L2860P41j2401j9383k5137j2140L3469K8354l7808K59j182j2933
6663c507O184K1775N988L493R456o594k14p63l0673j9213P284J0311j3253K2858
6649A3132M7275k9502j572R412l1911K415M2131l0369j4644M186m259J9394j492
6636B4196J0639j82P023n188k9556k6447J4620P882j0049L8261j9945l640J7130
6623B4744J051J8928l7174J3299O46q352l6136K0775J8923j675K0597Q062K6864
$$ plain form
6610 70552 46019 38476 18030 25115 20389 17360 17648 18735 9413 29746 64720 21227 -12988
6597 -12988 7428 27149 46709 10156 9015 26754 10941 31461 35442 -7493 15451 34622
6585 34622 38397 21542 577 -9569 -8648 22075 20394 22431 61549 54938 21264 25277 21827
6572 21827 4798 -35315 -27966 21580 49757 43720 37436 18869 44113 15660 15797 25374 2018
6559 2018 39627 37344 -17141 -3276 34227 56026 56061 34807 46919 33593 32684 36647 7324
6546 7324 -7489 -15574 22097 -6958 -34885 -39153 1172 13655 -1922 -4975 -7052 -21203 5505
6533 5505 7555 -11012 13600 35903 39129 51610 18529 16374 39718 20016 29235 49528 63211
6520 63211 13857 32860 41352 19202 -6374 4206 2425 -2298 -11729 18531 23245 36201 52472
$$ packed form
6610G0552k4533p543k0446P085m726l029K88J087r322K0333L4974m3493l4215
6597a2988K0416J9721J9560l6553j141J7739j5813K0520L981m2935K2944J9171
6585C4622L775j6855k0965j0146R21L0723j681K037L9118o611l3674M013l450
6572B1827j7029m0113P349M9546K8177o037o284j8567K5244k8453J37R577k3356
6559B018L7609k283n4485J3865L7503K1799L5k1254J2112j3326r09L963k9323
6546G324j4813q085L7671k9055k7927m268M0325J2483j5577l053k077j4151K6708
6533E505K050j8567K4612K2303L226J2481l3081k155K3344j9702R219K0293J3683
6520F3211m9354J9003Q492k2150k5576J0580j781m723r431L0260M714J2956J6271
$$ plain form
6507 52472 48045 5335 13943 6964 -12902 5613 41103 50090 20130 16118 17548 -4567 1736
6494 1736 19872 9680 -4579 2622 5371 -5764 -1682 32822 35806 4643 36992 8052 -10039
6481 -10039 -2790 26724 23678 26115 40056 48023 56030 20438 6400 29176 45295 46419 36000
6468 36000 19396 14679 -5947 15553 5602 11809 3847 12468 24191 21890 26398 -5571 2783
6455 2783 27576 63053 38302 39677 37059 31356 30287 22183 508 -10494 17694 27336 32596
6442 32596 20830 7770 14851 30860 45244 53505 43132 23347 33560 21012 27928 19589 16611
6429 16611 39899 55154 56454 2718 -4044 23121 21212 2785 -2523 19661 8746 50352 67034
6416 67034 61065 26141 27688 4795 3324 14299 25348 59143 34966 47421 37304 46555 64509
$$ packed form
6507E2472m427m2710Q608o979j9866J8515L5490Q987k9960m012J430k2115O303
6494A736J8136j0192j4259P201K749j1135M082L4504K984l1163L2349k8940j8091
6481a0039P249K9514l046K437J3941P967Q007l5592j4038K2776J6119J124j0419
6468C6000j6604m717k0626K1500r951O207p962Q621J1723k301M508l1969Q354
6455B783K4793L5477k4751J375k618n703j069q104k1675j1002K8188R642N260
6442C2596j1766j3060P081J6009J4384Q261j0373j9785J0213j2548O916q339k978
6429A6611K3288J5255J300n3736o762K7165j909j8427n308K2184j0915M1606J6682
6416F7034n969l4924J547k2893j471J0975J1049L3795k4177J2455j0117R251J7954
$$ plain form
6403 64509 50417 8580 23299 37123 41736 41504 9099 4204 -393 -10874 7540 9724 23351
6390 23351 -364 -12583 -557 24057 57562 44949 9222 -18864 47188 99910 40969 43606
6378 43606 52890 34108 13645 20433 14610 3484 18896 19545 40714 35151 42344 21401 30785
6365 30785 29676 59983 99669 51123 22660 48028 33802 23965 20741 32163 26767 8612 30234
6352 30234 30381 39182 48169 6973 20653 28325 26374 25148 34106 39938 25472 27931 28838 43451
6338 43451 53787 43056 27814 45725 20931 53943 59260 53164 62873 54138 50173 57330 51541
6325 51541 60337 46100 73523 60319 61319 53752 42728 54724 40110 39519 37812 64366 55966
6312 55966 67615 44757 34485 60444 74204 46261 54594 74826 72431 99269 84522 69282
$$ packed form
6403F4509j4092m1837J4719J3824M613k32l2405m895m597j0481J8414K184J3627
6390B3351k3715j2219J2026K4614L3505j2613l5727k8086O6052N2722n8941K637
6378D3606R284j8782k0463O788n823j1126J5412O49K1169n563P193k0943R384
6365C0785j109L0307L9686m8546k8463K5368j4226r837l224J1422n396j8155K1622
6352C0234J47Q801Q987m1196J3680P672j951j226Q958N832j4466K459R07J4613
6338D3451J0336j0731j5242J7911k4794L3012N317o096R709q735l965P157n789
6325E1541Q796j4237K7423j3204J000p567j1024J1996j4614n91j707K6554q400
6312E5966J1649k2858j0272K5959J3760k7943Q333K0232k395K6838j4747j5240
$$ plain form
6300 69282 37604 7166 29079 61742 57428 47574 48456 34398 15183 53805 35580 37051 14700
6287 14700 10800 12537 26488 59649 42757 35643 47021 60029 64602 56271 29124 41741 27828
6274 27828 56830 58217 32693 38173 99232 116844 54923 24498 3566 18199 37526 52063
6262 52063 30500 18083 51815 59017 31645 53735 90904 58419 51555 53511 48172 64155 46676
6249 46676 18852 16679 12541 40098 30714 41174 53130 63294 53398 31388 1396 18305 44239
6236 44239 33883 52373 36623 49543 49153 47379 64707 39841 42684 30655 31044 48191 47450
6223 47450 2470 43769 21693 36059 47976 34847 55875 76659 74456 43549 61979 60182
6211 60182 60436 31066 41391 85255 81645 81147 74104 77537 54698 74744 62608 49766 49587 40432
$$ packed form
6300F9282l1678l0438K1913L2663m314r854Q82j4058j9215L8622j8225J471k2351
6287A4700l900J737J3951L3161j6892p114J1378J3008M573q331k7147J2617j3913
6274B7828K9002J387k5524N480O1059J7612o1921l0425k0932J4633J9327J4537
6262E2063k1563j2417L3732P202k7372K2090L7169l2485o864J956n339J5983j7479
6249D6676k7824k173m138K7557r384J0460J1956J0164r896k2010k9992J6909K5934
6236D4239j0356J8490j5750J2920l90j774J7328k4866K843j2029L89J7147p41
6223D7450m4980M1299k2076J4366J1917j3129K1028K0784k203l0907J8430j797
6211F0182K54k9370J0325M3864l610m98p043L433k2839K0046j2136j2842j79r155
$$ plain form
6197 40432 60414 17913 41295 57287 43263 41832 61117 42843 14248 24142 9563 17764
6185 17764 31151 -5608 10761 36004 42361 73620 54709 14532 -2416 -721 22506 13240
6173 13240 45832 41844 49163 80698 51597 48132 57520 21473 6128 25732 22264 16941 -2850
6160 -2850 14584 65437 40770 8733 45532 61407 55016 70691 43182 53808 66454 49666
6148 49666 61199 21907 10255 36195 32087 34939 26260 66292 71788 100947 66480 79880 104004
6135 104004 75114 67522 53904 26814 26525 22445 37980 53392 49447 64698 62926 71569 48916
6122 48916 26892 53380 57262 46868 47653 45328 55130 50474 72789 78812 68245 65201 43355
6109 43355 42886 34571 31860 54721 47085 58644 70082 105360 117558 47807 76837 95852 60288
$$ packed form
6197D0432J9982m2501K3382J5992j4024j431J9285j8274k8595R894j4579Q201
6185A7764J3387l6759J6369K5243O357L1259j8911m0177j6948J695K3227r266
6173A3240L2592l988P319L1535k9101l465R388l6047j5345J9604l468n323j9791
6160b850J7434N0853k4667l2037L6799J5875o391J5675k7509J0626J2646j6788
6148D9666J1533l9292j1652K5940m108K852q679M0032N496K9159l4467J3400K4124
6135A04004k8890p592j3618k7090k89m080J5535J5412l945J5251j772Q643k2653
6122D8916k2024K6488L882j0394P85k325R802m656K2315O023j0567l044k1846
6109D3355m69q315k711K2861p636J1559J1438L5278J2198o9751K9030J9015l5564
$$ plain form
6096 60288 72408 60398 45584 54569 87708 112914 103640 98507 106237 97669 78874 47075 60365
6083 60365 54165 32720 33156 63566 78201 78098 86349 79537 117721 93330 49555 6392 26321
6070 26321 87946 71645 85441 82124 50732 42837 99100 99629 69621 51078 82285 50718 49052
6057 49052 79845 71267 67961 42260 54250 87466 83155 79930 67449 66938 65419 49615 84290
6044 84290 107448 97000 101580 80006 79104 78419 97554 94456 101587 89707 80819 125794 127867 98813
6030 98813 75467 90583 68347 74523 83308 74578 80127 82922 63759 72333 66866 104176 103194 84989
6016 84989 97212 86604 100081 90800 88626 90934 97189 94583 83474 82014 52010 66767 83883
6003 83883 74391 97481 84468 71650 89762 118957 100404 103620 97777 102198 67314 51873 75427
$$ packed form
6096F0288J2120j2010j4814Q985L3139K5206r274n133P730q568j8795l1799J3290
6083F0365o200k1445M36L0410J4635j03Q251o812L8184k4391m3775m3163J9929
6070B6321O1625j6301J3796l317l1392p895N6263N29l0008j8543L1207l1567j666
6057D9052L0793q578l306k5701J1990L3216m311l225j2481n11j519j5804L4675
6044H4290K3158j0448M580k1574r02o85J9135l098P131j1880q888M4975K073k9054
6030I8813k3346J5116k2236O176Q785q730N549K795j9163Q574n467L7310r82j8205
6016H4989J2223j0608J3477r281k174K308O255k606j1109j460l0004J4757J7116
6003H3883r492K3090j3013j2818J8112K9195j8553L216n843M421l4884j5441K3554
$$ plain form
5990 75427 71164 109682 117638 95470 97189 115636 136899 142422 105285 106218 130157 152126 129444
5977 129444 111620 123684 90940 77298 114847 140827 136527 96468 117702 101303 102725 123198
5965 123198 132512 149165 154650 165878 116810 108387 113203 91456 75360 86584 87518 107035 125697
5952 125697 83806 106443 127425 94026 96364 97561 121317 134755 118115 87598 70806 65215
5940 65215 34041 19871 78888 123489 128168 106849 111794 127073 132321 141754 128786 112432 128001
5927 128001 160283 166494 126707 103928 130536 134736 152199 178617 174094 149742 154158 156141 168072
5914 168072 128836 144823 143391 132053 168724 151312 146711 180759 177674 182515 191630 194150 181392
5901 181392 205648 192897 193596 209732 210847 173021 195502 196419 190221 191158 180130 188668 206873
$$ packed form
5990G5427m263L8518P956k2168J719J8447K1263N523l7137R33K3939K1969k2682
5977A29444j7824J2064l2744j3642L7549K5980m300m0059K1234j6399J422K0473
5965A23198R314J6653N485J1228m9068q423M816k1747j6096J1224R34J9517J8662
5952A25697m1891K2637K0982l3399K338J197K3756J3438j6640l0517j6792n591
5940F5215l1174j4170N9017M4601M679k1319M945J5279N248R433j2968j6354J5569
5927A28001L2282O211l9787k2779K6608M200J7463K6418m523k4352M416J983J1931
5914A68072l9236J5987j432j1338L6671j7412m601L4048l085M841R115K520j2758
5901A81392K4256j2751O99J6136J115l7826K2481R17o198R37j1028Q538J8205
$$ plain form
5888 206873 208568 207211 218505 220184 213094 217312 228139 239883 236193 220933 228155 225171 217201
5875 217201 233174 240047 242249 261493 264921 285401 256215 252621 227531 239229 224319 203650
5863 203650 207388 196204 186802 185848 169735 211925 214814 208706 198769 196509 157109 144563 166730
5850 166730 166817 181735 190969 200166 190437 194226 227208 213870 227456 205595 213490 229371 217116
5837 217116 207788 208748 216792 181067 230776 226964 253741 265806 254258 253101 264620 281970 268821
5824 268821 266057 242935 263375 233549 227433 231092 205095 249502 307102 283099 294043 260660
5812 260660 257901 261891 256494 290000 277974 259583 282668 295934 294854 291420 289842 312391 326766
5799 326766 303155 298747 341496 340392 339722 326684 312678 313216 322600 332230 340543 304277 325549
$$ packed form
5888B06873J695j357J1294J679p090M218J0827J1744l690j5260P222k984p970
5875B17201J5973O873K202J9244L428K0480k9186l594k5090J1698j4910k0669
5863B03650L738j1184r402r54j6113M2190K889o108r937k260l9400j2546K2167
5850A66730Q7J4918R234R197r729L789L2982j3338J3586k1861P895J5881j2255
5837B17116r328R60Q044l5725M9709l812K6777J2065j1548j157J1519J7350j3149
5824B68821k764k3122K0440k9826o116L659k5997M4407N7600k4003J0944l3383
5812B60660k759L990n397L3506j2026j8391K3085J3266j080l434j578K2549J4375
5799C26766k3611m408M2749j104o70j3038j4006N38R384R630Q313l6266K1272
$$ plain form
5786 325549 320227 289797 321345 346888 354978 359675 367313 350708 336417 371559 391192 397971 390537
5773 390537 392398 409439 397232 400017 380658 408414 477433 488921 463593 468128 460285 477057
5761 477057 515314 488358 495085 480384 460303 454480 457580 471370 499607 496800 489773 483173 472944
5748 472944 468392 479845 483335 510107 514904 517065 542928 521623 524140 527528 561702 587022 631789
5735 631789 623583 599895 607127 602843 631896 632514 632560 655119 651258 638220 641299 641578 640370 635081
5721 635081 651188 634124 670183 696532 716412 713941 698450 719513 745964 734243 717675 746603
5709 746603 763324 769476 778199 760119 753479 767826 769081 781704 779007 764184 773592 800439 819362
5696 819362 806874 782859 802886 826556 824793 829892 842981 843540 850258 868099 863838 858674 895140
$$ packed form
5786C25549n322l0430L1548K5543Q090M697P638j6605j4291L5142J9633O779p434
5773C90537J861J7041j2207K785j9359K7756O9019J1488k5328M535p843J6772
5761D77057L8257k6956O727j4701k0081n823L100J3790K8237k807p027o600j0229
5748D72944m552J1453L490K6772M797K161K5863k1305K517L388L4174K5320M4767
5735F31789q206k3688P232m284K9053O18M6K2559l861j3038L079K79j208n289
5721F35081J6107j7064L6059K6349J9880k471j5491K1063K6451j1721j6568K8928
5709G46603J6721O152Q723j8080o640J4347J255J2623k697j4823R408K6847J8923
5696H19362j2488k4015K0027K3670j763N099J3089N59O718J7841m261n164L6466
$$ plain form
5683 895140 917383 922172 956871 943552 948866 958203 991217 961173 954482 967380 976788 991176 995633
5670 995633 980413 965194 989089 986686 1013334 1042118 1053939 1047753 1100300 1096088 1102944 1149039
5658 1149039 1120201 1129412 1156499 1162058 1183398 1182651 1168990 1212780 1226843 1245446 1267482 1258652
5646 1258652 1301784 1314668 1328174 1330388 1333480 1346917 1368352 1388247 1387069 1380698 1404474 1424365
5634 1424365 1453006 1439183 1453992 1505679 1512410 1512423 1544098 1564588 1581647 1600001 1606932 1618275
5622 1618275 1618639 1632592 1713707 1711426 1741259 1764662 1782989 1802124 1830312 1841471 1878909 1922088
5610 1922088 1966895 1981272 1990096 2043525 2086779 2133663 2154944 2155496 2199327 2266526 2298125 2337165
5598 2337165 2400986 2473334 2494129 2519841 2541664 2595918 2656137 2682423 2718938 2776801 2806348
$$ packed form
5683H95140K2243M789L4699j3319N314R337L3014l0044o691J2898R408J4388M457
5670I95633j5220j5219K3895k403K6648K8784J1821o186N2547m212O856M6095
5658A149039k8838R211K7087N559K1340p47j3661M3790J4063J8603K2036q830
5646A258652M3132J2884J3506K214L092J3437K1435J9895j178o371K3776J9891
5634A424365K8641j3823J4809N1687O731J3L1675K0490J7059J8354O931J1343
5622A618275L64J3953Q1115k281K9833K3403J8327J9135K8188J1159L7438M3179
5610A922088M4807J4377Q824N3429M3254M6884K1281N52M3831O7199L1599L9040
5598B337165O3821P2348K0795K5712K1823N4254O0219K6286L6515N7863K9547
$$ plain form
5587 2806348 2872786 2917130 2939039 3013249 3038577 3104077 3163052 3223444 3312287 3380420 3427682
5576 3427682 3453521 3486696 3557050 3646417 3710773 3755245 3826314 3908011 3982742 4067488 4135846
5565 4135846 4202980 4254114 4393968 4478561 4559389 4616449 4708885 4835069 4897843 4979244 5111323
5554 5111323 5283763 5369390 5459387 5575647 5669490 5810624 5944951 6041895 6159331 6236974
5544 6236974 6345876 6493135 6635244 6784176 6918041 7061138 7237183 7447950 7637350 7855836
5534 7855836 8057541 8244508 8491079 8743284 8938563 9219170 9480036 9759001 10052114 10314692
5524 10314692 10570287 10830083 11067257 11317516 11575214 11829101 12096627 12387387 12658610
5515 12658610 12908835 13192737 13481364 13768719 14085035 14413749 14714860 15036901 15371916
$$ packed form
5587B806348O6438M4344K1909P4210K5328O5500N8975O0392Q8843O8133M7262
5576C427682K5839L3175P0354Q9367O4356M4472P1069Q1697P4731Q4746O8358
5565D135846O7134N1134J39854Q4593Q0828N7060R2436J26184O2774Q1401J32079
5554E111323J72440Q5627Q9997J16260R3843J41134J34327R6944J17436P7643
5544F236974J08902J47259J42109J48932J33865J43097J76045K10767J89400K18486
5534G855836K01705J86967K46571K52205J95279K80607K60866K78965K93113K62578
5524A0314692K55595K59796K37174K50259K57698K53887K67526K90760K71223
5515A2658610K50225K83902K88627K87355L16316L28714L01111L22041L35015
$$ plain form
5506 15371916 15754407 16181213 16578091 17047079 17542728 18090255 18616667 19186960 19848367
5497 19848367 20546245 21209149 21903945 22704258 23532276 24374648 25259553 26245271 27291202
5488 27291202 28408806 29637033 30918754 32309799 33824228 35437375 37213645 39067116
5480 39067116 41147612 43395389 45838044 48479472 51358999 54516646 57965577 61808443
5472 61808443 66058228 70834886 76130785 82052397 88693164 96158200 104582730 114057927
5464 114057927 124664132 136472480 149713927 164389120 180470112 197770603 215875395
5457 215875395 234117987 251662367 267283066 279677699 287589192 290200236 287068180
5450 287068180 278568005 265493113 249079666 230782995 211909310 193434005 175975604
$$ packed form
5506A5371916L82491M26806L96878M68988M95649N47527N26412N70293O61407
5497A9848367O97878O62904O94796Q00313Q28018Q42372Q84905R85718J045931
5488B7291202J117604J228227J281721J391045J514429J613147J776270J853471
5480C9067116K080496K247777K442655K641428K879527L157647L448931L842866
5472F1808443M249785M776658N295899N921612O640767P465036Q424530R475197
5464A14057927J0606205J1808348J3241447J4675193J6080992J7300491J8104792
5457B15875395J8242592J7544380J5620699J2394633P911493K611044l132056
5450B87068180q500175j3074892j6413447j8296671j8873685j8475305j7458401
$$ plain form
5443 175975604 160008978 145654111 132897662 121617104 111621872 102753064 94879600
5436 94879600 87824044 81533422 75931852 70903281 66359801 62216746 58445168 55064360
5428 55064360 51995932 49212111 46655694 44367367 42248431 40295708 38494577 36813473
5420 36813473 35236902 33806225 32444971 31128957 29894750 28744833 27651879 26623785
5412 26623785 25612649 24683313 23813636 22959034 22183803 21453937 20785215 20130275 19441111
5403 19441111 18788961 18208467 17631977 17128439 16623984 16155149 15665410 15222941 14803310
5394 14803310 14359269 13929618 13519207 13099057 12738631 12349417 11975159 11650889 11354261
5385 11354261 11090271 10806820 10518966 10280572 10045653 9744388 9474109 9225100 8999555
$$ packed form
5443A75975604j5966626j4354867j2756449j1280558r995232q868808p873464
5436I4879600p055556o290622n601570n028571m543480m143055l771578l380808
5428E5064360l068428k783821k556417k288327k118936j952723j801131j681104
5420C6813473j576571j430677j361254j316014j234207j149917j092954j028094
5412B6623785j011136r29336q69677q54602p75231p29866o68722o54940o89164
5403A9441111o52150n80494n76490n03538n04455m68835m89739m42469m19631
5394A4803310m44041m29651m10411m20150l60426l89214l74258l24270k96628
5385A1354261k63990k83451k87854k38394k34919l01265k70279k49009k25545
$$ plain form
5376 8999555 8762785 8540564 8367806 8190033 7986849 7804315 7664785 7490212 7334854 7183119
5366 7183119 7051530 6921413 6752818 6624312 6516828 6390869 6287473 6167831 6035725 5914972
5356 5914972 5787805 5692077 5511729 5431480 5379729 5274790 5158915 5081803 4983536 4920560 4838771
5345 4838771 4747574 4674076 4595880 4559682 4468318 4419797 4327163 4241281 4169796 4112268 4065045
5334 4065045 3976566 3921998 3861926 3798943 3694946 3630101 3573327 3512706 3466781 3404614 3332408
5323 3332408 3264371 3207362 3183891 3119740 3028834 2989584 2947738 2877130 2825129 2753556 2702217
5312 2702217 2646568 2592032 2573819 2523678 2477600 2438527 2414691 2387326 2331996 2311530 2309064 2279180
5300 2279180 2253852 2252758 2254071 2180938 2153275 2162166 2141943 2076530 2048327 2043007 2021305 2006289
$$ packed form
5376H999555k36770k22221j72758j77773k03184j82534j39530j74573j55358j51735
5366G183119j31589j30117j68595j28506j07484j25959j03396j19642j32106j20753
5356E914972j27167r5728j80348q0249n1751j04939j15875p7112r8267o2976q1789
5345D838771r1197p3498p8196l6198r1364m8521r2634q5882p1485n7528m7223
5334D065045q8479n4568o0072o2983j03997o4845n6774o0621m5925o2167p2206
5323C332408o8037n7009k3471o4151r0906l9250m1846p0608n2001p1573n1339
5312B702217n5649n4536j8213n0141m6078l9073k3836k7365n5330k0466k466k9884
5300B279180k5328j094J313p3133k7663Q891k0223o5413k8203n320k1702j5016
$$ plain form
5288 2006289 1980797 1985985 1953502 1941758 1963164 1982571 1977129 1943740 1926317 1929076 1870983 1853849
5276 1853849 1852652 1804780 1765080 1759004 1714691 1693994 1713291 1696613 1622174 1583507 1582551 1548764
5264 1548764 1509912 1460170 1443634 1432630 1375280 1321730 1324465 1282871 1252526 1231377 1214286 1181987
5252 1181987 1170554 1155565 1136749 1101734 1070658 1042841 1038268 1035845 1046561 1017023 968422 976433
5240 976433 956226 970672 989658 938599 911961 910443 881626 866213 863289 861267 884097 857343
5228 857343 820101 799407 792325 787205 775297 761511 726986 756700 750185 722683 723709 697752
5216 697752 682987 698340 692079 683471 666561 643821 633230 632363 629378 620672 604974 580594 589366
5203 589366 581976 539684 577448 563177 552060 554895 527598 548598 520592 521828 505476 482789
$$ packed form
5288B006289k5492N188l2483j1744K1406J9407n442l3389j7423K759n8093j7134
5276A853849j197m7872l9700o076m4313k0697J9297j6678p4439l8667r56l3787
5264A548764l8852m9742j6536j1004n7350n3550K735m1594l0345k1149j7091l2299
5252A181987j1433j4989j8816l5015l1076k7817m573k423J0716k9538m8601Q011
5240I76433k0207J4446J8986n1059k6638j518k8817j5413k924k022K2830k6754
5228H57343l7242k0694p082n120j1908j3786l4525K9714o515k7502J026k5957
5216F97752j4765J5353o261q608j6910k2740j0591q67k985q706j5698k4380Q772
5203E89366p390m2292L7764j4271j1117K835k7297K1000k8006J236j6352k2687
$$ plain form
5191 482789 484519 469090 482342 484276 478733 499366 497763 456626 452141 457159 469903 463809 439889
5178 439889 454929 416916 393541 390062 381975 396034 393932 411200 396260 374708 356026 352072
5166 352072 401768 408956 413800 395442 384464 382299 400469 384679 394094 386250 379571 388102 377124
5153 377124 378557 381490 372344 377900 397365 394635 371428 358542 370895 369634 316729 304406 313219
5140 313219 333880 335585 299293 319022 337625 331011 325308 316318 323667 295197 303591 346828 327669
5127 327669 344876 343607 331776 339796 358448 341866 322773 355561 351628 326862 338078 330377
5115 330377 340802 358877 374497 354458 333026 351158 367409 389300 400468 395727 432928 422694
5103 422694 426991 408193 415643 490046 480653 500525 526690 542568 572367 550287 555692 570387
$$ packed form
5191D82789J730j5429J3252J934n543K0633j603m1137m485N018J2744o094k3920
5178D39889J5040l8013k3375l479q087J4059k102J7268j4940k1552j8682l954
5166C52072M9696P188M844j8358j0978k165J8170j5790R415p844o679Q531j0978
5153C77124J433K933r146N556J9465k730k3207j2886J2353j261n2905j2323Q813
5140C13219K0661J705l6292J9729J8603o614n703q990P349k8470Q394M3237j9159
5127C27669J7207j269j1831Q020J8652j6582j9093L2788l933k4766J1216p701
5115C30377J0425J8075J5620k0039k1432J8132J6251K1891J1168m741L7201j0234
5103D22694M297j8798P450P4403r393J9872K6165J5878K9799k2080N405J4695
$$ plain form
5091 570387 592786 585111 583620 596532 604541 579620 591645 599642 608054 592158 575330 557457 542445
5078 542445 527268 517708 494032 489527 438225 394408 376921 385573 368331 344360 352713 344909 331887
5065 331887 329813 332001 310666 325081 336674 322455 285575 298279 286116 281218 283619 290820 267812
5052 267812 247929 259645 261584 253587 258489 231288 217788 223764 227002 222666 229909 212892 199544
5039 199544 220962 230963 218015 222622 241594 237837 204146 172005 199333 222704 190820 186082
5027 186082 204692 225063 208048 193982 193930 174360 159382 201021 171950 178141 202173 202427 195629
5014 195629 146464 147830 181082 214304 199271 186152 195433 214709 194123 191996 203063 216173
5002 216173 213190 192076 211844 227665 241639 259680 265069 272296 305111 319385 312911 314744 293781
$$ packed form
5091E70387K2399p675j491J2912Q009k4921J2025P997Q412j5896j6828j7873j5012
5078E42445j5177r560k3676m505n1302m3817j7487Q652j7242k3971Q353p804j3022
5065C31887k074K188k1335J4415J1593j4219l6880J2704j2163m898K401P201k3008
5052B67812j9883J1716J939p997M902k7201j3500N976L238m336P243j7017j3348
5039A99544K1418J0001j2948M607J8972l757l3691l2141K7328K3371l1884m738
5027A86082J8610K0371j7015j4066n2j9570j4978M1639k9071O191K4032K54o798
5014A95629m9165J366L3252L3222j5033j3119R281J9276k0586k127J1067J3110
5002B16173k983k1114J9768J5821J3974J8041N389P227L2815J4274o474J833k0963
$$ plain form
4989 293781 315562 326960 297716 255986 262618 300806 289887 289835 246325 223854 240998 268454
4977 268454 278001 254172 228334 232095 221490 235960 256828 249051 216169 234267 239972 248492 235380
4964 235380 212441 213582 212904 236464 235967 219875 211074 220177 219182 243060 263937 246894 263828
4951 263828 279837 296304 317907 327573 320951 339275 329469 317388 359024 371749 466626 507999
4939 507999 543087 582328 614121 640602 691823 728916 706859 693085 682251 665771 650214 624020
4927 624020 550480 487503 480838 423859 407525 411721 338536 345271 333955 277623 245227 255711
4915 255711 232792 225181 215552 202441 244299 262595 254855 251458 259778 257969 249127 233375 241543
4902 241543 254109 291535 285731 264969 226788 228473 196538 211631 268650 265768 232786 220635
$$ packed form
4989B93781K1781J1398k9244m1730O632L8188j0919n2m3510k2471J7144K7456
4977B68454R547k3829k5838L761j0605J4470K0868p777l2882J8098N705Q520j3112
4964B35380k2939J141o78K3560m97j6092q801R103r95K3878K0877j7043J6934
4951B63828J6009J6467K1603R666o622J8324r806j2081M1636J2725R4877M1373
4939E07999L5088L9241L1793K6481N1221L7093k2057j3774j0834j6480j5557k6194
4927F24020p3540o2977o665n6979j6334M196p3185O735j1316n6332l2396J0484
4915B55711k2919p611r629j3111M1858J8296p740l397Q320j809q842j5752Q168
4902B41543J2566L7426n804k0762l8181J685l1935J5093N7019k882l2982j2151
$$ plain form
4890 220635 208560 198168 205851 228179 225268 212703 211572 220887 191057 178098 168785 170209 181209
4877 181209 217226 240348 210842 194595 168271 164191 142053 113889 139774 155749 153537 163450
4865 163450 125155 121930 103452 107805 120605 165115 193989 212683 221672 199745 188818 175079
4853 175079 137320 118445 140236 165775 156474 133748 143707 123977 106438 135908 177371 187133
4841 187133 203795 202316 150762 162396 165417 141680 127841 154078 139200 148791 161836 158092
4829 158092 168515 169542 178862 183344 180747 170657 169078 189329 187696 148757 183080 157960 170657
4816 170657 158828 162285 176452 165176 218182 201472 180624 164085 223855 241699 221055 235354
4804 235354 226358 246531 256066 278986 297294 301395 340073 366171 394352 429519 503968 535823
$$ packed form
4890B20635j2075j0392P683K2328k911j2565j131R315k9830j2959r313J424J1000
4877A81209L6017K3122k9506j6247k6324m080k2138k8164K5885J5975k212R913
4865A63450l8295l225j8478M353J2800M4510K8874J8694Q989k1927j0927j3739
4853A75079l7759j8875K1791K5539r301k2726R959j9730j7539K9470M1463R762
4841A87133J6662j479n1554J1634L021k3737j3839K6237j4878R591J3045l744
4829A58092J0423J027R320M482k597j0090j579K0251j633l8939L4323k5120J2697
4816A70657j1829L457J4167j1276N3006j6710k0848j6539N9770J7844k0644J4299
4804B35354q996K0173R535K2920J8308M101L8678K6098K8181L5167P4449L1855
$$ plain form
4792 535823 558246 570436 586333 601750 630029 649547 686327 682534 649889 593971 544488 494646
4780 494646 429448 417828 413022 419775 391351 363176 356393 326329 326245 365741 335310 287459 255031
4767 255031 267645 272059 300430 307723 291239 260327 290204 308914 326034 286928 270175 281751
4755 281751 282901 290840 270445 289467 289815 283139 273946 274815 271812 259990 251598 248795 246644 264150
4741 264150 274317 294287 315659 301100 231613 256067 268179 252684 259632 257610 254020 266207
4729 266207 286010 282073 291141 288996 270338 237343 257839 265902 264259 289323 298070 288449 295115
4716 295115 314962 315911 286272 275801 302537 324803 329662 324014 317580 339714 331796 351212 338202
4703 338202 326733 346049 345234 371514 346174 367206 377761 385625 428131 365713 390591 431120
$$ packed form
4792E35823K2423J2190J5897J5417K8279J9518L6780l793l2645n5918m9483m9842
4780D94646o5198j1620m806O753k8424k8175o783l0064q4L9496l0431m7851l2428
4767B55031J2614M414K8371P293j6484l0912K9877J8710J7120l9106j6753J1576
4755B81751J150P939k0395J9022L48o676r193Q69l003j1822q392k803k151J7506
4741B64150J0167J9970K1372j4559o9487K4454J2112j5495O948k022l590J2187
4729B66207J9803l937R068k145j8658l2995K0496Q063j643K5064Q747r621O666
4716B95115J9847R49k9639j0471K6736K2266M859n648o434K2134p918J9416j3010
4703C38202j1469J9316q15K6280k5340K1032J0555P864M2506o2418K4878M0529
$$ plain form
4691 431120 457981 424684 394646 400550 434827 471612 459032 482152 470894 480241 483119 508537
4679 508537 526528 578641 583834 594180 588169 596177 609938 607030 638320 633480 647799 670449 695140
4666 695140 719218 739510 739299 740538 749848 787145 841424 885308 898392 933062 928242 924103 961541
4653 961541 1001511 1025101 1034216 1106269 1132529 1131762 1196770 1249470 1292499 1342100 1376099 1440698
4641 1440698 1505336 1590846 1640998 1703609 1800881 1920509 2048074 2150758 2291449 2466644
4631 2466644 2661551 2877854 3153979 3429463 3709890 4042919 4371667 4707796 5067855 5331717
4621 5331717 5549813 5719330 5744982 5715521 5634437 5513896 5401489 5292055 5246265 5233646
4611 5233646 5255659 5394986 5591934 5804464 6068068 6418244 6772048 7169897 7560791 7973003
$$ packed form
4691D31120K6861l3297l0038N904L4277L6785j2580K3120j1258R347K878K5418
4679E08537J7991N2113N193J0346o011Q008J3761k908L1290m840J4319K2650K4691
4666F95140K4078K0292k11J239R310L7297N4279M3884J3084L4670m820m139L7438
4653I61541L9970K3590R115P2053K6260p67O5008N2700M3029M9601L3999O4599
4641A440698O4638Q5510N0152O2611R7272J19628J27565J02684J40691J75195
4631B466644J94907K16303K76125K75484K80427L33029L28748L36129L60059K63862
4621E331717K18096J69517K5652k9461q1084j20541j12407j09434m5790j2619
4611E233646K2013J39327J96948K12530K63604L50176L53804L97849L90894M12212
$$ plain form
4601 7973003 8404305 8862289 9349706 9804098 10290987 10757047 11211575 11669730 12041102 12415759
4591 12415759 12758316 13035582 13312168 13504006 13671644 13805321 13855159 13840405 13715753 13529049
4581 13529049 13264357 12961006 12621296 12283452 11907651 11468665 10999303 10497076 9999329
4572 9999329 9495422 8969151 8440655 7971587 7449183 6957718 6509630 6040158 5571690 5159122
4562 5159122 4755820 4414654 4064193 3782537 3559570 3313111 3126126 2937173 2748375 2591256
4552 2591256 2454982 2325915 2225357 2127391 2004138 1921764 1843772 1762678 1710263 1646693 1550781
4541 1550781 1505691 1496576 1484761 1379114 1300335 1285227 1258813 1224322 1166122 1122242 1097540
4530 1097540 1063654 1021901 997092 952156 933143 947961 939549 896008 847803 790628 781016 762012
$$ packed form
4601G973003M31302M57984M87417M54392M86889M66060M54528M58155L71372L74657
4591A2415759L42557K77266K76586J91838J67638J33677M9838j4754j24652j86704
4581A3529049k64692l03351l39710l37844l75801m38986m69362n02227m97747
4572I999329n03907n26271n28496m69068n22404m91465m48088m69472m68468m12568
4562E159122m03302l41166l50461k81656k22967k46459j86985j88953j88798j57119
4552B591256j36274j29067j00558r7966j23253q2374p7992q1094n2415o3570r5912
4541A550781m5090r115j1815j05647p8779j5108k6414l4491n8200m3880k4702
4530A097540l3886m1753k4809m4936j9013J4818q412m3541m8205n7175r612j9004
$$ plain form
4518 762012 759006 746849 744325 719176 699342 691795 658344 627426 628596 628029 606571 586143 558796
4505 558796 529012 517056 526355 503601 485542 514804 498800 473864 468160 465383 437164 404242
4493 404242 427618 443866 427365 402389 413462 386740 405951 391298 374132 347522 365782 361151
4481 361151 365231 341476 329356 342615 330803 321463 293624 326504 328156 361009 338532 330589
4469 330589 304611 304436 284953 251298 249213 278545 268994 248194 259602 299345 278416 266544
4457 266544 281781 260190 265230 255770 202434 209359 227522 225582 221890 209741 179869 182006 191204
4444 191204 172436 170782 207934 184730 160441 193367 172030 186118 189613 204102 238523 228298
4432 228298 174216 171908 188843 196802 181965 143366 133645 175710 177622 187105 164504 180066 174816
$$ packed form
4518G62012l006j2157k524k5149j9834p547l3451l0918J170n67k1458k0428k7347
4505E58796k9784j1956R299k2754j8059K9262j6004k4936n704k777k8219l2922
4493D04242K3376J6248j6501k4976J1073k6722J9211j4653j7166k6610J8260m631
4481C61151M080k3755j2120J3259j1812r340k7839L2880J652L2853k2477p943
4469C30589k5978j75j9483l3655k085K9332r551k0800J1408L9743k0929j1872
4457B66544J5237k1591N040r460n3336O925J8163j940l692j2149k9872K137R198
4444A91204j8768j654L7152k3204k4289L2926k1337J4088L495J4489L4421j0225
4432B28298n4082k308J6935P959j4837l8599r721M2065J912R483k2601J5562n250
$$ plain form
4419 174816 190645 149978 155284 146344 148878 165556 157137 185346 164306 154101 149511 157571 187937
4406 187937 201440 147731 143393 174061 177690 146371 154431 168328 189785 202757 199222 179227
4394 179227 176291 171184 130975 124886 133940 134839 171182 156211 165927 119160 128108 142568 131812
4381 131812 141335 124060 145806 154994 150720 133417 144360 157649 162366 142936 154505 156439 145409
4368 145409 140971 105195 98920 105389 105062 108237 124926 113637 112278 71053 67762 79184 73010
4355 73010 71202 92851 110172 92805 132600 120911 111661 105466 137898 120423 73638 74975 92559
4342 92559 86138 69901 93448 112175 96366 91242 98285 86207 87179 104116 86204 100906 88055
4329 88055 47136 45858 89608 104902 103455 92444 99120 107230 119778 89166 94591 123495 106453
$$ packed form
4419A74816J5829m0667N306q940K534J6678q419K8209k1040j0205m590Q060L0366
4406A87937J3503n3709m338L0668L629l1319Q060J3897K1457J2972l535j9995
4394A79227k936n107m0209o089R054Q99L6343j4971R716m6767Q948J4460j0756
4381A31812R523j7275K1746R188m274j7303J0943J3289M717j9430J1569J934j1030
4368A45409m438l5776o275O469l27L175J6689j1289j359m1225l291J1422o174
4355G3010j808K1649J7321j7367L9795j1689r250o195L2432j7475m6785J337J7584
4342I2559o421j6237K3547J8727j5809n124P043j2078R72J6937j7912J4702j2851
4329H8055m0919j278M3750J5294j447j1011O676Q110J2548l0612N425K8904j7042
$$ plain form
4316 106453 151854 124159 116684 110830 81862 98067 104456 117070 132283 159357 162914 152406
4304 152406 113727 97117 131580 127914 134865 139060 139350 143272 120810 143880 149797 150940 179287
4291 179287 140759 158057 153622 160866 161426 148568 178290 175373 145663 187720 160006 123324 167489
4278 167489 170358 171243 193989 143469 148212 183840 159594 179629 184911 178482 191697 205248 158515
4265 158515 129107 156416 190564 191050 198645 185709 171335 149847 138849 157698 169522 196673
4253 196673 186604 190958 160501 175945 196611 174649 142359 164168 173179 162736 183694 170906
4241 170906 162428 168210 184203 135281 142774 155476 153901 116792 154580 195576 165474 164426 188874
4228 188874 183567 184559 203773 207137 212840 216068 197081 181585 187570 211373 199439 184049 214659
$$ packed form
4316A06453M5401k7695p475n854k8968J6205O389J2614J5213K7074L557j0508
4304A52406l8679j6610L4463l666O951M195K90L922k2462K3070N917J143K8347
4291A79287l8528J7298m435P244N60j2858K9722k917k9710M2057k7714l6682M4165
4278A67489K869Q85K2746n0520M743L5628k4246K0035N282o429J3215J3551m6733
4265A58515k9408K7309L4148M86P595j2936j4374k1488j0998J8849J1824K7151
4253A96673j0069M354l0457J5444K0666k1962l2290K1809R011j0443K0958j2788
4241A70906q478N782J5993m8922P493J2702j575l7109L7788M0996l0102j048K4448
4228A88874n307R92J9214L364N703L228j8987j5496N985K3803j1934j5390L0610
$$ plain form
4215 214659 244672 286789 271479 251980 236589 254170 240648 245521 248440 237506 245306 276422
4203 276422 272388 319249 350121 361897 331538 282567 291065 302260 310910 322578 354177 353323 355354
4190 355354 343640 354181 337096 324617 322157 350387 386134 416523 440126 443799 431755 435318
4178 435318 504403 510378 486798 514380 542632 545635 551689 580135 619082 660289 685199 708029
4166 708029 735888 745676 779092 845305 848459 868812 943264 1050030 1091479 1108942 1136924 1185712
4154 1185712 1242842 1298447 1343949 1408072 1435552 1498113 1537048 1622045 1689366 1734343 1826793
4143 1826793 1866290 1927206 2019739 2114082 2156459 2219405 2299173 2322837 2353395 2431848 2462331
4132 2462331 2489117 2515046 2585093 2625228 2663643 2736111 2761407 2819258 2845011 2891919 2914125
$$ packed form
4215B14659L0013M2117j5310j9499j5391J7581j3522M873K919j0934P800L1116
4203B76422m034M6861L0872J1776l0359m8971Q498J1195Q650J1668L1599q54K031
4190C55354j1714J0541j7085j2479k460K8230L5747L0389K3603L673j2044L563
4178D35318O9085N975k3580K7582K8252L003O054K8446L8947M1207K4910K2830
4166G08029K7859R788L3416O6213L154K0353P4452J06766M1449J7463K7982M8788
4154A185712N7130N5605M5502O4123K7480O2561L8935Q4997O7321M4977R2450
4143A826793L9497O0916R2533R4343M2377O2946P9768K3664L0558P8453L0483
4132B462331K6786K5929P0047M0135L8415P2468K5296N7851K5753M6908K2206
$$ plain form
4121 2914125 2880649 2893122 2897752 2895949 2874142 2873775 2858335 2834109 2814628 2788454 2711497 2673145
4109 2673145 2636673 2586793 2545373 2493186 2421975 2361508 2295858 2214194 2140342 2067372 2004736
4098 2004736 1943374 1891524 1843140 1782456 1726270 1640100 1587480 1503158 1445097 1401100 1323763
4087 1323763 1272957 1202200 1137163 1062877 1028871 991014 938464 886648 838771 810391 777062
4076 777062 730967 715065 685195 633783 614881 596069 583401 588031 558491 500601 514971 511537
4064 511537 454971 447090 433898 431700 406263 380924 393146 421845 401156 391731 391164 359532 344894
4051 344894 320280 333275 330808 334800 344994 300018 272389 278456 296137 280857 292537 270575
4039 270575 261950 294489 285579 272821 336357 354745 314948 324332 346677 344471 318588 334182
$$ packed form
4121B914125l3476J2473M630j803k1807l67j5440k4226j9481k6174p6957l8352
4109B673145l6472m9880m1420n2187p1211o0467o5650q1664p3852p2970o2636
4098B004736o1362n1850m8384o0684n6186q6170n2620q4322n8061m3997p7337
4087A323763n0806p0757o5037p4286l4006l7857n2550n1816m7877k8380l3329
4076G77062m6095j5902k9870n1412j8902j8812j2668M630k9540n7890J4370l434
4064E11537n6566p881j3192k198k5437k5339J2222K8699k0689r425n67l1632j4638
4051C44894k4614J2995k467L992J0194m4976k7629O067J7681j5280J1680k1962
4039B70575q625L2539q910j2758O3536J8388l9797R384K2345k206k5883J5594
$$ plain form
4027 334182 300042 270241 247580 230302 249195 248023 269775 266422 258655 265732 294507 309560
4015 309560 311529 293634 278206 284039 233211 206048 225642 244732 260086 283725 281916 288298
4003 288298 279929 257523 262102 275187 282747 268812 275768 257636 256502 289664 264925 284435 287140
3990 287140 285349 284916 294435 273987 258271 241339 246331 255820 246762 217114 217329 235805 241468 279978
3976 279978 284117 277437 262629 246168 235054 229361 226630 257311 243330 248434 208502 214976 240945
3963 240945 229238 183835 182674 231195 229235 215175 238960 244197 190090 199062 216092 212407 200836
3950 200836 201573 177097 187807 218178 216954 221506 236212 242665 255139 246255 211816 227576 220543
3937 220543 221194 226744 224259 230426 221627 236474 252066 275603 272469 264312 258477 286910 313677
$$ packed form
4027C34182l4140k9801k2661j7278J8893j172K1752l353p767P077K8775J5053
4015C09560J969j7895j5428N833n0828k7163J9594J9090J5354K3639j809O382
4003B88298q369k2406M579J3085P560j3935O956j8132j134L3162k4739J9510K705
3990B87140j791m33R519k0448j5716j6932M992R489r058k9648K15J8476N663L8510
3976B79978M139o680j4808j6461j1114n693k731L0681j3981N104l9932O474K5969
3963B40945j1707m5403j161M8521j960j4060K3785N237n4107Q972J7030l685j1571
3950B00836P37k4476J0710L0371j224M552J4706O453J2474q884l4439J5760p033
3937B20543O51N550k485O167q799J4847J5592K3537l134q157n835K8433K6767
$$ plain form
3924 313677 294326 292452 281739 272449 273396 274587 284415 333009 345880 338196 344458 350328 381858
3911 381858 408774 419091 427534 407740 429675 448498 459590 478596 502583 488853 499215 520941
3899 520941 551078 621460 643962 672231 681606 725983 779458 800793 860760 879759 951743 1030051
3887 1030051 1057717 1097527 1125000 1189082 1227386 1253652 1305030 1314974 1313112 1340333 1350164 1358148
3875 1358148 1332091 1301811 1315769 1331239 1342329 1332505 1286603 1301400 1298967 1288155 1233319 1191957
3863 1191957 1161295 1140638 1100683 1058102 1047581 1021796 986031 990111 954078 921981 897008 849226
3851 849226 832695 832289 831154 835486 860521 867225 816479 816952 828410 837372 849315 854768 873598
3838 873598 837007 864710 845438 855313 916189 910014 910686 896061 879034 907896 913157 932197 943559
$$ packed form
3924C13677j9351j874j0713r290R47J191R828M8594J2871p684O262N870L1530
3911C81858K6916J0317Q443j9794K1935J8823J1092J9006K3987j3730J0362K1726
3899E20941L0137P0382K2502K8269R375M4377N3475K1335N9967J8999P1984P8308
3887A030051K7666L9810K7473O4082L8304K6266N1378R944j862K7221R831P984
3875A358148k6057l0280J3958J5470J1090r824m5902J4797k433j0812n4836m1362
3863A191957l0662k0657l9955m2581j0521k5785l5765M080l6033l2097k4973m7782
3851H49226j6531m06j135M332K5035O704n0746M73J1458Q962J1943N453J8830
3838H73598l6591K7703j9272R875O0876o175O72j4625j7027K8862N261J9040J1362
$$ plain form
3825 943559 957361 960984 981989 988813 1027479 1058468 1043190 1049863 1069933 1116929 1143677 1136928
3813 1136928 1204971 1232751 1223657 1255196 1279898 1288041 1306599 1342155 1392755 1408345 1400691 1417855
3801 1417855 1459208 1460704 1487766 1514325 1515813 1550328 1587832 1575924 1573585 1547448 1544448 1576612
3789 1576612 1590654 1629440 1642734 1639552 1625979 1635256 1634809 1682437 1694731 1689884 1705292 1754978
3777 1754978 1807629 1854863 1928210 1957449 1981690 2061430 2141152 2225971 2327402 2380639 2461015
3766 2461015 2572731 2673790 2794394 2930544 3085824 3247360 3403620 3539439 3716058 3911376
3756 3911376 4083716 4253871 4417729 4615601 4818654 5022772 5212875 5429871 5679059 5907161
3746 5907161 6178999 6442927 6707292 6985907 7253353 7559713 7906509 8214769 8531325 8903739
$$ packed form
3825I43559J3802L623K1005O824L8666L0989j5278O673K0070M6996K6748o749
3813A136928O8043K7780r094L1539K4702Q143J8558L5556N0600J5590p654J7164
3801A417855M1353J496K7062K6559J488L4515L7504j1908k339k6137l000L2164
3789A576612J4042L8786J3294l182j3573R277m47M7628J2294m847J5408M9686
3777A754978N2651M7234P3347K9239K4241P9740P9722Q4819J01431N3237Q0376
3766B461015J11716J01059J20604J36150J55280J61536J56260J35819J76619J95318
3756C911376J72340J70155J63858J97872K03053K04118J90103K16996K49188K28102
3746E907161K71838K63928K64365K78615K67446L06360L46796L08260L16556L72414
$$ plain form
3736 8903739 9268702 9627382 9994858 10367339 10712498 10996691 11278313 11523433 11738520 11891436
3726 11891436 11998377 12075172 12161692 12129573 12052771 12000489 11892939 11789317 11661018 11499448
3716 11499448 11306256 11043432 10748679 10426483 10050690 9676370 9243530 8770407 8334032
3707 8334032 7924780 7482535 7026438 6604036 6209077 5856102 5500384 5162363 4877298 4589670
3697 4589670 4336906 4112497 3878196 3676013 3476518 3298583 3135214 2987995 2851142 2719025
3687 2719025 2599157 2501936 2392360 2269746 2181847 2116104 2069074 2026103 1972772 1917312 1880605
3676 1880605 1849645 1827482 1761702 1718630 1699520 1675267 1659369 1639340 1587146 1570026 1594803
3665 1594803 1590413 1535251 1481173 1477364 1461478 1418000 1389543 1382434 1323042 1304322 1285433 1261209
$$ packed form
3736H903739L64963L58680L67476L72481L45159K84193K81622K45120K15087J52916
3726A1891436J06941P6795Q6520l2119p6802n2282j07550j03622j28299j61570
3716A1499448j93192k62824k94753l22196l75793l74320m32840m73123m36375
3707H334032m09252m42245m56097m22402l94959l52975l55718l38021k85065k87628
3697D589670k52764k24409k34301k02183j99495j77935j63369j47219j36853j32117
3687B719025j19868r7221j09576j22614q7899o5743m7030m2971n3331n5460l6707
3676A880605l0960k2163o5780m3072j9110k4253j5898k0029n2194j7120K4777
3665A594803m390n5162n4078l809j5886m3478k8457p109n9392j8720j8889k4224
$$ plain form
3653 1261209 1252661 1171512 1118390 1084382 1061281 1039566 986025 948124 929675 886700 924686 869246
3641 869246 816214 831630 789049 767245 761689 721744 695634 625368 602658 599279 621940 620535
3629 620535 590200 532786 513253 539525 555011 517330 447926 415221 430913 430380 418553 410568
3617 410568 415881 399281 378413 408650 407622 372743 351827 370919 373081 358303 321382 299388
3605 299388 272228 270191 262535 263484 233332 256116 267636 240609 243311 274889 272837 287652 259293
3592 259293 268832 285188 279934 280566 273759 288429 278461 249225 239966 223335 220965 234240 243009
3579 243009 238320 219499 212239 226141 224671 199356 197443 201327 199710 210224 200321 159421 184507
3566 184507 198085 174719 137224 108495 140374 112144 109548 93652 110051 149723 144408 127819
$$ packed form
3653A261209q548q1149n3122l4008k3101k1715n3541l7901j8449m2975L7986n5440
3641H69246n3032J5416m2581k1804n556l9945k6110p0266k2710l379K2661j405
3629F20535l0335n7414j9533K6272J5486l7681o9404l2705J5692n33j1827p985
3617D10568N313j6600k0868L0237j028l4879k0916J9092K162j4778l6921k1994
3605B99388k7160k037p656R49l0152K2784J1520k7027K702L1578k052J4815k8359
3592B59293R539J6356n254O32o807J4670r968k9236r259j6631k370J3275Q769
3579B43009m689j8821p260J3902j470k5315j913L884j617J0514r903m0900K5086
3566A84507J3578k3366l7495k8729L1879k8230k596j5896J6399L9672n315j6589
$$ plain form
3554 127819 107839 127488 137871 150687 156503 176917 160043 138437 141318 154114 162820 149286
3542 149286 116790 106859 120552 112418 134570 135515 121138 160138 154508 124160 118121 84880 103633
3529 103633 93429 118834 103022 79751 86402 63045 67604 86355 85737 108738 127102 100944
3517 100944 113652 113383 105802 81303 78962 88895 123078 157966 149748 149684 144807 103205 107680 112640
3503 112640 121775 112630 132244 107391 110657 116854 95523 93552 110761 101657 83094 94163 88648
3490 88648 98468 84530 75453 87250 105379 105642 85424 88990 75841 61518 71463 85926 123188
3477 123188 113028 112878 127875 92843 77134 81600 69723 87180 131561 100360 127225 109211
3465 109211 110071 141862 105499 98198 99622 100916 114912 126642 110487 92220 88351 93892 102151
$$ packed form
3554A27819j9980J9649J0383J2816N816K0414j6874k1606K881J2796Q706j3534
3542A49286l2496r931J3693q134K2152R45j4377L9000n630l0348o039l3241J8753
3529A03633j0204K5405j5812k3271O651k3357M559J8751o18K3001J8364k6158
3517A00944J2708k69p581k4499k341R933L4183L4888q218o4m877m1602M475M960
3503A12640R135r145J9614k4853L266O197k1331j971J7209r104j8563J1069n515
3490H8648R820j3938r077J1797J8129K63k0218L566j3149j4323R945J4463L7262
3477A23188j0160j50J4997l5032j5709M466j1877J7457M4381l1201K6865j8014
3465A09211Q60L1791l6363p301J424J294J3996J1730j6155j8267l869N541Q259
$$ plain form
3452 102151 101365 92198 127486 151009 134993 135396 140723 141881 178928 186983 172931 154916 157842
3439 157842 164308 176633 186663 209713 211123 195391 190777 209404 190794 210715 227627 195153
3427 195153 190614 179519 197610 210277 213742 222552 242233 233442 183867 150880 141936 138481 125626
3414 125626 135202 147093 130892 87434 55819 74054 102733 90116 87726 132328 124787 122895
3402 122895 112688 103760 97878 69721 95351 68209 87570 122008 94990 103849 122247 119330
3390 119330 99042 94360 85902 95190 87608 68498 76295 69736 49743 38451 30523 43347 74366
3377 74366 77511 58015 49142 31196 42061 52783 56178 90586 84543 70323 80127 80290 70272
3364 70272 111861 107684 101579 92478 98902 102651 127087 136614 123717 117601 115565 129454 120833 113160
$$ packed form
3452A02151p86r167L5288K3523j6016M03N327J158L7047Q055j4052j8015K926
3439A57842O466J2325J0030K3050J410j5732m614J8627j8610J9921J6912l2474
3427A95153m539j1095J8091J2667L465Q810J9681q791m9575l2987q944l455j2855
3414A25626R576J1891j6201m3458l1615J8235K8679j2617k390M4602p541j892
3402A22895j0207q928n882k8157K5630k7142J9361L4438k7018Q859J8398k917
3390A19330k0288m682q458R288p582j9110P797o559j9993j1292p928J2824L1019
3377G4366L145j9496q873j7946J0865J0722L395L4408o043j4220R804J63j0018
3364G0272M1589m177o105r101O424L749K4436R527j2897o116k036J3889q621p673
$$ plain form
3350 113160 87866 122829 136157 143489 145632 177237 157778 121771 105550 91978 103107 115547
3338 115547 80293 109187 83331 75082 96237 54848 51650 92333 97452 90652 107546 94586
3326 94586 94373 69394 74563 94365 75358 67229 88138 78855 87544 102854 105118 81260 67053
3313 67053 84312 86217 28410 30784 85297 79014 46174 24974 41837 59438 68285 119662 103541
3300 103541 96854 82194 64958 75594 49471 68302 80557 67313 51357 44897 78121 80805
3288 80805 90770 97477 114418 120354 127431 102039 129267 144836 130785 158426 164627 170721 171151
3275 171151 182627 200982 245171 239993 269502 303844 351214 384148 402646 468409 516896 507476
3263 507476 485345 515587 486466 431409 428698 387062 364627 340920 328637 322273 302986 276747
$$ packed form
3350A13160k5294L4963J3328P332K143L1605j9459l6007j6221j3572J1129J2440
3338A15547l5254K8894k5856q249K1155m1389l198M0683N119o800J6894j2960
3326I4586k13k4979N169J9802j9007q129K0909r283Q689J5310K264k3858j4207
3313F7053J7259J905n7807K374N4513o283l2840k1200J6863J7601Q847N1377j6121
3300A03541o687j4660j7236J0636k6123J8831J2255j3244j5956o460L3224K684
3288H0805R965O707J6941N936P077k5392K7228J5569j4051K7641O201O094M30
3275A71151J1476J8355M4189n178K9509L4342M7370L2934J8498O5763M8487r420
3263E07476k2131L0242k9121n5057k711m1636k2435k3707j2283o364j9287k6239
$$ plain form
3251 276747 239806 208925 200891 233830 248160 281848 278790 277234 357833 389015 371535 402327
3239 402327 425946 443660 475954 476974 476846 480960 426973 394745 354736 320020 280003 273552 256555
3226 256555 203506 146327 136526 153578 117124 133488 129695 111074 136214 124553 69052 98438
3214 98438 101842 90848 110614 74329 52209 75533 63024 42670 47792 69147 51964 48734
3202 48734 45411 50521 52867 26989 39360 47840 64879 67062 46401 37170 55491 56991 38624
3189 38624 26637 3890 19971 33126 53604 54582 51526 30166 56412 67935 69438 91864 70678
3176 70678 92509 14818 -613 45860 47734 45176 23086 4920 7733 20086 -1644 16375
3164 16375 -431 -799 9191 12917 9519 31838 34831 11972 -4748 -21794 14107 14427 12802 21345
$$ packed form
3251B76747l6941l0881q034L2939J4330L3688l058j556Q0599L1182j7480L0792
3239D02327K3619J7714L2294J020j28M114n3987l2228m0009l4716m0017o451j6997
3226B56555n3049n7179r801J7052l6454J6364l793j8621K5140j1661n5501K9386
3214I8438L404j0994J9766l6285k2120K3324j2509k0354N122K1355j7183l230
3202D8734l323N110K346k5878J2371Q480J7039K183k0661r231J8321J500j8367
3189C8624j1987k2747J6081J3155K0478R78l056k1360K6246J1523J503K2426k1186
3176G0678K1831p7691j5431M6473J874k558k2090j8166K813J2353k1730J8019
3164A6375j6806l68R990L726l398K2319K993k2859j6720j7046L5901L20j625Q543
$$ plain form
3150 21345 32119 32521 30246 48333 33946 68891 79316 49891 34997 14287 51196 40429
3138 40429 39062 41042 37562 39705 29331 39745 19684 16965 31035 43910 26235 32423 14077
3125 14077 -235 29869 31154 9612 2452 38192 56823 65404 56933 45137 54178 45637 48190
3112 48190 37502 23917 31300 44594 69906 58538 48212 69370 67547 32017 36080 20670
3100 20670 29423 12547 20709 44529 27604 49556 93415 80099 90046 35780 83967 92720 70156
3087 70156 73171 60772 87080 81002 69905 77391 92500 79356 87755 65525 35479 31967 72443
3074 72443 62098 38103 25554 19386 38046 57188 42822 36854 11975 25809 55733 64574
3062 64574 39042 37356 34830 61060 86622 68595 68550 19223 11635 3090 27501 55127 41235
$$ packed form
3150B1345J0774M02k275J8087j4387L4945J0425k9425j4894k0710L6909j0767
3138D0429j367J980l480K143j0374J0414k0061k719J4070J2875j7675O188j8346
3125A4077j4312L0104J285k1542p160L5740J8631Q581q471j1796R041q541K553
3112D8190j0688j3585P383J3294K5312j1368j0326K1158j823l5530M063j5410
3100B0670Q753j6876Q162K3820j6925K1952M3859j3316R947n4266M8187Q753k2564
3087G0156L015j2399K6308o078j1097P486J5109j3144Q399k2230l0046l512M0476
3074G2443j0345k3995j2549o168J8660J9142j4366n968k4879J3834K9924Q841
3062F4574k5532j686k526K6230K5562j8027m5m9327p588q545K4411K7626j3892
$$ plain form
3049 41235 29234 45608 52638 75518 54883 10607 -5859 25415 35920 -1055 15884 25683
3037 25683 50123 37853 39420 58403 33780 21044 40964 29008 56335 42508 9848 6682
3025 6682 -6245 16134 63671 37151 -10544 -13502 612 22756 14633 15478 29770 45512 26569
3012 26569 30593 20210 8506 -975 -11556 -9325 9851 25476 35631 9528 12378 624 -46085
2999 -46085 -27668 -27448 -17854 -19849 -34311 -33478 -6922 9649 -304 15857 44350 13888 21306
2986 21306 25031 29585 31313 7558 -40115 -24632 -9849 -11127 -10294 -2643 -24715 -32539 -17203
2973 -17203 -10845 -3829 -43712 -48676 -18609 9192 -3311 -9448 -7070 -26596 12727 41917 7988
2960 7988 -21471 -23766 -22968 -16702 -54003 -18765 -7383 -15402 6472 6053 3320 -14220 -10543 -40613
$$ packed form
3049D1235j2001J6374P030K2880k0635m4276j6466L1274J0505l6975J6939R799
3037B5683K4440j2270J567J8983k4623j2736J9920j1956K7327j3827l2660l166
3025F682j2927K2379M7537k6520m7695k958J4114K2144q123Q45J4292J5742j8943
3012B6569M024j0383j1704r481j0581K231J9176J5625J0155k6103K850j1754m6709
2999d6085J8417K20R594j995j4462Q33K6556J6571r953J6161K8493l0462P418
2986B1306L725M554J728k3755m7673J5483J4783j278Q33P651k2072p824J5336
2973a7203O358P016l9883m964L0067K7801j2503o137K378j9526L9323K9190l3929
2960G988k9459k295P98O266l7301L5238J1382q019K1874m19k733j7540L677l0070
$$ plain form
2946 -40613 -33252 -17619 -15658 6189 10832 4512 13112 21948 36107 13906 -3745 -7966 -1370
2933 -1370 24281 -5946 -48030 -70527 -64746 -26518 -16886 -7573 7829 1880 -16310 -9236 -8210
2920 -8210 -6872 -34289 -27394 -31458 -30286 -2359 -8271 -21197 -17995 9703 6396 -11630 -29789
2907 -29789 -36474 12820 -13985 -25884 -19445 -41971 -44025 -25213 18245 14650 945 -21195 -39532
2894 -39532 -28860 -34513 -22968 -29507 -30800 242 16233 27875 37973 -17625 -42690 -39147 -20519
2881 -20519 -41880 -48121 -51969 -10761 -7952 12349 24716 789 -1477 -23535 -1493 19194 17919
2868 17919 10025 -224 -9546 9787 -8152 -52795 -45585 -47409 -35618 -1614 -22743 -10250 -346
2855 -346 -10642 -33639 15417 2440 9109 -14835 -14939 -25159 -43439 -19465 1274 13127 4926
$$ packed form
2946d0613P361J5633J961K1847M643o320Q600Q836J4159k2201j7651m221O596
2933a370K5651l0227m2084k2497N781L8228R632R313J5402n949j8190P074J026
2920h210J338k7417O895m064J172K7927n912j2926L202K7698l307j8026j8159
2907b9789o685M9294k6805j1899O439k2526k054J8812M3458l595j3705k2140j8337
2894c9532J0672n653J1545o539j293L1042J5991J1642J0098n5598k5065L543J8628
2881b0519k1361o241l848M1208K809K0301J2367k3927k266k2058K2042K0687j275
2868A7919p894j0249r322J9333j7939m4643P210j824J1791L4004k1129J2493R904
2855c46j0296k2997M9056j2977O669k3944j04j0220j8280K3974K0739J1853q201
$$ plain form
2842 4926 4585 8692 -7301 868 2338 -2057 -19043 -41970 -283 -594 -49395 -3831 -19355 -39263
2828 -39263 3177 -16276 -21444 -11615 -28518 -31289 -14109 13901 41743 2599 3637 3361 29196
2815 29196 8075 -9096 -37175 -51400 -45062 -40861 -14130 7399 -18328 -27244 -4833 -3770 -1217
2802 -1217 2592 1612 3122 15099 21951 -596 8020 -6524 3022 9341 1366 37060 47298 32132
2788 32132 32221 2035 4549 27311 8883 -25772 -31461 -54280 2316 16607 -22861 -16467 -32993
2775 -32993 -36753 -42628 5588 33801 17829 -32806 -22674 14169 42452 -7469 23149 21008
2763 21008 -39869 -30186 -3611 -24702 -17607 -32191 -19891 1309 15412 36431 36270 -1434 6434
2750 6434 -14695 -17861 -32495 -13474 -7921 -34973 -28281 -29334 -33102 -11927 -6221 6004 4859
$$ packed form
2842D926l41M107j5993Q169J470m395j6986k2927M1687l11m8801M5564j5524j9908
2828c9263M2440j9453n168R829j6903k771J7180K8010K7842l9144J038k76K5835
2815B9196k1121j7171k8079j4225O338M201K6731K1529k5727q916K2411J063K553
2802a217L809r80J510J1977O852k2547Q616j4544R546O319p975L5694J0238j5166
2788C2132Q9l0186K514K2762j8428l4655n689k2819N6596J4291l9468O394j6526
2775c2993l760n875M8216K8213j5972n0635J0132L6843K8283m9921L0618k141
2763B1008o0877R683K6575k1091P095j4584J2300K1200J4103K1019j61l7704P868
2750F434k1129l166j4634J9021N553k7052O692j053l768K1175N706J2225j145
$$ plain form
2737 4859 -15376 -12265 -9380 18368 7132 -1759 -3502 4290 -13560 -16254 -2522 -15883 -18356
2724 -18356 -48317 -18274 6308 -15634 -22200 -3572 39905 32563 -15293 -43361 14574 -1042
2712 -1042 19040 -2185 -37750 -33348 -11891 -27348 -22133 16341 3616 -36417 -28499 -16696 1345
2699 1345 7721 13942 13941 37075 45334 47850 35320 10445 -11287 -15372 -22504 -26470 -4116 12082
2685 12082 -9692 -18888 1476 9352 -10145 -46868 -46556 -27145 -14832 -30188 -27163 -9324 13018
2672 13018 -9525 -17350 -17805 -38798 -34260 -41456 -6851 -15814 -46907 -39923 13809 20694 -1234
2659 -1234 19892 22381 24873 4788 -11285 -14876 1998 25676 36683 55810 31856 22262 29445
2646 29445 4165 470 -19231 -32399 -30462 -3147 -9540 2976 941 -19331 -15257 -13427 -19993
$$ packed form
2737D859k0235L111K885K7748j1236q891j743P792j7850k694J3732j3361k473
2724a8356k9961L0043K4582k1942o566J8628M3477p342m7856k8068N7935j5616
2712a042K0082k1225l5565M402K1457j5457N215L8474j2725m0033P918J1803J8041
2699A345O376O221jK3134Q259K516j2530k4875k1732m085p132l966K2354J6198
2685A2082k1774r196K0364P876j9497l6723L12J9411J2313j5356L025J7839K2342
2672A3018k2543p825m55k0993M538p196L4605q963l1093O984N3732O885k1928
2659a234K1126K489K492k0085j6073l591J6874K3678J1007J9127k3954r594P183
2646B9445k5280l695j9701j3168J937K7315o393J2516k035k0272M074J830o566
$$ plain form
2633 -19993 -36928 -47405 -4728 9395 -18202 -17054 2007 12824 11832 -11039 -7750 -6995 -3280
2620 -3280 -5672 -8749 -28216 11119 26958 -1153 13146 34250 34314 39706 16989 -22052 12166
2607 12166 -3785 33326 8378 -11855 -20947 -12599 -788 -11270 -12595 -33401 -23075 1164
2595 1164 -24907 -53544 -61137 -44621 -6049 -26923 -55397 -78860 -55638 -21136 4054 1230
2583 1230 -10918 22031 8839 27428 4690 -2221 47759 15609 10241 18534 -18810 -70492 -40713
2570 -40713 -13807 -24134 -30775 -15582 -6672 -601 11232 3845 -26701 -15931 -16726 -47230 -38107
2557 -38107 -61105 -40071 2653 -16359 -39201 -33239 -7110 10891 16053 9454 41828 17575
2545 17575 -20938 -25102 -26382 -16492 6815 -5764 -1797 14795 47664 54482 8115 -38773 -5034
$$ packed form
2633a9993j6935j0477M2677J4123k7597J148J9061J0817r92k2871L289P55L715
2620c280k392l077j9467L9335J5839k8111J4299K1104O4N392k2717l9041L4218
2607A2166j5951L7111k4948k0233r092Q348J1811j0482j325k0806J0326K4239
2595A164k6071k8637p593J6516L8572k0874k8474k3463K3222L4502K5190k824
2583A230j2148L2949j3192J8589k2738o911M9980l2150n368Q293l7344n1682K9779
2570d0713K6906j0327o641J5193Q910O071J1833p387l0546J0770p95l0504R123
2557c8107k2998K1034M2724j9012k2842N962K6129J8001N162o599L2374k4253
2545A7575l8513m164j280R890K3307j2579L967J6592L2869O818m6367m6888L3739
$$ plain form
2532 -5034 -4226 -4995 11577 -6945 -6019 9518 11431 8130 10054 -12051 -9544 -35591 -39606 -47963
2518 -47963 -34974 -29222 -6444 -15181 -50373 -29522 -4543 10703 936 -8445 -1202 -27417 -26795
2505 -26795 -32907 -49974 -26962 -10573 -8326 -533 4826 -13012 -15030 -15356 -19480 -37094 -53538
2492 -53538 -182 -26042 -43288 -10386 -28052 -4768 14436 -8216 -14603 -4920 -5642 -9271 -41164
2479 -41164 -42620 -37884 -16276 5586 -20121 -25419 -11468 -13216 -1447 -14307 -4671 34692 24522
2466 24522 -1705 -3946 -15165 -13852 -11875 -8249 -14598 -26497 -24119 -45612 -13260 -5161 -1988
2453 -1988 -6256 -395 -5606 -23618 -17738 11677 15084 -16309 -27529 -26305 -31319 -3361 -42789
2440 -42789 -53759 -48389 -41490 -34726 2810 18987 23595 47231 10897 -29227 -30223 -23580 -48179
$$ packed form
2532e034Q08p69J6572j8522R26J5537J913l301J924k2105K507k6047m015q357
2518d7963J2989N752K2778q737l5192K0851K4979J5246r767r381P243k6215O22
2505b6795o112j7067K3012J6389K247P793N359j7838k018l26m124j7614j6444
2492e3538N3356k5860j7246L2902j7666K3284J9204k2652o387R683p22l629l1893
2479d1164j456M736K1608K1862k5707n298J3951j748J1769j2860R636L9363j0170
2466B4522k6227k241j1219J313J977L626o349j1899K378k1493L2352Q099L173
2453a988m268N861n211j8012N880K9415L407l1393j1220J224n014K7958l9428
2440d2789j0970N370O899O764L7536J6177M608K3636l6334m0124r96O643k4599
$$ plain form
2427 -48179 -23660 -31376 -41451 -45151 -47510 -41593 -4847 -17432 -48199 -62709 -24447 8521 -621
2414 -621 -38121 -48945 -27120 -42536 -43510 -17146 -3910 12479 7781 -14391 -12833 -7325 -20637
2401 -20637 -47437 -38123 -32954 -38164 -28076 -37397 -46860 -32494 -11862 1266 -22460 -46889 -31649
2388 -31649 -13327 -4229 307 -13034 -50069 -37996 -16306 -22575 -6956 -440 -16017 -22840 -32285
2375 -32285 -41227 -29070 -4361 -12649 -24263 -32602 -13771 -8790 -21971 -23033 -36353 -45057 -24389
2362 -24389 20373 -18790 -11407 -19945 -25815 -24506 -12921 21578 31272 31461 24586 -7020 1276 -10141
2348 -10141 -4554 -13273 -6863 3818 -18208 721 24331 15965 -18878 -19408 -29059 -44726 -15466
2335 -15466 33986 4379 -13978 2628 14906 6290 17116 16620 -18782 -29066 -59360 -21119
$$ packed form
2427d8179K4519p716j0075l700k359N917L6746j2585l0767j4510L8262L2968r142
2414f21l7500j0824K1825j5416r74K6364J3236J6389m698k2172J558N508j3312
2401b0637k6800R314N169n210J0088r321r463J4366K0632J3128k3726k4429J5240
2388c1649J8322R098M536j3341l7035J2073K1690o269J5619O516j5577o823r445
2375c2285q942J2157K4709q288j1614q339J8831M981j3181j062j3320q704K0668
2362b4389M4762l9163P383q538n870J309J1585L4499R694J89o875l1606Q296j1417
2348a0141N587q719O410J0681k2026J8929K3610q366l4843n30r651j5667K9260
2335a5466M9452k9607j8357J6606J2278q616J0826m96l5402j0284l0294L8241
$$ plain form
2323 -21119 16027 458 -31488 -32715 -24082 -6765 11655 -17081 -7008 -1984 -9801 -34629 -33324
2310 -33324 -21877 1639 1631 8876 -33313 -39346 -18152 1429 -10182 -1087 -3587 -16818 7759
2297 7759 10399 -26307 -72505 -52791 -23038 -11603 5321 -17014 1836 -15252 -30384 -40482
2285 -40482 -69499 -55741 -53160 -47988 -40117 -22535 -24696 -42918 -11173 4718 -19250 -12075 -6605
2272 -6605 -14254 -16648 -39750 -35449 -29502 -27883 -17197 -26168 -38663 -31142 -24111 -54249 -31750 -23781
2258 -23781 -1880 26353 27269 27240 53500 40126 -18802 -24512 -22663 5088 -3203 -18348 -26767 -23922
2244 -23922 -22782 -40475 -42791 -40891 -31876 -14005 -20931 -10000 -15959 -43046 -61902 -53869 -6672
2231 -6672 909 20299 5062 -14619 -27580 -11797 -5897 19505 -3145 -28838 -16308 -18848 -4613
$$ packed form
2323b1119L7146j5569l1946j227Q633J7317J8420k8736J0073N024p817k4828J305
2310c3324J1447K3516qP245m2189o033K1194J9581j1611R095k500j3231K4577
2297G759K640l6706m6198J9714K9753J1435J6924k2335J8850j7088j5132j0098
2285d0482k9017J3758K581N172P871J7582k161j8222L1745J5891k3968P175N470
2272f605p649k394k3102M301N947J619J0686q971j2495P521P031l0138K2499P969
2258b3781K1901K8233R16k9K6260j3374n8928n710J849K7751q291j5145q419K845
2244b3922J140j7693k316J900R015J7871o926J0931n959k7087j8856Q033M7197
2231f672P581J9390j5237j9681j2961J5783N900K5402k2650k5693J2530k540J4235
$$ plain form
2218 -4613 -26580 6376 6960 -16539 -15541 -36824 -31404 8002 15320 901 -27941 -51547 5745
2205 5745 48150 35679 21717 42978 1396 -20728 -61672 -50943 -21462 -18548 18798 39830
2193 39830 26352 7491 -8397 -28162 -29386 -30169 -51444 -38831 -27005 9764 -33034 -47035
2181 -47035 -35323 -20875 4181 7980 -13927 -9075 1404 1815 -19021 -27081 -18231 -36008 -37404
2168 -37404 -4404 -35468 -33248 -1732 -6079 395 18964 30250 21534 -8300 -20929 -19660 -30183
2155 -30183 -34193 -40691 -14923 -28263 -10531 -10137 -9953 -32768 -50795 -24774 4746 -19573 -2879
2142 -2879 26487 16203 -14758 -15852 -13526 -49915 -33800 -1536 -29962 -26861 -25673 -12545 6050
2129 6050 -8968 -3418 1786 -21240 -16317 -13225 -19997 6247 2470 9155 26651 13122 16861 9217
$$ packed form
2218d613k1967L2956N84k3499R98k1283N420L9406P318j4419k8842k3606N7292
2205E745M2405j2471j3962K1261m1582k2124m0944J0729K9481K914L7346K1032
2193C9830j3478j8861j5888j9765j224p83k1275J2613J1826L6769m2798j4001
2181d7035J1712J4448K5056L799k1907M852J0479M11k0836q060Q850j7777j396
2168c7404L3000l1064K220L1516m347O474J8569J1286q716k9834j2629J269j0523
2155c0183m010o498K5768j3340J7732L94J84k2815j8027K6021K9520k4319J6694
2142b879K9366j0284l0961j094K326l6389J6115L2264k8426L101J188J3128J8595
2129F050j5018N550N204k3026M923L092o772K6244l777O685J7496j3529L739p644
$$ plain form
2115 9217 9663 -19537 -41710 -9534 4657 -40980 -20542 -25698 -20940 -15681 -13736 -41070 -4115
2102 -4115 23305 1911 5880 11199 -19968 -18299 722 -10160 4694 14348 11562 10955 8033 23905
2088 23905 8166 -3885 5884 -22986 -27071 -13992 -28641 -4167 -17 11525 19751 -5827 -5189
2075 -5189 19639 -4342 -8392 -6625 1330 1756 -11684 -42795 -51663 -36576 -29018 -25162 10870 6290
2061 6290 1046 -10534 -35607 -27456 6466 -4951 -30530 -14473 -21008 -2890 -29531 -1090 3562
2048 3562 -9044 -60947 -52367 -10724 1417 -28547 -22700 -41192 16277 18288 8603 -29859 -43779
2035 -43779 -44903 -27937 -12082 10307 -6061 -39514 -36607 -51436 -25956 -595 -7257 -9136 3426
2022 3426 13421 1580 17612 14743 -9631 -7589 -1320 9662 -16186 -37736 -9929 3801 14115
$$ packed form
2115I217M46k9200k2173L2176J4191m5637K0438n156M758N259J945k7334L6955
2102d115K7420k1394L969N319l1167J669J9021j0882J4854R654k786o07k922J5872
2088B3905j5739j2051R769k8870m085J3079j4649K4474M150J1542Q226k5578O38
2075e189K4828k3981m050J767P955M26j3440l1111q868J5087P558L856L6032m580
2061F290n244j1580k5073Q151L3922j1417k5579J6057o535J8118k6641K8441M652
2048C562j2606n1903Q580M1643J2141k9964N847j8492N7469K011r685l8462j3920
2035d3779j124J6966J5855K2389j6368l3453K907j4829K5480K5361o662j879J2562
2022C426R995j1841J6032k869k4374K042O269J0982k5848k1550K7807J3730J0314
$$ plain form
2009 14115 -3798 -16439 -33768 -10694 -21152 -37015 -65994 -33249 -25322 -29162 838 408 16403
1996 16403 -18156 -25618 -37245 -23102 -25024 -21509 -43163 -44001 -25263 -9529 -9325 -11623 -12686 -7938
1982 -7938 -8446 -38278 -55979 -12776 -925 -8971 -51560 -60934 -58429 -5019 688 -37153 -18051
1969 -18051 -12777 -28272 -23306 2196 6151 -21702 -33269 -41701 -7021 4027 -218 -8893 -3906
1956 -3906 -37605 -61627 -27881 -17131 -31403 -55004 -53320 -14946 2780 4561 5349 -27322 -52008
1943 -52008 -24194 6203 -14513 13960 14644 30678 16344 5730 -5949 -28451 -40009 -17795
1931 -17795 -20369 -34574 -33616 -69949 -79553 -60916 -20769 -12966 -34001 -69932 -26529 9734 -13411
$$ packed form
2009A4115j7913j2641j7329K3074j0458j5863k8979L2745P927l840L0000m30J5995
1996A6403l4559p462j1627J4143j922L515k1654q38J8738J5734K04k298j063M748
1982g938n08k9832j7701M3203J1851q046m2589r374K505N3410N707l7841J9102
1969a8051N274j5495M966K5502L955k7853j1567q432L4680J1048m245q675M987
1956c906l3699k4022L3746J0750j4272k3601J684L8374J7726J781P88l2671k4686
1943e2008K7814L0397k0716K8473O84J6034j4334j0614j1679k2502j1558K2214
1931a7795k574j4205R58l6333r604J8637M0147P803k1035l5931M3403L6263k3145
$$ [...]
##END NTUPLES=NMR SPECTRUM
##END=
