##TITLE=1H_DE-80H_X3
 200.13MHz, d2o
 8 sc
 
 19ns.26.2.2025
##JCAMPDX= 6.0         $$ Bruker NMR JCAMP-DX V2.0
##DATA TYPE= NMR SPECTRUM
##DATA CLASS= NTUPLES
##ORIGIN= UXNMR, Bruker Analytische Messtechnik GmbH
##OWNER= pz
$$ XWIN-NMR		Version 3.5
$$ Wed Jul  1 10:00:19 2026 Russian Standard Time (UT+4h)  Yarkov@DPX200
##.OBSERVE FREQUENCY= 200.1313
##.OBSERVE NUCLEUS= ^1H
##.ACQUISITION MODE= SIMULTANEOUS
##.ACQUISITION SCHEME= undefined
##.AVERAGES= 8
##.DIGITISER RES= 18
##SPECTROMETER/DATA SYSTEM= spect
##.PULSE SEQUENCE= zg30
##.SOLVENT NAME= CDCl3
##.SHIFT REFERENCE= (INTERNAL, CDCl3, 0, 15.5133)
##AUDIT TRAIL= $$ (NUMBER, WHEN, WHO, WHERE, WHAT)
$$ ##TITLE= Audit trail, XWIN-NMR		Version 3.5
$$ ##JCAMPDX= 5.01
$$ ##ORIGIN= Bruker BioSpin GmbH
$$ ##OWNER= Yarkov
$$ C:/Bruker/XWIN-NMR/data/yarkov2/nmr/H-C/1/pdata/1/auditp.txt
$$ ##AUDIT TRAIL=  $$ (NUMBER, WHEN, WHO, WHERE, WHAT)
(   1,<2026-07-01 09:59:37.35 +0400>,<Yarkov>,<DPX200>,
      <created by zg, POWCHK disabled, PULCHK disabled
       configuration hash MD5:
       00 E9 B6 7A A2 85 ED C7 34 08 36 98 17 FE 4E 26
       data hash MD5: 16K
       CE 16 AF FC 60 4A 49 DE AB 94 C0 50 70 93 CC 04>)
(   2,<2026-07-01 09:59:43.23 +0400>,<Yarkov>,<DPX200>,
      <Start of raw data processing
       efp BC_mod = 2 LB = 0.25 FT_mod = 6 PKNL = 1 PHC0 = -6900.419 PHC1 = 13.42196 SI = 16K 
       data hash MD5: 16K
       7D 69 78 09 E2 9E 27 A9 86 85 BA 8F 22 0F C2 7A>)
(   3,<2026-07-01 09:59:47.75 +0400>,<Yarkov>,<DPX200>,
      <abs ABSG = 5 
       data hash MD5: 16K
       1F FE 99 AE 4D B0 6D 07 11 E1 28 CD 22 8F 8E 05>)
$$ ##END=
$$ 
$$ hash MD5
$$ 1E 05 00 7B 2C 7C 1A 32 CD 07 17 87 DF 60 49 66
##$RELAX= 
##$RELAX= 
##$RELAX= 
##$RELAX= 
##$RELAX= 
##$RELAX= 
$$ Bruker specific parameters
$$ --------------------------
##$DU= <C:/Bruker/XWIN-NMR>
##$EXPNO= 1
##$NAME= <H-C>
##$PROCNO= 1
##$TYPE= <nmr>
##$USER= <yarkov2>
##$AMP= (0..31)
100 100 100 100 100 100 100 100 100 100 100 100 100 100 100 100 100 100 
100 100 100 100 100 100 100 100 100 100 100 100 100 100 
##$AQSEQ= 0
##$AQ_mod= 1
##$AUNM= <au_zg>
##$AUTOPOS= <>
##$BF1= 200.13
##$BF2= 200.13
##$BF3= 200.13
##$BF4= 200.13
##$BF5= 200.13
##$BF6= 200.13
##$BF7= 200.13
##$BF8= 200.13
##$BYTORDA= 1
##$CFDGTYP= 0
##$CFRGTYP= 5
##$CHEMSTR= <none>
##$CNST= (0..31)
1 1 145 1 1 1 1 1 1 1 1 1 1 1 1 1 1 1 1 1 1 1 1 1 1 1 1 1 1 1 1 1 
##$CPDPRG= <>
##$CPDPRG1= <>
##$CPDPRG2= <>
##$CPDPRG3= <>
##$CPDPRG4= <mlev>
##$CPDPRG5= <mlev>
##$CPDPRG6= <mlev>
##$CPDPRG7= <mlev>
##$CPDPRG8= <mlev>
##$CPDPRGB= <>
##$CPDPRGT= <>
##$D= (0..31)
0 0.7 0 0 0 0 0 0 0 0 0 0.03 0 0 0 0 0 0 0 0 0 0 0 0 0 0 0 0 0 0 0 0 
##$DATE= 1782885576
##$DBL= (0..7)
120 120 120 120 120 120 120 120 
##$DBP= (0..7)
150 150 150 150 150 150 150 150 
##$DBP07= 0
##$DBPNAM0= <>
##$DBPNAM1= <>
##$DBPNAM2= <>
##$DBPNAM3= <>
##$DBPNAM4= <>
##$DBPNAM5= <>
##$DBPNAM6= <>
##$DBPNAM7= <>
##$DBPOAL= (0..7)
0.5 0.5 0.5 0.5 0.5 0.5 0.5 0.5 
##$DBPOFFS= (0..7)
0 0 0 0 0 0 0 0 
##$DE= 6
$$ [...]
##$SUBNAM3= <"">
##$SUBNAM4= <"">
##$SUBNAM5= <"">
##$SUBNAM6= <"">
##$SUBNAM7= <"">
##$SUBNAM8= <"">
##$SUBNAM9= <"">
##$SW= 18.0517328524113
##$SWIBOX= (0..15)
0 0 2 0 0 0 0 0 0 0 0 0 0 0 0 0 
##$SW_h= 3612.71676300578
##$TD= 16384
##$TD0= 1
##$TE= 0
##$TE2= 300
##$TE3= 300
##$TEG= 300
##$TL= (0..7)
0 120 120 120 120 120 120 120 
##$TP= (0..7)
150 150 150 150 150 150 150 150 
##$TP07= 0
##$TPNAME0= <>
##$TPNAME1= <>
##$TPNAME2= <>
##$TPNAME3= <>
##$TPNAME4= <>
##$TPNAME5= <>
##$TPNAME6= <>
##$TPNAME7= <>
##$TPOAL= (0..7)
0.5 0.5 0.5 0.5 0.5 0.5 0.5 0.5 
##$TPOFFS= (0..7)
0 0 0 0 0 0 0 0 
##$TUNHIN= 0
##$TUNHOUT= 0
##$TUNXOUT= 0
##$USERA1= <user>
##$USERA2= <user>
##$USERA3= <user>
##$USERA4= <user>
##$USERA5= <user>
##$V9= 5
##$VALIST= <valist>
##$VCLIST= <CCCCCCCCCCCCCCC>
##$VD= 0
##$VDLIST= <DDDDDDDDDDDDDDD>
##$VPLIST= <PPPPPPPPPPPPPPP>
##$VTLIST= <TTTTTTTTTTTTTTT>
##$WBST= 1024
##$WBSW= 4
##$XGAIN= (0..3)
0 0 0 0 
##$XL= 0
##$YL= 0
##$YMAX_a= 195577
##$YMIN_a= -204920
##$ZGOPTNS= <>
##$ZL1= 120
##$ZL2= 120
##$ZL3= 120
##$ZL4= 120
##$ABSF1= 15.49017
##$ABSF2= -2.56168
##$ABSG= 5
##$ABSL= 3
##$ALPHA= 0
##$AQORDER= 0
##$ASSFAC= 0
##$ASSFACI= 0
##$ASSFACX= 0
##$ASSWID= 0
##$AUNMP= <proc_1d>
##$AZFE= 0.1
##$AZFW= 0.1
##$BCFW= 0
##$BC_mod= 2
##$BYTORDP= 0
##$COROFFS= 0
##$CY= -3
##$DATMOD= 1
##$DC= 0
##$DFILT= <>
##$DTYPP= 0
##$F1P= 0
##$F2P= 0
##$FCOR= 1
##$FTSIZE= 16384
##$FT_mod= 6
##$GAMMA= 0
##$GB= 0
##$INTBC= 1
##$INTSCL= 3.241238e-09
##$ISEN= 128
##$LB= 0.25
##$LEV0= 0
##$LPBIN= 0
##$MAXI= 10000
##$MC2= 0
##$MEAN= 0
##$ME_mod= 0
##$MI= 1.114404
##$NCOEF= 0
##$NC_proc= -7
##$NLEV= 6
##$NOISF1= 3.799351
##$NOISF2= 2.8
##$NSP= 0
##$NTH_PI= 0
##$NZP= 0
##$OFFSET= 15.51331
##$PC= 1
##$PHC0= -6900.419
##$PHC1= 13.42196
##$PH_mod= 1
##$PKNL= yes
##$PPARMOD= 0
##$PSCAL= 0
##$PSIGN= 0
##$REVERSE= no
##$SF= 200.130001680308
##$SI= 16384
##$SIGF1= 3
##$SIGF2= 2
##$SINO= 0.751879
##$SIOLD= 32768
##$SREGLST= <19F.Aceton>
##$SSB= 0
##$STSI= 16384
##$STSR= 0
##$SW_p= 3612.71676300578
##$SYMM= 0
##$S_DEV= 0
##$TDeff= 16384
##$TDoff= 0
##$TI= <>
##$TILT= no
##$TM1= 0
##$TM2= 0
##$TOPLEV= 0
##$USERP1= <user>
##$USERP2= <user>
##$USERP3= <user>
##$USERP4= <user>
##$USERP5= <user>
##$WDW= 1
##$XDIM= 16384
##$YMAX_p= 438116749
##$YMIN_p= -443352
$$ End of Bruker specific parameters
$$ ---------------------------------
##NTUPLES= NMR SPECTRUM
##VAR_NAME=  FREQUENCY,     SPECTRUM/REAL,   SPECTRUM/IMAG
##SYMBOL=    X,             R,               I
##VAR_TYPE=  INDEPENDENT,   DEPENDENT,       DEPENDENT
##VAR_FORM=  AFFN,          ASDF,            ASDF
##VAR_DIM=   16384,         16384,           16384
##UNITS=     HZ,            ARBITRARY UNITS, ARBITRARY UNITS
##FACTOR=    0.220516191357247, 1,           1
##FIRST=     3104.67884291017, 0,            0
##LAST=      -508.037920095608, 0,           0
##MIN=       -508.037920095608, -443352,     0
##MAX=       3104.67884291017, 438116749,    0
$$ Real data points
##PAGE= N=1
##DATA TABLE= (X++(R..R)), XYDATA
$$ [...]
6930H6855j186n0640O6966o7143l2841k7197j2790M2849K2109K7728n747O39M571
$$ 86855 85669 35029 101995 34852 2011 -25186 -37976 4873 26982 54710 48963 49602 54173
6917E4173L6418k968q3809j818M2309k8397r157L0534L9832l3589R582M4364n1763
$$ 54173 90591 87623 3814 1996 44305 15908 6751 37285 77117 43528 53110 97474 45711
6904D5711M9807L5021l8308N4129J0493m0362o5630N9227L4782k6323j3900p5222
$$ 45711 95518 130539 92231 146360 156853 116491 50861 110088 144870 118547 104647 29425
6892B9425o294Q9158L5931o640n9836K080O5998p170J3584L9899l5230r6340j6840
$$ 29425 23131 112289 148220 141580 81744 83824 149822 142652 156236 196135 160905 64565 47725
6879D7725N44P2271j1651L0606l0603l6865m0786k4294L0778J2321N8405j7472
$$ 47725 48269 120540 108889 139495 108892 72027 31241 6947 37725 50046 108451 90979
6867I0979k4251o4887M818l6747r278R5118O1129k5917L381l4667j7699J9651
$$ 90979 66728 1841 6659 -30088 -39366 55752 116881 90964 94345 59678 41979 61630
6855F1630L4780o981J3773q383p234M2599L2972n6370k8616q446K8496J21j7138
$$ 61630 96410 89429 103202 94819 87585 130184 163156 106786 78170 69724 98220 98341 81203
6842H1203q570k2189j529R778L8289p132J046m9599m354N1622K6344n9065R924
$$ 81203 72633 50444 48915 58693 96982 89850 90896 41297 36943 88565 114909 55844 65768
6829F5768m2351K0255L4182L2815O0065J2035q9706K1602K1724j3472K3641k1728
$$ 65768 23417 43672 77854 110669 170734 182769 93063 114665 136389 122917 146558 124830
6817A24830k8693k4018l1313L5472R821j5770Q2349m7897K0569p769k2710L16
$$ 124830 96137 72119 40806 76278 86099 70329 152678 104781 125350 117581 94871 95187
6805I5187l3371J5248J2069J5714j3068Q463K1737l1627k409j4557J573J2453
$$ 95187 61816 77064 89133 104847 91779 100242 121979 90352 87943 73386 74959 87412
6793H7412N1481r1631j8745K9640J1856M4236K4247L4944j2760q1395O4134r9874
$$ 87412 138893 47262 28517 58157 70013 114249 138496 173440 160680 79285 143419 43545
6781D3545m5932O2264k3786K0616L6297k914k641j7682k381M292n8997K2775N7512
$$ 43545 -2387 59877 36091 56707 93004 90090 87449 69767 67386 71678 12681 35456 92968
6768I2968N8692k6534R4999k4110l2632r2238K3427K4685l95k7722n7974J9366
$$ 92968 151660 125126 220125 196015 163383 71145 94572 119257 118862 91140 33166 52532
6756E2532L4175j3578L0300p016o8087N1950R6410J9264j5778k1241k8776L4720
$$ 52532 86707 73129 103429 96413 28326 80276 176686 195950 180172 158931 130155 164875
6744A64875j3402m0730o8335N3435n8625L4379l2445m6515O2659N5197k6539l7667
$$ 164875 151473 110743 42408 95843 37218 71597 39152 -7363 55296 110493 83954 46287
6732D6287P3394J9767p3942L2771O7717k5488pj5939j9315j2990l4471j3408P8992
$$ 46287 119681 139448 65506 98277 165994 140506 140499 124560 105245 92255 57784 44376 123368
6719A23368n4196m0156K7923j0620J5863P594J3094L7764j2626k6783M3071O126
$$ 123368 69172 29016 56939 46319 62182 69776 82870 120634 108008 81225 124296 130422
6707A30422j407r4762q513Q3087M614P462M4311l2453j7564o6421p989j0093P7571
$$ 130422 129015 34253 25740 108827 113441 120903 165214 132761 115197 48776 40787 30694 108265
6694A08265k1064m4446Q6966l2725l8442j4980P7361M1402j4506l986j193p6271
$$ 108265 87201 42755 129721 96996 58554 43574 120935 162337 147831 143845 142652 66381
6682F6381P26L9545K1543J2614p736j0893q605l3614K0990m9436R43K09K7964
$$ 66381 67107 106652 128195 140809 133073 122180 113575 79961 100951 51515 52458 52667 80631
6669H0631J5968P614N5419l3951n3197L9906j7761m0291L6386J4511p422J3015
$$ 80631 96599 104213 159632 125681 72484 112390 94629 54338 90724 105235 97813 110828
6657A10828K5327p850k3598J4047j5283j7339o8748M3999l175Q377k9075O425
$$ 110828 136155 128305 104707 118754 103471 86132 17384 61383 58208 66585 37510 43935
6645D3935J9206N3393M7572q9098J998n729m450N1600l9361J0245j14k0811P2767
$$ 43935 63141 116534 164106 75008 77006 71277 66827 118427 79066 89311 89197 68386 141153
6632A41153J1335j0594K1239k0165K4099r073j7929K0648l8367l663l4443M8241
$$ 141153 152488 141894 163133 142968 167067 157994 140065 160713 122346 118683 84240 132481
6620A32481K2809m8313L9130o7510j9497J03476q273O1276l5554n1918J0757M5222
$$ 132481 155290 106977 146107 78597 59100 162576 154303 215579 180025 128107 138864 184086
6608A84086k7766m2616k8797M057o7774O613J40309K0512r8795L0236J2346k4566
$$ 184086 156320 113704 84907 88964 21190 27803 168112 188624 89829 120065 132411 107845
6596A07845N3802r934k4911m9459k3822Q0291n7223O809L9446j4987o1018O9870
$$ 107845 161647 151713 126802 77343 53521 133812 76589 83398 122844 107857 46839 116709
6584A16709O658k2313M099J279K7014m2974P2662k3103n7513K7501L8200L5637
$$ 116709 123367 101054 105153 106432 133446 90472 163134 140031 82518 110019 148219 183856
6572A83856m3976n4742K0263R244j248P490J3145K8831L561L248p113p3791K3607
$$ 183856 139880 85138 105401 114645 113397 120887 134032 162863 166424 169672 162559 88768 112375
6559A12375J0142P7991l805j3842n7923l3239j276k5448N7143O0466Q70l3294
$$ 112375 122517 200508 196703 182861 124938 91699 90423 64975 122118 182584 183454 150160
6547A50160L0990m0971l4006M2571L462m0572L0577r325m054N9736L1300o0877
$$ 150160 181150 140179 106173 148744 152206 111634 142211 132886 128832 188568 219868 158991
6535A58991k5311q2293K4017J8742k9383J1849j9942j4787M8903J25549q8863
$$ 158991 133680 51387 75404 94146 64763 76612 56670 41883 90786 216335 127472
6524A27472k7575j2935k0270O0796K1296m3781j6585n329l2706J00038j9820k8842
$$ 127472 99897 86962 66692 127488 148784 105003 88418 83089 50383 150421 130601 101759
6512A01759J8682o7509L3705P1991m1445L7550L0791k3314J042L2561q8413J0081
$$ 101759 120441 52932 86637 158628 117183 154733 185524 162210 163252 195813 107400 117481
6500A17481J1434J5379O976K943j9622J6585J13463l9562k2595p7370K5895o700
$$ 117481 128915 144294 151270 154213 134591 151176 264639 225077 202482 125112 151007 144307
6488A44307M1878l705n3009m5498L3807k4525M0378J5984K0524k77J3574J8051
$$ 144307 186185 182480 129471 83973 117780 93255 133633 149617 170141 169864 183438 201489
6476B01489n494K5911r2518p6688m5339K3285Q8364O4514n838j3700R952k4190
$$ 201489 195995 221906 129388 52700 7361 30646 119010 183524 177686 163986 173938 149748
6464A49748o466J8376L007m5212J7728J5063N8300k1888l6671o1208M5260j6439
$$ 149748 143282 161658 164665 119453 137181 152244 210544 188656 151985 90777 136037 119598
6452A19598L9895N9946j15528k5587K9133O0603m2326l7612L876N4662L0793L6881
$$ 119598 159493 219439 103911 78324 107457 168060 125734 88122 91998 146660 177453 214334
6440B14334o3302k8185p431J6550n835k0261L1793O783J9513j0804m088M9929
$$ 214334 151032 122847 115416 131966 126131 105870 137663 144446 163959 153155 149067 198996
6428A98996L6223j8017k0687J452m8415J4164K9779j6636j1438m6587o1398P4288
$$ 198996 235219 217202 196515 197967 149552 163716 193495 176859 165421 118834 57436 131724
6416A31724J6682M1366l8158p973J8210j0843o9088L3034O6824j6038N1404J7309
$$ 131724 148406 189772 151614 143641 161851 151008 81920 114954 181778 165740 217144 234453
6404B34453j3973j9744j6674k2317N1782k0609o0605M337n141k8520J00849K5695
$$ 234453 220480 200736 184062 161745 213527 192918 132313 136650 131509 102989 203838 229533
6392B29533q8362L8908J1683m6840k6939l9481m8005P1614K1293j9729l175P494
$$ 229533 141171 180079 191762 144922 117983 78502 30497 102111 123404 103675 100500 107994
6380A07994M9170k7931L0287K2435L717O7656J3371q1154o879j544M17J1971m7628
$$ 107994 157164 129233 159520 181955 185672 253328 266699 185545 178666 177122 177539 189510 141882
6367A41882k3805K540Q5561M1634l2142o2381K444J0467J4780K3041n5092l751
$$ 141882 118077 120617 206178 247812 215670 153289 155733 166200 180980 204021 148929 145178
6355A45178J9129K74l8161M0458k7559J8533K2017N584k8437j00608O0396j7058
$$ 145178 164307 164581 126420 166878 139319 157852 179869 185453 157016 56408 116804 99746
6343I9746q593p629L5220L5746K020l6405J1920L9484J5880l5215j3586M3821
$$ 99746 91153 83524 118744 154490 156510 120105 132025 171509 187389 152174 138588 182409
6331A82409L9297k8824o1223k5691k3494N3308K8616N2197m8033n042O043K6149
$$ 182409 221706 192882 131659 105968 82474 135782 164398 216595 168562 163520 169563 195712
6319A95712J2761r0301k2941L3200j7452m907k330k4533K1299J7871N2118m8589
$$ 195712 208473 118172 95231 128431 110979 106072 103742 79209 100508 118379 170497 121908
6307A21908m8200J33521j9398m9351J9536p211R506N8887n6233J1406m973N9408
$$ 121908 73708 207229 187831 138480 158016 150805 160311 219198 162965 174371 169398 228806
6295B28806n1642k6153K1727l8961k1693J3444M0476K3648K3322k9506o828k209
$$ 228806 177164 151011 172738 133777 112084 125528 166004 189652 212974 183468 176640 174431
6283A74431L6924l8937M1341k6497m7041K9913K7153k8115P412N1431n204L2181
$$ 174431 211355 172418 213759 187262 140221 170134 197287 169172 176584 228015 222811 254992
6271B54992k3146k5898O7344q6144k4221K8835J3810j7005l2937K5102K1580m586
$$ 254992 231846 205948 273292 187148 162927 191762 205572 188567 155630 180732 202312 197726
6259A97726o949j841N4150k3111m467k0545J3345L3708l9529j5542l5841K2800
$$ 197726 190777 188936 243086 219975 215508 194963 208308 242016 202487 186945 151104 173904
6247A73904n8695M5642O6518o1851k6303J0357m0136N4873l0694k2137K7564j4175
$$ 173904 115209 160851 227369 165518 139215 149572 109436 164309 133615 111478 139042 124867
6235A24867K6019L9230R003m2892N5851L9025l5442j8693k236J5712r461k6958
$$ 124867 150886 190116 199119 156227 212078 251103 215661 196968 194732 210444 200983 174025
6223A74025N1057j757p0307K2287M6704m6694M8037N0334j1148m5578J9102J480
$$ 174025 225082 223325 153018 175305 222009 175315 223352 273686 262538 216960 236062 237542
6211B37542J590k0627j4940p695n5743K5459O3247O5382m6164m5249M0212J8121
$$ 237542 239132 218505 203565 195870 140127 165586 228833 294215 248051 202802 243014 261135
6199B61135k9983m2461j7614L3035O0531k1957J3000k8504n3286r353K0859P6890
$$ 261135 231152 188691 171077 204112 264643 242686 255686 227182 173896 164543 185402 262292
6187B62292q914o3565N7114J8354J8259p4552m3703M5059o950J1456j0667L7717
$$ 262292 253378 189813 246927 265281 283540 208988 165285 210344 203394 214850 204183 241900
6175B41900K8538L5298p5692j8768P3303m1744m3488O068L193L7695J1140k2573
$$ 241900 270438 305736 230044 211276 284579 242835 199347 205415 208608 246303 257443 234870
6163B34870M0220Q332J5422J4737n7352k6299m6753K3861R9302n9208P067K3427
$$ 234870 275090 283422 298844 313581 256229 229930 183177 207038 306340 247132 254199 277626
6151B77626K4542L2600o0879o020l4611N9008L2660K1384p2388l9065m476k661
$$ 277626 302168 334768 273889 267869 233258 292266 324926 346310 273922 234857 230381 227720
6139B27720O8260m9226M065J3320o6069j00441j8168P2857J2820Q1400K6779l1964
$$ 227720 295980 246754 250819 264139 198070 97629 79461 152318 165138 246538 273317 241353
6127B41353q5995M5248K2533l7653N9299Q3935K3711M818m7422l5617o7913J9915
$$ 241353 155358 200606 223139 185486 244785 328720 352431 357249 309827 274210 206297 226212
6115B26212Q640j3703L6296M9571M2408l9893L2437k2278l9676j3844K1672K5833
$$ 226212 234852 221149 257445 307016 349424 309531 341968 319690 280014 266170 287842 313675
6103C13675j149n732M2302K7111m4804n1474J3801K5756p044j7464k345p29m0245
$$ 313675 312526 306794 349096 376207 331403 279929 293730 319486 312442 294978 292633 291904 251659
6090B51659p194L295J951P2585N267K76j6009J3878k3604P7583j9651m0577l5607
$$ 251659 244465 247760 249711 322296 327563 327839 311830 325708 302104 379687 360036 319459 283852
6077B83852p866O2931k6542k2434N0998N6853m6827q423k2956l027l743M0880
$$ 283852 275986 338917 312375 289941 340939 397792 350965 342542 319586 316559 312816 353696
6065C53696k5944m2149j7503J4481L4310K1684N0243M4989l9060j5658K4497j8781
$$ 353696 327752 285603 268100 282581 316891 338575 388818 433807 394747 379089 403586 384805
6053C84805l6319j7666P159m7214Q7145L3371J045p2095N0006o143K04M1926l2882
$$ 384805 348486 330820 337979 290765 377910 411281 412326 340231 390237 384094 384298 426224 393342
6040C93342j1320L1885j8701J6308K5572j640K2048M8603m5300n9882K2080o2381
$$ 393342 382022 413907 395206 411514 437086 435446 457494 506097 460797 400915 422995 360614
6028C60614K2881P4109l5039R859j1582p291j5698j1655O7197n3380O711l4023
$$ 360614 383495 457604 422565 432424 420842 413551 397853 386198 453395 400015 406726 372703
6016C72703J17677Q86k1462M3496m5181j04267L0800K4476r0430J4565O2622J2985
$$ 372703 490380 491266 469804 513300 468119 363852 394652 419128 328698 343263 405885 418870
6004D18870j3652k8260R907N4316l914j2105k3182o217J8559N2765j3338j9815
$$ 418870 405218 376958 386865 441181 437267 425162 401980 395763 414322 467087 453749 433934
5992D33934L896M3277l738P0507l9595M4456R443k6697k7184k1638N7418p9502
$$ 433934 437830 481107 477369 547876 508281 552737 562180 535483 508299 486661 544079 464577
5980D64577K3054L2190J0881l729K8890O0217K9415L6982J8460o9070n877K1230
$$ 464577 487631 519821 530702 526973 555863 616080 645495 682477 700937 631867 625990 647220
5968F47220J00046N5500P9291L8953P9583J22670J66290K8727J17384Q2814J3644
$$ 647220 747266 802766 882057 921010 1000593 1123263 1289553 1318280 1435664 1518478 1532122
5957A532122K4180l173O7841n0546m4381O4060O808K4376J475m1266J6516m5683
$$ 1532122 1556302 1553129 1620970 1570424 1526043 1590103 1596911 1621287 1622762 1581496 1598012 1552329
5945A552329j07147l6089j11385j18398r1009j13065r9325m5269j0997l5108k3217
$$ 1552329 1445182 1409093 1297708 1179310 1088301 975236 875911 830642 819645 784537 761320
5934G61320o9500m2998m0009n0496l3442L5252N8332j2013o2263J2270P9874K4015
$$ 761320 691820 648822 608813 558317 524875 560127 618459 606446 544183 556453 636327 660342
5922F60342k8120M851k8494k820J6073J4307l7124P6668l3103p1245L7611L4912
$$ 660342 632222 637073 608579 605759 621832 636139 599015 675683 642580 571335 608946 643858
5910F43858k8346l1680J2379L4293K7125K0949M8439m176k5019L7470p0841m154
$$ 643858 615512 583832 596211 630504 657629 678578 727017 722841 697822 735292 664451 660297
5898F60297K4767J0062M6304j8719o4947j7767L9002K7998n7396M52m0680k9739
$$ 660297 685064 695126 741430 722711 657764 639997 678999 706997 649601 650053 609373 579634
5886E79634m8397P1507q66R641O4360j7669P8939O4700k0730j4129Q037j8352
$$ 579634 531237 602744 601878 611519 675879 658210 737149 801849 781119 766990 775027 756675
5874G56675k2954j4196j2954O3988L7424j3072O1876N3121n5843n9089q346l5839
$$ 756675 733721 719525 706571 770559 807983 794911 856787 909908 854065 794976 786630 750791
5862G50791L2698L6049n1042j9886J1590j223J12623k5888J610l9380J107N7165
$$ 750791 783489 819538 768496 748610 760200 758977 871600 845712 847322 807942 809049 866214
5850H66214m6034P471L9738K1173M017j1564P690j9646k4675j0539P308L2050
$$ 866214 820180 827651 867389 888562 892579 881015 888705 869059 844384 833845 841153 873203
5838H73203K7347j0275M1075k0790J6463M8271L943p5176L899Q2756l899n2965
$$ 873203 900550 890275 931350 910560 927023 975294 979237 904061 907960 990716 986817 933852
5826I33852l4419m8150K5084K4890j4642k5967P7486J34471J4254J4050J2398
$$ 933852 899433 851283 876367 901257 886615 860648 938134 1072605 1086859 1100909 1113307
5815A113307N0460l3654l2737m9713N077N5220k6637M8536J6350J32183q407m8815
$$ 1113307 1163767 1130113 1097376 1047663 1052740 1107960 1081323 1129859 1146209 1278392 1269985 1221170
5803A221170N5220O9595q5016p3102M7588K4118m3560k5299N2592K3301M2913
$$ 1221170 1276390 1345985 1260969 1187867 1235455 1259573 1216013 1190714 1243306 1266607 1309520
5792A309520L1349O7797q3662L6234J39112N8491p0254l2954J3771L3979J32315
$$ 1309520 1340869 1408666 1325004 1361238 1500350 1558841 1488587 1455633 1469404 1503383 1635698
5781A635698J6868l7956K3067N2150J90376O4924o463k7769L8967P9130K1011
$$ 1635698 1652566 1614610 1637677 1689827 1880203 1945127 1938664 1910895 1949862 2028992 2050003
5770B050003N388M5481j0823K9771K2346k5130N5446J08649o0350n0665M6128
$$ 2050003 2055391 2100872 2090049 2119820 2142166 2117036 2172482 2281131 2220781 2170116 2216244
5759B216244k2136M5341K3010N319R698Q7732o0059L9546M5792K3097O8840P7688
$$ 2216244 2194108 2239449 2262459 2267778 2277476 2365208 2305149 2344695 2390487 2413584 2482424 2560112
5747B560112M1947n487L1455j088L249j3306J8555R2485P7354N8409P3391n5637
$$ 2560112 2602059 2596572 2628027 2626939 2630188 2616882 2635437 2727922 2805276 2863685 2937076 2881439
5735B881439N1354Q6256J7184J15184k7056P299M3047L2357R5395M0574K9293
$$ 2881439 2932793 3019049 3036233 3151417 3124361 3131660 3174707 3207064 3302459 3343033 3372326
5724C372326L0521P3184J75687Q9977Q467J51002J16729Q2621J30329J20842J05680
$$ 3372326 3402847 3476031 3651718 3741695 3750162 3901164 4017893 4100514 4230843 4351685 4457365
5713D457365M8097K5517Q9734J18863P9131J61237K05833J39681L4877P3958J41280
$$ 4457365 4505462 4530979 4620713 4739576 4818707 4979944 5185777 5325458 5360335 5434293 5575573
5702E575573J47002P3472L5944J58756J98481J11683J77910J41102J11223J41376
$$ 5575573 5722575 5796047 5831991 5990747 6189228 6300911 6478821 6619923 6731146 6872522
5692F872522K09286J70861J49922K41272J65535K67651J86078J54255J81948L01175
$$ 6872522 7081808 7252669 7402591 7643863 7809398 8077049 8263127 8417382 8599330 8900505
5682H900505K62858K97757K74010K31127K60711M08834M43320M07339M58610N51233
$$ 8900505 9163363 9461120 9735130 9966257 10226968 10635802 11079122 11486461 11945071 12496304
5672A2496304N63063O19203Q39395Q89369Q38038R72158J033589J112329J247759
$$ 12496304 13059367 13678570 14517965 15407334 16245372 17217530 18251119 19363448 20611207
5663B0611207J412420J664987K034869K266209K444267K705910L001598L705261
$$ 20611207 22023627 23688614 25723483 27989692 30433959 33139869 36141467 39846728
5655C9846728M649215N873519P677995J0293703J3861566J8660214K3908704K8539991
$$ 39846728 44495943 50369462 58047457 68341160 82202726 100862940 124771644 153311635
5647A53311635L1472823K8492752J8887416Q768658o93706q039664r642066o972698
$$ 153311635 184784458 213277210 232164626 240933284 240239578 232199914 222557848 215585150
5639B15585150j249394O291302J1517803J3126785R579880j92096j0250367j7273474
$$ 215585150 214335756 220627058 232144861 245271646 254851526 254659430 244409063 227135589
5631B27135589k2915408k5128401k4535578k3074381k0778488j8065335j5257609
$$ 227135589 204220181 179091780 154556202 131481821 110703333 92637998 77380389
5624G7380389j2516266r853610p796863o017859m690371l857920l020308k495195
$$ 77380389 64864123 55010513 47213650 41195791 36505420 32647500 29627192 27131997
5616B7131997k154143j832850j648285j572500j345878j187284j067490r67645
$$ 27131997 24977854 23145004 21496719 19924219 18578341 17391057 16323567 15355922
5608A5355922p94298p71846p16050n44769n94208m99181m57382m54817m47577
$$ 15355922 14561624 13789778 13073728 12528959 11934751 11435570 10978188 10523371 10075794
5599A0075794l83069m04188l46107k89372k59862l38328l36763k23505j84726
$$ 10075794 9692725 9288537 8942430 8653058 8393196 8054868 7718105 7494600 7309874
5590G309874k10302k71590k26878j90003k02890k14567k78203j82955j95847j44574
$$ 7309874 7099572 6827982 6601104 6411101 6208211 5993644 5715441 5532486 5336639 5192065
5580E192065j01112j54505j14958j19150j05285j16820j17209k02417j36334j3373
$$ 5192065 5090953 4936448 4821490 4702340 4597055 4480235 4363026 4160609 4024275 4010902
5570D010902o2335j39683m1986m8298j19312p0535k5670j4069j13224k9958p4456
$$ 4010902 3948567 3808884 3766898 3718600 3599288 3528753 3503083 3489014 3375790 3345832 3271376
5559C271376j08018j1007p8667j10821m2869K2794k7595n5324n3486p6787p6735
$$ 3271376 3163358 3152351 3073684 2962863 2919994 2942788 2915193 2859869 2806383 2729596 2652861
5548B652861n9172j2490j07103q9449l1958r3980P345O0437p6359j10213l0534
$$ 2652861 2593689 2581199 2474096 2384647 2352689 2258709 2266054 2326491 2250132 2139919 2109385
5537B109385K7149O38l3490k1199k0339j1255m8940o0380o4753n70o2432j13756
$$ 2109385 2136534 2137172 2103682 2082483 2062144 2050889 2001949 1941569 1876816 1876246 1813814 1700058
5525A700058j0055M4125j3207j7766l9474k1645l7488o1339o763n721m0683o3112
$$ 1700058 1690003 1734128 1720921 1703155 1663681 1642036 1604548 1543209 1536446 1530725 1490042 1426930
5513A426930m7916l1325L6500o473r5300j0362n0255j048n440R582j4098M3842
$$ 1426930 1379014 1347689 1384189 1377716 1282416 1272054 1221799 1220751 1215311 1224893 1210795 1254637
5501A254637j1377K190O1898m3966Q2523K163J1121L0699R0806J2415l4098k6052
$$ 1254637 1243260 1245450 1307348 1263382 1345905 1348068 1359189 1389888 1480694 1493109 1459011 1432959
5489A432959m1212l1871n755j0700N6038J7019K3298K705K2377M0022L6783j9994
$$ 1432959 1391747 1359876 1354121 1343421 1399459 1416478 1439776 1442481 1464858 1504880 1541663 1521669
5477A521669k450J1435k4968l0568j8111N9396O1130L9449L1390J0431j468k2784
$$ 1521669 1519219 1530654 1505686 1475118 1457007 1516403 1577533 1616982 1648372 1658803 1657335 1634551
5465A634551O3137N3432P9748M7286m3648O492k452N6955J6655O5840L9819j1262
$$ 1634551 1697688 1751120 1830868 1878154 1834506 1840998 1838546 1895501 1912156 1977996 2017815 2006553
5453B006553p5634k7138R1320J39443R2996J7408M8248P0095M371Q5287Q6465
$$ 2006553 1930919 1903781 1995101 2134544 2227540 2244948 2293196 2363291 2367662 2452949 2539414
5442B539414k3152n0818R284K5738N2534O6768Q4122R8287R1540Q7818J06986
$$ 2539414 2516262 2465444 2474728 2500466 2553000 2619768 2703890 2802177 2893717 2981535 3088521
5431C088521J50219K69159J88825J88707K04201J64841K05022K45328L22806L33577
$$ 3088521 3238740 3507899 3696724 3885431 4089632 4254473 4459495 4704823 5027629 5361206
5421E361206L56885M60542N24885O04122P00534Q78194J009552J212904J571820
$$ 5361206 5718091 6178633 6703518 7307640 8008174 8886368 9895920 11108824 12680644
5412A2680644J964530K744860L831268N120327O268051O656769N342586K911151
$$ 12680644 14645174 17390034 21221302 26341629 32609680 39266449 44609035 47520186
5404D7520186L97950j527571k603865k734963j947808o94532R06373K543907L649324
$$ 47520186 47918136 46390565 43786700 41051737 39103929 38409397 39315770 41859677 45509001
5395D5509001L488171J575086r45763k955945m409199n001296m939607m623083
$$ 45509001 48997172 50572258 49626495 46670550 42261351 37260055 32320448 27697365
5387B7697365m149670l573610l145674k627009k098978j611357j254931j081947
$$ 27697365 23547695 19974085 16828411 14201402 12102424 10491067 9236136 8154189
5379H154189q81400p05948n44888m14503m05792l21485k35825l41394k75258k58844
$$ 8154189 7272789 6566841 6021953 5607450 5201658 4880173 4644348 4302954 4027696 3768852
5369C768852k81872j62421q3756j37654p7956j01113k03765j30731j31916j64238
$$ 3768852 3486980 3324559 3240803 3103149 3025193 2924080 2720315 2589584 2457668 2293430
5359B293430K696n9192j23470Q80q5166q8775J8534o4203q4471n5013m7324R77
$$ 2293430 2296126 2236934 2113464 2114344 2029178 1940403 1958937 1894734 1810263 1755250 1707926 1708903
5347A708903n5085q6670l7337K1504l8953l9571q487l4299p4385O3975J7516l2472
$$ 1708903 1653818 1567148 1529811 1551315 1512362 1472791 1464304 1430005 1355620 1419595 1437111 1404639
5335A404639l112j8232J7816J33449K08954J09853L9063L4240Q2093j5559L8407
$$ 1404639 1401527 1383295 1401111 1534560 1743514 1853367 1892430 1926670 2008763 1993204 2031611
5324B031611k8766n1944l8744j887Q8186p499n2275l0310k9276k0312o1029j03457
$$ 2031611 2002845 1950901 1912157 1910270 1998456 1990957 1938682 1908372 1879096 1858784 1797755 1694298
5312A694298p1775q0715j48474j25360j34390j10210n4048j5182p0303q7131l2450
$$ 1694298 1622523 1541808 1393334 1267974 1133584 1023374 969326 954144 883841 796710 764260
5301G64260K4579o6804j24521M9450j9194n0893q416l9643p0K3436o2459L7004
$$ 764260 788839 722035 597514 646964 627770 576877 568461 528818 528748 552184 489725 526729
5289E26729k3154p1947Q075l4492K6028n6656r0812J40989L4016j8581l0747K1237
$$ 526729 503575 431628 439703 405211 431239 374583 283771 424760 458776 440195 409448 430685
5277D30685L0284o0126J7407j0953K209l1216j6848P55j3113J5548r894K489q249
$$ 430685 460969 400843 418250 407297 409506 378290 361442 362197 349084 364632 354738 357227 348978
5264C48978o7865R538L2218M3666M1683o3435L2686O0945r2214l5330J6967J08030
$$ 348978 281113 290651 322869 366535 408218 344783 377469 438414 346200 310870 327837 435867
5252D35867j7617q1500J1146M748m4012M4909L4040l8953k798j383j0213J0338
$$ 435867 418250 336750 347896 352644 308632 353541 387581 348628 345830 344447 334234 344572
5240C44572Q0249Q602q0261k9623m0323m459J4258k0057m8204q157J2046N1086
$$ 344572 424821 433423 353162 323539 283216 278757 293015 272958 224754 216597 228643 279729
5228B79729N3562m7900m1506p1001Q641O1919N1517J8044l3172J8804O107o0474
$$ 279729 333291 285391 243885 172884 181525 243444 294961 313005 279833 298637 304744 244270
5216B44270m4635L1335R4512K909j5771J6921j6950p4179N1163P2412k481r6688
$$ 244270 199635 230970 325482 328391 312620 329541 312591 238412 289575 361987 359506 262818
5204B62818L0633J561m1390L6211n026j2691m2576r018M228m1524R8030m0213
$$ 262818 293451 295012 253622 289833 284807 272116 229540 220522 224750 183226 281256 241043
5192B41043r3451N0960k0799N8327M5408j5536j0993l5327m1520J4099L6089l6407
$$ 241043 147592 198552 177753 236080 281488 265952 254959 219632 178112 192211 228300 191893
5180A91893n5428M7238N009M16K1033m6400N1385O6206n0886o309j9236n8885
$$ 191893 136465 183703 188712 189128 210161 163761 215146 281352 230466 224157 204921 146036
5168A46036J7338Q4438N68q7015J5926P9054k9385k4736m323q243o7357k8227
$$ 146036 163374 247812 248380 161365 177291 256345 226960 202224 197901 189658 122301 94074
5156I4074J7322R3178m0477j1335L0094o9947K2600O6501L5926J5611j1992j2993
$$ 94074 111396 204574 164097 152762 182856 112909 135509 202010 237936 253547 241555 228562
5144B28562m6912O689K3906l3601K6126L1180n5770q424M0487K4473K2868L3618
$$ 228562 181650 188339 212245 178644 204770 235950 180180 171756 212243 236716 259584 293202
5132B93202o619k5892N0308j9541q122p726N5952k8999l114m101P0719p0716j04942
$$ 293202 286583 260691 310999 291458 283336 275610 331562 302563 299449 295348 366067 295351 190409
5119A90409O6056p391l0759K5782R021J5339K3649j4247m1751j5437J6971Q365
$$ 190409 256465 249074 218315 244097 253118 268457 292106 277859 236108 220671 237642 246007
5107B46007L297o224l1620K1662r683j1866J9946j3238O233L5361J3502J7407
$$ 246007 249304 243080 211460 233122 223439 211573 231519 218281 224514 259875 273377 290784
5095B90784M5609J01917R854l6646q4837R1832O5020l1331M0581k3141o080J1185
$$ 290784 336393 438310 448164 411518 326681 418513 483533 452202 492783 469642 463562 474747
5083D74747K7208k8330J0631n3779J2267k5643M1791K9684l8151n5907k8046n8714
$$ 474747 501955 473625 484256 430477 442744 417101 458892 488576 450425 394518 366472 307758
5071C07758k5843j8012K6063J9241K6438r232q1495m7646K9162J6102j3489L1321
$$ 307758 281915 263903 289966 309207 335645 326413 244918 197272 226434 242536 229047 260368
5059B60368j2261L006o809j5680O2305J151L1967k5827j2823l3818j0074L8639
$$ 260368 248107 251113 244304 228624 290929 292080 324047 298220 285397 251579 241505 280144
5047B80144j6232J3213j0603k4641p03P029k4714J0247Q7713j7507l5716r976
$$ 280144 263912 277125 266522 241881 241178 248207 223493 233740 321453 303946 268230 258254
5035B58254r2233R7461j4735O449n078n424N9476o6172J8840N1895k6752n7004
$$ 258254 166021 263482 248747 255196 250118 244694 304170 237998 256838 308733 281981 224977
5023B24977L4971K369M0353M3049p1093l505Q3568j1678k3163K3560o293n4835
$$ 224977 259948 262317 302670 345719 274626 271121 354689 343011 319848 343408 337115 282280
5011B82280K9126J9281k6075k3837J3834j548n00n9986M7734P9888m6703O2245
$$ 282280 311406 330687 304612 280775 294609 293061 292561 232575 280309 360197 313494 375739
4999C75739l6049l8369k3278O1949N3174J630M0491l3072l3539j7726o598L700
$$ 375739 339690 301321 278043 339992 393166 394796 435287 402215 368676 350950 344352 348052
4987C48052l8458K2444J0769k3816n0850R509O4011N7911r1499j5057J8911Q857
$$ 348052 309594 332038 342807 318991 268141 277650 341661 399572 308073 293016 311927 320784
4975C20784K3638L9859j10150O2938K2388j19465N4283M5281o725J6799K4140
$$ 320784 344422 384281 274131 337069 359457 239992 294275 339556 332831 349630 373770
4964C73770j9960K2173o0244J5667j324m2854L3660j4183R470l5643M7326O3320
$$ 373770 353810 375983 315739 331406 330082 287228 320888 306705 316175 280532 327858 391178
4952C91178k707m8694k4232K7818J4498O8670m8188q2830r535L0645M3268M1266
$$ 391178 388471 339777 315545 343363 357861 426531 378343 295513 285978 316623 359891 401157
4940D01157J3027l5407k1473L3080o9328K314o144j8731Q3586K0952j9156m8083
$$ 401157 414184 378777 357304 390384 321056 323370 317226 298495 382081 403033 383877 335794
4928C35794j1402M6152J3290m390l877J2802j3157j5940q938L569n289k3292K9379
$$ 335794 324392 370544 383834 379444 375567 388369 375212 359272 350334 353903 348614 325322 354701
4915C54701K3367J2527m3458K5877o425k7001M9278Q112l5244l4327p802k6574
$$ 354701 378068 390595 347137 373014 366589 339588 388866 396978 361734 327407 319605 293031
4903B93031J1734N096j5547R752Q4802J719l3277K4265l248k019M3565l8020J093
$$ 293031 304765 309861 294314 304066 388868 390587 357310 381575 378327 376308 419873 381853 382946
4890C82946r98l7401M5458O299m3237R9017M5153K5528M6609k2208m6165j3350
$$ 382946 381948 344547 390005 396304 353067 452084 497237 522765 569374 547166 501001 487651
4878D87651J9323P6838M9704K9049K7922N8344L3789k3701P234k6638N8891R0429
$$ 487651 506974 583812 633516 662565 690487 748831 782620 758919 766153 739515 798406 888835
4866H88835L9209K8780q909L5895Q5194J22724K5570j04407o4203J9989o1094
$$ 888835 928044 956824 947915 983810 1069004 1191728 1217298 1112891 1048688 1068677 1007583
4855A007583r2219M8585k6103N2579O0910p5905p0304m0606r7212m6829O243n9183
$$ 1007583 915364 963949 937846 990425 1051335 975430 905126 864520 767308 720479 726722 667539
4843F67539l3878K6901l4552o9074q260J403M3833n8176K195k0764j8013M0594
$$ 667539 633661 660562 626010 556936 548676 550079 593912 535736 537931 517167 499154 539748
4831E39748n100m9517l4581K2699L4933K7910j1696k0476m4881M884J2004N5160
$$ 539748 534648 485131 450550 473249 508182 536092 524396 503920 459039 463923 475927 531087
4819E31087K2r615n2351k4647l5493j287k7916N4832L2342j5422K4530J5322L4667
$$ 531087 531109 521494 469143 444496 409003 407716 379800 434632 466974 451552 476082 491404 526071
4806E26071l4466q095j2304N549O8188M4060j277j24480k0039J9269Q660p037
$$ 526071 491605 483510 471206 476755 544943 589003 587726 463246 443207 462476 471136 464099
4794D64099j12750K6904R9203L7887j6038L0000L3286m2588l2843K9479l2871
$$ 464099 351349 378253 477456 515343 499305 529305 562591 520003 487160 516639 483768
4783D83768N24q4568N6919R4618O6254p5034L524l8658m6331M8445k1247P7696
$$ 483768 484292 399724 456643 551261 617515 542481 546005 507347 461016 509461 488214 565910
4771E65910J6305k8020K203L2469n685l5773l2529M594M4442M5726J4617K8808
$$ 565910 582215 554195 556398 588867 583182 547409 514880 519474 563916 609642 624259 653067
4759F53067n4688p1771j724L965J1993P0855n6782j2956p870J4573m4035K2316
$$ 653067 598379 526608 524884 528849 540842 611697 554915 541959 534089 548662 504627 526943
4747E26943k663J0896M9155j119K8062k0256n3908P299K5076l6547l7567j9312
$$ 526943 524280 535176 584331 583212 611274 591018 537110 544409 569485 532938 495371 476059
4735D76059N0344P2375N395l4857j5570N8600o8109k9335L8893K590o2435j3645
$$ 476059 526403 598778 604173 569316 553746 612346 544237 514902 553795 556385 493950 480305
4723D80305P1003J1033j5004L0864N534O157M3807q6069q999K5956J2010R721
$$ 480305 551308 562341 547337 578201 583735 589892 633699 547630 538631 564587 576597 586318
4711E86318l2101o2239K1465L9619l40N061P3300j1160q0761M1849O3253L450
$$ 586318 554217 491978 513443 553062 552722 557783 631083 619923 539162 581011 644264 647714
4699F47714j6679j02750K7525P2012O397O095l1241P3554L1150N0313R8730j1841
$$ 647714 631035 528285 555810 627822 634219 640314 609073 682627 713777 764090 862820 850979
4687H50979j3864k1001L7678o2712M7617j3895n4948p7803n4268l7478K2128O4077
$$ 850979 837115 816114 853792 791080 838697 824802 769854 692051 637783 600305 622433 686510
4675F86510k3133L9790o2168n0839M361N8621L1417J8063k8254q5425N9807O1447
$$ 686510 663377 703167 640999 590160 594521 653142 684559 702622 674368 588943 648750 710197
4663G10197k5255L1054l4277R943J1269J4534l1083j2476m40l1486O6065Q2296
$$ 710197 684942 715996 681719 691662 702931 717465 686382 673906 673466 641980 708045 790341
4651G90341k1231p1447n6237M1114O3520j1422N4149L1834n2770j3164o7478o034
$$ 790341 769110 697663 641426 682540 746060 734638 788787 820621 767851 754687 687209 681175
4639F81175J1356O8936l1029M6560J8680k0394K1448k184J3184l6800l0685j01306
$$ 681175 692531 761467 730438 776998 795678 775284 796732 794548 807732 770932 740247 638941
4627F38941L6283l680N7556K9306Q8948j2479p4041O9821J2481m2538K5098k0391
$$ 638941 675224 671544 729100 758406 847354 834875 760834 830655 843136 800598 825696 805305
4615H05305L1099K0624k5535q1338L2871p343j9263m852N4023M2532O3331j149
$$ 805305 836404 857028 831493 750155 783026 775683 756420 751568 805591 848123 911454 910305
4603I10305k8393R141j3236M4264m8881k8180J5866k2532J9214M1313k3720m9533
$$ 910305 881912 891053 877817 922081 873200 845020 860886 838354 857568 898881 875161 825628
4591H25628P4820M3073n7722j7750l2774N5057L7322K0903r8385M2239J3496K9098
$$ 825628 900448 943521 885799 868049 835275 890332 927654 948557 850172 892411 905907 935005
4579I35005M8830L5619m5135n770N22M5042k6759n86J01035j6671p1003m2395
$$ 935005 983835 1019454 974319 968549 969071 1014113 987354 986768 1087803 1071132 1000129 957734
4567I57734N6663m9700m217J3639m0938N0807j3060K7923N2917l8591l1199M8047
$$ 957734 1014397 964697 960480 974119 933181 983988 970928 998851 1051768 1013177 981978 1030025
4555A030025L5492L2970j3780r5329J0943J3075J7717M1853R4016K6079J0562
$$ 1030025 1065517 1098487 1084707 989378 1000321 1013396 1031113 1072966 1166982 1193061 1203623
4544A203623j0476j8889K1772Q076j7340k4674p058l867j0950M9225N2105J444
$$ 1203623 1193147 1174258 1196030 1204106 1186766 1162092 1155034 1151167 1140217 1189442 1241547 1242991
4532A242991M0018k9785N9582P3283N6299r565j9583j6379M1497L6112k36l2262
$$ 1242991 1283009 1253224 1312806 1386089 1442388 1432823 1413240 1396861 1438358 1474470 1474234 1441972
4520A441972N0762N5373n327J8349M9376O4969J8891L2870J0262J4582j3625k7322
$$ 1441972 1492734 1548107 1542780 1561129 1610505 1675474 1694365 1727235 1737497 1752079 1738454 1711132
4508A711132M5460N6031j9088N4600P2642n127J0616N1524L6302J468P6537L2881
$$ 1711132 1756592 1812623 1793535 1848135 1920777 1915650 1926266 1977790 2014092 2015560 2092097 2124978
4496B124978k4148R9416L6233M306o8399J3863L3316j7048N5709j5694j16741
$$ 2124978 2100830 2200246 2236479 2240785 2172386 2186249 2219565 2202517 2258226 2242532 2125791
4485B125791k2012N4186N6587r310k0778q4731O5586L9423l0348L3181q6245J6961
$$ 2125791 2103779 2157965 2214552 2205242 2184464 2099733 2165319 2204742 2174394 2207575 2121330 2138291
4473B138291L9406L3782k3583j0207J6354M172J4262J4026k7370l3660l526M9750
$$ 2138291 2177697 2211479 2187896 2177689 2194043 2198215 2212477 2226503 2199133 2165473 2161947 2211697
4461B211697O5744m0441L5535J5833m2673P1620k5881j7092j5857j2085j1893
$$ 2211697 2277441 2237000 2272535 2288368 2245695 2317315 2291434 2274342 2258485 2246400 2234507
4450B234507n2485J1249M2280M3392N1761l8526j3751R14P516N3378L2416K3717
$$ 2234507 2182022 2193271 2235551 2278943 2330704 2292178 2278427 2279341 2286857 2340235 2372651 2396368
4438B396368K141j00050P121P8680J2399l925m4517O9493j542L0018J9081N6443
$$ 2396368 2398509 2298459 2305580 2384260 2396659 2392734 2348217 2417710 2416168 2446186 2465267 2521710
4426B521710R0998K1610L2237K2720O1867J73602j0536j1470K4816j5799N5894
$$ 2521710 2612708 2634318 2666555 2689275 2751142 2924744 2914208 2902738 2927554 2911755 2967649
4415B967649J8474R178J26532O6995J99499Q4112l7678j6844Q886q7723n9804
$$ 2967649 2986123 2995301 3121833 3188828 3388327 3472439 3434761 3417917 3426803 3339080 3279276
4404C279276L4571K4143L0931J03924N7363m5047K5987r446n8765o0307r245K9501
$$ 3279276 3313847 3337990 3368921 3472845 3530208 3485161 3511148 3501702 3442937 3382630 3373385 3402886
4392C402886L7778j0167k6501n022j8994N8138l0838l6076N3217Q0943Q8620Q792
$$ 3402886 3440664 3430497 3403996 3398974 3379980 3438118 3407280 3371204 3424421 3505364 3593984 3602776
4380C602776L7533J4772J9931K5805J48594J15753P5913R2067L0812M0211Q4120
$$ 3602776 3640309 3655081 3675012 3700817 3849411 3965164 4041077 4133144 4163956 4204167 4288287
4369D288287L6455J33359Q6803J17407J72324J62435J46371K59504L14070L32163
$$ 4288287 4324742 4458101 4544904 4662311 4834635 4997070 5143441 5402945 5717015 6049178
4359F049178K53863J55193l0589M3351j3654o4489k2972n5167J6631Q5737Q0383
$$ 6049178 6303041 6458234 6427645 6470996 6457342 6392853 6369881 6314714 6331345 6417082 6497465
4348F497465O1483N1474J17795J51553J06293R9596J07974J65870J14710K18278
$$ 6497465 6558948 6610422 6728217 6879770 6986063 7085659 7193633 7359503 7474213 7692491
4338G692491K15237K12940K86795J86896L07480K62061K48056L28223L70257M90737
$$ 7692491 7907728 8120668 8407463 8594359 8901839 9163900 9411956 9740179 10110436 10601173
4328A0601173M49054N16244N87651O54218P44186Q12694J021219J122464J517693
$$ 10601173 11050227 11566471 12154122 12808340 13552526 14365220 15386439 16508903 18026596
4319A8026596J884519K328185L183340M084803M949761N707038O659763P364985
$$ 18026596 19911115 22239300 25422640 29507443 34457204 40164242 46824005 54188990
4311E4188990P085341O139416M665838K902782K200162K659950M076567O769737
$$ 54188990 61274331 67413747 72079585 74982367 77182529 79842479 83919046 90688783
4303I0688783R362870J1134750J1138769P470792K247138j602919n349679p561907
$$ 90688783 100051653 111186403 122325172 129795964 132043102 130440183 125090504 117528597
4295A17528597p199811n920632l226127n62664J143313J340673j110538m654112
$$ 117528597 110328786 104408154 101182027 100619363 101762676 103103349 101992811 97338699
4287I7338699o604595q264878r064999q543488p683643o457124n188464l668489
$$ 97338699 90734104 82469226 73404227 64860739 57177096 50719972 45531508 41863019
4279D1863019k391473j995171k385710k487865k605801k789213k385902j979974
$$ 41863019 39471546 37476375 35090665 32602800 29996999 27207786 24821884 22841910
4271B2841910j652075j415703j203829j039384p37147n65332l73119k17188j68478
$$ 22841910 21189835 19774132 18570303 17530919 16793772 16228440 15855321 15638133 15469655
4262A5469655j19958n5610k9868J4241J16809K00867J09312J44121J89603K00614
$$ 15469655 15349697 15294087 15264219 15278460 15395269 15596136 15705448 15849569 16039172 16239786
4252A6239786K38473K97793L28634L42659N02255N81173N20562O26963O88148
$$ 16239786 16478259 16776052 17104686 17447345 17949600 18530773 19051335 19678298 20366446
4243B0366446O52730P82882P96559R23726R50559R96140J093624J256636J383672
$$ 20366446 21019176 21802058 22598617 23522343 24472902 25469042 26562666 27819302 29202974
4234B9202974J485955J506553J686529J848893K000034J988563K123413K247415
$$ 29202974 30688929 32195482 33882011 35730904 37730938 39719501 41842914 44090329
4226D4090329K351399K457578K581502K822180K840464K973850L182786L278620
$$ 44090329 46441728 48899306 51480808 54302988 57143452 60117302 63300088 66578708
4218F6578708L476073L649843L560621L662817L779859L564735L636954L513103
$$ 66578708 70054781 73704624 77265245 80928062 84707921 88272656 91909610 95422713
4210I5422713L368041L354195L226101L119484L128208L222472L196696L242553
$$ 95422713 98790754 102144949 105371050 108490534 111618742 114841214 118037910 121280463
4202A21280463L168007L009419K831679K624690K247085J896140J457264J269612
$$ 121280463 124448470 127457889 130289568 132914258 135161343 137057483 138514747 139784359
4194A39784359R38006P90180O84569N24120M86709K92531J47640j28114l58489
$$ 139784359 140722365 141512545 142197114 142721234 143207943 143500474 143648114 143520000 143161511
4185A43161511n25041p04075j044339j313054j485009j745767j930925k014665
$$ 143161511 142636470 141932395 140888056 139575002 138089993 136344226 134413301 132398636
4177A32398636k120399k308396k390139k371449k458879k478606k541045k455680
$$ 132398636 130278237 127969841 125579702 123208253 120749374 118270768 115729723 113274043
4169A13274043k473671k577435k511163k577025k689840k767857k827136k872598
$$ 113274043 110800372 108222937 105711774 103134749 100444909 97677052 94849916 91977318
4161I1977318k972421k889676k885376k838508k723825k676861k501754k411955
$$ 91977318 89004897 86115221 83229845 80391337 77667512 74990651 72488897 70076942
4153G0076942k356594k292434k274917k330692k354860k426016k315039k357524
$$ 70076942 67720348 65427914 63152997 60822305 58467445 56041429 53726390 51368866
4145E1368866k414678k263603k235482k083072j954429j883686j768233j694969
$$ 51368866 48954188 46690585 44455103 42372031 40417602 38533916 36765683 35070714
4137C5070714j598764j540607j467034j422409j488592j383967j385545j267316
$$ 35070714 33471950 31931343 30464309 29041900 27553308 26169341 24783796 23516480
4129B3516480j194907j170192j067627r33394r42044r32352q11127p90885o87120
$$ 23516480 22321573 21151381 20083754 19150360 18208316 17275964 16464837 15673952 14986832
4120A4986832o31125n62668n80474n36866n17663m39213l74624l51517l49407
$$ 14986832 14355707 13793039 13212565 12675699 12158036 11718823 11344199 10992682 10643275
4111A0643275l05884k37491k86337k42515j30587j09236j99184k30043j03355
$$ 10643275 10337391 10099900 9813563 9571048 9440461 9331225 9132041 8901998 8798643
4102H798643n2347n2583p2120m9127n4552k9318J5375K0802K402K6672k5818k4953
$$ 8798643 8746296 8693713 8621593 8572466 8517914 8488596 8503971 8524773 8527175 8553847 8528029 8503076
4090H503076o647P1533R7895N2893P2974N4745j0249k539L4301L0297P7531K3330
$$ 8503076 8496429 8567962 8665857 8718750 8791724 8846469 8836220 8833681 8867982 8898279 8975810 8999140
4078H999140J04470J3794o236M3345L3013l2945l75Q0160J2157p5544o9578m2926
$$ 8999140 9103610 9117404 9111168 9154513 9187526 9154581 9154206 9234366 9246523 9170979 9101401 9058475
4066I058475O769j19236L8290K9068j3723L3759K2914r1657n0872k2690k1568
$$ 9058475 9065244 8946008 8984298 9013366 8999643 9033402 9056316 8964659 8913787 8891097 8869529
4055H869529m287k8427l0908o4289j5521o5746k4389L8719M8479j9032P1746Q2747
$$ 8869529 8865242 8836815 8805907 8741618 8726097 8660351 8635962 8674681 8723160 8704128 8775874 8858621
4043H858621Q9112P1356P1705J15582J01324K6964J48447J50254Q3497P4850J66225
$$ 8858621 8947733 9019089 9090794 9206376 9307700 9334664 9483111 9633365 9716862 9791712 9957937
4032I957937J95668J88396J14489J82428K42684K57502K38545J58714J53913J89949
$$ 9957937 10153605 10342001 10456490 10638918 10881602 11139104 11377649 11536363 11690276 11880225
4022A1880225K19430K87803K22705K00333K57322K44045K83657K85579K91646
$$ 11880225 12099655 12387458 12610163 12810496 13067818 13311863 13595520 13881099 14172745
4013A4172745K53245K29281K65746K40836L23830K89450L19681M15263L76235
$$ 14172745 14425990 14655271 14921017 15161853 15485683 15775133 16094814 16510077 16886312
4004A6886312M07761M32305L89722M08933N80786O61728O43877O35980P68958
$$ 16886312 17294073 17726378 18116100 18525033 19105819 19767547 20411424 21047404 21816362
3995B1816362R31872R32338R73202J141423J259814J400310J558426J780701K039035
$$ 21816362 22748234 23680572 24653774 25795197 27055011 28455321 30013747 31794448 33833483
3986C3833483K293562K674671L185083L675187M396183N112420N884086O986874
$$ 33833483 36127045 38801716 41986799 45661986 50058169 55170589 61054675 68041549
3978F8041549Q419001J0257891J2633687J5532654J8837535K2148911K4898543
$$ 68041549 76460550 86718441 99352128 114884782 133722317 155871228 180769771
3971A80769771K6192485K5696993K3164341J8811461J3472421P846090K888571
$$ 180769771 206962256 232659249 255823590 274635051 288107472 295953562 298842133
3964B98842133r09817l471089m672020m596552l627783k056733j51679J594484
$$ 298842133 297932316 294461227 289789207 285192655 281564872 279508139 279356460 280950944
3956B80950944K672741K723303J186758j793679n932002j0526016j5222370j8827119
$$ 280950944 283623685 286346988 287533746 285740067 279808065 269282049 254059679 235232560
3948B35232560k1192683k2143347k1806536k0590312j8677720j6585415j4321702
$$ 235232560 214039877 191896530 170089994 149499682 130821962 114236547 99914845
3941I9914845j2204525j0208192q634903p148397o002828n002701m236170l557551
$$ 99914845 87710320 77502128 68867225 61718828 55716000 50713299 46477129 42919578
3933D2919578l057697k617406k263983j951053j597911j464399j261712j032104
$$ 42919578 39861881 37244475 34980492 33029439 31431528 29967129 28705417 27673313
3925B7673313q98473q36189q05106n78957m96059n43544m27468m10172l36313
$$ 27673313 26774840 25938651 25133545 24554588 24058529 23514985 23087517 22677345 22341032
3916B2341032k46703l57395l41004k67210k54267k58001j73340j96473j79374
$$ 22341032 22094329 21736934 21395930 21128720 20874453 20616452 20443112 20246639 20067265
3907B0067265j34030k14248o7446j06247r3102n4502k3406k9412k7888k5394M5020
$$ 20067265 19933235 19718987 19651541 19545294 19452192 19397690 19374284 19344872 19316984 19291590 19336610
3896A9336610M538K2521M7618r1554n2750j582L4919L0525O0682N3088J31108
$$ 19336610 19341148 19363669 19411287 19319733 19266983 19265401 19300320 19330845 19391527 19444615 19575723
3885A9575723J43271J78884K54996K10910L36581L87938M08076M31697M28746
$$ 19575723 19718994 19897878 20152874 20363784 20700365 21088303 21496379 21928076 22356822
3876B2356822N25939N64675O13716O80160O89232P42837O58623P04109Q37067
$$ 22356822 22882761 23447436 24061152 24741312 25430544 26173381 26832004 27536113 28373180
3867B8373180Q11396P47143Q59369R33879J078287J292987J221679J279325J321591
$$ 28373180 29184576 29931719 30791088 31724967 32803254 34096241 35317920 36597245 37918836
3858C7918836J393613J364808J175125J189101J009911Q64394Q57296P47630O75350
$$ 37918836 39312449 40677257 41852382 43041483 44051394 44915788 45773084 46520714 47196064
3849D7196064P26600P84260Q03435P27543P52225P50459P06884N47554M20138
$$ 47196064 47922664 48706924 49510359 50237902 50990127 51740586 52447470 52995024 53415162
3840E3415162L07360J24495O0826m4367j02599j1993m4083J9366J34704K22226
$$ 53415162 53722522 53847017 53907843 53863476 53760877 53748884 53704801 53724167 53858871 54081097
3830E4081097L04322M58571O40254P06774R42460J126987J422929J654744K046017
$$ 54081097 54385419 54843990 55484244 56191018 57133478 58260465 59683394 61338138 63384155
3821F3384155K513539K920510L594976M090488M642218N587075O460655P481876
$$ 63384155 65897694 68818204 72413180 76503668 81145886 86732961 93193616 100675492
3813A00675492Q783059J0578440J2519316J4738336J6908098J8568538J9337762
$$ 100675492 109458551 120036991 132556307 147294643 164202741 182771279 202109041
3806B02109041J9324090J8476776J7076687J5361519J3614218J2023288J0762466
$$ 202109041 221433131 239909907 256986594 272348113 285962331 297985619 308748085
3799C08748085J0070281R866882J0154297J0679356J1373829J2040035J2482073
$$ 308748085 318818366 328685248 338839545 349518901 360892730 372932765 385414838
3792C85414838J2610835J2154528J1025105R018330N810457K082656j282739l870994
$$ 385414838 398025673 410180201 421205306 430223636 436034093 438116749 436834010 432963016
3784D32963016n543627o200412o258243n899426n482057n068048m978607n060495
$$ 432963016 427419389 421218977 414960734 409061308 403579251 398511203 393532596 388472101
3776C88472101n406444o000059o803745p944104r088882j0141442j0999493j1589831
$$ 388472101 383065657 377065598 370261853 362317749 353228867 343087425 332087932 320498101
3768C20498101j1824871j1837139j1471824j0835356j0303680r750773r479101
$$ 320498101 308673230 296836091 285364267 274528911 264225231 254474458 244995357
3761B44995357r334292r230049r104888r143970r107017r067835r000559q669140
$$ 244995357 235661065 226431016 217326128 208182158 199075141 190007306 181006747 172337607
3753A72337607q027042o967414n739547l978796j898813K66639K608537M714604
$$ 172337607 164310565 157343151 151603604 147624808 145725995 145992634 148601171 153315775
3745A53315775O393192P698184Q228981P806489O704881M947516K733425N84364
$$ 153315775 159708967 167407151 175636132 183442621 190147502 195095018 197828443 198412807
3737A98412807j304139k531464l210481l277441k906831k102129j059684j29785
$$ 198412807 197108668 194577204 191366723 188089282 185182451 183080322 182020638 181890853
3729A81890853M78983K19700n19825j950687l945050n752251p551588r188615
$$ 181890853 182369836 182589536 182069711 180119024 176173974 170421723 162870135 153681520
3721A53681520j0190659j0891562j0962655j0539015r759371q749620p789824
$$ 153681520 143490861 132599299 121636644 111097629 101338258 92588638 84798814
3714H4798814o825532n792913n075149m193098l440138k865224k383920k016699
$$ 84798814 77973282 72180369 67105220 62912122 59471984 56606760 54222840 52206141
3706E2206141j773037j728429j623624j718984j723010j697105j829776j872956
$$ 52206141 50433104 48704675 47081051 45362067 43639057 41941952 40112176 38239220
3698C8239220j865636j738586j592329j513078j352655j368601j194856j048901
$$ 38239220 36373584 34634998 33042669 31529591 30176936 28808335 27613479 26564578
3690B6564578q84522q75039r29029q46263p99696q85376p85110o71210o53670
$$ 26564578 25680056 24805017 23875988 23029725 22230029 21344653 20559543 19888333 19234663
3681A9234663p17722o99194o43677n75190m55275n24018n03124m52058m08338
$$ 19234663 18516941 17817747 17174070 16598880 16143605 15619587 15116463 14664405 14256067
3672A4256067l64804l98488l42035k68347k30590k52732k64951k59326k83300
$$ 14256067 13891263 13492775 13150740 12882393 12651803 12399071 12134120 11874794 11591494
3663A1591494k57250k62523k15700k35687l05339k36221k19783k66268k43641
$$ 11591494 11334244 11071721 10856021 10620334 10314995 10078774 9858991 9592723 9349082
3654I349082j90340k84399k13062j94935j22732j49241j39621j31591j51319j64778
$$ 9349082 9158742 8874343 8661281 8466346 8343614 8194373 8054752 7923161 7771842 7607064
3644G607064j11067r5929q8287j05879p8770p7718j64467q0779k1229o8046q5350
$$ 7607064 7495997 7400068 7311781 7205902 7127132 7049414 6884947 6804168 6782939 6714893 6629543
3633F629543q5319q1320k8221j2584m3183j11916o304l5368r7252r3244k4795
$$ 6629543 6544224 6462904 6434683 6422099 6378916 6267000 6260696 6225328 6128076 6034832 6010037
3622F010037o0261l7885n0737q5326j4037j3072j21007J4921Q728p6771m4721
$$ 6010037 5949776 5911891 5861154 5775828 5761791 5748719 5627712 5642633 5651361 5574590 5529869
3611E529869l4869q385r832m1749l0766k4083p4854L6440R130l7838O3049K0948
$$ 5529869 5495000 5486615 5476783 5435034 5404268 5380185 5305331 5341771 5350901 5313063 5376112 5397060
3599E397060l4970l9336o5809l8087N0901n4088L426L1788K9378J9320p697j3571
$$ 5397060 5362090 5322754 5256945 5218858 5269759 5215671 5219097 5250885 5280263 5299583 5291886 5278315
3587E278315N0123O4404n3516l29N3354J0678M1113M0040l8749q658L5965K3068
$$ 5278315 5328438 5392842 5339326 5338997 5392351 5403029 5444142 5484182 5445433 5436775 5472740 5495808
3575E495808L5157L1105K2083M2427j6660J07089M7963O148k5841O3033R2793
$$ 5495808 5530965 5562070 5584153 5626580 5609920 5717009 5764972 5771120 5745279 5808312 5901105
3564E901105K5002K5429N6457M7941J5738J68968J14778P0662P4210L3828Q2118
$$ 5901105 5926107 5951536 6007993 6055934 6071672 6240640 6355418 6426080 6500290 6534118 6616236
3553F616236Q6472O6542K8338J15349O5735P6270J23775J2792O8076N0452R2173
$$ 6616236 6702708 6769250 6797588 6912937 6978672 7054942 7178717 7191509 7259585 7310037 7402210
3542G402210P0253R5536J26089P1668J03413J58131J72174J90534J42916J88502
$$ 7402210 7472463 7567999 7694088 7765756 7869169 8027300 8199474 8390008 8532924 8721426
3532H721426K27132J55993J67226K64483J74941J68628K32349J29519L8706J72047
$$ 8721426 8948558 9104551 9271777 9536260 9711201 9879829 10112178 10241697 10280403 10452450
3522A0452450J87445J60250J34136N6690K03129J38509K02980J99975J62422K57197
$$ 10452450 10639895 10800145 10934281 10990971 11194100 11332609 11535589 11735564 11897986 12155183
3512A2155183L06631L13681K83635L46611L46077L36207L60319M85148N22584
$$ 12155183 12461814 12775495 13059130 13405741 13751818 14088025 14448344 14933492 15456076
3503A5456076M89332L81394M25591L37097L45587L95131K59817L19883L42188
$$ 15456076 15945408 16326802 16752393 17089490 17435077 17830208 18090025 18409908 18752096
3494A8752096K94269K70847K72757J88658J09886J52268K82771K11718J95050
$$ 18752096 19046365 19317212 19589969 19778627 19888513 20040781 20323552 20535270 20730320
3485B0730320K96304K43035L58175M47049M41390O01884O39884O98951P45556
$$ 20730320 21026624 21269659 21627834 22074883 22516273 23118157 23758041 24456992 25202548
3476B5202548P47680O49443O09213O09496N93066O24762P02410P55033R08095
$$ 25202548 25950228 26599671 27208884 27818380 28411446 29036208 29738618 30493651 31401746
3467C1401746J049900J311742J546737J966532K341935K759497L193823L326268
$$ 31401746 32451646 33763388 35310125 37276657 39618592 42378089 45571912 48898180
3459D8898180L412005L521094L453201L049854K589343J752813Q06171r6838r26344
$$ 48898180 52310185 55831279 59284480 62334334 64923677 66676490 67482661 67385823 66459479
3450F6459479j758226k363049k599284k634229k590351k520297k344769k201664
$$ 66459479 64701253 62338204 59738920 57104691 54514340 51994043 49649274 47447610
3442D7447610k085932j992885j891492j840460j691282j697404j741802j580190
$$ 47447610 45361678 43368793 41477301 39636841 37945559 36248155 34506353 32926163
3434C2926163j536619j508666j412044j367278j263105j229150j138280j079194
$$ 32926163 31389544 29880878 28468834 27101556 25838451 24609301 23471021 22391827
3426B2391827r37413q87707q82887p71228p13535n69585n73034m52952m92092
$$ 22391827 21454414 20566707 19683820 18912592 18199057 17629472 17056438 16603486 16111394
3417A6111394l95156k93549l03468l77357k99780l13246l14869k44353l21673
$$ 16111394 15716238 15422689 15119221 14741864 14442084 14128838 13813969 13569616 13247943
3408A3247943k68454k56713k38581k48227j22736j82622k37963j55552j59495
$$ 13247943 12979489 12722776 12484195 12235968 12113232 11930610 11692647 11537095 11377600
3399A1377600j99393j59136j11588k19037j70664j87346j59928q1971j16724q3713
$$ 11377600 11178207 11019071 10907483 10688446 10517782 10330436 10170508 10088537 9971813 9888100
3389I888100j19489j11429j64514p4985o1317q2891j32307r0415j44943j31048
$$ 9888100 9768611 9657182 9492668 9417683 9356366 9273475 9141168 9050753 8905810 8774762
3379H774762m5887j38973j49007r8892j26936r7546p5722q8818k5668j03015j06894
$$ 8774762 8728875 8589902 8440895 8342003 8215067 8117521 8041799 7952981 7927313 7824298 7717404
3368G717404r2499m3114p3710n8913k4548n4746o6622m574r2463n7975r1050n5177
$$ 7717404 7624905 7581791 7508081 7449168 7424620 7369874 7303252 7298678 7206215 7148240 7057190 7002013
3356G002013o2699q2702r6927q6505o8963p9013p3222k4444o3511l7502q5195
$$ 7002013 6939314 6856612 6759685 6673180 6604217 6525204 6451982 6427538 6364027 6326525 6241330
3345F241330j5223n0778o5021o7002j08200l4268O251l260j03252n2883k7772
$$ 6241330 6226107 6175329 6110308 6043306 5935106 5900838 5907089 5903829 5800577 5747694 5719922
3334E719922m1202r2538K671j29034n6105l0533J4008J7590N1134l0255n3614
$$ 5719922 5678720 5586182 5588853 5459819 5403714 5373181 5387189 5404779 5455913 5425658 5372044
3323E372044R133o2773j24014o3965q982m6263j32089o9668l6521r0735p2111
$$ 5372044 5381177 5318404 5194390 5130425 5121443 5075180 4943091 4873423 4836902 4746167 4674056
3312D674056n5578j4784k3805q1355q8218P065m8711J1823k695o0010j02693j4749
$$ 4674056 4618478 4603694 4579889 4498534 4410316 4417381 4368670 4380493 4377798 4317788 4215095 4200346
3300D200346R0053Q837M1883Q9660k697p3624m0902j41886n4398k8993j6185q5709
$$ 4200346 4290399 4299236 4341119 4430779 4428082 4354458 4313556 4171670 4117272 4088279 4072094 3986385
3288C986385j08183j1544o1282j2658p1768p3854n0322o7n4509q5015n8816K6471
$$ 3986385 3878202 3866658 3805376 3792718 3720950 3647096 3596774 3596707 3542198 3457183 3398367 3424838
3276C424838L6374j03233J3868j7264m1338J5124j25922k9496N2442j7164j5158
$$ 3424838 3461212 3357979 3371847 3354583 3313245 3328369 3202447 3172951 3225393 3208229 3193071
3265C193071l7301k0308l7781j9041p374J4769m5778L4689l2668p0738j32o6485
$$ 3193071 3155770 3135462 3097681 3078640 3071266 3086035 3040257 3074946 3042278 2971540 2971408 2904923
3253B904923m9121N494N8419p0824o0412k840K8840j9295l4084o0029K5621m9301
$$ 2904923 2855802 2861296 2919715 2848891 2788479 2785639 2814479 2795184 2761100 2701071 2726692 2677391
3241B677391k9210N7136k7501j969l4009j03608N4280K3454j6402M2332P060j9112
$$ 2677391 2648181 2705317 2677816 2675847 2641838 2538230 2592510 2615964 2599562 2641894 2648954 2629842
3229B629842k7537k1287o5896q1208r0730M5463L5665L0687O0000j8952j00031
$$ 2629842 2602305 2581018 2515122 2433914 2343184 2388647 2424312 2454999 2514999 2496047 2396016
3218B396016o044R304M6502N5091q31r151m3449R617K7143o4117q057L0117R1345
$$ 2396016 2389972 2399276 2445778 2500869 2500038 2490887 2447438 2457055 2484198 2420081 2412024 2442141 2533486
3205B533486J3693j9724M1404K1702J2032p4465J16537k0308J586j5728m2035
$$ 2533486 2547179 2527455 2568859 2590561 2602593 2528128 2644665 2624357 2625943 2610215 2568180
3194B568180N2958J21669J3365j4022k3592k3507R215J3924O0278m291P4995P3136
$$ 2568180 2621138 2742807 2756172 2742150 2718558 2695051 2704266 2718190 2778468 2774177 2849172 2922308
3182B922308m9950Q2196M6042Q3432R5400k8175k0099L9929R0309m7644M8763
$$ 2922308 2872358 2954554 3000596 3084028 3179428 3151253 3131154 3171083 3261392 3213748 3262511
3171C262511K5994J06360K2830O2333J28797J3627J11878O2686L0645J04635J20810
$$ 3262511 3288505 3394865 3417695 3480028 3608825 3622452 3734330 3797016 3827661 3932296 4053106
3160D053106J22426J12097J01694J05817K27114J66719J91625J73981K64298L49035
$$ 4053106 4175532 4287629 4389323 4495140 4722254 4888973 5080598 5254579 5518877 5867912
3150E867912L17652L30805L49036M09800M53997N46613P36313P46176P61200R31324
$$ 5867912 6185564 6516369 6865405 7275205 7729202 8275815 9012128 9758304 10519504 11450828
3140A1450828R68159J104998J293483J277198J230951R85723Q62286N03611K62664
$$ 11450828 12418987 13523985 14817468 16094666 17325617 18311340 19173626 19677237 19939901
3131A9939901J19281M0498q3430p8256l6258j39698j70839q2740k8845o6733J3423
$$ 19939901 20059182 20099680 20016250 19937994 19901736 19762038 19591199 19508459 19479614 19412881 19426304
3120A9426304O9998L5831J32553J68266K63823M22278N23792Q16376J091832J809949
$$ 19426304 19496302 19532133 19664686 19832952 20096775 20519053 21042845 21859221 22951053 24761002
3110B4761002K744404L819913M744836N062518L711612J441672n67033k183535
$$ 24761002 27505406 31325319 36070155 41132673 44844285 46285957 45718924 43535389
3102D3535389l288681l648533l670377l410126k980809k632542k261624j842168
$$ 43535389 40246708 36598175 32927798 29517672 26536863 23904321 21642697 19800529
3094A9800529j383853j077201r79151p64718o66741n04949l02920k73009j86591
$$ 19800529 18416676 17339475 16360324 15595606 14928865 14423916 14120996 13847987 13661396
3085A3661396n6654N7722J96315K49120M00775O02509P83553P60863P94492O80425
$$ 13661396 13604742 13662464 13858779 14107899 14508674 15111183 15894736 16655599 17450091 18130516
3075A8130516L27420m8520m42324q08657j079090j177244j179642j177310j141771
$$ 18130516 18457936 18409416 17967092 17158435 16079345 14902101 13722459 12545149 11403378
3066A1403378j060884r47077q09170o68086n51828m91493m73289m90548l76779
$$ 11403378 10342494 9395417 8586247 7918161 7366333 6874840 6401551 5911003 5534224
3057E534224l79175l41445l06616k51342j91211k83573k62967j55034q3496j21974
$$ 5534224 5155049 4813604 4506988 4255646 4064435 3780862 3517895 3362861 3279365 3157391
3047C157391j58856j28907j16088j46162j15018r1990j17615j07539q2222q2874
$$ 3157391 2998535 2869628 2753540 2607378 2492360 2400370 2282755 2175216 2092994 2010120
3037B010120k6464j02365j02999J2183j11866k6372J8140l358q9154m9254j10771
$$ 2010120 1983656 1881291 1778292 1790475 1678609 1652237 1670377 1667019 1577865 1528611 1417840
3026A417840p6221j2858J7561l8575o0100p1223l2196M0985n7566p6646l5148
$$ 1417840 1341619 1328761 1346322 1307747 1247647 1176424 1144228 1185213 1127647 1051001 1015853
3015A015853J1467J188n4338K4184l921n6718r4981M3453O977m8557K3279p0727
$$ 1015853 1027320 1028508 974170 998354 994433 937715 842734 886187 893164 844607 867886 797159
3003G97159l4746l7698M762L6365m158p9161k2719m2282k0649o164m7053m1412
$$ 797159 762413 724715 729477 765842 761684 682523 659804 617522 596873 590709 543656 502244
2991E02244L9821K2633J9923o416J7355j3314J2682j2860M003o9088M0217l2186
$$ 502244 542065 564698 584621 578205 595560 582246 594928 582068 586071 516983 557200 525014
2979E25014n4794O3247n3368j6990J6165l0819n2222J6444K8065k1749m3935R146
$$ 525014 470220 533467 480099 463109 479274 448455 396233 412677 440742 418993 375058 384204
2967C84204m2044l7937j8942Q590M6780J0719k8189P718j2493K1883J3584k9018
$$ 384204 342160 304223 285281 293871 340651 351370 323181 330899 318406 340289 353873 324855
2955C24855j0633O484J9301j5073j02617L178q962O723m9528M3729L8029p801
$$ 324855 314222 320706 340007 324934 222317 225495 216533 223256 173728 217457 255486 247685
2943B47685K4783l6489r0578n170K0920L6929k3070J0118n9994j9042L6839K0625
$$ 247685 272468 235979 145401 140231 161151 198080 175010 185128 125134 106092 142931 163556
2931A63556N1201K883K8506m6426R128n8371J7830j1325j3919K6287K8381m1344
$$ 163556 214757 217640 246146 199720 208848 150477 168307 156982 143063 169350 197731 156387
2919A56387N940K8620k1892k3553K1526L5050l2904l4066p0953P1425q626j7948
$$ 156387 162327 190947 169055 145502 167028 202078 169174 135108 64155 135580 126954 109006
2907A09006J2873j0202o0730J9595N0538K315o208l3079j3200r2516J4877J4691
$$ 109006 121879 111677 50947 70542 121080 123395 117187 84108 70908 -21608 -6731 7960
2895G960P492j3659k7319L0324o292J4584L2311J9821L0583m6548K4479N3440
$$ 7960 15452 1793 -25526 4798 -1494 13090 45401 65222 95805 49257 73736 127176
2883A27176J1036m0327l4518n2612l4030P926J4300P1853k0384m0759o4608L4087
$$ 127176 138212 97885 63367 10755 -23275 -15349 -1049 70804 50420 9661 -54947 -20860
2871b0860J13260M368p918j2818m1726k6004K7604j476j8229J4325N0703j4190
$$ -20860 92400 96768 88850 76032 34306 8302 35906 34430 16201 30526 81229 67039
2859F7039K8854M825k3602J8320L8164q2779Q1651k638j9612K9987k992m0185
$$ 67039 95893 100718 77116 95436 133600 50821 132472 129834 110222 140209 137217 97032
2847I7032n647J243o7276N8684M9237l588l8829n1924j382K9808l2268q706n6673
$$ 97032 91385 92628 25352 84036 133273 129685 90856 38932 37550 67358 35090 26384 -30289
2834c0289L6604M4937J9489j8992p366P4011m346n7605K3657J18827P0672r338
$$ -30289 6315 51252 70741 51749 44383 118394 114048 56443 80100 198927 269599 260261
2822B60261n0562k7863l3910k8035j2428N721J2958m2700J2833k1329O303L3183
$$ 260261 209699 181836 147926 119891 107463 113184 126142 83442 96275 74946 81249 114432
2810A14432o4442j9926P4466K1594m2622p0227n4606l5305N8862N7548p8629L3113
$$ 114432 49990 30064 104530 126124 83502 13275 -41331 -76636 -17774 39774 -38855 -5742
2798e742j0064j1262j9386M2559K7563J3871L3840L0197k6629j2040k1164k0143
$$ -5742 -15806 -27068 -46454 -3895 23668 37539 71379 101576 74947 62907 41743 21600
2786B1600k8177n8053n287l6920L8005j8620M6722K1225M6985l6411M18l8336
$$ 21600 -6577 -64630 -69917 -106837 -68832 -87452 -40730 -19505 27480 -8931 -8513 -46849
2774d6849o9798p555J16799m9127l5966P8031Q74m7900m5378j9377P5455N875
$$ -46849 -116647 -124202 -7403 -56530 -92496 -14465 -13591 -61491 -106869 -126246 -50791 -44916
2762d4916l7649k5696M424J5948O1866m3481j7174R800l0006j3569J2985K5370
$$ -44916 -82565 -108261 -103837 -87889 -26023 -69504 -86678 -76878 -106884 -120453 -107468 -82098
2750h2098M6956j7332o7305n5388M6250N3989K8896L3237l7774Q653l430P0513
$$ -82098 -35142 -52474 -119779 -175167 -128917 -74928 -46032 -12795 -50569 -41916 -45346 25167
2738B5167n0486k3665n8496J9390Q3722n6340o9877O6926J5707J4125j3905o4446
$$ 25167 -25319 -48984 -107480 -88090 -4368 -60708 -130585 -63659 -47952 -33827 -47732 -112178
2726a12178K9231L3549O083j4398K1487K4005k4592l171j8394K5836q0889O0621
$$ -112178 -82947 -49398 -43315 -57713 -36226 -12221 -36813 -39984 -58378 -32542 -113431 -52810
2714e2810K8291L9876j3627k2317l3391l1544j637N8502N6569k7535k6536j8114
$$ -52810 -24519 15357 1730 -20587 -53978 -85522 -87159 -28657 27912 377 -26159 -44273
2702d4273Q278M257n9217n7591P613Q0663L3519m4711p9902J5691P6023K6426
$$ -44273 -35995 -31738 -90955 -148546 -140933 -60270 -26751 -71462 -151364 -135673 -59650 -33224
2690c3224K949m4159j7301M3082J9810m6169m20j3910j6900J13K7755k3099l765
$$ -33224 -30275 -74434 -91735 -48653 -28843 -75012 -75432 -89342 -106242 -106129 -78374 -101473 -105238
2677a05238M592K6824k8368j1588P3664q024l0580M2579J550J5448o7330m5575
$$ -105238 -100646 -73822 -102190 -113778 -40114 -48138 -78718 -36139 -34589 -19141 -86471 -132046
2665a32046r079N5906K7155k6358k1954O173j2788o7456j4127J17838o507o601
$$ -132046 -141125 -85219 -58064 -84422 -106376 -100203 -112991 -180447 -194574 -76736 -83243 -89844
2653h9844L3260J4428m8754O143M1971k8684K1493R3123j02762m4988M7967j9603
$$ -89844 -56584 -42156 -90910 -84767 -42796 -71480 -49987 43136 -59626 -104614 -56647 -76250
2641g6250J9482l4161n938N6782L0549p4910n4731j2852j3473m3861R8634O4915
$$ -76250 -56768 -90929 -96867 -40085 -9536 -84446 -139177 -152029 -165502 -209363 -110729 -45814
2629d5814j6664k1909M7534l2889J3161j6897L849L0985k4071p2475K8674J05560
$$ -45814 -62478 -84387 -36853 -69742 -56581 -73478 -69629 -38644 -62715 -135190 -106516 -956
2617i56k8641o0903K7125R040q3269L6584Q0334q9536q85L2737j3968l242j6682
$$ -956 -29597 -90500 -63375 -54335 -137604 -101020 -20686 -110222 -111107 -78370 -92338 -95580 -112262
2604a12262R424M1397l0043j3238R3258j1485l1240k5536n998L3142n9001L6725
$$ -112262 -102838 -61441 -91484 -104722 -11464 -22949 -54189 -79725 -85723 -52581 -111582 -74857
2592g4857K8835m6729j0881l3607J9808L6642q038J8669R7157n2148m1598K6352
$$ -74857 -46022 -92751 -103632 -137239 -117431 -80789 -88827 -70158 26999 -25149 -66747 -40395
2580d0395K6940L9146R912q361P426k7904O0140R8339M4563J8313p5014L8945
$$ -40395 -13455 25691 35603 27242 34668 6764 66904 165243 209806 228119 153105 192050
2568A92050o6271p8017O0786o6816n2826P9832L5662l7453n6431j1640o8162l3477
$$ 192050 125779 47762 108548 41732 -11094 68738 104400 66947 10516 -1124 -69286 -102763
2556a02763M8692K6056n0797l3840Q9329l6629K5177o5760k4818P2521J5253M719
$$ -102763 -54071 -28015 -78812 -112652 -23323 -59952 -34775 -100535 -125353 -52832 -37579 -32860
2544c2860k2100m6217J6966L81P0691J3897q4204j7773m5125N8788K3122M2566
$$ -32860 -54960 -101177 -84211 -83830 -13139 758 -83446 -101219 -146344 -87556 -64434 -21868
2532b1868j0664l3401m883J704K969j5069N44R450L5872J5047r161j454l108j8274
$$ -21868 -32532 -65933 -70816 -69112 -66143 -81212 -80668 -71218 -35346 -20299 -29460 -30914 -34022 -52296
2518e2296K6696j3267k5888o3414L7115L1412o2390J0796K5539K8142K2170j5975
$$ -52296 -25600 -38867 -64755 -128169 -91054 -59642 -122032 -111236 -85697 -57555 -35385 -51360
2506e1360P9851J476m6748n9846O042J6467J7025Q230J2257k6524k6096K2485
$$ -51360 28491 29967 -16781 -76627 -70585 -54118 -37093 -28863 -16606 -43130 -69226 -46741
2494d6741R757L7995M4589n496m7392J7727j00919M9936k0969p0223M572K0102
$$ -46741 -36984 1011 45600 40104 -7288 10439 -90480 -40544 -61513 -131736 -127164 -107062
2482a07062P5137K4731k0208k4404l243p841m767M3639k0380j1485k7246K3266
$$ -107062 -31925 -7194 -27402 -51806 -55049 -62890 -67657 -24018 -44398 -55883 -83129 -59863
2470e9863J4994K0612j025o082l6186J2975K8628K165j926n1163J7990L998O5021
$$ -59863 -44869 -24257 -25282 -31364 -67550 -54575 -25947 -23782 -25708 -76871 -58881 -54883 10138
2457A0138n099n0394K2553m589J3387l9860q581J15997K1178j7682o9923L4445
$$ 10138 5039 -45355 -22802 -27391 -14004 -53864 -62445 53552 74730 57048 -12875 21570
2445B1570L9664k7918R373N373N755J4995J5873o2467J154K5143o9091l1105M5891
$$ 21570 61234 33316 42689 48062 53817 68812 84685 22218 23372 48515 -20576 -51681 -5790
2432e790N0305o513O2336m9501j5492J4931L0873l857l0191q962l275Q8984j0682
$$ -5790 44515 38002 100338 50837 35345 50276 81149 77292 47101 38139 34864 123848 113166
2419A13166r078O1636J2191q7579k975p513l1987O9241k3638l7461k68k3581M640
$$ 113166 104088 165724 177915 90336 87361 79848 47861 117102 93464 56003 55735 32154 36794
2406C6794o92P0172N6142n9203K0866Q72o4708L0525m7913N3814L8597n0176j2480
$$ 36794 36102 106274 162416 103213 124079 124951 60243 90768 42855 96669 135266 85090 72610
2393G2610j8105K7937J7230N0150O517J0103k2101k2619P3791j2748j3677J2820
$$ 72610 54505 82442 99672 149822 156339 166442 144341 121722 195513 182765 169088 181908
2381A81908l9711K2346Q7896m1573r362N5847Q1250k4779k989J1895l859J0303
$$ 181908 142197 164543 252439 210866 201504 257351 338601 313822 310833 322728 318869 329172
2369C29172m3750m968N2465n0698k3821L622R7468M4317n829K552M693Q558P921
$$ 329172 285422 280454 332919 282221 258400 262022 359490 403807 397978 400530 405223 413781 421702
2356D21702r824O6710M3000k487o5608N3816L5025K4460K0950r379M3915R264
$$ 421702 411878 478588 521588 519101 453493 507309 542334 566794 587744 578365 622280 631544
2344F31544N1995p4307P8585L7833L192N3379P8423j4039l042j6490Q4811J04227
$$ 631544 683539 609232 687817 725650 728842 782221 860644 846605 843563 827073 911884 1016111
2332A016111L7775R3032M0453R6214J33500J09478J36378J29760J37076K15177
$$ 1016111 1053886 1146918 1187371 1283585 1417085 1526563 1662941 1792701 1929777 2144954
2322B144954L09639L83831M57776L35416K71545K13484J83242K47478M22314N82407
$$ 2144954 2454593 2838424 3296200 3631616 3903161 4116645 4299887 4547365 4969679 5552086
2312E552086R19428J132203J606354K540863M852679O777238R059363R327376
$$ 5552086 6471514 7603717 9210071 11750934 16603613 23380851 32440214 41767590
2304D1767590L882265q21643k977501n569424n777535m993476m697441l884157
$$ 41767590 45649855 44828212 41850711 36281287 30503752 25510276 20812835 16928678
2296A6928678l360599k835201k282877j492416r34059n97058l84215m21489m43081
$$ 16928678 13568079 10732878 8450001 6957585 6023526 5426468 5042253 4620764 4177683
2287D177683l61869l97502l06634l41348k97674k54428j76686j10389j28161j71102
$$ 4177683 3815814 3418312 3111678 2770330 2472656 2218228 2041542 1931153 1802992 1631890
2277A631890j65618j52117m0547n0080m8583l177j3825j20735o9910m2135j6510
$$ 1631890 1466272 1314155 1273608 1223528 1174945 1171768 1157943 1037208 967298 925163 908653
2266I08653o2058K0086k7249q1653k7515k3285j7638j00180j5379K0966j2891
$$ 908653 846595 866681 839432 757779 730264 706979 689341 589161 573782 594748 581857
2255E81857j4633j9523j3097k1215n4713j5650l8815j155L7796o082l8235m779
$$ 581857 567224 547701 534604 513389 458676 443026 404211 403056 440852 434770 396535 391756
2243C91756K7007J1165o089o8160J325k6368j2670r225j428J3298p5005n4061
$$ 391756 418763 429928 423839 355679 357004 330636 317966 308741 307313 320611 245606 191545
2231A91545p114Q888k132L6976j3915n972N7109j7416m0746p730J683j8123k2367
$$ 191545 184431 193319 191187 228163 214248 208276 265385 247969 207223 199493 201176 183053 160686
2218A60686l3995o578j260J8715L181l1727R864J9702O5075l256j6487m4367l7606
$$ 160686 126691 120113 118853 137568 140749 109022 118886 138588 203663 200407 183920 139553 101947
2205A01947O1141m1693K7000j2072n5800R721j0009k3595J8143K7206L3223J1212
$$ 101947 163088 121395 148395 136323 80523 90244 80235 56640 74783 101989 135212 146424
2193A46424r671l6050l6665M7808J5522o5637o9096J0950O3237J5845l2524L7541
$$ 146424 136753 100703 64038 111846 127368 61731 -7365 3585 66822 82667 50143 87684
2181H7684l6808k3634M0301J0867M879J3175o4911p0467j0013N9988K175J936
$$ 87684 50876 27242 67543 78410 83289 96464 31553 -38914 -48927 11061 13236 15172
2169A5172k6059o2018J4446L6932M5247m2917o204n5827O9964n851l9345L5017
$$ 15172 -10887 -72905 -58459 -21527 23720 -19197 -25401 -81228 -11264 -17115 -56460 -21443
2157b1443k0389k1221O4073O4830P006J8305o1111l2011L5346J1612P278j01889
$$ -21443 -41832 -63053 1020 65850 72856 91161 30050 -1961 33385 44997 52275 -49614
2145d9614r914J5975m9889n900j8280L4807l6836M8554k5609l6015J11526K6604
$$ -49614 -59528 -43553 -93442 -99342 -117622 -82815 -119651 -71097 -96706 -132721 -21195 5409
2133E409K332M0974k0759k3514J4073M1404n3177m9736m61P6597k0396L403n3673
$$ 5409 7741 48715 27956 4442 18515 59919 6742 -42994 -43455 33142 12746 16149 -37524
2120c7524k9550N6370K7009J4716L8808p0257p2212O0651N4012J9474k679m693
$$ -37524 -67074 -10704 16305 31021 69829 -428 -72640 -11989 42023 61497 58818 54125
2108E4125k4694M6644L6000n9460l3298R382L7185K6067N4646p8961l8141o5924
$$ 54125 29431 76075 112075 52615 19317 28699 65884 91951 146597 67636 29495 -36429
2096c6429M6907K2876m7507L9098l0966m004Q131n7293p585M8212M0886m5347
$$ -36429 10478 33354 -14153 24945 -6021 -10025 -1894 -59187 -66772 -18560 22326 -23021
2084b3021o6041O5768m2457m3819l4518M7865K6910m1601j6232O6993J4413K8904
$$ -23021 -89062 -23294 -65751 -109570 -144088 -96223 -69313 -110914 -127146 -60153 -45740 -16836
2072a6836j2773M4179j2689j4698J6521j8738m2666p8087j1600M0147n0380L2763
$$ -16836 -29609 14570 1881 -12817 3704 -15034 -57700 -135787 -147387 -107240 -157620 -124857
2060a24857L8921J0778J6075Q354M7848L7255P226m0263k1833R2201N6781q7463
$$ -124857 -85936 -75158 -59083 -50729 -2881 34374 41600 1337 -20496 71705 128486 41023
2048D1023o8629L5166L5264o0503K0679O0236o2372o1131L8678K7706l1839R0024
$$ 41023 -27606 7560 42824 -17679 3000 63236 864 -60267 -21589 6117 -25722 64302
2036F4302N2132l1509m433N679j2520O30K2147l5204m1872m8829m0129o6545N9398
$$ 64302 116434 84925 80492 86171 73651 74281 96428 61224 19352 -29477 -69606 -136151 -76753
2023g6753P6202n6931n1398Q6257N9494Q396M5874O605m0743n685M2456j29211
$$ -76753 -551 -57482 -108880 -22623 36871 45267 91141 97746 57003 51318 93774 -35437
2011c5437m1685N6019l9577M545L003J3035M1069J4776p5346r54M0595k4528k0183
$$ -35437 -77122 -21103 -60680 -56135 -53132 -40097 972 15748 -59598 -60552 -19957 -44485 -64668
1998f4668j481k2370J6060j1198K5088K428k4414J4350L5174j2206K8449N0608
$$ -64668 -66149 -88519 -72459 -83657 -58569 -56141 -80555 -66205 -31031 -43237 -14788 35820
1986C5820k4726k4681l4173q5802O3391O7392j2304m1895k102L3598N102m4475
$$ 35820 11094 -13587 -47760 -133562 -70171 -2779 -15083 -56978 -59080 -25482 -20380 -64855
1974f4855n4651J6855M1313Q5777k8125j4372k7680K1195K1281k7201l1501L8928
$$ -64855 -119506 -102651 -61338 24439 -3686 -18058 -45738 -24543 -3262 -30463 -61964 -23036
1962b3036K0399k1815k2961P521k01L424l1506k4072M9182M2144j3508r6045j8279
$$ -23036 -2637 -24452 -47413 -39892 -40093 -36669 -68175 -92247 -43065 -921 -14429 -110474 -128753
1949a28753O0110N1950n5R075l9443J2062K5887l5179m767l0042K7128M7108J3237
$$ -128753 -68643 -16693 -16748 -7673 -47116 -35054 -9167 -44346 -49113 -79155 -52027 -4919 8318
1936H318j232k3592l2444J2647K2548J3482k6279N408k140J8904K0498j8760O1703
$$ 8318 7086 -16506 -48950 -36303 -13755 -273 -26552 -21144 -23284 -4380 16118 -2642 59061
1923E9061j034m5912j1666n1751l883J1133j9201K1900j5686q816M1278M341K608
$$ 59061 58027 12115 449 -51302 -55185 -44052 -63253 -41353 -57039 -65855 -24577 -20236 -17628
1910a7628P082n8202k2552n033P504J7008J6814M3299m8253k7729Q12r938J7264
$$ -17628 -10546 -68748 -91300 -96333 -88829 -71821 -55007 -11708 -59961 -87690 -86878 -96816 -79552
1897g9552k3541K7649L2802L2127J3957k593L27q616j8922k8609k2610l5975k8269
$$ -79552 -103093 -75444 -42642 -10515 3442 849 1176 -7440 -26362 -54971 -77581 -113556 -141825
1884a41825M2407M0532j2936L2750j2161N68K3068n4099l0211J4284l886O5232
$$ -141825 -99418 -58886 -71822 -39072 -51233 -50665 -27597 -81696 -111907 -97623 -101509 -36277
1872c6277J115o5375L4461L0145K3192m6538m9336P161m4819L4127L5404k261
$$ -36277 -35162 -100537 -66076 -35931 -12739 -59277 -108613 -101452 -146271 -112144 -76740 -79001
1860g9001l419J5020O435M395L8313K0127K8084m5584M1155j5522n8048L513L9169
$$ -79001 -82420 -67400 -60965 -56570 -18257 1870 29954 -15630 25525 10003 -48045 -44532 -5363
1847e363n035k680p6n3341p649K854P0813J110o8215P8922p4081K727n858J74
$$ -5363 -10398 -13078 -13154 -66495 -74144 -71290 -477 633 -67582 11340 -62741 -60014 -65872 -65698
1833f5698P2808l4534n8690p904J5647J4088n6587k008M1126J0576J7995k8841
$$ -65698 7110 -27424 -86114 -94018 -78371 -64283 -120870 -122878 -81752 -71176 -53181 -82022
1821h2022N2489M4140m8219j5633M7180O1163K188m3589n254q8821J2164j177
$$ -82022 -29533 14607 -33612 -49245 -2065 59098 61286 17697 12443 -76378 -64214 -65391
1809f5391j8186K6487K6835l8949J7739l195k6205J6136J0945K8359N4356p939
$$ -65391 -83577 -57090 -30255 -69204 -51465 -54660 -80865 -64729 -53784 -25425 28931 20992
1797B0992n6694k8158k9949P4562N4946j10497m9319Q133M5953Q7898J4313l1574
$$ 20992 -35702 -63860 -93809 -19247 35699 -74798 -124117 -115984 -70031 17867 32180 606
1785F06r246k4873M6057p5781N0834M5386q7175K415k0046k3104L0669K1862K3644
$$ 606 -8640 -33513 12544 -63237 -12403 32983 -54192 -51777 -71823 -94927 -64258 -42396 -18752
1772a8752M1678n280j788o8655N4319l083R7817j1948j1217N692j11548k7638
$$ -18752 22926 17646 15858 -52797 1522 -1561 96256 84308 73091 78783 -32765 -60403
1760f0403J2574J3848O417j7736k0942O2795j7402k3L0723o7301n29L4730j7841
$$ -60403 -47829 -33981 -27564 -45300 -66242 -3447 -20849 -20872 9851 -57450 -57979 -23249 -41090
1747d1090M0335N1885j1160l0217J9563m2886K1026j541j6122m1405L7963O5186
$$ -41090 -755 51130 39970 9753 29316 -13570 7456 5915 -10207 -51612 -13649 51537
1735E1537K4628j8780q3571o0437o0797Q0394J41000j1737M3685o7662n0473l4073
$$ 51537 76165 57385 -26186 -86623 -147420 -67026 73974 62237 105922 38260 -12213 -46286
1723d6286k7048O6896j0798m1741o6781K0073K012j5249o30L809L7167MN86p9270
$$ -46286 -73334 -6438 -17236 -58977 -125758 -105685 -103673 -118922 -119552 -115743 -78576 -78572 -77986 -157256
1709a57256L0399O4754L9197K372l4163j3009L3897k6094N052L3696p7122J7030
$$ -157256 -126857 -62103 -22906 -20534 -54697 -67706 -33809 -59903 -54851 -21155 -98277 -81247
1697h1247K5778j3117n6291L6717j6883P6487k8338k4804K3577j9703p200J998
$$ -81247 -55469 -68586 -124877 -88160 -105043 -28556 -56894 -81698 -58121 -77824 -85024 -83026
1685h3026N5084k3539n7313N3168R401M8386L6067l6001n2055L0769M0741k9482
$$ -83026 -27942 -51481 -108794 -55626 -46225 2161 38228 2227 -49828 -19059 21682 -7800
1673g800n5086L630O3909O8190K0822o2607K130j333k7866j8420m3011K3900J0577
$$ -7800 -62886 -59256 4653 72843 93665 31058 33188 31855 3989 -14431 -57442 -33542 -22965
1660b2965O7139k898j5856J2703j05656K9264M6520j4579l4122M9970J000o377
$$ -22965 44174 41276 25420 38123 -67533 -38269 8251 -6328 -40450 9520 10520 4143
1648D143J8303j9177k0405q8665M3637O0698k1768o0057J2971L3254r006R447
$$ 4143 22446 3269 -17136 -105801 -62164 -1466 -23234 -83291 -70320 -37066 -46072 -36625
1636c6625l2354j1872N4500r843m472O3659j4491n9592j9433L4569M9041J0937
$$ -36625 -68979 -80851 -26351 -36194 -40666 22993 8502 -51090 -70523 -35954 13087 24024
1624B4024l1417r730m349j2416R292K8373J3265j5718L6094P163q551K6631o3892
$$ 24024 -7393 -17123 -21472 -33888 -24596 3777 17042 1324 37418 44581 36030 62661 -1231
1611a231j8541k0514j001j4379J8535J0698r409q4106J7382L8481j003K9517j6309
$$ -1231 -19772 -40286 -41287 -55666 -37131 -26433 -35842 -119948 -102566 -64085 -65088 -35571 -51880
1598e1880Q758j8517O6400K7501l3746m1755n7813P2554K7900j31771J1081R8715
$$ -51880 -43122 -61639 4761 32262 -1484 -43239 -101052 -28498 -598 -132369 -121288 -22573
1586b2573J6146k2159K4874N102l6369K295k3442J1080M7201k6273M8567K2245
$$ -22573 -6427 -28586 -3712 1390 -34979 -32684 -56126 -45046 2155 -24118 24449 46694
1574D6694P0677r7000j12064K2759N2258L3427j8277j6901k4094O1764n2977l0717
$$ 46694 117371 20371 -91693 -68934 -16676 16751 -1526 -18427 -42521 19243 -33734 -64451
1562f4451K5892N515L5599k7703j7192L185m1317m0548j377L0371J12518P1846
$$ -64451 -38559 -33044 2555 -25148 -42340 -39155 -80472 -121020 -122397 -92026 20492 92338
1550I2338r2034m0875o8469J11004J4869J3069k0436J1993k2347M406qp7053J2309
$$ 92338 304 -40571 -109040 1964 16833 29902 9466 21459 -888 3518 3510 -73543 -61234
1537f1234L4189J6698k8410m3114J8365K1826O431k6675L8099R8175j7454j4837
$$ -61234 -27045 -10347 -38757 -81871 -63506 -41680 -35249 -61924 -23825 74350 56896 42059
1525D2059k2180m3732M8682K4862k5034k8844m3458l1498l4713Q0107o00P081
$$ 42059 19879 -23853 24829 49691 24657 -4187 -47645 -79143 -113856 -33749 -34349 -27268
1513b7268m6096N4445O855q8684L0405r357O3644P7326J4929q070m7720k8660
$$ -27268 -73364 -18919 -12064 -100748 -70343 -79700 -16056 61270 76199 68129 20409 -8251
1501h251o799K6428N415o93K2289l3015L4412Q54n5440l369O84L4458j5190j786
$$ -8251 -15050 11378 16793 16100 38389 5374 39786 40640 -14800 -18169 -17485 16973 1783 -3
1487cR092l4575j0658N7170K227R903n0473L3984k1865q939N4089M0954p738l9843
$$ -3 9089 -25486 -36144 21026 23253 33156 -17317 16667 -5198 -14137 39952 80906 73168 33325
1473C3325Q403o158m2359K790o2705P558M1499m2411L6849O6120P756o9327j0231
$$ 33325 41728 35570 -6789 -3999 -66704 -59146 -17647 -60058 -23209 42911 50667 -18660 -28891
1460b8891M258j4426o540L0452M2388M5447K477n2978k638k5836R164J0148n7897
$$ -28891 -24633 -39059 -45599 -15147 27241 72688 75165 22187 19549 -6287 2877 13025 -44872
1447d4872k2704L4267k492o49q2412Q810P509L0314L3088n4784R5410n5583N5560
$$ -44872 -67576 -33309 -35801 -36450 -118862 -110052 -102543 -72229 -39141 -93925 1485 -54098 1462
1434A462M753L526L9095m4857k9879j5856N895M4115N8486j7883l0180M0183k6243
$$ 1462 6215 9741 48836 3979 -25900 -41756 -35861 8254 66740 48857 18677 58860 32617
1421C2617m5497j4340j4381P0297L9982O857l6616r8226K0085O0057l0181m0870
$$ 32617 -12880 -27220 -41601 28696 68678 75535 38919 -59307 -39222 20835 -9346 -50216
1409e0216j0239k0597P2815Q5169J774j0041J5765o2257o8215K4344o259q275
$$ -50216 -60455 -81052 -8237 76932 78706 68665 84430 22173 -46042 -21698 -27957 -36232
1397c6232n5056J6968L7525O705J073j6454k9697j7394N0535M2809n87O460L7767
$$ -36232 -91288 -74320 -36795 -30090 -29017 -45471 -75168 -92562 -42027 782 195 6655 44422
1384D4422j9769m7844n2013K9306M7089k1786K0797N0825j3240M002m1564O647
$$ 44422 24653 -23191 -75204 -45898 1191 -20595 202 51027 37787 41789 225 6872
1372F872N821N702j9956j4908L3572l8984L0718j1076P1262l9207l701O943L504
$$ 6872 12693 18395 -1561 -16469 17103 -21881 8837 -2239 69023 29816 26115 33058 36562
1359C6562L6632L3205J2012k416k5270j738l6K1527M738k7625M757j30156j3013
$$ 36562 73194 106399 118411 115995 90725 88987 88951 110478 115216 87591 92348 -37808 -50821
1346e0821O8544K9650j8016j08537k842P6028M3665m6233n6417Q1275K3252j6537
$$ -50821 17723 47373 29357 -79180 -82022 -5994 37671 -8562 -64979 16296 39548 23011
1334B3011l1652M7523n682j4745n576L0149K6344j2385q1822p0659M8085P0226
$$ 23011 -8641 38882 33200 18455 12879 43028 69372 56987 -24835 -95494 -47409 22817
1322B2817l7232L9256M0489l1333l6022N134K5699m7900l5635J7440J5531L1050
$$ 22817 -14415 24841 65330 33997 -2025 3109 28808 -19092 -54727 -37287 -21756 9294
1310I294l6301j9858R6663K082Q567J9293k9385l0384L4062k8048l5071j03597
$$ 9294 -27007 -46865 49798 51880 60447 79740 50355 19971 54033 25985 -9086 -112683
1298a12683R71J16415m698J1630k5978k5610L1703m856J3123K8741M3661l3996
$$ -112683 -111712 4703 5 11635 -14343 -39953 -8250 -13106 17 28758 72419 38423
1286C8423p9694J7665n628P3038m663l0939k6291O48K1415J0934J007m3073l769
$$ 38423 -41271 -23606 -29234 43804 39141 8202 -18089 -17441 3974 14908 15915 -27158 -30927
1273c0927l07K4572M2186J750J6451J5495j0681j4917Q996N0471p1883j622o7988
$$ -30927 -31234 -6662 35524 37274 53725 69220 58539 43622 52618 103089 31206 29584 -38404
1260c8404M8100j3710p1O0018n238j8160K9179J4266p371j2745j3026r884l8527
$$ -38404 9696 -4014 -4085 55933 50695 32535 61714 75980 68609 55864 42838 32954 -5573
1247e573O2376P6991r122p9131N257m4845R097n1158O0404L4297K5505k1964q3551
$$ -5573 56803 133794 124672 45541 50798 5953 15050 -36108 24296 58593 84098 62134 -21417
1234b1417K855m6427P6521K3603K5928l7177M3355K863m8719o191q1478P165L6582
$$ -21417 -18562 -64989 11532 35135 61063 23886 67241 70104 21385 15194 -66284 -59119 -22537
1221b2537k1510J3854M5744k0473L5343L271n4662l1879N8905l279K4487M5448
$$ -22537 -44047 -30193 15551 -4922 30421 33692 -20970 -52849 6056 2777 27264 72712
1209G2712N020p6381J5042J08528m2216p46j2208n8612j907J2904n1715L1828
$$ 72712 77732 1351 16393 124921 82705 81959 69751 11139 9232 22136 -29579 2249
1197B249j5849o49R8243k8598j6339O982P945m0551j5840J5128n314o3538Q852
$$ 2249 -13600 -14249 83994 55396 39057 46039 53984 13433 -2407 12721 7407 -56131 -47279
1184d7279m3485l6186N5373N4775L3424J7463J9521q4700P551R659K8981j1229
$$ -47279 -90764 -126950 -71577 -16802 16622 34085 53606 -31094 -23543 -13884 15097 3868
1172C868O1369j4796m8364q7340N2063L3823J9186J3747r6029j453J04981j1127
$$ 3868 65237 50441 2077 -85263 -33200 623 19809 33556 -62473 -63926 41055 29928
1160B9928l3150R257l3806p082j9444J2183j4773m8104O4658Q4974R807O179m1326
$$ 29928 -3222 6035 -27771 -34853 -54297 -42114 -56887 -104991 -40333 44641 54448 60627 19301
1147A9301q978J7666m7064n0093k7798l4817L1885M0171K2577k7447P5959O163
$$ 19301 10323 27989 -19075 -69168 -96966 -131783 -99898 -59727 -37150 -64597 11362 17525
1135A7525j3612R981j7510j4049K6723K6552k3354j9020K5925J4205j56j6667
$$ 17525 3913 13894 -3616 -17665 9058 35610 12256 -6764 19161 33366 33210 16543
1123A6543j7958k0928N680k0878k5789l974N8522M895R819J5717j8863l1075J1930
$$ 16543 -1415 -22343 -16663 -37541 -63330 -67304 -8782 -3887 5932 21649 2786 -28289 -16359
1110a6359p335J9495N4030N575j28l8172k0240K4036L9856m5198j1985m408P907
$$ -16359 -23694 -4199 49831 55406 55278 17106 -3134 20902 60758 15560 3575 -833 7074
1097G074k7446l5641P8028J0041J757k9019K8083K5673o378J847m6452m3487r155
$$ 7074 -20372 -56013 22015 32056 33813 4794 32877 58550 52172 54019 7567 -35920 -45075
1084d5075n834k7589K7297M6459N2858m2594n6544L0071J8960L8398J2894o8229
$$ -45075 -50909 -78498 -51201 -4742 48116 5522 -51022 -20951 -1991 36407 49301 -18928
1072a8928L148j4472j0784j4036Q2571L6725j7376p947M248j6523l7519l0149
$$ -18928 -15780 -30252 -41036 -55072 27499 64224 46848 38901 43149 26626 -10893 -41042
1060d1042m7583N8235L6556k2759P871J5713q311k827m2667P618o4701Q399L3256
$$ -41042 -88625 -30390 6166 -16593 -8722 6991 -1320 -4147 -46814 -39196 -103897 -95498 -62242
1047f2242J7572R555K6822J4424k8271J3415M4193N3056n9285l0899k772N1727
$$ -62242 -44670 -35115 -8293 6131 -22140 -8725 35468 88524 29239 -1660 -4432 47295
1035D7295K4942o3498J8805L4929J3730k0512n5896m760N2899P473k5663k2083
$$ 47295 72237 8739 27544 62473 76203 55691 -205 -4965 47934 55407 29744 7661
1023G661o2746Q666J1460N224L3467K8608J5356k5364P0069l193o2870k5136L9476
$$ 7661 -55085 -46419 -34959 -29735 3732 32340 47696 22332 92401 89208 26338 1202 40678
1010D0678L3172m3524J4023p099R7843N721n4403o1805l0908O2122k4642n358
$$ 40678 73850 30326 44349 37250 135093 140814 86411 24606 -6302 55820 31178 25820
998B5820P1109n2072r0174K3199Q2554J0321L451k2304M3741q5834p854L1252
$$ 25820 96929 44857 -45317 -22118 60436 70757 74208 51904 95645 9811 1957 33209
986C3209r0061K5139J9772L631K5458O045J6666L2844Q134k952m3012O661r933
$$ 33209 -56852 -31713 -11941 -8310 17148 23193 39859 72703 80837 77885 34873 41534 31601
973C1601o0998k241K6687n585m1457O9690K4291K7735n6907J873k4488M3432O1856
$$ 31601 -29397 -31638 -4951 -10536 -51993 17697 41988 69723 12816 14689 -9799 33633 95489
960I5489l7280L7431m8467j9357l1829Q6260n7355J1490K7169J1504j0638o4742
$$ 95489 58209 95640 47173 27816 -4013 82247 24892 36382 63551 75055 64417 -325
948c25J8624L2797K9354j5611r052M2953L6769j3492n8823o0144q585k0215k9192
$$ -325 18299 51096 80450 64839 55787 98740 135509 122017 63194 3050 -5535 -25750 -54942
935e4942k4083k632J2630L6246N0590k5193q212L0009j9644n0526J5187J4500
$$ -54942 -79025 -81657 -69027 -32781 17809 -7384 -15596 14413 -5231 -55757 -40570 -26070
923b6070M826Q4893o788J5968l2362L8723K165q4774O7844O4023M895p7458l8934
$$ -26070 -21244 63649 56861 72829 40467 79190 81355 -3419 64425 128448 133343 55885 16951
910A6951J7474J6019j1308K1166O0600q5312p2664M6497J5499J1361l7736j4931
$$ 16951 34425 50444 39136 60302 120902 35590 -37074 9423 24922 36283 -1453 -16384
898a6384L5840Q037J6076n3341m6859K8702L3923K960n024j6235N2987j3582j7176
$$ -16384 19456 27493 43569 -9772 -56631 -27929 5994 8954 3930 -12305 40682 27100 9924
885I924N9470m022P797p3083K5128l5210O5184l2880l8445J6803q5220J4721J10889
$$ 9924 69394 65372 73169 86 25214 -9996 55188 22308 -16137 666 -84554 -69833 41056
872D1056J0853N6095k0415o6466M1035o6410K0373L919o9391o803P0737J4397
$$ 41056 51909 108004 87589 21123 62158 -4252 16121 20040 -49351 -56154 14583 28980
860B8980K032k5305j0948p565o09m522m0852N4673K0428K3636k5098L1820j9275
$$ 28980 31012 5707 -5241 -12806 -13415 -17937 -58789 -4116 16312 39948 14850 46670 27395
847B7395j877N0241k3038m5123L1973m2401O37O478n1896L9712O6925K8166k3436
$$ 27395 25518 75759 52721 7598 39571 -2830 -2193 4285 -47611 -7899 59026 87192 63756
834F3756R802q346n3804o4184M1069J2800n9440J7189L2380m7081O255O1701j6417
$$ 63756 73558 65212 11408 -52776 -11707 1093 -58347 -41158 -8778 -55859 -49604 12097 -4320
821d320Q989J00611n5041m1394J0535p066M1406n463m2286M565k4102j3039J0423
$$ -4320 4669 105280 50239 8845 19380 12314 53720 48257 5971 10536 -13566 -26605 -16182
808a6182L9154k1253N981P530O745N517N785J8153L3628k5273k6246l949N2579
$$ -16182 22972 1719 7700 15230 21975 27492 33277 51430 85058 59785 33539 29590 82169
795H2169l9708n7754j9548L7491l2885j4641R0838j3575J3972M5952m959l2295
$$ 82169 42461 -15293 -34841 2650 -30235 -44876 45962 32387 46359 92311 87352 55057
783E5057l1213J2330J9732l7715P7780m5941m3823L687l1592M9122q241j9941
$$ 55057 23844 36174 55906 18191 95971 50030 6207 9894 -21698 27424 19183 -758
771g58k2733O0630o145N8181o1049n5051k185M9359J8318j0069j2270l186P168
$$ -758 -23491 37139 30994 89175 28126 -26925 -29110 20249 38567 28498 16228 13042 20210
758B0210k2630k2148M2267l5350m936N8962k6182J1744N0983N2635J6220k6444
$$ 20210 -2420 -24568 17699 -17651 -22587 36375 10193 21937 72920 125555 141775 115331
746A15331n4681k730o3014K2487K0170Q524p6628L9541L1088l6807K0017m0569
$$ 115331 60650 57920 -5094 17393 37563 46087 -30541 9000 40088 3281 23298 -17271
734a7271j0856J3645L3812L7118l8888j649m6270p5621P1978L4448o449J6717
$$ -17271 -28127 -14482 19330 56448 17560 15911 -30359 -105980 -34002 446 -6003 10714
722A0714N7478M8358J6472p2226j19357N1318M2963l8724J6543K1075r7254N9782
$$ 10714 68192 116550 133022 60796 -58561 -7243 35720 -3004 13539 34614 -62640 -2858
710b858L1552r431K057M1868o5382l8209O1635l9357j4372L3060j1886o791k3355
$$ -2858 28694 19263 21320 63188 -2194 -40403 21232 -18125 -32497 563 -11323 -18114 -41469
697d1469P5555K7417L9788j9491r2369n211L4487J9986j6076l9205M8787K710
$$ -41469 34086 61503 101291 81800 -10569 -15780 18707 38693 22617 -16588 32199 34909
685C4909m1129k7505j6569Q4842k9198m3420j3305P1575n0607R18l0627M8127
$$ 34909 -6220 -33725 -50294 34548 5350 -38070 -51375 20200 -30407 -29489 -60116 -11989
673a1989O4557J1332l6463m9692N6288m168o0175N0831K4274o175N6494l1113
$$ -11989 52568 63900 27437 -22255 34033 29865 -30310 20521 44795 38620 95114 64001
661F4001m4954r827k015l943p122N3430k0112p5126O4168k0093M0543l0132J419
$$ 64001 19047 9220 7205 3262 -3860 49570 29458 -45668 18500 -1593 38950 8818 10237
648A0237n634J1989l6754j5910l9752M299n2205K0812j4354L9175L2407n1330
$$ 10237 4603 16592 -20162 -36072 -75824 -71525 -123730 -102918 -117272 -78097 -45690 -97020
636i7020K5135j122J62609M4500p8220k3988J1913l2224J4968J3986K1824l2330
$$ -97020 -71885 -73007 89602 134102 55882 31894 43807 11583 26551 40537 62361 30031
624C0031l0854K1569M3717l8228j6418p495M7542L82R64J2420m6107k9806N7258
$$ 30031 -823 20746 64463 26235 9817 2322 49864 50246 51210 63630 17523 -12283 44975
611D4975K7009k6491J5582N1527p4992o1898J4440L7732J818o5490J3501j4307
$$ 44975 71984 45493 61075 112602 37610 -24288 -9848 27884 29702 -35788 -22287 -36594
599c6594M3156k6627K2471M6194k4844o2522L0977j9171K1371j1595l8551Q2801
$$ -36594 6562 -20065 2406 48600 23756 -38766 -7789 -26960 -5589 -17184 -55735 27066
587B7066l0784M6906l4739Q856K0877n234K7578j9745l2445K1945Q2894Q125r2717
$$ 27066 -3718 43188 8449 17305 38182 32948 60526 40781 8336 30281 113175 121300 28583
574B8583q1450k1538L3418n251O2099j3021J3822o4721k9386P4028N9610Q763
$$ 28583 -52867 -74405 -40987 -46238 15861 2840 16662 -48059 -77445 -3417 56193 64956
562F4956J0370l3812p566q8654N9869N7315l9447q3O3037K4290q5574r769J6747
$$ 64956 75326 41514 33948 -54706 5163 62478 23031 22948 85985 110275 24701 14932 31679
549C1679k2751p5017P2144J1353L39J0648n01J4074K620j2517l6507N7630k6685
$$ 31679 8928 -66089 6055 17408 17747 28395 27894 41968 44588 32071 -4436 53194 26509
536B6509l6201L8025k3443k689k093j8745m9166k139L2623j1812K7518N6557J3389
$$ 26509 -9692 28333 4890 2201 108 -18637 -67803 -69942 -37319 -49131 -21613 34944 48333
523D8333n4237M8375K2732j5179K4672K4376p7657m2755O0438l5789J3846K8847
$$ 48333 -5904 42471 65203 50024 74696 99072 21415 -21340 39098 3309 17155 46002
511D6002j0008k0101J1289j3789l1866p1619j5322k4418L5609K5823P2778J9197
$$ 46002 35994 15893 27182 13393 -18473 -90092 -105414 -129832 -94223 -68400 4378 23575
499B3575l195J2661o571n2305q617N877L0495l1170J553O4379P4525q3467K4899
$$ 23575 20380 33041 26470 -25835 -34452 -28575 1920 -29250 -27697 36682 111207 27740 52639
486E2639j948n9885l8780R75P0324k9803r196K8N471L1711K8832l3907q378J8842
$$ 52639 50691 -9194 -47974 -46999 23325 -6478 -15674 -15646 -10175 21536 50368 16461 8083 26925
472B6925k5026o63o559q95K9729K9198m659M7440m1926l1347K5848n2672M6291
$$ 26925 1899 1236 -5323 -6218 23511 52709 48050 95490 53564 22217 48065 -4607 41684
459D1684K5762o4828J5296Q3595l2619m8388J613O940N013m8616J5186M1189K3098
$$ 41684 67446 2618 17914 101509 68890 20502 22115 29055 34068 -14548 638 41827 64925
446F4925l8515l3279P1531n1864N1497J9919R021n2827J035J0516n2517K1143
$$ 64925 26410 -6869 64662 12798 64295 84214 93235 40408 41443 51959 -558 20585
$$ [...]
##END NTUPLES=NMR SPECTRUM
##END=
