##TITLE=1H_DE-80H_X3
 200.13MHz, d2o
 8 sc
 
 19ns.26.2.2025
##JCAMPDX= 6.0         $$ Bruker NMR JCAMP-DX V2.0
##DATA TYPE= NMR SPECTRUM
##DATA CLASS= NTUPLES
##ORIGIN= UXNMR, Bruker Analytische Messtechnik GmbH
##OWNER= pz
$$ XWIN-NMR		Version 3.5
$$ Wed Jul 22 14:08:41 2026 Russian Standard Time (UT+4h)  Yarkov@DPX200
##.OBSERVE FREQUENCY= 200.1313
##.OBSERVE NUCLEUS= ^1H
##.ACQUISITION MODE= SIMULTANEOUS
##.ACQUISITION SCHEME= undefined
##.AVERAGES= 8
##.DIGITISER RES= 18
##SPECTROMETER/DATA SYSTEM= spect
##.PULSE SEQUENCE= zg30
##.SOLVENT NAME= DMSO
##.SHIFT REFERENCE= (INTERNAL, DMSO, 0, 15.5056)
##AUDIT TRAIL= $$ (NUMBER, WHEN, WHO, WHERE, WHAT)
$$ ##TITLE= Audit trail, XWIN-NMR		Version 3.5
$$ ##JCAMPDX= 5.01
$$ ##ORIGIN= Bruker BioSpin GmbH
$$ ##OWNER= Yarkov
$$ C:/Bruker/XWIN-NMR/data/yarkov2/nmr/H-C/1/pdata/1/auditp.txt
$$ ##AUDIT TRAIL=  $$ (NUMBER, WHEN, WHO, WHERE, WHAT)
(   1,<2026-07-22 14:07:51.17 +0400>,<Yarkov>,<DPX200>,
      <created by zg, POWCHK disabled, PULCHK disabled
       configuration hash MD5:
       00 E9 B6 7A A2 85 ED C7 34 08 36 98 17 FE 4E 26
       data hash MD5: 16K
       9F 2A 8F EB 22 20 50 4C 3B 90 96 BC 48 3B 46 68>)
(   2,<2026-07-22 14:07:55.06 +0400>,<Yarkov>,<DPX200>,
      <Start of raw data processing
       efp BC_mod = 2 LB = 0.25 FT_mod = 6 PKNL = 1 PHC0 = -7264.547 PHC1 = 21.42198 SI = 16K 
       data hash MD5: 16K
       30 81 6B EA E5 D7 A0 7F F6 E1 A2 95 64 A1 AC 64>)
(   3,<2026-07-22 14:07:59.28 +0400>,<Yarkov>,<DPX200>,
      <abs ABSG = 5 
       data hash MD5: 16K
       97 31 4A 87 D4 18 F2 E8 1B CE 7B CA 06 5A 6D 90>)
$$ ##END=
$$ 
$$ hash MD5
$$ 62 52 D6 41 65 CF FC 97 22 25 CB 77 D9 06 CB 61
##$RELAX= 
##$RELAX= 
##$RELAX= 
##$RELAX= 
##$RELAX= 
##$RELAX= 
$$ Bruker specific parameters
$$ --------------------------
##$DU= <C:/Bruker/XWIN-NMR>
##$EXPNO= 1
##$NAME= <H-C>
##$PROCNO= 1
##$TYPE= <nmr>
##$USER= <yarkov2>
##$AMP= (0..31)
100 100 100 100 100 100 100 100 100 100 100 100 100 100 100 100 100 100 
100 100 100 100 100 100 100 100 100 100 100 100 100 100 
##$AQSEQ= 0
##$AQ_mod= 1
##$AUNM= <au_zg>
##$AUTOPOS= <>
##$BF1= 200.13
##$BF2= 200.13
##$BF3= 200.13
##$BF4= 200.13
##$BF5= 200.13
##$BF6= 200.13
##$BF7= 200.13
##$BF8= 200.13
##$BYTORDA= 1
##$CFDGTYP= 0
##$CFRGTYP= 5
##$CHEMSTR= <none>
##$CNST= (0..31)
1 1 145 1 1 1 1 1 1 1 1 1 1 1 1 1 1 1 1 1 1 1 1 1 1 1 1 1 1 1 1 1 
##$CPDPRG= <>
##$CPDPRG1= <>
##$CPDPRG2= <>
##$CPDPRG3= <>
##$CPDPRG4= <mlev>
##$CPDPRG5= <mlev>
##$CPDPRG6= <mlev>
##$CPDPRG7= <mlev>
##$CPDPRG8= <mlev>
##$CPDPRGB= <>
##$CPDPRGT= <>
##$D= (0..31)
0 0.7 0 0 0 0 0 0 0 0 0 0.03 0 0 0 0 0 0 0 0 0 0 0 0 0 0 0 0 0 0 0 0 
##$DATE= 1784714870
##$DBL= (0..7)
120 120 120 120 120 120 120 120 
##$DBP= (0..7)
150 150 150 150 150 150 150 150 
##$DBP07= 0
##$DBPNAM0= <>
##$DBPNAM1= <>
##$DBPNAM2= <>
##$DBPNAM3= <>
##$DBPNAM4= <>
##$DBPNAM5= <>
##$DBPNAM6= <>
##$DBPNAM7= <>
##$DBPOAL= (0..7)
0.5 0.5 0.5 0.5 0.5 0.5 0.5 0.5 
##$DBPOFFS= (0..7)
0 0 0 0 0 0 0 0 
##$DE= 6
$$ [...]
##$SUBNAM3= <"">
##$SUBNAM4= <"">
##$SUBNAM5= <"">
##$SUBNAM6= <"">
##$SUBNAM7= <"">
##$SUBNAM8= <"">
##$SUBNAM9= <"">
##$SW= 18.0517328524113
##$SWIBOX= (0..15)
0 0 2 0 0 0 0 0 0 0 0 0 0 0 0 0 
##$SW_h= 3612.71676300578
##$TD= 16384
##$TD0= 1
##$TE= 0
##$TE2= 300
##$TE3= 300
##$TEG= 300
##$TL= (0..7)
0 120 120 120 120 120 120 120 
##$TP= (0..7)
150 150 150 150 150 150 150 150 
##$TP07= 0
##$TPNAME0= <>
##$TPNAME1= <>
##$TPNAME2= <>
##$TPNAME3= <>
##$TPNAME4= <>
##$TPNAME5= <>
##$TPNAME6= <>
##$TPNAME7= <>
##$TPOAL= (0..7)
0.5 0.5 0.5 0.5 0.5 0.5 0.5 0.5 
##$TPOFFS= (0..7)
0 0 0 0 0 0 0 0 
##$TUNHIN= 0
##$TUNHOUT= 0
##$TUNXOUT= 0
##$USERA1= <user>
##$USERA2= <user>
##$USERA3= <user>
##$USERA4= <user>
##$USERA5= <user>
##$V9= 5
##$VALIST= <valist>
##$VCLIST= <CCCCCCCCCCCCCCC>
##$VD= 0
##$VDLIST= <DDDDDDDDDDDDDDD>
##$VPLIST= <PPPPPPPPPPPPPPP>
##$VTLIST= <TTTTTTTTTTTTTTT>
##$WBST= 1024
##$WBSW= 4
##$XGAIN= (0..3)
0 0 0 0 
##$XL= 0
##$YL= 0
##$YMAX_a= 457088
##$YMIN_a= -396423
##$ZGOPTNS= <>
##$ZL1= 120
##$ZL2= 120
##$ZL3= 120
##$ZL4= 120
##$ABSF1= 15.49237
##$ABSF2= -2.55948
##$ABSG= 5
##$ABSL= 3
##$ALPHA= 0
##$AQORDER= 0
##$ASSFAC= 0
##$ASSFACI= 0
##$ASSFACX= 0
##$ASSWID= 0
##$AUNMP= <proc_1d>
##$AZFE= 0.1
##$AZFW= 0.1
##$BCFW= 0
##$BC_mod= 2
##$BYTORDP= 0
##$COROFFS= 0
##$CY= -3
##$DATMOD= 1
##$DC= 0
##$DFILT= <>
##$DTYPP= 0
##$F1P= 0
##$F2P= 0
##$FCOR= 1
##$FTSIZE= 16384
##$FT_mod= 6
##$GAMMA= 0
##$GB= 0
##$INTBC= 1
##$INTSCL= 3.241238e-09
##$ISEN= 128
##$LB= 0.25
##$LEV0= 0
##$LPBIN= 0
##$MAXI= 10000
##$MC2= 0
##$MEAN= 0
##$ME_mod= 0
##$MI= 1.114404
##$NCOEF= 0
##$NC_proc= -6
##$NLEV= 6
##$NOISF1= 3.799351
##$NOISF2= 2.8
##$NSP= 0
##$NTH_PI= 0
##$NZP= 0
##$OFFSET= 15.5056
##$PC= 1
##$PHC0= -7264.547
##$PHC1= 21.42198
##$PH_mod= 1
##$PKNL= yes
##$PPARMOD= 0
##$PSCAL= 0
##$PSIGN= 0
##$REVERSE= no
##$SF= 200.13000322329
##$SI= 16384
##$SIGF1= 3
##$SIGF2= 2
##$SINO= 0.751879
##$SIOLD= 32768
##$SREGLST= <19F.Aceton>
##$SSB= 0
##$STSI= 16384
##$STSR= 0
##$SW_p= 3612.71676300578
##$SYMM= 0
##$S_DEV= 0
##$TDeff= 16384
##$TDoff= 0
##$TI= <>
##$TILT= no
##$TM1= 0
##$TM2= 0
##$TOPLEV= 0
##$USERP1= <user>
##$USERP2= <user>
##$USERP3= <user>
##$USERP4= <user>
##$USERP5= <user>
##$WDW= 1
##$XDIM= 16384
##$YMAX_p= 447426501
##$YMIN_p= -403586
$$ End of Bruker specific parameters
$$ ---------------------------------
##NTUPLES= NMR SPECTRUM
##VAR_NAME=  FREQUENCY,     SPECTRUM/REAL,   SPECTRUM/IMAG
##SYMBOL=    X,             R,               I
##VAR_TYPE=  INDEPENDENT,   DEPENDENT,       DEPENDENT
##VAR_FORM=  AFFN,          ASDF,            ASDF
##VAR_DIM=   16384,         16384,           16384
##UNITS=     HZ,            ARBITRARY UNITS, ARBITRARY UNITS
##FACTOR=    0.220516191357247, 1,           1
##FIRST=     3103.13577309306, 0,            0
##LAST=      -509.580989912721, 0,           0
##MIN=       -509.580989912721, -403586,     0
##MAX=       3103.13577309306, 447426501,    0
$$ Real data points
##PAGE= N=1
##DATA TABLE= (X++(R..R)), XYDATA
$$ [...]
$$ plain form
6725 -1077 -69596 -32117 -25274 -73371 -24494 -36785 -3841 -40126 38709 49883 55462 -15082
6713 -15082 -39602 47378 7606 -20635 37407 -11767 -15750 -4 -14921 -99732 -121795 -83555
6701 -83555 -45425 -5635 35481 45568 13145 18637 6273 11096 55633 39798 -38221 -7703
6689 -7703 -39066 -3946 36853 12774 -36563 -1576 -14479 -18942 -22255 -14342 -6570 -60835 -71312
6676 -71312 -45151 44671 74503 31270 1535 26448 -3621 -67736 -58105 -120791 -82351 -51789
6664 -51789 1403 46362 3454 48032 -19567 -74895 -60059 -31908 6864 -16051 -60 -5740
6652 -5740 -22753 -125999 -61476 -24844 -36355 -33572 -50516 -37980 -5685 -39784 -39523 -40467 -31126
6639 -31126 760 65499 62676 -5658 -14038 -24602 -67225 -27439 3810 -3795 -53872 -64462
$$ packed form
6725a077o8519L7479O843m8097M8877j2291L2944l6285P8835J1174N579p0544
6713a5082k4520Q6980l9772k8241N8042m9174l983J5746j4917q4811k2063L8240
6701h3555L8130L9790M1116J0087l2423N492j2364M823M4537j5835p8019L0518
6689g703l1363L5120M0799k4079m9337L4987j2903m463l313P913P772n4265j0477
6676g1312K6161Q9822K9832m3233k9735K4913l0069o4115R631o2686L8440L0562
6664e1789N3192M4959m2908M4578o7599n5328J4836K8151L8772k2915J5991n680
6652e740j7013j03246O4523L6632j1511K783j6944J2536L2295l4099K61r44R341
6639c1126L1886O4739k823o8334q380j0564m2623L9786L1249p605n0077j0590
$$ plain form
6627 -64462 -31464 -46711 2160 -11220 12843 -10627 -15172 21417 -10168 -9486 -20650 43661
6615 43661 64263 -10128 32770 26738 52141 -15194 2545 19887 3441 -28428 -28846 -47191
6603 -47191 13470 22123 92660 24344 10260 -13626 -27828 -43937 -44888 -10307 -46442 -36515 -42700
6590 -42700 -12234 -54179 6144 -3528 -32977 3883 10318 43515 26833 -21139 -97887 -50774
6578 -50774 5716 20905 89915 91589 37004 -47276 -8 -25821 -52656 -737 -77583 -96918
6566 -96918 -94933 -57575 -14655 -15336 -21086 -32024 32829 27814 -39047 -24287 -17453 -24828 8853
6553 8853 22907 12665 -65058 -83854 -13232 10523 -26081 -25251 -5521 -11860 -2414 28111 77827
6540 77827 30028 57313 55317 -24449 -8584 -7870 -80727 -41474 -54112 -29142 16239 46515
$$ packed form
6627f4462L2998j5247M8871j3380K4063k3470m545L6589l1585O82j1164O4311
6615D3661K0602p4391M2898o032K5403o7335J7739J7342j6446l1869m18j8345
6603d7191O0661Q653P0537o8316j4084k3886j4202j6109r51L4581l6135R927o185
6590d2700L0466m1945O0323r672k9449L6860O435L3197j6682m7972p6748M7113
6578e0774N6490J5189O9010J674n4585q4280M7268k5813k6835N1919p6846j9335
6566i6918J985L7358M2920o81n750j0938O4853n015o6861J4760O834p375L3681
6553H853J4054j0242p7723j8796P0622K3755l6604Q30J9730o339R446L0525M9716
6540G7827m7799K7285j996p9766J5865P14p2857L9253j2638K4970M5381L0276
$$ plain form
6528 46515 63625 -7287 -30533 32256 15673 1147 -4022 -73440 -46126 11068 18818 -104566
6516 -104566 -108841 -39231 -46351 -71868 6711 51241 58307 1353 23961 9176 46438 15702
6504 15702 -40845 -18313 1474 -8993 9974 46851 34524 -38321 -33250 44173 56615 22089
6492 22089 6642 -52101 4703 22908 23371 49547 -3 -37802 44123 69855 37141 -68190
6480 -68190 -82584 -35680 -9794 -25062 -71111 6739 21344 43449 23696 3593 4376 -23055
6468 -23055 39941 65580 19878 11428 -50067 -73719 -54861 -57957 -24835 -6477 -95676 -89643
6456 -89643 -21123 -61332 -41986 -2981 7273 15128 24172 1464 22712 -4694 -931 33750
6444 33750 26512 -32894 -59505 -36451 -5452 65956 26794 24255 74604 103516 34775 51087
$$ packed form
6528D6515J7110p0912k3246O2789j6583j4526n169o9418K7314N7194P750j23384
6516a04566m275O9610p120k5517P8579M4530P066n6954K2608j4785L7262l0736
6504A5702n6547K2532J9787j0467J8967L6877j2327p2845N071P7423J2442l4526
6492B2089j5447n8743N6804J8205M63K6176m9550l7799Q1925K5732l2714j05331
6480f8190j4394M6904K5886j5268m6049P7850J4605K2105j9753k0103P83k7431
6468b3055O2996K5639m5702q450o1495k3652J8858l096L3122J8358q9199O033
6456h9643O8520m0209J9346L9005J0254P855R044k2708K1248k7406L763L4681
6444C3750p238n9406k6611K3054L0999P1408l9162k539N0349K8912o8741J6312
$$ plain form
6432 51087 21467 32051 24560 67885 29633 54700 22628 88482 32894 20428 58575 50636
6420 50636 57379 47378 50454 39785 46544 78739 16267 -30240 15620 24513 32375 50634 100112
6407 100112 23014 48680 70733 45685 18724 56763 111659 72807 680 -8599 13877 31245
6395 31245 99102 116280 95723 74709 14692 95902 160052 173298 142637 98640 96108 117461
6383 117461 40668 50611 23534 -17242 51475 102732 35628 17077 25726 25033 12469 54348
6371 54348 81699 55065 9981 -4459 35051 24506 2773 -12181 33332 52326 39226 -29660
6359 -29660 -27330 14774 -18100 -79278 -40775 -7927 4727 56900 30930 27902 70935 61395
6347 61395 38492 4431 33376 49876 41522 11171 16740 77147 48087 53956 -18532 -18287 -17953
$$ packed form
6432E1087k9620J0584p491M3325l8252K5067l2072O5854n5588j2466L8147p939
6420E0636O743j0001L076j0669O759L2195o2472m6507M5860Q893P862J8259M9478
6407A00112p7098K5666K2053k5048k6961L8039N4896l8852p2127r279K2476J7368
6395C1245O7857J7178k0557k1014o0017Q1210O4150J3246l0661m3997k532K1353
6383A17461p6793R943k7077m0776O8717N1257o7104j8551Q649o93j2564M1879
6371E4348K7351k6634m5084j4440L9510j0545k1733j4954M5513J8994j3100o8886
6359b9660K330M2104l2874o1178L8503L2848J2654N2173k5970l028M3033r540
6347F1395k2903l4061K8945J6500q354l0351N569O0407k9060N869p2488K45L34
$$ plain form
6334 -17953 3937 30109 34419 41444 -14700 -7882 15602 33084 92259 67051 49326 35668
6322 35668 -25885 -11903 -19786 -55003 -30371 -27934 -11466 38359 54132 106073 86597 101305
6310 101305 41257 16457 -22284 -15917 21787 85324 1113 -64928 -24214 20898 -39034 -36999
6298 -36999 -20478 86565 96528 54791 95361 63016 99791 26551 -15300 37115 83023 -16527
6286 -16527 -3040 7431 -58672 -38626 5790 -25625 -21854 -35607 -5873 -5779 5062 60120 19380
6273 19380 17416 -34469 30433 38015 87453 37423 -14559 67340 92218 49851 33120 35362
6261 35362 59382 39869 17532 23563 -27959 59599 36103 435 9909 -48727 5737 61770
6249 61770 27463 -496 93232 172854 188493 76480 28569 98592 115783 53929 28496 59097
$$ packed form
6334a7953K1890K6172M310P025n6144O818K3484J7482N9175k5208j7725j3658
6322C5668o1553J3982p883l5217K4632K437J6468M9825J5773N1941j9476J4708
6310A01305o0048k4800l8741O367L7704O3537q4211o6041M0714M5112n9932K035
6298c6999J6521J07043R963m1737M0570l2345L6775p3240m1851N2415M5908r9550
6286a6527J3487J0471o6103K0046M4416l1415L771j3753K9734R4J0841N5058m0740
6273A9380j964n1885O4902P582M9438n0030n1982Q1899K4878m2367j6731K242
6261C5362K4020j9513k2337O031n1522Q7558k3496l5668R474n8636N4464N6033
6249F1770l4307k7959R3728P9622J5639j12013m7911P0023J7191o1854k5433L0601
$$ plain form
6237 59097 -17485 27496 56163 67269 -19272 48336 -8612 27993 74103 62731 9740 -17112
6225 -17112 52127 113969 101983 91192 106845 97244 28828 33644 69957 90527 47547 37451
6213 37451 57999 83184 38737 1065 -39494 -91527 -57748 -14888 53043 62912 102796 87965
6201 87965 82805 101999 63116 89895 100398 69635 85744 93113 122598 177512 135808 105645
6189 105645 31408 -30451 -6651 15015 37560 77652 118539 95331 61674 118268 147806 109698
6177 109698 192593 107301 52126 72829 98297 58368 54133 42250 72729 126874 160151 82935
6165 82935 89873 135137 177641 186688 127445 131490 164187 110453 106037 114841 166929 173620 156978
6152 156978 143589 89000 62480 58996 84369 124217 184750 203787 211932 193274 123485 87003
$$ packed form
6237E9097p6582M4981K8667J1106q6541O7608n6948L6605M6110j1372n2991k6852
6225a7112O9239O1842j1986j0791J5653r601o8416M816L6313K0570m2980j0096
6213C7451K0548K5185m4447l7672m0559n2033L3779M2860O7931R869L9884j4831
6201H7965n160J9194l8883K6779J0503l0763J6109P369K9485N4914m1704l0163
6189A05645p4237o1859K3800K1666K2545M0092M0887k3208l3657N6594K9538l8108
6177A09698Q2895q5292n5175K0703K5468l9929m235j1883L0479N4145L3277p7216
6165H2935O938M5264M2504R047n9243M045L2697n3734m416Q804N2088O691j6642
6152A56978j3389n4589k6520l484K5373L9848O0533J9037Q145j8658o9789l6482
$$ plain form
6140 87003 75984 95966 115979 140518 162311 227618 267584 291880 309336 284241 295635 381463
6128 381463 437749 533562 675955 900411 1012615 1178335 1284974 1232528 1109374 1047384
6118 1047384 1016101 909848 912305 1029179 1216668 1346351 1337880 1316211 1219610 1071791 916595
6107 916595 781356 696500 649349 656928 466112 444355 451658 389935 314564 283496 245579 307065
6095 307065 299470 294507 272224 267503 281747 250076 229641 172441 223740 336267 343348 308409
6083 308409 299101 307758 235435 240355 246742 223221 195343 199248 215587 242909 281101 223727 216449
6070 216449 218625 202374 265274 319104 267597 230690 257663 267944 371181 382171 431827 468922
6058 468922 463479 421921 356940 369388 374362 351002 301744 307739 254105 246344 248959 200214 190165
$$ packed form
6140H7003j1019J9982K0013K4539K1793O5307L9966K4296J7456k5095J1394Q5828
6128C81463N6286R5813J42393K24456J12204J65720J06639n2446j23154o1990
6118A047384l1283j06253K457J16874J87489J29683q471k1669r6601j47819j55196
6107I16595j35239q4856m7151P579j90816k1757P303o1723p5371l1068l7917O1486
6095C07065p595m963k2283m721J4244l1671k0435n7200N1299J12527P081l4939
6083C08409r308Q657p2323M920O387k3521k7878L905J6339K7322L8192n7374p278
6070B16449K176j6251O2900N3830n1507l6907K6973J0281J03237J0990M9656L7095
6058D68922n443m1558o4981J2448M974k3360m9258N995n3634p761K615m8745j0049
$$ plain form
6045 190165 217633 186874 143878 179177 159774 108875 144243 212834 237528 244803 180095 197088
6033 197088 216142 264522 256581 222810 372468 284504 256536 276921 332959 268625 288899 250510
6021 250510 193985 210811 268702 256556 213508 270634 247379 249960 281720 323186 290483 298510
6009 298510 346884 336697 405741 468682 438294 479269 564244 721414 943534 1197508 1469765
5998 1469765 1633056 1573381 1490021 1358239 1252888 1188905 1177813 1186505 1263972 1433217 1582929
5987 1582929 1591684 1507499 1391801 1210990 1092969 993794 919963 832729 710212 617867 600982
5976 600982 580314 518431 512901 593693 700737 884533 983439 921450 873692 861323 823051
5965 823051 713660 681728 744808 732071 775875 868731 892985 937130 945335 835646 702888
$$ packed form
6045A90165K7468l0759m2996L5299j9403n0899L5368O8591K4694P275o4708J6993
6033A97088J9054M8380p941l3771J49658q7964k7968K0385N6038o4334K0274l8389
6021B50510n6525J6826N7891j2146m3048N7126k3255K581L1760M1466l2703Q027
6009B98510M8374j0187O9044O2941l0388M0975Q4975J57170K22120K53974K72257
5998A469765J63291n9675q3360j31782j05351o3983j1092Q692P7467J69245J49712
5987A582929Q755q4185j15698j80811j18021r9175p3831q7234j22517r2345j6885
5976F00982k0668o1883n530Q0792J07044J83796R8906o1989m7758j2369l8272
5965H23051j09391l1932O3080j2737M3804R2856K4254M4145Q205j09689j32758
$$ plain form
5954 702888 596163 497580 488738 448007 421048 408675 378805 369374 386337 378974 338146 350268
5942 350268 347999 271909 351880 385158 352338 307300 294226 286715 319789 303055 274044 279883
5930 279883 362679 348441 347009 383519 380238 377373 307649 290434 290675 352537 293016 339500 316966
5917 316966 330882 337850 339150 367576 343460 326252 284481 252514 315022 391738 354693 312299
5905 312299 370590 362429 281187 284031 308055 360370 428420 409607 375887 346702 346794 360845 359251
5892 359251 357182 392363 414936 430906 426224 432324 468967 438661 385415 420096 498859 473765
5880 473765 438466 535780 602309 546740 562681 538059 471542 448135 486626 524611 535182 550740
5868 550740 557752 509928 475385 485133 503586 586589 638857 596173 538062 604211 638195 642734
$$ packed form
5954G02888j06725r8583q842m0731k6959j2373k9870r431J6963p363m0828J2122
5942C50268k269p6090P9971L3278l2820m5038j3074p511L3074j6734k9011N839
5930B79883Q2796j4238j432L6510l281k865o9724j7215K41O1862n9521M6484k2534
5917C16966J3916O968J300K8426k4116j7208m1771l1967O2508P6716l7045m2394
5905C12299N8291q161q1242K844K4024N2315O8050j8813l3720k9185R2J4051j594
5892C59251k069L5181K2573J5970m682O100L6643l0306n3246L4681P8763k5094
5880D73765l5299R7314O6529n5569J5941k4622o6517k3407L8491L7985J0571J5558
5868E50740P012m7824l4543R748J8453Q3003N2268m2684n8111O6149L3984M539
$$ plain form
5856 642734 638775 647392 673534 679633 693567 699171 758253 769831 769964 771199 803396 843781 925221
5843 925221 922300 908128 964949 946635 998367 1007329 1002611 1145591 1233588 1324019 1482389 1604855
5831 1604855 1760664 2035931 2394932 2540667 2521802 2453122 2419822 2262078 2112759 2067852
5821 2067852 1976618 1896645 1834815 1775683 1797953 1802859 1865689 1892253 1981748 2051713 2190232
5810 2190232 2415673 2580894 2852514 3183306 3582627 4357487 5483475 6965748 8727189
5801 8727189 10117919 10694822 10654707 10175611 9371678 8465962 7573925 6811094 5993100 5274098
5791 5274098 4706697 4271745 4073991 3983100 4024874 4126410 4268282 4470874 4723001 5204286
5781 5204286 5793718 6446724 7274676 8597330 10684351 13853763 17948360 22275294 25277275
$$ packed form
5856F42734l959Q617K6142O099J3934N604N9082J1578J33J235L2197M0385Q1440
5843I25221k921j4172N6821j8314N1732Q962m718J42980Q7997R0431J58370J22466
5831A604855J55809K75267L59001J45735j8865o8680l3300j57744j49319m4907
5821B067852r1234p9973o1830n9132K2270M906O2830K6564Q9495O9965J38519
5810B190232K25441J65221K71620L30792L99321P74860J125988J482273J761441
5801H727189J390730N76903m0115m79096q03933r05716q92037p62831q17994p19002
5791E274098n67401m34952j97754r0891M1774J01536J41872K02592K52127M81285
5781E204286N89432O53006Q27952J322654K087021L169412M094597M326934L001981
$$ plain form
5772 25277275 26121497 25425621 23763990 21489704 19084019 16778376 14742583 12914518
5764 12914518 11339172 10127983 9514615 9389887 9588233 10296549 11869773 14310659 17891366
5755 17891366 21659368 24289941 25140412 24959903 24547236 24618809 26083810 29202375 33431629
5746 33431629 37257575 38780372 37759380 35402189 32020538 28314843 24682443 21202889
5738 21202889 17890299 14902728 12309993 10254089 8810562 7860208 7266015 7006206 6780069
5729 6780069 6679311 6757198 6955683 7328845 7861492 8538611 9535559 11292133 13996875
5720 13996875 17766633 22197333 25770941 27203600 26807489 25151935 22656628 19846805
5712 19846805 17227315 14721768 12394958 10241032 8427863 7019032 6016237 5456732
$$ packed form
5772B5277275Q44222o95876j661631k274286k405685k305643k035793j828065
5764A2914518j575346j211189o13368j24728J98346P08316J573224K440886L580707
5755A7891366L768002K630573Q50471j80509m12667P1573J465001L118565M229254
5746C3431629L825946J522797j020992k357191l381651l705695l632400l479554
5738B1202889l312590k987571k592735k055904j443527r50354n94193k59809k26137
5729F780069j00758P7887J98485L73162N32647O77119R96948J756574K704742
5720A3996875L769758M430700L573608J432659l96111j655554k495307k809823
5712A9846805k619490k505547k326810k153926j813169j408831j002795n59505
$$ plain form
5704 5456732 4980045 4725432 4581070 4419766 4396343 4453416 4476971 4588413 4892441 5341165
5694 5341165 6103764 7282817 8920173 10717921 11793835 12006261 11615404 10768523 9668239
5685 9668239 8498067 7368425 6258063 5303372 4487201 3711514 3222861 2866239 2640552
5676 2640552 2472546 2373202 2241344 2011321 1967637 2019168 1943797 1917881 1950460 2005739 2037901
5665 2037901 2268078 2611798 2860597 2947494 2970346 2791050 2658129 2442076 2163093 1933645
5655 1933645 1718884 1533292 1381458 1208171 1167440 1129336 1049743 1009643 1057824 1003629 954679
5644 954679 966538 963876 909935 833357 779457 775039 777150 811408 850684 734848 781049 785425
5632 785425 806265 755550 721312 710745 706097 648546 641073 672404 597346 538416 584904 577135
$$ packed form
5704E456732m76687k54613j44362j61304k3423N7073K3555J11442L04028M48724
5694E341165P62599J179053J637356J797748J075914K12426l90857q46881j100284
5685I668239j170172j129642j110362r54691q16171p75687m88653l56622k25687
5676B640552j68006r9344j31858k30023m3684N1531p5371k5916L2579N5279L2162
5665B037901K30177L43720K48799Q6897K2852j79296j32921k16053k78983k29448
5655A933645k14761j85592j51834j73287m0731l8104p9593m0100M8181n4195m8950
5644I54679J1859k662n3941p6578n3900m418K111L4258L9276j15836M6201M376
5632G85425K0840n0715l4238j0567m648n7551p473L1331p5058n8930M6488p769
$$ plain form
5620 577135 557000 546457 550119 584272 565019 541474 488085 482986 501057 524829 602513 694330
5608 694330 772083 769202 676789 613592 719934 700302 666004 603463 535295 544131 557844 616783
5596 616783 564062 540761 558000 592711 569720 599715 643306 482086 472979 444682 474033 429011
5584 429011 438897 390786 344153 406434 432513 487245 546504 496032 463575 482388 452329 455176
5572 455176 455636 443818 519376 481777 479642 485463 464404 483908 459075 446193 466932 473500 402990
5559 402990 468571 492010 503824 515153 516282 505335 544815 572460 522579 616169 641818 627697
5547 627697 636168 736248 792698 805231 890200 1044934 1277255 1459853 1560379 1745463 1839576
5536 1839576 1856346 1997843 2036189 2051382 2034734 1997898 1996891 2044745 2105766 2139412 2205682
$$ packed form
5620E77135k0135j0543L662L4153j9253k3545n3389n099J8071K3772P7684R1817
5608F94330P7753k881r2413o3197J06342j9632l4298o2541o8168Q836J3713N8939
5596F16783n2721k3301J7239L4711k2991K9995M3591j61220r107k8297K9351m5022
5584D29011R886m8111m6633O2281K6079N4732N9259n0472l2457J8813l0059K847
5572D55176M60j1818P5558l7599k135N821k1059J9504k4833j2882K0739O568p0510
5559D02990O5581K3439J1814J1329J129j0947L9480K7645m9881R3590K5649j4121
5547F27697Q471J00080N6450J2533Q4969J54734K32321J82598J00526J85084R4113
5536A839576J6770J41497L8346J5193j6648l6836j007M7854O1021L3646O6270
$$ plain form
5525 2205682 2110716 2003361 1839497 1642876 1528359 1391476 1214534 1108183 974157 846028
5515 846028 764720 736975 716264 728493 785431 661003 600293 608840 566092 509927 578775 613441
5503 613441 622086 596238 622287 649024 795684 888313 953601 1017104 1066939 1075188 1005255 885257
5491 885257 849360 756290 715559 699986 643122 568782 498653 533374 628116 526830 522043 604529
5479 604529 582212 561874 612944 632014 633298 692861 771353 808038 790323 886489 1042709 1284704
5467 1284704 1654459 2047019 2230776 2340707 2256881 2105918 1977702 1811625 1570061 1380255
5457 1380255 1250899 1134740 1057256 914165 849593 826925 809944 722151 691753 724791 631371
5446 631371 582971 586483 577726 679241 705532 681867 750970 901557 1014031 1173921 1474623
$$ packed form
5525B205682r4966j07355j63864j96621j14517j36883j76942j06351j34026j28129
5515H46028q1308k7745k0711J2229N6938j24428o0710Q547m2748n6165O8848L4666
5503F13441Q645k5848K6049K6737J46660R2629O5288O3503M9835Q249o9933j19998
5491H85257l5897r3070m0731j5573n6864p4340p0129L4721R4742j01286m787Q2486
5479F04529k2317k0338N1070J9070J284N9563P8492L6685j7715R6166J56220K41995
5467A284704L69755L92560J83757J09931q3826j50963j28216j66077k41564j89806
5457A380255j29356j16159p7484j43091o4572k2668j6981q7793l0398L3038r3420
5446F31371m8400L512q757J01515K6291k3665O9103J50587J12474J59890L00702
$$ plain form
5435 1474623 1907085 2238210 2442104 2515353 2417724 2306093 2129080 1959196 1767937 1558203
5425 1558203 1314597 1168382 1045397 997544 932938 812217 702827 694871 697620 680164 654384
5414 654384 635991 645117 608574 544794 617558 669488 657453 696325 806299 890438 999916
5403 999916 1119172 1328602 1473991 1489314 1397351 1301662 1186516 1094259 1069749 1005003 901586
5392 901586 793956 794525 778652 748334 689930 698454 756942 787848 701091 638388 710355 709944
5380 709944 637027 724059 780431 701138 718692 820598 830151 856257 862397 874027 901288 888732
5368 888732 859296 806858 872025 933601 960757 929237 886747 947809 926438 887676 920285 922949
5356 922949 951724 830769 738501 826355 823071 864177 875361 835997 871732 871399 892343 935936
$$ packed form
5435A474623M32462L31125K03894P3249r7629j11631j77013j69884j91259k09734
5425A558203k43606j46215j22985m7853o4606j20721j09390p956K749j7456k5780
5414F54384j8393R126l6543o3780P2764N1930j2035L8872J09974Q4139J09478
5403I99916J19256K09430J45389J5323r1963r5689j15146r2257k4510o4746j03417
5392I01586j07630N69j5873l0318n8404Q524N8488L0906q6757o2703P1967m11
5380G09944p2917Q7032N6372p9293J7554J01906R553K6106O140J1630K7261j2556
5368H88732k9436n2438O5167O1576K7156l1520m2490O1062k1371l8762L2609K664
5356I22949K8775j20955r2268Q7854l284M1106J1184l9364L5735l33K0944M3593
$$ plain form
5344 935936 929397 990749 1011331 1010186 1055046 1051664 1097059 1102357 1066240 1156033 1192898 1273715
5332 1273715 1372421 1393261 1431838 1491759 1630777 1708716 1667127 1693504 1819146 1961026 2021603
5321 2021603 2125668 2286355 2396408 2513243 2642311 2744403 2867961 3111806 3306477 3498746
5311 3498746 3859284 4317265 4771800 5346634 6046091 6929787 7947496 9404972 11629135
5302 11629135 14935452 19456688 24558811 28828684 30932808 31119887 29997124 28284097
5294 28284097 26525833 25081443 24321640 24496910 26088989 28876658 31799240 33443891
5286 33443891 33023918 31093241 28296997 25161576 22004772 19031445 16143446 13360082
5278 13360082 10900642 8912605 7377947 6295292 5572875 4912055 4427328 4094435 3745932
$$ packed form
5344I35936o539O1352K0582j145M4860l382M5395N298l6117Q9793L6865Q0817
5332A273715R8706K0840L8577N9921J39018P7939m1589K6377J25642J41880O0577
5321B021603J04065J60687J10053J16835J29068J02092J23558K43845J94671J92269
5311C498746L60538M57981M54535N74834O99457Q83696J017709J457476K224163
5302A1629135L306317M521236N102123M269873K104124J87079j122763j713027
5294B8284097j758264j444390p59803J75270J592079K787669K922582J644651
5286C3443891m19973j930677k796244l135421l156804k973327k887999k783364
5278A3360082k459440j988037j534658j082655p22417o60820m84727l32893l48503
$$ plain form
5269 3745932 3405404 3127151 2936922 2787089 2678412 2594055 2443800 2315810 2215124 2089170
5259 2089170 2019012 1988740 1935845 1872397 1877413 1799080 1695080 1674133 1597014 1467533 1458903
5248 1458903 1504356 1544365 1488513 1422654 1424395 1416923 1428976 1365568 1315874 1240685 1223588 1195861
5236 1195861 1157827 1107616 1084084 1102015 1152602 1028117 1006928 1030485 1013713 975464 931456
5225 931456 901902 887544 891596 850494 784900 781246 815382 767539 786103 793795 764601 791947
5213 791947 745124 782772 783889 642216 601688 646593 671206 743012 741983 710277 675618 666841
5201 666841 714492 700287 676272 654063 650193 689293 654027 604358 540481 557300 582994 546737
5189 546737 602311 647227 685687 632904 621151 617784 641480 660506 694981 645984 674886 633705
$$ packed form
5269C745932l40528k78253j90229j49833j08677q4357j50255j27990j00686j25954
5259B089170p0158l0272n2895o3448N016p8333j04000k0947p7119j29481q630
5248A458903M5453M0009n5852o5859J741p472J2053o3408m9694p5189j7097k7727
5236A195861l8034n0211k3532J7931N0587j24485k1189K3557j6772l8249m4008
5225I31456k9554j4358M052m1102o5594l654L4136m7843J8564P692k9194K7346
5213G91947m6823L7648J117j41673m0528M4905K4613P1806j029l1706l4659q777
5201F66841M7651j4205k4015k2209l870L9100l5266m9669o3877J6819K5694l6257
5189E46737N5574M4916L8460n2783j1753l367K3696J9026L4475m8997K8902m1181
$$ plain form
5177 633705 631932 703207 681553 592953 576362 546346 625754 608105 586390 596035 632479 658560
5165 658560 615025 563040 591999 554791 511065 590010 646588 601349 566199 497977 449216 487915
5153 487915 568916 591974 530724 502718 549727 603399 610655 601897 606933 619529 591709 622833
5141 622833 622352 598795 562551 497100 484915 538607 586283 649813 621080 607058 497848 488705
5129 488705 528797 493601 497952 497213 503216 564746 591312 513823 560956 665231 618683 549255
5117 549255 501701 557962 627999 637319 634033 640440 595730 552934 509596 537452 544922 611268
5105 611268 607146 512884 576944 681385 669799 612250 563751 530791 532337 573172 534029 551427
5093 551427 587072 598323 575465 561330 630735 605541 602805 630333 637233 624624 628165 642842
$$ packed form
5177F33705j773P1275k1654q8600j6591l0016P9408j7649k1715R645L6444K6081
5165F58560m3535n1985K8959l7208m3726P8945N6578m5239l5150o8222m8761L8699
5153D87915Q1001K3058o1250k8006M7009N3672P256q758N036J2596k7820L1124
5141F22833m81k3557l6244o5451j2185N3692M7676O3530k8733j4022j09210r143
5129D88705M0092l5196M351p39O003O1530K6566p7489M7133J04275m6548o9428
5117E49255m7554N6261P0037R320l286O407m4710m2796m3338K7856P470O6346
5105F11268m122r4262O4060J04441j1586n7549m8499l2960J546M0835l9143J7398
5093E51427L5645J1251k2858j4135O9405k5194k736K7528O900j2609L541J4677
$$ plain form
5081 642842 634320 624927 570087 607400 625016 668383 708285 727409 688781 733460 715570 732185
5069 732185 734780 703442 765021 722115 765338 785679 738925 685442 650024 725740 747071 700859
5057 700859 681892 725984 738056 706310 781081 747279 803370 797089 786950 867769 822224 712635
5045 712635 666879 651672 692068 780279 762047 769044 739858 755797 771790 808490 775285 760157
5033 760157 798129 793242 786355 775391 858016 857495 934914 891689 906422 931628 969493 968684 1042239
5020 1042239 998306 954162 1058873 1063457 1144428 1199470 1218695 1227289 1255576 1238580 1153779 1092456
5008 1092456 1133880 1174060 1126229 1031703 1051675 1038498 1045068 1131034 1170641 1129259 1141681 1085850
4996 1085850 1024385 1052243 1023447 1083266 1161551 1237249 1319407 1458015 1595555 1583067 1558464
$$ packed form
5081F42842q522r393n4840L7313J7616M3367L9902J9124l8628M4679j7890J6615
5069G32185K595l1338O1579m2906M3223K0341m6754n3483l5418P5716K1331m6212
5057G00859j8967M4092J2072l1746P4771l3802N6091o281j0139Q0819m5545j09589
5045G12635m5756j5207M0396Q8211j8232O997k9186J5939J5993L6700l3205j5128
5033G60157L7972m887o887j0964Q2625n21P7419m3225J4733K5206L7865q09P3555
5020A042239m3933m4144J04711M584Q0971N5042J9225Q594K8287j6996q4801o1323
5008A092456M1424M0180m7831r4526J9972j3177O570Q5966L9607m1382J2422n5831
4996A085850o1465K7858k8796N9819P8285P5698Q2158J38608J37540j2488k4603
$$ plain form
4985 1558464 1525520 1451269 1432689 1360963 1288325 1266416 1268022 1195522 1159415 1116982 1044426 1122577
4973 1122577 1129544 1090985 1102519 1113313 1029517 944569 1038976 972464 933972 950091 989892 961791
4961 961791 965777 963471 986539 1000454 985523 1057606 1025706 1032899 1046745 988688 978974 1054233
4949 1054233 1045641 1011931 918892 952850 947363 941915 938240 926714 1000925 1028610 948158 953804
4937 953804 979717 1018972 1046782 992497 961528 1006839 1007200 1028471 1037847 1008380 1083829 1048753
4925 1048753 1046302 1016395 1048909 1079925 1072034 1086752 1099915 1151447 1142685 1093624 1159175 1176305
4913 1176305 1201428 1149234 1167666 1215842 1177526 1188230 1187523 1229760 1276836 1304328 1289820 1314735
4901 1314735 1442990 1444750 1338448 1330379 1330284 1334354 1386729 1352149 1358176 1368773 1337131 1312623
$$ packed form
4985A558464l2944p4251j8580p1726p2638k1909J606p2500l6107m2433p2556P8151
4973A122577O967l8559J1534J0794q3796q4948R4407o6512l8492J6119L9801k8101
4961I61791L986k306K3068J3915j4931P2083l1900P193J3846n8057r714P5259
4949A054233q592l3710r3039L3958n487n448l675j1526P4211K7685q0452N646
4937I53804K5913L9255K7810n4285l0969M5311L61K1271R376k9467P5449l5076
4925A048753k451k9907L2514L1016p891J4718J3163N1532q762m9061O5551J7130
4913A176305K5123n2194J8432M8176l8316J0704p07M2237M7076K7492j4508K4915
4901A314735J28255J760j06302q069r5M070N2375l4580O027J0597l1642k4508
$$ plain form
4889 1312623 1333758 1412279 1422229 1408465 1391697 1338298 1427438 1423741 1375371 1392737 1374950 1380398
4877 1380398 1265482 1239753 1308094 1360225 1326847 1354374 1411528 1450886 1521866 1515816 1488311
4866 1488311 1544277 1506590 1488492 1540810 1604998 1551540 1523158 1543999 1608694 1627818 1719893
4855 1719893 1804046 1848783 1936230 2023885 2156487 2293974 2366378 2429579 2506116 2594429 2586537
4844 2586537 2627073 2659279 2754285 2854258 2851501 2836503 2919646 2816244 2801398 2801308 2745275 2739339
4832 2739339 2774807 2814218 2942064 3130881 3282235 3435049 3590212 3832959 4190708 4695540
4822 4695540 5505867 6899089 8898559 11444989 13583590 14403117 13882331 12868260 11623282
4813 11623282 10490569 9290537 8256843 7167673 6091494 5111892 4341541 3908538 3651884
$$ packed form
4889A312623K1135P8521R950j3764j6768n3399Q9140l697m8370J7366j7787N448
4877A380398j14916k5729O8341N2131l3378K7527N7154L9358P0980o050k7505
4866A488311N5966l7687j8098N2318O4188n3458k8382K0841O4695J9124R2075
4855A719893Q4153M4737Q7447Q7655J32602J37487P2404O3201P6537Q8313p892
4844B586537M0536L2206R5006R9973k757j4998Q3143j03402j4846r0n6033n936
4832B739339L5468L9411J27846J88817J51354J52814J55163K42747L57749N04832
4822D695540Q10327J393222J999470K546430K138601Q19527n20786j014071j244978
4813A1623282j132713j200032j033694j089170j076179r79602p70351m33003k56654
$$ plain form
4804 3651884 3480386 3305375 3151240 3016776 2942714 2799120 2782533 2701384 2666187 2689371
4794 2689371 2622290 2647368 2583752 2582944 2566049 2609143 2607024 2565361 2672220 2697586 2651263 2628435
4782 2628435 2648632 2679117 2674345 2709080 2783765 2826524 2866325 2873821 2897259 2898686 2870172 2839851
4770 2839851 2839391 2762605 2718467 2707521 2663149 2695138 2779084 2738736 2765564 2765653 2710905 2775844
4758 2775844 2773191 2727284 2697263 2733860 2749395 2734338 2751766 2774861 2803815 2789643 2804987 2867989
4746 2867989 2801168 2777637 2789745 2803344 2821906 2837137 2854360 2859596 2854185 2888549 2948003 2952422
4734 2952422 2983915 2985243 2933720 2934172 2949625 3011706 3079356 3055245 3024843 3048488 3078154 3128187
4722 3128187 3146625 3141852 3272183 3307826 3284305 3214654 3293867 3312622 3314264 3346470 3363232 3397359
$$ packed form
4804C651884j71498j75011j54135j34464p4062j43594j6587q1149l5197K3184
4794B689371o7081K5078o3616q08j6895M3094k119m1663J06859K5366m6323k2828
4782B628435K0197L0485m772L4735P4685M2759L9801P496K3438J427k8514l0321
4770B839851m60p6786m4138j0946m4372L1989Q3946m0348K6828Q9n4748O4939
4758B775844k653m5907l0021L6597J5535j5057J7428K3095K8954j4172J5344O3002
4746B867989o6821k3531J2108J3599J8562J5231J7223N236n411L4364N9454M419
4734B952422L1493J328n1523M52J5453O2081O7650k4111l0402K3645K9666N0033
4722C128187J8438m773J30331L5643k3521o9651P9213J8755J642L2206J6762L4127
$$ plain form
4710 3397359 3355171 3412528 3389209 3407108 3475438 3529788 3576707 3567243 3638316 3655185 3704444 3663070
4698 3663070 3659797 3794845 3810199 3771455 3753469 3793969 3827876 3820651 3890163 4004098 4017574
4687 4017574 3977845 3987167 4104256 4116537 4127381 4141086 4180282 4204439 4223094 4278005 4286799 4343033
4675 4343033 4458016 4502269 4523798 4603706 4625397 4591495 4615720 4632761 4591541 4672164 4781728
4664 4781728 4874142 4940930 5022662 5030903 4983080 5061000 5057846 5048751 5108363 5134184 5160150 5160760
4652 5160760 5190772 5302957 5284392 5357918 5465903 5489161 5531188 5625745 5708681 5776852 5847612
4641 5847612 5894338 5957787 6027245 6102833 6174421 6259714 6363162 6529445 6646659 6843668 7092276
4630 7092276 7350659 7616540 8187628 9033362 9938494 10495119 10578253 10472694 10172758 9967149
$$ packed form
4710C397359m2188N7357k3319J7899O8330N4350M6919r464P1073J6869M9259m1374
4698C663070l273J35048J5354l8744j7986M0500L3907p225O9512J13935J3476
4687D017574l9729R322J17089J2281J0844J3705L9196K4157J8655N4911Q794N6234
4675D343033J14983M4253K1529P9908K1691l3902K4225J7041m1220Q0623J09564
4664D781728R2414O6788Q1732Q241m7823P7920l154r095N9612K5821K5966O10
4652E160760L0012J12185j8565P3526J07985K3258M2027R4557Q2936O8171P0760
4641E847612M6726O3449O9458P5588P1588Q5293J03448J66283J17214J97009K48608
4630G092276K58383K65881N71088Q45734R05132N56625Q3134j05559k99936k05609
$$ plain form
4620 9967149 9639075 9365688 9218607 8994398 8846847 8778672 8777608 8920780 9163444 9501867
4610 9501867 9895220 10341877 10748669 11131281 11530049 11740250 12015252 12464519 13051039 13777253
4600 13777253 14451161 14925236 15241660 15422016 15617974 15833932 16222001 16822646 17511782
4591 17511782 17980676 18208107 18134636 17860875 17609019 17409034 17366984 17439212 17466833 17282729
4581 17282729 16989313 16626432 16147423 15773089 15520052 15268791 15066917 14827358 14534215
4572 14534215 14265446 13974167 13704279 13415085 13257755 13144282 13100323 13010781 12885423 12829621
4562 12829621 12793933 12767582 12879617 12893172 12950329 13116652 13251653 13340320 13449762 13598422
4552 13598422 13602698 13640578 13736226 13819215 13881125 13958131 14049500 14168209 14191971 14273218 14352069
$$ packed form
4620I967149l28074k73387j47081k24209j47551o8175j064J43172K42664L38423
4610I501867L93353M46657M06792L82612L98768K10201K75002M49267N86520P26214
4600A3777253O73908M74075L16424J80356J95958K15958L88069O00645O89136
4591A7511782M68894K27431p3471k73761k51856j99985m2050P2228K7621j84104
4581A7282729k93416l62881m79009l74334k53037k51261k01874k39559k93143
4572A4534215k68769k91279k69888k89194j57330j13473m3959q9542j25358n5802
4562A2829621l5688k6351J12035J3555N7157J66323J35001Q8667J09442J48660
4552A3598422M276L7880R5648Q2989O1910P7006R1369J18709K3762Q1247P8851
$$ plain form
4541 14352069 14451055 14641172 14680098 14840251 15034950 15074525 15247138 15328887 15418871 15516544
4531 15516544 15682329 15908325 16055489 16246185 16441001 16634602 16878746 17061938 17383059
4522 17383059 17749701 18087766 18422540 18795817 19344052 20041398 20978218 22362043 23887113
4513 23887113 25236780 26005770 26378108 26497049 26343793 26219502 26389395 26777525 27677326
4504 27677326 29270203 31532509 33588632 34713809 35081772 34593640 33574238 32546865
4496 32546865 31592281 30924607 30440247 30246704 30458851 30897962 31163656 31125860 30965340 30408995
4486 30408995 29763294 29235160 28719782 28271139 27835184 27458107 27222847 27152998 27138845 27256386
4476 27256386 27334629 27459984 27631133 27713239 27926336 28203830 28406145 28554351 28802755 29103619
$$ packed form
4541A4352069R8986J90117L8926J60153J94699L9575J72613Q1749Q9984R7673
4531A5516544J65785K25996J47164J90696J94816J93601K44144J83192L21121
4522A7383059L66642L38065L34774L73277N48235O97346R36820J383825J525070
4513B3887113J349667P68990L72338J18941j53256j24291J69893L88130Q99801
4504B7677326J592877K262306K056123J125177L67963m88132j019402j027373
4496C2546865r54584o67674m84360j93543K12147M39111K65694l7796j60520n56345
4486C0408995o45701n28134n15378m48643m35955l77077k35260o9849j4153J17541
4476B7256386P8243J25355J71149Q2106K13097K77494K02315J48206K48404L00864
$$ plain form
4466 29103619 29390128 29600086 29830805 30034773 30322177 30555660 30810607 31051260 31264909
4457 31264909 31504334 31705768 31994831 32376777 32631219 32827224 33013918 33285453 33520877
4448 33520877 33779977 34015000 34243802 34453706 34648633 34978454 35227423 35432964 35733111
4439 35733111 36002919 36210804 36512892 36789017 36960818 37144185 37364345 37642529 37780397
4430 37780397 37830515 37901947 38003255 38013911 37970836 37986600 38056302 38028481 38001519 38051162 38108132
4419 38108132 38139136 38166074 38106556 38172893 38248215 38243854 38275701 38208247 38161229 38152887 38113667 38077585
4407 38077585 38006816 38007067 37995760 37954851 37854737 37808950 37719575 37608524 37542564 37489172 37359359
4396 37359359 37177134 37055642 36936378 36895611 36688317 36496009 36349270 36198028 36022792 35849319
$$ packed form
4466B9103619K86509K09958K30719K03968K87404K33483K54947K40653K13649
4457C1264909K39425K01434K89063L81946K54442J96005J86694K71535K35424
4448C3520877K59100K35023K28802K09904J94927L29821K48969K05541L00147
4439C5733111K69808K07885L02088K76125J71801J83367K20160K78184J37868
4430C7780397N0118P1432J01308J0656m3075J5764O9702k7821k6962M9643N6970
4419C8108132L1004K6938n9518O6337P5322m361L1847o7454m7018q342l9220l6082
4407C8077585p0769K51j1307m0909j00114m5787q9375j11051o5960n3392j29813
4396C7359359j82225j21492j19264m0767k07294j92308j46739j51242j75236j73473
$$ plain form
4386 35849319 35607246 35491273 35254111 35018843 34848510 34585306 34395377 34125232 33978493
4377 33978493 33797039 33474778 33303406 33094248 32831434 32595432 32385579 32106314 31847656
4368 31847656 31598263 31319115 31049934 30793882 30561988 30397205 30112672 29853130 29565932
4359 29565932 29259449 29007527 28779100 28607551 28408793 28129069 27850708 27565360 27265145
4350 27265145 27096031 26833881 26605585 26353167 26133379 25901150 25666587 25430200 25145511
4341 25145511 24906040 24593804 24291934 24054933 23879744 23607235 23331492 23061453 22857131
4332 22857131 22654387 22333767 22140839 21913017 21672120 21507531 21275401 21054306 20833324
4323 20833324 20630855 20431442 20254069 20015615 19819512 19601013 19412691 19244711 19024287
$$ packed form
4386C5849319k42073j15973k37162k35268j70333k63204j89929k70145j46739
4377C3978493j81454l22261j71372k09158k62814k36002k09853k79265k58658
4368C1847656k49393k79148k69181k56052k31894j64783k84533k59542k87198
4359B9565932l06483k51922k28427j71549j98758k79724k78361k85348l00215
4350B7265145j69114k62150k28296k52418k19788k32229k34563k36387k84689
4341B5145511k39471l12236l01870k37001j75189k72509k75743k70039k04322
4332B2857131k02744l20620j92928k27822k40897j64589k32130k21095k20982
4323B0833324k02469j99413j77373k38454j96103k18499j88322j67980k20424
$$ plain form
4314 19024287 18777825 18625656 18456934 18299446 18151458 17922843 17756588 17567275 17457447
4305 17457447 17294651 17210104 17039680 16806641 16638411 16609153 16479503 16284394 16139715 16033418
4295 16033418 15961524 15842175 15641891 15510747 15381084 15244611 15095225 14992578 14943958 14809077
4285 14809077 14628060 14515077 14405366 14279951 14116003 13990808 13967511 13862201 13736100 13685780
4275 13685780 13600580 13527958 13458071 13360838 13304024 13258117 13091143 12952896 12851122 12790375 12596824
4264 12596824 12520798 12469791 12351996 12312281 12273780 12251751 12195088 12113625 11983794 11942020 11798462
4253 11798462 11744541 11751433 11818572 11729619 11636373 11506813 11498716 11485022 11433750 11395353 11422351
4242 11422351 11373562 11342476 11345391 11342468 11233935 11204497 11218061 11193881 11185944 11226061 11201757 11179174
$$ packed form
4314A9024287k46462j52169j68722j57488j47988k28615j66255j89313j09828
4305A7457447j62796q4547j70424k33039j68230k9258j29650j95109j44679j06297
4295A6033418p1894j19349k00284j31144j29663j36473j49386j02647m8620j34881
4285A4809077j81017j12983j09711j25415j63948j25195k3297j05310j26101n0320
4275A3685780q5200p2622o9887r7233n6814m5907j66974j38247j01774o0747j93551
4264A2596824p6026n1007j17795l9715l8501k2029n6663q1463j29831m1774j43558
4253A1798462n3921O892O7139q8953r3246j29560q097j3694n1272l8397K6998
4242A1422351m8789l1086K915k923j08533k9438J3564k4180p937M0117k4304k2583
$$ plain form
4230 11179174 11198444 11170370 11213369 11345333 11415811 11399432 11447081 11475316 11516077 11601032 11723112
4219 11723112 11703322 11801472 11955408 12053599 12171928 12319525 12449294 12574378 12745685 12857970
4209 12857970 13070027 13296120 13501552 13799559 14155015 14513648 14856734 15267122 15732707
4200 15732707 16235913 16752757 17300744 17867710 18455614 19098198 19805324 20515096 21305511
4191 21305511 22182900 23191198 24183034 25192841 26347662 27555412 28864070 30234141
4183 30234141 31669077 33192684 34786987 36431525 38153034 40053318 41958493 43959436
4175 43959436 46053080 48248323 50540241 53056874 55671312 58398043 61265035 64222250
4167 64222250 67250289 70264020 73257086 76303498 79295412 82398196 85478169 88743664
$$ packed form
4230A1179174J9270k8074M2999J31964P0478j6379M7649K8235M0761Q4955J22080
4219A1723112j9790R8150J53936R8191J18329J47597J29769J25084J71307J12285
4209A2857970K12057K26093K05432K98007L55456L58633L43086M10388M65585
4200A5732707N03206N16844N47987N66966N87904O42584P07126P09772P90415
4191B1305511Q77389J008298R91836J009807J154821J207750J308658J370071
4183C0234141J434936J523607J594303J644538J721509J900284J905175K000943
4175D3959436K093644K195243K291918K516633K614438K726731K866992K957215
4167F4222250L028039L013731K993066L046412K991914L102784L079973L265495
$$ plain form
4159 88743664 92107695 95543657 99180232 102821640 106462111 110033784 113427378 116633270
4151 116633270 119738876 122535634 124974534 127357513 129508501 131505737 133423212 135292542
4143 135292542 137197006 138938266 140585391 142015446 143191585 143874541 143966651 143605704 142846231
4134 142846231 141788539 140373605 138706614 136878706 134892710 132841462 130616948 128413814
4126 128413814 126098215 123608486 120772167 117756325 114512412 110871917 107044970 102993076
4118 102993076 98844060 94728492 90566096 86557020 82637528 78828788 75156238 71666188
4110 71666188 68321220 64981000 61702798 58462204 55243951 52023062 48927015 45942005
4102 45942005 43041515 40350282 37752790 35392289 33190481 31194119 29388026 27754666
$$ packed form
4159H8743664L364031L435962L636575L641408L640471L571673L393594L205892
4151A16633270L105606K796758K438900K382979K150988J997236J917475J869330
4143A35292542J904464J741260J647125J430055J176139O82956R2110l60947p59473
4134A42846231j057692j414934j666991j827908j985996k051248k224514k203134
4126A28413814k315599k489729k836319l015842l243913l640495l826947m051894
4118A02993076m149016m115568m162396m009076l919492l808740l672550l490050
4110G1666188l344968l340220l278202l240594l218253l220889l096047k985010
4102D5942005k900490k691233k597492k360501k201808j996362j806093j633360
$$ plain form
4094 27754666 26239735 24827030 23499579 22263750 21185778 20084261 19127291 18214728
4086 18214728 17438091 16706044 16045669 15478154 14941328 14365528 13925042 13540455 13181214
4077 13181214 12809014 12464847 12168234 11914373 11662465 11484016 11249814 11047056 10843102
4068 10843102 10616789 10478329 10351878 10203066 10020318 9997971 9881701 9734469 9626242 9506536
4058 9506536 9357320 9268295 9183556 9082825 9045311 8959213 8901798 8864042 8832898 8807372 8810427
4047 8810427 8775355 8742647 8719873 8674731 8601597 8499314 8411861 8350296 8283459 8143832 8096310
4036 8096310 8017914 7945411 7905961 7836518 7717941 7633893 7518034 7445691 7250904 7179996 7063772
4025 7063772 6932155 6819484 6656086 6528766 6392893 6307617 6207484 6118760 5955619 5864287
$$ packed form
4094B7754666j514931j412705j327451j235829j077972j101517r56970r12563
4086A8214728p76637p32047o60375n67515n36826n75800m40486l84587l59241
4077A3181214l72200l44167k96613k53861k51908j78449k34202k02758k03954
4068A0843102k26313j38460j26451j48812j82748k2347j16270j47232j08227j19706
4058I506536j49216q9025q4739j00731l7514q6098n7415l7756l1144k5526L055
4047H810427l5072l2708k2774m5142p3134j02283q7453o1565o6837j39627m7522
4036H096310p8396p2503l9450o9443j18577q4048j15859p2343j94787p0908j16224
4025G063772j31617j12671j63398j27320j35873q5276j00133q8724j63141r1332
$$ plain form
4015 5864287 5841241 5818115 5765485 5585780 5578935 5534183 5517738 5514362 5434876 5426340 5388348 5382438
4003 5382438 5414346 5425786 5461721 5508894 5566872 5664050 5711813 5749125 5798744 5850450 5906586
3992 5906586 5852922 5794920 5796853 5834067 5880995 5902002 5937836 6039992 6146825 6224661 6193451
3981 6193451 6326151 6507521 6636033 6680741 6713435 6827387 6902411 6930957 6898395 6914958 6937528
3970 6937528 6938106 6893691 6868769 6763809 6733772 6669116 6665283 6694168 6740714 6774348 6771926 6734325
3958 6734325 6654130 6566582 6531936 6405868 6304192 6211083 6150244 6065720 5914560 5803739 5775847
3947 5775847 5724737 5773409 5787072 5961847 6251653 6651184 7058814 7376309 7490040 7411867
3937 7411867 7357948 7364515 7315975 7350135 7402526 7369407 7386953 7383975 7372484 7440556 7442348 7434902
$$ packed form
4015E864287k3046k3126n2630j79705o845m4752j6445l376p9486q536l7992n910
4003E382438L1908J1440L5935M7173N7978R7178M7763L7312M9619N1706N6136
3992E906586n3664n8002J933L7214M6928K1007L5834J02156J06833P7836l1210
3981F193451J32700J81370J28512M4708L2694J13952P5024K8546l2562J6563K2570
3970F937528N78m4415k4922j04960l0037o4656l833K8885M6546L3634k422l7601
3958F734325q0195q7548l4646j26068j01676r3109o0839q4524j51160j10821k7892
3947E775847n1110M8672J3663J74775K89806L99531M07630L17495J13731p8173
3937G411867n3919O567m8540L4160N2391l3119J7546k978j1491O8072J792p446
$$ plain form
3925 7434902 7501769 7593886 7609471 7541030 7638991 7694717 7807520 7843012 7959419 8080511 8152844
3914 8152844 8302454 8429180 8524009 8863581 9200235 9386056 9296878 9109436 8871833 8670103
3904 8670103 8580166 8448644 8229797 8063259 7883440 7703003 7685932 7685597 7680245 7624591 7662213
3893 7662213 7706690 7766903 7776980 7801632 7845170 7841605 7869236 7863975 7911757 7999189 8123958 8195096
3881 8195096 8263267 8334897 8377464 8418026 8569259 8674552 8721091 8813625 8966618 9179367 9294443
3870 9294443 9526498 9776603 10024266 10181257 10371174 10678283 11047130 11363637 11681164 12014231
3860 12014231 12408511 12879555 13329809 13698344 14148252 14587984 15000084 15449732 15924578
3851 15924578 16393902 16898834 17364552 17858053 18444691 19021379 19588228 20293855 21065733
$$ packed form
3925G434902O6867R2117J5585o8441R7961N5726J12803L5492J16407J21092P2333
3914H152844J49610J26726R4829L39572L36654J85821q9178j87442k37603k01730
3904H670103q9937j31522k18847j66538j79819j80437j7071l35n352n5654L7622
3893G662213M4477O0213J0077K4652M3538l565K7631n261M7782Q7432J24769P1138
3881H195096O8171P1630M2567M0562J51233J05293M6539R2534J52993K12749J15076
3870I294443K32055K50105K47663J56991J89917L07109L68847L16507L17527L33067
3860A2014231L94280M71044M50254L68535M49908M39732M12100M49648M74846
3851A5924578M69324N04932M65718M93501N86638N76688N66849P05627P71878
$$ plain form
3842 21065733 21836370 22726187 23710911 24701054 25693293 26755789 27721148 28735016 29679994
3833 29679994 30561621 31398372 32109252 32822859 33534071 34139318 34828173 35623328 36511543
3824 36511543 37330246 38168974 39059680 39793981 40413398 40893230 41128247 41210231 41149635 40965730
3814 40965730 40676431 40471129 40320722 40325576 40508710 40862271 41361359 41947202 42738576 43635820
3804 43635820 44612230 45712441 46964384 48392515 49900619 51516623 53410894 55568473
3796 55568473 57942287 60675532 63878753 67476932 71481687 76153737 81435953 87266238
3788 87266238 93568500 100447011 107860934 115724944 124050753 132699988 141592290 150614030
3780 150614030 159775852 168960640 178218123 187560772 197259450 207487944 218360799 230088448
$$ packed form
3842B1065733P70637Q89817R84724R90143R92239J062496R65359J013868R44978
3833B9679994Q81627Q36751P10880P13607P11212O05247O88855P95155Q88215
3824C6511543Q18703Q38728Q90706P34301O19417M79832K35017Q1984o0596j83905
3814D0965730k89299k05302j50407M854J83134L53561M99088N85843P91374Q97244
3804D3635820R76410J100211J251943J428131J508104J616004J894271K157579
3796E5568473K373814K733245L203221L598179M004755M672050N282216N830285
3788H7266238O302262O878511P413923P864010Q325809Q649235Q892302R021740
3780A50614030R161822R184788R257483R342649R698678J0228494J0872855J1727649
$$ plain form
3772 230088448 242740457 256398099 270978930 286381908 302253567 317939530 332980470
3765 332980470 346847961 358991208 368999283 376569014 381782371 384880323 386274361 386466288
3757 386466288 386098968 385484525 384987603 384626350 384104923 383213872 381654359 379271719 375536884
3748 375536884 370000647 362279226 352038018 339448301 324810665 308641458 291377599
3741 291377599 273876087 256721851 240454070 225341132 211609002 199242370 188058523
3734 188058523 177883349 168406915 159438280 150577660 141663564 132772636 124094409 115797059
3726 115797059 108006922 100965537 94695135 89175680 84494359 80529169 77475209 75176670
3718 75176670 73543495 72530737 72151979 72273197 72920589 74082533 75622495 77297321 79175352
$$ packed form
3772B30088448J2652009J3657642J4580831J5402978J5871659J5685963J5040940
3765C32980470J3867491J2143247J0008075P569731N213357L097952J394038J91927
3757C86466288l67320o14443m96922l61253n21427q91051j559513k382640l734835
3748C75536884n536237p721421j0241208j2589717j4637636j6169207j7263859
3741B91377599j7501512j7154236j6267781j5112938j3732130j2366632j1183847
3734A88058523j0175174r476434q968635q860620q914096q890928q678227q297350
3726A15797059p790137p041385o270402n519455m681321l965190l053960k298539
3718G5176670j633175j012758l78758J21218O47392J161944J539962J674826J878031
$$ plain form
3709 79175352 81298880 83754971 86558816 89692521 93345881 97800055 103271842 109910058
3701 109910058 118033957 127958406 140040722 154742363 172637716 194392919 220624136
3694 220624136 250883632 284060118 318562858 352273231 382886915 408446845 427659818
3687 427659818 440034559 446126814 447426501 445278521 441201634 436769587 433131043 431176503
3679 431176503 431178970 432829141 435031977 436296968 434426658 427582479 414881740 396067977
3671 396067977 371608609 342765089 311223807 278873458 247238314 217558773 190503380
3664 190503380 166581120 145842509 128258609 113463680 101150684 91022675 82619947
3657 82619947 75423594 69409585 64285751 59821933 56116908 52839338 50087337 47738501
$$ packed form
3709G9175352K123528K456091K803845L133705L653360M454174N471787O638216
3701A09910058Q123899R924449J2082316J4701641J7895353K1755203K6231217
3694B20624136L0259496L3176486L4502740L3710373L0613684K5559930J9212973
3687D27659818J2374741O092255J299687k147980m076887m432047l638544j954540
3679D31176503K467J650171K202836J264991j870310o844179j2700739j8813763
3671C96067977k4459368k8843520l1541282l2350349l1635144k9679541k7055393
3664A90503380k3922260k0738611j7583900j4794929j2312996j0128009q402728
3657H2619947p196353o014009n123834m463818l705025l277570k752001k348836
$$ plain form
3649 47738501 45641119 43797702 42223633 40857049 39558796 38276400 37149209 36173988
3641 36173988 35225965 34234634 33340364 32557989 31693385 30938080 30229562 29560298 28914351
3632 28914351 28306888 27648922 27052297 26398805 25769167 25112338 24566221 24052578 23621610
3623 23621610 23096954 22580056 22070587 21568932 21144921 20612125 19989543 19373306 18805591
3614 18805591 18311226 17896329 17454543 17059722 16611152 16168090 15755367 15410097 15012010
3605 15012010 14763176 14407921 14100887 13770609 13428288 13114424 12832622 12558281 12330763
3596 12330763 12166617 11906926 11683042 11540177 11332290 11179132 11017032 10898522 10709341
3587 10709341 10535490 10471600 10428333 10338750 10328799 10337343 10331039 10300739 10285491 10202346 10152646 10073976
$$ packed form
3649D7738501k097382j843417j574069j366584j298253j282396j127191r75221
3641C6173988r48023r91331q94270p82375q64604p55305p08518o69264o45947
3632B8914351o07463o57966n96625o53492o29638o56829n46117n13643m30968
3623B3621610n24656n16898n09469n01655m24011n32796o22582o16237n67715
3614A8805591m94365m14897m41786l94821m48570m43062m12723l45270l98087
3605A5012010k48834l55255l07034l30278l42321l13864k81802k74341k27518
3596A2330763j64146k59691k23884j42865k07887j53158j62100j18510j89181
3587A0709341j73851o3890m3267q9583r951Q544o304l0300j5248q3145m9700p8670
$$ plain form
3575 10073976 10110717 10077660 10075804 10099672 10117970 10149320 10240275 10375021 10665166 10928800 11042700
3564 11042700 11045027 10957769 10755443 10502594 10229738 9937023 9709435 9374643 9072194 8976261
3554 8976261 8783144 8605199 8506657 8442937 8294622 8208314 8195261 8183400 8095884 8065737 8041075
3543 8041075 8126962 8193095 8287241 8463437 8686260 8987974 9156795 9150983 9132129 8995189 8798033
3532 8798033 8640223 8349963 8134797 7997684 7879403 7774430 7735376 7599277 7496685 7424379
3522 7424379 7370453 7323094 7316959 7279654 7202335 7121118 7043158 6953595 6996157 7034778 7033566 7112799
3510 7112799 7166438 7191034 7281243 7354923 7411143 7383644 7448059 7484934 7498940 7504628 7555723 7607017
3498 7607017 7774445 7813950 7885759 8014610 8202217 8325199 8378409 8418031 8446709 8541703 8658620
$$ packed form
3575A0073976L6741l3057j856K3868J8298L1350R0955J34746K90145K63634J13900
3564A1042700K327q7258k02326k52849k72856k92715k27588l34792l02449r5933
3554H976261j93117j77945r8542o3720j48315q6308j3053j1861q7516l0147k4662
3543H041075Q5887O6133R4146J76196K22823L01714J68821n812j8854j36940j97156
3532H798033j57810k90260k15166j37113j18281j04973l9054j36099j02592p2306
3522G424379n3926m7359o135l7305p7319q1217p7960q9563M2562L8621j212P9233
3510G112799N3639K4596R0209P3680N6220k7499O4415L6875J4006N688N1095N1294
3498G607017J67428L9505P1809J28851J87607J22982N3210L9622K8678R4994J16917
$$ plain form
3487 8658620 8757399 8864515 8976735 9058188 9082247 9230156 9382096 9518071 9712002 9930924
3477 9930924 10118617 10285494 10416108 10490255 10572966 10718413 10738803 10858662 11010108 11147858
3467 11147858 11313216 11421373 11586238 11777867 11907857 12190082 12517854 12861472 13251800
3458 13251800 13600261 13900079 14190879 14518609 14829499 15132900 15557120 15900367 16341958
3449 16341958 16861474 17367639 17872888 18459547 18997375 19579373 20096675 20571374 20991718
3440 20991718 21328829 21421069 21231393 20946965 20512464 19910538 19163010 18340947 17460382 16569118
3430 16569118 15753708 15049977 14362133 13720671 13161136 12639512 12130865 11681193 11262545
3421 11262545 11031426 10759440 10555688 10512558 10362798 10171677 10045636 9913990 9817088 9594006
$$ packed form
3487H658620R8779J07116J12220Q1453K4059J47909J51940J35975J93931K18922
3477I930924J87693J66877J30614P4147Q2711J45447K0390J19859J51446J37750
3467A1147858J65358J08157J64865J91629J29990K82225L27772L43618L90328
3458A3251800L48461K99818K90800L27730L10890L03401M24220L43247M41591
3449A6341958N19516N06165N05249N86659N37828N81998N17302M74699M20344
3440B0991718L37111R2240j89676k84428m34501o01926p47528q22063q80565q91264
3430A6569118q15410p03731o87844o41462n59535n21624n08647m49672m18648
3421A1262545k31119k71986k03752m3130j49760j91121j26041j31646r6902k23082
$$ plain form
3411 9594006 9412833 9458420 9447030 9462703 9478677 9480341 9547960 9533566 9580370 9646156 9806862
3400 9806862 9811986 9793362 9806211 9739803 9729990 9751632 9748164 9775832 9802475 9853157 9905481 9892638
3388 9892638 9880008 9859026 9811673 9840737 9823453 9818662 9642862 9431921 9243560 9051410 8799517
3377 8799517 8675217 8608448 8505531 8359194 8343108 8271216 8199102 8052717 7928494 7825184
3367 7825184 7759473 7710193 7788295 7942996 8062470 8137585 8248922 8344460 8473013 8612844
3357 8612844 8807783 8949397 9005756 9013092 9312292 9682967 10277556 11064533 11761294 12061791
3347 12061791 12044981 11915514 11602871 11333662 11014611 10675194 10366840 10153150 9914619 9710375
3337 9710375 9789900 9860867 10072824 10416394 10944440 11378629 11753772 12005091 12133384 12198476
$$ packed form
3411I594006j81173M5587j1390J5673J5974J664O7619j4394M6804O5786J60706
3400I806862N124j8624J2849o6408r813K1642l468K7668K6643N0682N2324j2843
3388I892638j2630k0982m7353K9064j7284m791j75800k10941j88361j92150k51893
3377H799517j24300o6769j02917j46337j6086p1892p2114j46385j24223j03310
3367G825184o5711m9280P8102J54701J19474P5115J11337R5538J28553J39831
3357H612844J94939J41614N6359P336K99200L70675N94589P86977O96761L00497
3347A2061791j6810j29467l12643k69209l19051l39417l08354k13690k38531k04244
3337I710375P9525P0967K11957L43570N28046M34189L75143K51319J28293O5092
$$ plain form
3327 12198476 12368127 12608532 12983081 13440297 14115110 14854090 15369844 15614279 15705705 15730285
3317 15730285 15638409 15513229 15420606 15218537 14978849 14879230 14914561 15130704 15559191 16333256
3307 16333256 17184656 18054768 18945947 19874173 20818825 22017081 23640816 25839578 28072090
3298 28072090 30435329 32991224 36063083 39859174 44579555 50049471 56659685 64824718
3290 64824718 76118970 93823045 123678492 170094123 232926253 296572087 334119055
3283 334119055 338128834 323925844 296213158 263127583 231725574 200747390 170999401
3276 170999401 142064118 115777547 94704800 80485973 71426363 66295833 63115717
3269 63115717 61695875 61357862 62359737 64368400 67700519 72246440 79087476 90083481
$$ packed form
3327A2198476J69651K40405L74549M57216O74813P38980N15754K44435R1426K4580
3317A5730285r1876j25180r2623k02069k39688r9619L5331K16143M28487P74065
3307A6333256Q51400Q70112Q91179R28226R44652J198256J623735K198762K232512
3298B8072090K363239K555895L071859L796091M720381N469916O610214Q165033
3290F4824718J1294252J7704075K9855447M6415631O2832130O3645834L7546968
3283C34119055M009779j4202990k7712686l3085575l1402009l0978184k9747989
3276A70999401k8935283k6286571k1072747j4218827r059610n130530l180116
3269F3115717j419842l38013J001875K008663L332119M545921O841036J0996005
$$ plain form
3261 90083481 109435631 142348577 192324760 255666607 311497755 336180785 332166116
3254 332166116 312845958 281396641 248207743 216255868 185197144 155194283 126517858
3247 126517858 101230616 81611434 68203777 59208945 52832967 47658688 43395834 39451652
3239 39451652 36004074 33110730 30667866 28361475 26724190 25400959 24304061 23282299
3231 23282299 22582189 21746124 21088599 20450860 19943894 19319246 18724966 18084707 17469118
3222 17469118 16820281 16388719 15934176 15543807 15233000 14896988 14471178 14218678 14068667
3213 14068667 13847142 13569477 13284211 12855328 12586309 12291827 12003539 11707628 11593845
3204 11593845 11438832 11338559 11241269 11067116 10790172 10516288 10286356 10084231 9815394 9533113
$$ packed form
3261I0083481J9352150L2912946M9976183O3341847N5831148K4683030m014669
3254C32166116j9320158l1449317l3188898l1951875l1058724l0002861k8676425
3247A26517858k5287242j9619182j3407657q994832o375978n174279m262854l944182
3239C9451652l447578k893344k442864k306391j637285j323231j096898j021762
3231B3282299p00110q36065o57525o37739n06966o24648n94280o40259o15589
3222A7469118o48837m31562m54543l90369l10807l36012m25810k52500j50011
3213A4068667k21525k77665k85266m28883k69019k94482k88288k95911j13783
3204A1593845j55013j00273r7290j74153k76944k73884k29932k02125k68837k82281
$$ plain form
3194 9533113 9245864 9055155 8973276 8953422 8914798 8831067 8790934 8623358 8388998 8196308
3184 8196308 8097713 7950633 7817154 7757542 7714621 7592515 7455953 7425896 7392798 7451717 7558654
3173 7558654 7482377 7425531 7359447 7218114 7046383 6928498 6834867 6871391 6756490 6681690 6809098
3162 6809098 6842687 6857691 6859315 6812206 6723617 6637818 6644962 6760944 6845023 6863006 6847017 6821411
3150 6821411 6886458 6911759 7051693 7195191 7397531 7498600 7519202 7476419 7510886 7583800 7733954
3139 7733954 7785229 7750699 7858772 7869710 7773846 7727807 7675858 7689336 7673200 7605612 7531636
3128 7531636 7545262 7521084 7466285 7434697 7393877 7443781 7480073 7612408 7828855 8033942 8144484
3117 8144484 8356332 8593951 8916775 9284543 9623249 9918404 10132224 10233363 10255542 10173104
$$ packed form
3194I533113k87249j90709q1879j9854l8624q3731m0133j67576k34360j92690
3184H196308r8595j47080j33479n9612m2921j22106j36562l0057l3098N8919J06937
3173G558654p6277n6846o6084j41333j71731j17885r3631L6524j14901p4800J27408
3162F809098L3589J5004J624m7109q8589q5799P144J15982Q4079J7983j5989k5606
3150F821411O5047K5301J39934J43498K02340J01069K0602m2783L4467P2914J50154
3139G733954N1275l4530J08073J0938r5864m6039n1949J3478j6136o7588p3976
3128G531636J3626k4178n4799l1588m0820M9904L6292J32335K16447K05087J10542
3117H144484K11848K37619L22824L67768L38706K95155K13820J01139K2179q2438
$$ plain form
3107 10173104 10053901 9825151 9577594 9367915 9076763 8767191 8455741 8240116 8091957
3098 8091957 7913856 7770471 7619515 7525458 7610584 7637492 7702197 7826127 7999013 8146829
3088 8146829 8373865 8513483 8657161 8794891 9034153 9198823 9360271 9489779 9551249 9593589
3078 9593589 9547668 9420947 9209237 8905910 8556084 8283146 8009513 7741191 7492367 7278305
3068 7278305 7104650 6856960 6664334 6533160 6467639 6485520 6478934 6460365 6455948 6461438 6423542
3057 6423542 6384427 6396957 6372997 6265039 6246610 6250766 6278793 6190019 6013534 5810267 5693594
3046 5693594 5646777 5571761 5484755 5299040 5087550 4947618 4902416 4700232 4597987 4529766
3036 4529766 4379421 4280451 4245833 4191307 4169223 4149525 4063550 4065096 4029212 3971937 3935057
$$ packed form
3107A0173104j19203k28750k47557k09679k91152l09572l11450k15625j48159
3098H091957j78101j43385j50956r4057Q5126K6908O4705J23930J72886J47816
3088H146829K27036J39618J43678J37730K39262J64670J61448J29508O1470M2340
3078I593589m5921j26721k11710l03327l49826k72938k73633k68322k48824k14062
3068G278305j73655k47690j92626j31174o5521J7881o586j8569m417N490l7896
3057F423542l9115J2530k3960j07958j8429M156K8027q8774j76485k03267j16673
3046E693594m6817p5016q7006j85715k11490j39932m5202k02184j02245o8221
3036D529766j50345r8970l4618n4526k2084j9698q5975J546l5884n7275l6880
$$ plain form
3025 3935057 3946807 3902457 3841498 3785857 3750425 3744401 3657173 3584518 3549851 3524175 3548961 3544908
3013 3544908 3477272 3467191 3407258 3387898 3423195 3395643 3356841 3395607 3478633 3683531 3897656
3002 3897656 4147776 4348015 4466547 4556860 4494999 4357790 4162315 3964948 3831357 3659476
2992 3659476 3395995 3238134 3084337 3005519 2916731 2817560 2761980 2720600 2625085 2678073 2671431
2981 2671431 2674902 2679464 2730929 2826314 2905680 3041720 3258551 3507192 3658099 3757390 3738964
2970 3738964 3630093 3453222 3356445 3204070 3031831 2905811 2740003 2540292 2458637 2354655
2960 2354655 2284180 2307507 2161671 2196066 2190754 2157724 2113270 2040552 2043652 1985995 1932424 1939941
2948 1939941 1885878 1831953 1806239 1848452 1857541 1777672 1807291 1837111 1728215 1717999 1733776
$$ packed form
3025C935057J1750m4350o0959n5641l5432o024q7228p2655l4667k5676K4786m053
3013C544908o7636j0081n9933j9360L5297k7552l8802L8766Q3026K04898K14125
3002C897656K50120K00239J18532R0313o1861j37209j95475j97367j33591j71881
2992C659476k63481j57861j53797p8818q8788r9171n5580m1380r5515N2988o642
2981B671431L471M562N1465R5385P9366J36040K16831K48641J50907R9291j8426
2970C738964j08871j76871r6777j52375j72239j26020j65808j99711q1655j03982
2960B354655p0475K3327j45836L4395n312l3030m4454p2718L100n7657n3571P517
2948A939941n4063n3925k5714M2213R089p9869K9619K9820j08896j0216J5777
$$ plain form
2937 1733776 1738590 1695723 1742416 1704583 1681664 1723278 1713207 1654516 1659626 1634633 1545368 1586908
2925 1586908 1528377 1510578 1556885 1586074 1493487 1439957 1390260 1397265 1451029 1492124 1492773 1563695
2913 1563695 1582016 1593473 1564906 1614138 1551812 1528015 1605327 1579381 1545350 1523883 1504913
2902 1504913 1481736 1458498 1480809 1504115 1489397 1443958 1401814 1406671 1353146 1375520 1352796 1288204
2890 1288204 1295224 1284162 1260246 1272954 1258159 1276340 1320704 1325499 1300823 1305920 1292569 1290505
2878 1290505 1231244 1243307 1228338 1164202 1181097 1181716 1130222 1121729 1144761 1202586 1163081 1128668
2866 1128668 1139226 1114559 1079095 1153208 1149723 1081606 1095099 1052128 1043706 1057042 1077915 1058472
2854 1058472 1128248 1148239 1074695 1027314 1094107 1177255 1131723 1016958 997035 1043089 1082708
$$ packed form
2937A733776M814m2867M6693l7833k2919M1614j0071n8691N110k4993q9265M1540
2925A586908n8531j7799M6307K9189r2587n3530m9697P005N3764M1095O49P0922
2913A563695J8321J1457k8567M9232o2326k3797P7312k5946l4031k1467j8970
2902A504913k3177k3238K2311K3306j4718m5439m2144M857n3525K2374k2724o4592
2890A288204P020j1062k3916J2708j4795J8181M4364M795k4676N097j3351k064
2878A290505n9261J2063j4969o4136J6895O19n1494q493K3032N7825l9505l4413
2866A128668J0558k4667l5464P4113l485o8117J3493m2971q422J3336K0873j9443
2854A058472O9776J9991p3544m7381O6793Q3148m5532j14765j9923M6054L9619
$$ plain form
2843 1082708 1019657 1074713 1150851 1135023 1108479 1134867 1146591 1101194 1108678 1112227 1094253 1140057
2831 1140057 1151211 1100451 1134488 1052469 1046449 1112996 1180584 1202467 1161825 1124355 1116321 1068777
2819 1068777 1042015 1040124 1047497 1040790 992352 1060658 1065124 1039313 1071526 1064051 985425 1037673
2807 1037673 1013334 973643 1005600 978629 1012185 1073710 1061104 1000321 971834 963434 955680 1010700
2795 1010700 1027948 1028244 1040117 1015280 977440 1005160 986094 939259 891823 863154 853478 888876
2783 888876 900807 941953 946241 911871 936509 962410 961390 956668 1010183 994113 913278 982192
2771 982192 939268 899195 881791 911819 919665 925663 977959 1034986 993441 1005077 1012151 929321
2759 929321 913223 862538 963119 929135 897608 956839 923553 893186 915706 890669 919987
$$ packed form
2843A082708o3051N5056P6138j5828k6544K6388J1724m5397P484L549j7974M5804
2831A140057J1154n0760L4037q2019o020O6547O7588K1883m0642l7470q034m7544
2819A068777k6762j891P373o707m8438O8306M466k5811L2213p475p8626N2248
2807A037673k4339l9691L1957k6971L3556O1525j2606o0783k8487q400p754N5020
2795A010700J7248K96J1873k4837l7840K7720j9066m6835m7436k8669r676L5398
2783H88876J1931M1146M288l4370K4638K5901j020m722N3515j6070q0835O8914
2771I82192m2924m0073j7404L0028P846N998N2296N7027m1545J1636P074q2830
2759I29321j6098n0685J00581l3984l1527N9231l3286l0367K2520k5037K9318
$$ plain form
2748 919987 905275 840012 803911 799456 850736 871309 875134 875175 893938 908088 958395 1009543 927726
2735 927726 915280 894119 833653 864503 848633 839224 875014 845369 863609 862250 810558 816826
2723 816826 830569 820661 822867 842940 906218 923380 884094 829925 829592 801502 765778 739469
2711 739469 793826 794799 898028 885234 859014 826550 801414 814379 812582 802776 787964 842651
2699 842651 831251 835732 861225 858028 859445 802835 796845 799774 759154 702208 711422 708405 721939
2686 721939 780785 792697 832775 817107 756265 711996 715063 736686 702037 689526 768361 781168
2674 781168 705169 718640 676071 737255 717904 757415 832301 753915 745049 699585 739983 699454
2662 699454 709059 760386 784884 738423 766268 778223 775404 813182 837535 842530 821776 772801
$$ packed form
2748I19987j4712o5263l6101m455N1280K0573L825M1J8763J4150N0307N1148q1817
2735I27726j2446k1161o0466L0850j5870r409L5790k9645J8240j359n1692O268
2723H16826J3743r908K206K0073O3278J7162l9286n4169l33k8090l5724k6309
2711G39469N4357R73J03229j2794k6220l2464k5136J2965j797r806j4812N4687
2699H42651j1400M481K5493l197J417n6610n990K929m0620n6946R214l017J3534
2686G21939N8846J1912M0078j5668o0842m4269L067K1623l4649j2511P8835J2807
2674G81168p5999J3471m2569O1184j9351L9511P4886p8386q866m5464M0398m0529
2662F99454R605N1327K4498m6461K7845J1955k819L7778K4353M995k0754m8975
$$ plain form
2650 772801 811116 761950 736989 706586 736946 745784 683028 699232 678705 702598 660614 700135
2638 700135 775009 793570 743266 814932 814577 791652 757721 722815 714442 709148 711337 691212 666779
2625 666779 663147 680227 679571 723935 688217 633869 609123 628827 612413 625967 674366 764170
2613 764170 792538 785545 794779 749430 648702 686761 678633 666448 718126 647681 621322 667805
2601 667805 684898 642637 631332 592305 684530 721729 631510 671333 669185 692358 671036 616459
2589 616459 657234 657160 602662 676734 718944 761349 824864 853808 900042 946237 965086 1048780
2577 1048780 1045556 984392 957346 969357 935115 884355 875851 876263 768601 726073 681019 679335
2565 679335 622340 613830 605369 586917 617955 604281 612300 645764 696922 628728 687154 684493
$$ packed form
2650G72801L8315m9166k4961l0403L0360Q838o2756J6204k0527K3893m1984L9521
2638G00135P4874J8561n0304P1666l55k2925l3931l4906q373n294K189k0125k4433
2625F66779l632J7080o56M4364l5718n4348k4746J9704j6414J3554M8399Q9804
2613G64170K8368o993R234m5349j00728L8059q128j2185N1678p0445k6359M6483
2601F67805J7093m2261j1305l9027R2225L7199r0219L9823k148K3173k1322n4577
2589F16459M0775p4n4498P4072M2210M2405O3515K8944M6234M6195J8849Q3694
2577A048780l224o1164k7046J2011l4242n0760q504M12j07662m2528m5054j684
2565F79335n6995q510q461j8452L1038j3674Q019L3464N1158o8194N8426k661
$$ plain form
2553 684493 585616 567776 667709 697075 689055 680075 633657 716377 702153 692585 742927 642592
2541 642592 619529 604678 579033 536257 586448 569753 580445 608944 622377 654719 606336 634276
2529 634276 598068 601192 611539 620398 596317 615654 566079 526015 579025 626631 690481 672917
2517 672917 664084 586696 567396 632861 648721 692748 660061 657415 669868 665249 629175 632566
2505 632566 584096 597693 600832 586543 584305 562414 588932 650474 627001 568355 610257 587060
2493 587060 638483 595461 700492 695793 676011 648307 658429 641586 631869 634798 647269 638872
2481 638872 600127 610243 654227 615052 589763 624949 595972 585804 632387 642106 597402 628812
2469 628812 647634 635618 680413 692046 679910 624059 599196 574039 607166 615732 636224 532252
$$ packed form
2553F84493r8877j7840R9933K9366q020q980m6418Q2720j4224r568N0342j00335
2541F42592k3063j4851k5645m2776N0191j6695J0692K8499J3433L2342m8383K7940
2529F34276l6208L124J0347Q859k4081J9337m9575m0064N3010M7606O3850j7564
2517F72917q833p7388j9300O5465J5860M4027l2687k646J2453m619l6074L391
2505F32566m8470J3597L139j4289k238k1891K6518O1542k3473n8646M1902k3197
2493E87060N1423m3022J05031m699j9782k7704J0122j6843r717K929J2471q397
2481F38872l8745J0116M3984l9175k5289L5186k8977j0168M6583R719m4704L1410
2469F28812J8822j2016M4795J1633j2136n5851k4863k5157L3127Q566K0492j03972
$$ plain form
2457 532252 513073 584055 574915 553650 595215 616810 635388 679442 645712 611058 630868 606874
2445 606874 648158 704239 743060 719773 690383 743975 723880 716171 676973 662527 675667 667585
2433 667585 622438 661589 608950 620242 646758 608336 586754 587585 586572 586745 549352 551551 546651
2420 546651 573336 556838 582243 613447 629092 655573 665597 678532 730242 792926 788477 797177
2408 797177 749412 700151 700570 716108 673301 726663 763093 736766 738617 802581 777508 760903
2396 760903 815046 844374 805704 766851 814363 853335 867546 878183 922848 857815 918730 897358
2384 897358 884120 911616 976741 922678 889199 847199 842358 878512 894087 922610 928176 897905
2372 897905 877930 886850 901257 894856 849616 820485 903156 857677 814193 853560 872089 910324
$$ packed form
2457E32252j9179P0982r140k1265M1565K1595J8578M4054l3730l4654J9810k3994
2445F06874M1284N6081L8821k3287k9390N3592k0095p709l9198j4446J3140q082
2433F67585m5147L9151n2639J1292K6516l8422k1582Q31j013J73l7393K199m900
2420E46651K6685j6498K5405L1204J5645K6481J0024J2935N1710O2684m449Q700
2408G97177m7765m9261M19J5538m2807N3362L6430k6327J851O3964k5073j6605
2396G60903N4143K9328l8670l8853M7512L8972J4211J0637M4665o5033O0915k1372
2384H97358j3238K7496O5125n4063l3479m2000m841L6154J5575K8523N566l0271
2372H97905j9975Q920J4407o401m5240k9131Q2671m5479m3484L9367J8529L8235
$$ plain form
2360 910324 902629 940124 961510 1013597 1136544 1193736 1176741 1162302 1193853 1221109 1255317 1280478
2348 1280478 1315591 1440584 1472413 1574221 1649249 1619442 1656185 1686347 1708768 1830786 1914500
2337 1914500 1975465 2084465 2310666 2579658 2705072 2974529 3205417 3559913 4003371 4601557
2327 4601557 5184677 5650365 5972680 6393900 6887398 7676552 8616951 9913122 11555096
2318 11555096 13843245 17067256 22548036 31065710 43779580 59078469 71089909 75154863
2310 75154863 72655774 67054075 59405518 52460064 45628636 39014241 32430891 26039662
2302 26039662 20316596 16232734 13583930 12089665 11177754 10447494 9706700 8918430 8134542
2293 8134542 7283142 6607125 6148714 5709949 5278953 4955655 4635504 4410283 4185599 3926506
$$ packed form
2360I10324p695L7495K1386N2087J22947N7192j6995j4439L1551K7256L4208K5161
2348A280478L5113J24993L1829J01808P5028k9807L6743L0162K2421J22018Q3714
2337A914500O0965J09000K26201K68992J25414K69457K30888L54496M43458N98186
2327D601557N83120M65688L22315M21220M93498P89154R40399J296171J641974
2318A1555096K288149L224011N480780Q517674J2713870J5298889J2011440M064954
2310G5154863k499089n601699p648557o945454o831428o614395o583350o391229
2302B6039662n723066m083862k648804j494265r11911p30260p40794p88270p83888
2293H134542q51400o76017m58411m38765m30996l23298l20151k25221k24684k59093
$$ plain form
2283 3926506 3823377 3837386 3689284 3469876 3319791 3246312 3092970 2963071 2879038 2848469
2273 2848469 2835107 2784278 2721244 2664408 2643687 2578420 2493596 2516885 2484664 2439823 2383813
2262 2383813 2260742 2194960 2199893 2182030 2194717 2136970 2064954 2012634 1934664 1939708 1936367 1862886
2250 1862886 1777947 1767538 1685039 1653435 1675987 1656971 1673647 1653980 1594389 1528152 1526681 1422650
2238 1422650 1401806 1323600 1311281 1288375 1252563 1275271 1313742 1218610 1249679 1319024 1271247
2227 1271247 1164441 1116520 1132876 1175739 1084113 1027132 1038502 1059729 1098125 1065436 1007843
2216 1007843 974554 953720 1005245 1022503 1048786 1022443 985659 955984 987609 953039 871931
2205 871931 939725 1039348 1024914 961661 982761 1031487 1064036 1008818 966743 902598 869584 893364
$$ packed form
2283C926506j03129J4009j48102k19408j50085p3479j53342j29899q4033l0569
2273B848469j3362n0829o3034n6836k0721o5267q4824K3289l2221m4841n6010
2262B383813j23071o5782M933j7863J2687n7747p2016n2320p7970N044l341p3481
2250A862886q4939j0409q2499l1604K2552j9016J6676j9667n9591o6237j471j04031
2238A422650k0844p8206j2319k2906l5812K2708L8471r5132L1069O9345m7777
2227A271247j06806m7921J6356M2863r1626n6981J1370K1227L8396l2689n7593
2216A007843l3289k0834N1525J7258K6283k6343l6784k9675L1625l4570q1108
2205H71931O7794R9623j4434o3253K1100M8726L2549n5218m2075o4145l3014K3780
$$ plain form
2193 893364 910517 893643 902371 826868 833010 783067 831263 890446 848483 863328 894086 871371
2181 871371 818219 738805 700357 692426 739927 762305 706357 678887 642744 699373 724302 729591
2169 729591 732974 725342 716186 702128 741792 777125 737777 732032 760424 800121 731748 737149 755353
2156 755353 655453 658779 678289 684650 652540 692871 653251 660419 609096 652793 631241 644078
2144 644078 630745 682604 683627 626336 618745 604933 634324 614262 591653 549458 604687 569231
2132 569231 556990 609221 620746 636034 615568 602336 591045 559791 592678 595554 615255 647791
2120 647791 673450 647275 549813 544734 635841 602731 559649 581143 689449 619640 581383 484782
2108 484782 528569 587349 621893 610252 586428 589067 604551 638218 566606 622621 652998 629728
$$ packed form
2193H93364J7153j6874Q728p5503O142m9943M8196N9183m1963J4845L0758k2715
2181H71371n3152p9414l8448p931M7501K2378n5948k7470l6143N6629K4929N289
2169G29591L383p632r156j4058L9664L5333l9348n745K8392L9697o8373N401J8204
2156G55353r9900L326J9510O361l2110M0331l9620P168n1323M3697k1552J2837
2144F44078j3333N1859J023n7291p591j3812K9391k0062k2609m2195N5229l5456
2132E69231j2241N2231J1525J5288k0466j3232j1291l1254L2887K876J9701L2536
2120F47791K5659k6175r7462n079R1107l3110m3082K1494J08306o9809l8257r6601
2108D84782M3787N8780L4544j1641k3824K639J5484L3667p1612N6015L0377k3270
$$ plain form
2096 629728 625984 616750 535480 487703 516413 513124 513807 478206 488600 534704 533469 551261 562414
2083 562414 595953 605402 536039 490932 538685 523395 506650 519580 493538 568809 520132 498255
2071 498255 525626 507197 595983 591395 519899 475095 508653 526889 499956 469506 465646 465294
2059 465294 437319 484967 505558 493505 524506 527950 528948 549589 497503 492160 499844 527244 541588
2046 541588 587333 654133 683708 766991 803810 818994 833495 834258 774521 712413 676075 657936
2034 657936 653549 591289 541288 602946 580245 590996 617992 646434 597138 507773 525103 524541
2022 524541 455294 397011 428459 469314 442675 463990 500984 498217 443660 506525 549116 530976
2010 530976 493720 512558 485035 455724 466524 441278 390773 354327 407517 438681 432230 509236
$$ packed form
2096F29728l744r234q1270m7777K8710l289O83l5601J0394M6104j235J7792J1153
2083E62414L3539R449o9363m5107M7753j5290j6745J2930k6042P5271m8677k1877
2071D98255K7371j8429Q8786m588p1496m4804L3558J8236k6933l0450l860l52
2059D65294k7975M7648K0591j2053L1001L444R98K0641n2086n343P684K7400J4344
2046E41588M5745O6800K9575Q3283L6819J5184J4501P63n9737o2108l6338j8139
2034F57936m387o2260n0001O1658k2701J0751K6996K8442m9296q9365J7330n62
2022E24541o9247n8283L1448M0855k6639K1315L6994k767n4557O2865M2591j8140
2010E30976l7256J8838k7523k9311J0800k5246n0505l6446N3190L1164o451P7006
$$ plain form
1998 509236 475697 458399 456912 372301 379858 431385 376152 341324 374233 365242 383184 345448
1986 345448 327630 387829 375563 397715 410774 440698 458511 443858 450471 488637 423192 358128
1974 358128 358008 349885 351159 386847 421461 435699 469629 481220 449833 439316 469997 447618
1962 447618 446573 434384 386220 394656 417609 414331 392066 443145 399913 329279 357277 331254
1950 331254 377702 407273 473702 496168 486709 449721 413009 376999 376990 436226 519219 429198 314125
1937 314125 282552 314869 357065 378357 377940 357112 369543 434530 488081 482774 471149 465784
1925 465784 461482 454208 409402 391402 352492 438614 425239 448269 453433 456045 480526 447958
1913 447958 357359 355241 373529 333476 335334 419686 449060 437716 416220 400001 399825 385717
$$ packed form
1998E09236l3539j7298j487q4611P557N1527n5233l4828L2909q991J7942l7736
1986C45448j7818O0199j2266K2152J3059K9924J7813j4653O613L8166o5445o5064
1974C58128j20q123J274L5688L4614J4238L3930J1591l1387j0517L0681k2379
1962D47618j045j2189m8164Q436K2953l278k2265N1079m3232p0634K7998k6023
1950C31254M6448K9571O6429K2466r459l6988l6712l6010rN9236Q2993r0021j15073
1937C14125l1573L2317M2196K1292m17k0828J2431O4987N3551n307j1625n365
1925D65784m302p274m4806j8000l8910Q6122j3375K3030N164K612K4481l2568
1913D47958r0599k118J8288m0053J858Q4352K9374j1344k1496j6219j76j4108
$$ plain form
1901 385717 372560 396977 410802 450546 397358 345019 366622 356371 361159 383876 359983 278365
1889 278365 276192 302912 316469 339894 411887 394555 381994 390328 445188 432097 398796 483991
1877 483991 476050 373658 380892 367107 381342 389841 389528 401293 389948 385118 387833 373575 354554
1864 354554 335671 349475 347339 354496 340617 331605 316406 367823 358458 365242 373786 400559 356755
1851 356755 342112 326860 342905 363331 308962 330993 399532 435388 438037 426248 378037 367933
1839 367933 410490 399773 299815 311038 360961 349457 368383 405462 439912 384011 399040 372308
1827 372308 346909 357602 338181 299498 352930 388855 366931 404372 377204 424527 400061 353166
1815 353166 328398 307770 297867 314739 375313 377067 368131 385162 323650 369665 392117 313031
$$ packed form
1901C85717j3157K4417J3825L9744n3188n2339K1603j0251M788K2717k3893q1618
1889B78365k173K6720J3557K3425P1993j7332j2561Q334N4860j3091l3301Q5195
1877D83991p941j02392P234j3785J4235Q499l13J1765j1345m830K715j4258j9021
1864C54554j8883J3804k136P157j3879r012j5199N1417r365O784Q544K6773m3804
1851C56755j4643j5252J6045K0426n4369K2031O8539L5856K649j1789m8211j0104
1839C67933M2557j0717r9958J1223M9923j1504J8926L7079L4450n5901J5029k6732
1827C72308k5399J0693j9421l8683N3432L5925k1924L7441k7168M7323k4466m6895
1815C53166k4768k0628r903J6872O0574J754q936J7031o1512M6015K2452p9086
$$ plain form
1803 313031 321384 348630 348118 360704 313908 310647 323616 311029 361425 283557 256793 322432
1791 322432 323736 333599 371087 298004 336457 362107 362246 361234 353819 359184 301419 316043 286203
1778 286203 267802 318334 313313 270368 337591 343494 290241 235382 281078 265834 316919 299790
1766 299790 268968 334496 346819 338265 341736 341949 317074 345106 289438 244453 307395 391058
1754 391058 405949 366843 314499 370729 382551 356491 329479 345220 370219 343088 336068 316371
1742 316371 357625 364444 381473 334765 320793 307837 295524 344241 405997 352106 300968 326791
1730 326791 285263 302156 331116 288597 318341 432089 393231 362918 340216 351007 293829
1719 293829 276928 350277 372311 281239 210208 262916 280395 280681 261270 344793 365063 351458
$$ packed form
1803C13031Q353K7246n12J2586m6796l261J2969j2587N0396p7868k6764O5639
1791C22432J304R863L7488p3083L8453K5650J39j012p415N365n7765J4624k9840
1778B86203j8401N0532n021m2945O7223N903n3253n4859M5696j5244N1085j7129
1766B99790l0822O5528J2323q554L471K13k4875K8032n5668m4985O2942Q3663
1754C91058J4891l9106n2344N6230J1822k6060k7012J5741K4999k7131p020j9697
1742C16371M1254O819J7029m6708j3972j2956j2313M8717O1756n3891n1138K5823
1730C26791m1528J6893K8960m2519K9744J13748l8858l0313k2702J0791n7178
1719B93829j6901P3349K2034r1072p1031N2708J7479K86j9411Q3523K0270j3605
$$ plain form
1707 351458 291676 285794 316538 330265 348886 341553 345457 324894 290320 247272 235303 262435
1695 262435 320889 277018 201736 285369 314693 266934 309029 301660 267094 315805 339174 334923
1683 334923 324464 309696 293736 322758 294527 302442 306584 293464 329202 341270 326467 278946
1671 278946 271545 258123 235087 245862 291631 208567 202069 235037 301835 327295 323459 328411
1659 328411 385124 396316 374285 352912 304148 231350 199997 246772 271141 262673 289590 309738
1647 309738 218204 219624 280245 308062 401396 397037 328923 315726 297037 285764 274096 265191
1635 265191 294894 297603 307895 319514 353404 331323 338172 278729 268454 307755 250632 245848
1623 245848 202172 283389 269672 240952 248514 209936 245489 307751 290966 241551 152257 242843
$$ packed form
1707C51458n9782n882L0744J3727J8621p333L904k0563l4574m3048j1969K7132
1695B62435N8454m3871p5282Q3633K9324m7759M2095p369l4566M8711K3369m251
1683C34923j0459j4768j5960K9022k8231P915M142j3120L5738J2068j4803m7521
1671B78946p401j3422k3036J0775M5769q3064o498L2968O6798K5460l836M952
1659C28411N6713J1192k2031k1373m8764p2798l1353M6775K4369q468K6917K0148
1647C09738r1534J420O0621K7817R3334m359o8114j3197j8689j1273j1668q905
1635B65191K9703K709J0292J1619L3890k2081O849n9443j0275L9301n7123m784
1623B45848m3676Q1217j3717k8720P562l8578L5553O2262j6785m9415q9294R0586
$$ plain form
1611 242843 279162 323323 279103 258371 269707 262162 260540 272711 294461 270779 283088 239026
1599 239026 262610 293655 350869 313116 256925 229261 268238 352906 358458 344862 303429 233149
1587 233149 229394 284675 346060 286327 247318 278818 259535 244624 226165 204502 237223 281106
1575 281106 352793 381938 300253 262368 257757 263368 254537 298806 323704 314448 321669 290007 308539
1562 308539 197919 180734 284670 254023 216226 238949 253216 307507 315986 203986 218107
1551 218107 287061 303626 214915 176458 214601 226271 321436 294433 272313 251791 168113 229226
1539 229226 259703 254474 214206 216177 244692 228016 271316 281120 247051 277494 299563 316568
1527 316568 297127 239369 245328 198266 180974 245834 285702 241101 177628 230574 206212 261388
$$ packed form
1611B42843L6319M4161m4220k0732J1336p545j622J2171K1750k3682J2309m4062
1599B39026K3584L1045N7214l7753n6191k7664L8977Q4668N552j3596m1433p0280
1587B33149l755N5281O1385n9733l9009L1500j9283j4911j8459k1663L2721M3883
1575B81106P1687K9145q1685l7885m611N611q831M4269K4898r256P221l1662J8532
1562C08539j10620j7185J03936l0647l7797K2723J4267N4291Q479j12000J4121
1551B18107O8954J6565q8711l8457L8143J1670R5165k7003k2120k0522q3678O1113
1539B29226L0477n229m0268J971K8515j6676M3300R804l4069L0443K2069J7005
1527C16568j9441n7758N959m7062j7292O4860L9868m4601o3473N2946k4362N5176
$$ plain form
1515 261388 291258 241874 276532 307132 257358 214985 239869 251854 254890 275231 278533 297938
1503 297938 288080 216845 217489 265589 379583 290351 264790 297678 297129 306702 283577 185918 208620
1490 208620 266435 254952 262672 251193 239291 204120 241484 271379 239523 244450 271889 229226
1478 229226 265096 259923 238514 286609 348338 369618 254430 246649 201823 257610 245222 212116
1466 212116 241544 212154 198493 253234 181579 197155 193984 228463 286826 253646 244363 182537
1454 182537 167787 160054 233990 211528 176883 170793 154351 239469 187348 92340 146641 238855
1442 238855 298996 282440 233099 121394 173138 274020 238249 218013 281080 278996 265011
1431 265011 176924 153692 157366 182326 193178 230529 276230 225036 204751 192729 176589 193742
$$ packed form
1515B61388K9870m9384L4658L0600m9774m2373K4884J1985L036K0341L302J9405
1503B97938r858p1235O44M8100J13994q9232k5561L2888n49R573k3125r7659K2702
1490B08620N7815j1483P720j1479j1902l5171L7364K9895l1856M927K7439m2663
1478B29226L5870n173k1409M8095O1729K1280j15188p781m4826N5787j2388l3106
1466B12116K9428k9390j3661N4741p1655J5576l171L4479N8363l3180r283o1826
1454A82537j4750p733P3936k2462l4645o090j6442Q5118n2121r5008N4301R2214
1442B38855O0141j6556m9341j11705N1744J00882l5771k0236O3067k084j3985
1431B65011q8087k3232L674K4960J0852L7351M5701n1194k0285j2022j6140J7153
$$ plain form
1419 193742 155242 205588 209731 191693 231814 295596 272413 255391 271910 204314 241251 204070
1407 204070 140688 136079 133162 177874 139425 197496 211367 219852 150167 179511 221714 187641
1395 187641 185724 199826 172026 169155 210586 175307 130643 151999 215739 213009 222876 248506
1383 248506 242241 204572 218455 224066 178294 180587 186208 151529 207945 195050 155638 119703
1371 119703 134311 235457 217955 167470 169654 182169 169750 214808 273424 257549 229011 190843
1359 190843 156721 173759 230730 266963 223585 226351 232355 226914 223046 193117 171669 197689
1347 197689 184684 186706 173554 174170 124369 128555 220221 181120 228149 187953 234359 252124
1335 252124 263805 248275 226769 149660 138290 137019 145995 226700 193681 200109 223559 206217
$$ packed form
1419A93742l8500N0346M143j8038M0121O3782k3183j7022J6519o7596L6937l7181
1407B04070o3382m609k917M4712l8449N8071J3871Q485o9685K9344M2203l4073
1395A87641j917J4102k7800k871M1431l5279m4664K1356O3740k730R867K5630
1383B48506o265l7669J3883N611m5772K293N621l4679N6416j2895l9412l5935
1371A19703J4608J01146j7502n0485K184J2515j2419M5058N8616j5875k8538l8168
1359A90843l4122J7038N6971L6233m3378K766O004n441l868k9929k1448K6020
1347A97689j3005K022j3152O16m9801M186R1666l9101M7029m0196M6406J7765
1335B52124J1681j5530k1506p7109j1370j271Q976Q0705l3019O428K3450j7342
$$ plain form
1323 206217 181784 194853 171583 218103 232538 189632 145444 124725 132097 81581 152673 239075
1311 239075 192363 176089 185633 157954 146234 102575 103597 121195 178348 163060 166496 109689
1299 109689 141366 187603 98192 117256 153584 88591 116488 114268 158776 158852 162002 148147 171341
1286 171341 218840 165816 149082 153962 172525 134795 99259 114869 134390 128123 129201 109840
1274 109840 144118 158507 126719 135462 139843 101649 165570 232344 160935 132617 125333 191859
1262 191859 180456 157754 101440 102464 187487 220904 187807 213994 180704 154277 161422 142109
1250 142109 129275 165130 185568 196420 215093 186838 224771 196173 275192 188450 117504 112838
1238 112838 160111 185135 168780 115672 147185 179532 209882 172101 137242 135122 194281 204678
$$ packed form
1323B06217k4433J3069k3270M6520J4435m2906m4188k0719P372n0516P1092Q6402
1311B39075m6712j6274R544k7679j1720m3659J022J7598N7153j5288L436n6807
1299A09689L1677M6237q9411J9064L6328o4993K7897k220M4508P6L150j3855K3194
1286A71341M7499n3024j6734M880J8563l7730l5536J5610J9521o267J078j9361
1274A09840L4278J4389l1788Q743M381l8194O3921O6774p1409k8318p284O6526
1262A91859j1403k2702n6314J024Q5023L3417l3097K6187l3290k6427P145j9313
1250A42109j2834L5855K0438J0852J8673k8255L7933k8598P9019q6742p0946m666
1238A12838M7273K5024j6355n3108L1513L2347L0350l7781l4859k120N9159J0397
$$ plain form
1226 204678 201485 221898 111278 89781 92562 129098 136678 149512 163405 186983 174905 77394
1214 77394 134419 174422 149969 138047 118691 203568 168260 93007 155216 114671 172574 97524
1202 97524 90525 112156 73713 98611 118277 98739 78330 65461 121504 122490 179786 123459
1190 123459 72025 151906 148249 71586 112211 139405 162993 167240 141743 105427 154677 163278
1178 163278 124824 107294 116074 136902 112822 126708 98420 68072 77477 90492 79215 168466
1166 168466 166457 215429 150090 166888 123561 110947 119197 113498 98885 115372 134108 45645
1154 45645 85613 152723 89382 100794 69094 68836 142607 145433 185506 157939 117423 100070
1142 100070 122877 135991 112801 140778 126114 86939 114855 158139 150716 151330 139382 94985
$$ packed form
1226B04678l193K0413j10620k1497K781L6536P580J2834J3893K3578j2078r7511
1214G7394N7025M0003k4453j1922j9356Q4877l5308p5253O2209m0545N7903p5050
1202I7524o999K1631l8443K4898J9666j9538k0409j2869N6043R86N7296n6327
1190A23459n1434P9881l657p6663M0625K7194K3588M247k5497l6316M9250Q601
1178A63278l8454j7530Q780K0828k4080J3886k8288l0348R405J3015j1277Q9251
1166A68466k009M8972o5339J6798m3327j2614Q250n699j4613J6487J8736q8463
1154D5645L9968O7110o3341J1412l1700k58P3771K826M0073k7567m0516j7353
1142A00070K2807J3114k3190K7977j4664l9175K7916M3284p423O14j1948m4397
$$ plain form
1130 94985 52784 100892 95999 96080 123222 106871 101254 70348 93593 86363 22587 31224 15425
1117 15425 75495 93153 138523 110095 88202 50829 114764 54168 73669 180085 102327 81461
1105 81461 122189 142805 73035 38672 51682 71413 27531 78325 168545 168809 111235 58079
1093 58079 104174 99414 28680 118958 130043 179596 147815 158764 120018 56718 99285 86699
1081 86699 102082 124909 73036 120345 140360 149775 165442 154446 75387 90927 73922 14612
1069 14612 76684 117792 105466 128183 149210 108528 100222 108847 115711 73340 53869 -2870
1057 -2870 49355 57621 162259 177010 110476 98550 77021 24714 44448 102508 135637 98531
1045 98531 91667 102307 102816 49071 27059 47975 94856 -24228 -9903 39092 51853 72234
$$ packed form
1130I4985m2201M8108m893Q1K7142j6351n617l0906K3245p230o3776Q637j5799
1117A5425O0070J7658M5370k8428k1893l7373O3935o0596J9501J06416p7758k0866
1105H1461M0728K0616o9770l4363J3010J9731m3882N0794R0220K64n7574n3156
1093E8079M6095m760p0734R0278J1085M9553l1781J0949l8746o3300M2567j2586
1081H6699J5383K2827n1873M7309K0015R415J5667j0996p9059J5540j7005n9310
1069A4612O2072M1108j2326K2717K1027m0682q306Q625O864m2371j9471n6739
1057b870N2225Q266J04638J4751o6534j1926k1529n2307J9734N8060L3129l7106
1045I8531o864J0640N09n3745k2012K0916M6881j19084J4325M8995J2761K0381
$$ plain form
1033 72234 44419 56357 29265 70198 67841 82050 109423 154471 129105 162385 81498 57262
1021 57262 85967 56798 94060 129633 81092 144690 93117 46058 97222 163057 171513 133067
1009 133067 80178 40763 111005 100607 70810 57250 12527 65778 69373 26388 -5787 63592
997 63592 119599 133407 126370 31180 58173 123875 89841 88616 80642 91263 124533 61584 115758
984 115758 115859 93708 82605 98318 38363 637 81 5459 74101 44417 69889 121023 133731
971 133731 63657 96579 40804 -5169 43320 92584 43567 64532 53054 69969 124862 105010
959 105010 65542 70068 95912 95030 159909 125647 -8054 13150 30498 6513 38643 26360
947 26360 35498 15456 48621 3732 50455 68668 81899 113795 117864 97832 123429 72095
$$ packed form
1033G2234k7815J1938k7092M0933k357J4209K7373M5048k5366L3280q0887k4236
1021E7262K8705k9169L7262L5573m8541O3598n1573m7059N1164O5835Q456l8446
1009A33067n2889l9415P0242j0398k9797j3560m4723N3251L595m2985l2175O9379
997F3592N6007J3808p037r5190K6993O5702l4034j225p974J0621L3270o2949N4174
984A15758J01k2151j1103J5713n9955l7726n56N378O8642k9684K5472N1134J2708
971A33731p0074L2922n5775m5973M8489M9264m9017K0965j1478J6915N4893j9852
959A05010l9468M526K5844q82O4879l4262j33701K1204J7348k3985L2130j2283
947B6360R138k0042L3165m4889M6723J8213J3231L1896M069k0032K5597n1334
$$ plain form
935 72095 28148 72 -45012 10971 38786 69697 79271 45247 -30742 -19373 9675 8290
923 8290 -33347 45037 52488 47043 11994 29428 60792 8261 17754 -22856 -8813 15860 3255
910 3255 44265 67151 2083 14807 40134 21532 57553 67423 82368 59377 42322 69353
898 69353 108214 144776 136177 100308 104654 74475 14904 74916 76816 21499 66743 72988 62145
885 62145 30398 36502 80067 32425 9037 -57652 -53553 -50541 27362 54527 37621 -1336 -350
872 -350 9486 3880 28024 35026 106587 96643 22167 26314 60636 44821 -12889 -39603 -25027
859 -25027 57360 50073 42590 79357 40346 37318 66154 101766 61159 -36863 13084 -20035 -30068
846 -30068 25661 62084 65970 7821 -71145 -21348 -26172 -76294 -26684 3467 39735 29793 -6395
$$ packed form
935G2095m3947k8076m5084N5983K7815L0911R574l4024p5989J1369K9048j385
923H290m1637P8384P451n445l5049J7434L1364n2531R493m0610J4043K4673j2605
910C255M1010K2886o5068J2724K5327j8602L6021R870J4945k2991j7055K7031
898F9353L8861L6562q599l5869M346l0179n9571O0012J900n5317M5244O245j0843
885F2145l1747O104M3565m7642k3388o6689M099L012P7903K7165j6906l8957R86
872c50R836n606K4144P002P1561r944p4476M147L4322j5815n7710k6714J4576
859b5027Q2387p287p483L6767l9011l028K8836L5612m0607r8022M9947l3119j0033
846c0068N5729L6423L886n8149p8966M9797m824n0122M9610L0151L6268r942l6188
$$ plain form
833 -6395 -12403 -48383 -15337 -24430 -26994 -30493 24065 59264 3242 -54880 -13126 -36565 -49804
820 -49804 22339 13321 11230 -7168 -8801 -81552 -92804 -56951 -54070 -44094 -58393 -20331 20711
807 20711 15396 -11890 -57547 -20255 -49747 -63311 -80559 -35114 59426 61553 -5278 20333
795 20333 88583 96190 89449 31053 -31660 9103 -14292 -15601 -12776 -41199 20359 33118 79682
782 79682 36798 10662 47799 -15883 -42183 -84257 -58136 -43883 -2985 -64626 -65552 4207
770 4207 -36731 -20257 78357 36393 23006 44736 90124 75336 38987 16924 19138 24886 -30126
757 -30126 -69886 -43132 -46097 -63235 18628 -20311 -53112 42183 7399 6113 -5215 1179 17889
744 17889 -3433 89409 24055 -86357 -73459 -43247 -12991 -10529 -45931 -5976 37777 18545
$$ packed form
833f395o008l5980L3046r093k564l499N4558L5199n6022n8122M1754k3439j3239
820d9804P2143r018k091j8398j633p2751j1252L5853K881R976j4299L8062M1042
807B0711n315k7286m5657L7292k9492j3564j7248M5445R4540K127o6831K5611
795B0333O8250P607o741n8396o2713M0763k3395j309K825k8423O1558J2759M6564
782G9682m2884k6136L7137o3682k6300m2074K6121J4253M0898o1641r26O9759
770D207m0938J6474R8614m1964j3387K1730M5388j4788l6349k2063K214N748n5012
757c0126l9760K6754k965j7138Q1863l8939l2801R5295l4784j286j1328O394J6710
744A7889k1322R2842o5354j10412J2898L0212L0256K462l5402L9955M3753j9232
$$ plain form
732 18545 -16295 -47948 -28417 2755 -11978 -42176 -87638 -8513 -3142 -70432 -56443 -67211
720 -67211 -76463 -102753 -43975 -4661 -26301 -84967 -65204 -27523 -43519 -39230 -70514 -85169
708 -85169 -82619 -94978 -56174 -32385 -20431 -8744 -39706 -104367 -82155 -54370 -55788 -9987
696 -9987 28397 27063 57568 -20300 -49598 -58337 5957 -4677 -25324 72508 10175 -81524 -161661
683 -161661 -93146 -71641 -116378 -118305 -42706 3103 -3049 -20779 24182 16124 -23815 -54471
671 -54471 -67128 -86515 -38894 -23078 7459 -33798 -100986 -97268 -18854 -62627 -113437 -54180
659 -54180 48449 -17610 -23422 15651 -30131 -32259 -40179 -82538 -97312 -118380 -83217 -21653
647 -21653 -64772 -77066 -59847 -105606 -82785 -56155 -86026 -107963 -15793 -26250 -52451 -34805
$$ packed form
732A8545l4840l1653J9531L1172j4733l0198m5462P9125N371o7290J3989j0768
720f7211r252k6290N8778L9314k1640n8666J9763L7681j5996M289l1284j4655
708h5169K550j2359L8804K3789J1954J1687l0962o4661K2212K7785j418M5801
696i987L8384j334L0505p7868k9298q739O4294j0634k0647R7832o2333r1699q0137
683a61661O8515K1505m4737j927P5599M5809o152j7730M4961q058l9939l0656
671e4471j2657j9387M7621J5816L0537m1257o7188L718P8414m3773n0810N9257
659e4180J02629o6059n812L9073m5782k128p920m2359j4774k1068L5163O1564
647b1653m3119j2294J7219m5759K2821K6630k9871k1937R2170j0457k6201J7646
$$ plain form
635 -34805 -66612 -108377 -38122 -19004 -7807 47464 -21824 -38480 -48564 -4220 17735 -12957
623 -12957 -30579 -14378 -75464 -74024 -18436 -8621 -10653 -40016 -99349 -94110 -123788 -100502 -48090
610 -48090 -70527 -159048 -86317 -96027 -112282 -57001 -68046 -130278 -116391 -135610 -91604 -59054
598 -59054 -1038 60384 269 -31287 -139147 -71809 -54850 -54682 -102380 -78260 -116444 -107341
586 -107341 5044 -15300 -44325 -71281 -58453 -41263 -71871 -84741 -68828 -41604 -85912 -71021
574 -71021 -39170 -74467 -57943 -75624 4437 -76297 -78548 -103329 -115296 -23213 -30575 -80398
562 -80398 -88452 -115023 -98601 -129635 -113676 -45429 -50537 -1551 2816 -10160 -40358 -36494 -9773
549 -9773 -46558 -51803 -32683 -79303 -62696 -113188 -131476 -59489 -51110 -66452 -128530 -132827 -94566
$$ packed form
635c4805l1807m1765P0255J9118J1197N5271o9288j6656j0084M4344K1955l0692
623a2957j7622J6201o1086J440N5588R815k032k9363n9333N239k9678K3286N2412
610d8090k2437q8521P2731r710j6255N5281j1045o2232J3887j9219M4006L2550
598e9054N8016O1422o0115l1556j07860O7338J6959J68m7698K4120l8184R103
586a07341J12385k0344k9025k6956J2828J7190l0608j2870J5913K7224m4308J4891
574g1021L1851l5297J6524j7681Q0061q0734k251k4781j1967R2083p362m9823
562h0398q054k6571J6422l1034J5959O8247n108M8986M367j2976l0198L864K6721
549i773l6785n245J9120m6620J6607n0492j8288P1987Q379j5342o2078m297L8261
$$ plain form
536 -94566 -114075 -93832 -41409 -73154 -92087 -75869 -80315 -45292 -45614 -50106 -3578 -59943 -66732
523 -66732 -34718 -19972 -44617 -31193 -93470 -67657 -56607 -92668 -136531 -158039 -150597 -147365
511 -147365 -86073 -103002 -84659 -17728 -6038 -39089 -65780 -72786 -86861 -103767 -80727 -105386
499 -105386 -115347 -133834 -190578 -168124 -134139 -113890 -106872 -82253 -6547 -67396 -96159 -98579
487 -98579 -94051 -81786 -29961 -71278 -112845 -105334 -58246 -87686 -52820 -38565 -82875 -54736
475 -54736 -112238 -100123 -154457 -127569 -67109 -99419 -74861 14672 2577 -78441 -86624 -94429
463 -94429 -34949 -92280 -135390 -53680 -43148 -115119 -70730 -102500 -192320 -225763 -168138 -95175
451 -95175 -106565 -137777 -178464 -149081 -176890 -154999 -128186 -135274 -119365 -202488 -235952 -119933
$$ packed form
536i4566j9509K0243N2423l1745j8933J6218m446L5023l22m492M6528n6365o789
523f6732L2014J4746k4645J3424o2277K5813J1050l6061m3863k1508P442L232
511a47365O1292j6929J8343O6931J1690l3051k6691p006j4075j6906K3040k4659
499a05386r961j8487n6744K2454L3985K0249P018K4619P5706o0849k8763k420
487i8579M528J2265N1825m1317m1567P511M7088k9440L4866J4255m4310K8139
475e4736n7502J2115n4334K6888O0460l2310K4558Q9533j2095q1018q183p805
463i4429N9480n7331m3110Q1710J0532p1971M4389l1770q9820l3443N7625P2963
451i5175j1390l1212m0687K9383k7809K1891K6813p088J5909q3123l3464J16019
$$ plain form
439 -119933 -53291 -5263 -21751 -29497 -41100 -62030 -94955 -123173 -94794 -95765 -126477 -130510 -199249
$$ packed form
439a19933O6642M8028j6488p746j1603k0930l2925k8218K8379r71l0712m033o8739
$$ [...]
##END NTUPLES=NMR SPECTRUM
##END=
