##TITLE=1H_DE-80H_X3
 200.13MHz, d2o
 8 sc
 
 19ns.26.2.2025
##JCAMPDX= 6.0         $$ Bruker NMR JCAMP-DX V2.0
##DATA TYPE= NMR SPECTRUM
##DATA CLASS= NTUPLES
##ORIGIN= UXNMR, Bruker Analytische Messtechnik GmbH
##OWNER= pz
$$ XWIN-NMR		Version 3.5
$$ Tue Jul 21 14:15:25 2026 Russian Standard Time (UT+4h)  Yarkov@DPX200
##.OBSERVE FREQUENCY= 200.1313
##.OBSERVE NUCLEUS= ^1H
##.ACQUISITION MODE= SIMULTANEOUS
##.ACQUISITION SCHEME= undefined
##.AVERAGES= 8
##.DIGITISER RES= 18
##SPECTROMETER/DATA SYSTEM= spect
##.PULSE SEQUENCE= zg30
##.SOLVENT NAME= DMSO
##.SHIFT REFERENCE= (INTERNAL, DMSO, 0, 15.5045)
##AUDIT TRAIL= $$ (NUMBER, WHEN, WHO, WHERE, WHAT)
$$ ##TITLE= Audit trail, XWIN-NMR		Version 3.5
$$ ##JCAMPDX= 5.01
$$ ##ORIGIN= Bruker BioSpin GmbH
$$ ##OWNER= Yarkov
$$ C:/Bruker/XWIN-NMR/data/yarkov2/nmr/H-C/1/pdata/1/auditp.txt
$$ ##AUDIT TRAIL=  $$ (NUMBER, WHEN, WHO, WHERE, WHAT)
(   1,<2026-07-21 14:14:09.68 +0400>,<Yarkov>,<DPX200>,
      <created by zg, POWCHK disabled, PULCHK disabled
       configuration hash MD5:
       00 E9 B6 7A A2 85 ED C7 34 08 36 98 17 FE 4E 26
       data hash MD5: 16K
       1C 1A 9A AB C0 34 0F 8B EB 20 FD 90 BD 48 82 41>)
(   2,<2026-07-21 14:14:26.64 +0400>,<Yarkov>,<DPX200>,
      <Start of raw data processing
       efp BC_mod = 2 LB = 0.25 FT_mod = 6 PKNL = 1 PHC0 = -7259.724 PHC1 = 15.42198 SI = 16K 
       data hash MD5: 16K
       24 18 5E 80 98 BD A9 64 20 27 01 2C 1C 61 E1 55>)
(   3,<2026-07-21 14:14:47.73 +0400>,<Yarkov>,<DPX200>,
      <pk PHC0 = -4.823047 PHC1 = 5.999997 
       data hash MD5: 16K
       B0 5A F5 C4 DF 96 90 67 32 E6 B2 4B 7D C2 D1 3A>)
$$ ##END=
$$ 
$$ hash MD5
$$ 3C ED C5 2A D1 52 A4 A8 15 52 9B 06 83 4B EC 9D
##$RELAX= 
##$RELAX= 
##$RELAX= 
##$RELAX= 
##$RELAX= 
##$RELAX= 
$$ Bruker specific parameters
$$ --------------------------
##$DU= <C:/Bruker/XWIN-NMR>
##$EXPNO= 1
##$NAME= <H-C>
##$PROCNO= 1
##$TYPE= <nmr>
##$USER= <yarkov2>
##$AMP= (0..31)
100 100 100 100 100 100 100 100 100 100 100 100 100 100 100 100 100 100 
100 100 100 100 100 100 100 100 100 100 100 100 100 100 
##$AQSEQ= 0
##$AQ_mod= 1
##$AUNM= <au_zg>
##$AUTOPOS= <>
##$BF1= 200.13
##$BF2= 200.13
##$BF3= 200.13
##$BF4= 200.13
##$BF5= 200.13
##$BF6= 200.13
##$BF7= 200.13
##$BF8= 200.13
##$BYTORDA= 1
##$CFDGTYP= 0
##$CFRGTYP= 5
##$CHEMSTR= <none>
##$CNST= (0..31)
1 1 145 1 1 1 1 1 1 1 1 1 1 1 1 1 1 1 1 1 1 1 1 1 1 1 1 1 1 1 1 1 
##$CPDPRG= <>
##$CPDPRG1= <>
##$CPDPRG2= <>
##$CPDPRG3= <>
##$CPDPRG4= <mlev>
##$CPDPRG5= <mlev>
##$CPDPRG6= <mlev>
##$CPDPRG7= <mlev>
##$CPDPRG8= <mlev>
##$CPDPRGB= <>
##$CPDPRGT= <>
##$D= (0..31)
0 0.7 0 0 0 0 0 0 0 0 0 0.03 0 0 0 0 0 0 0 0 0 0 0 0 0 0 0 0 0 0 0 0 
##$DATE= 1784628849
##$DBL= (0..7)
120 120 120 120 120 120 120 120 
##$DBP= (0..7)
150 150 150 150 150 150 150 150 
##$DBP07= 0
##$DBPNAM0= <>
##$DBPNAM1= <>
##$DBPNAM2= <>
##$DBPNAM3= <>
##$DBPNAM4= <>
##$DBPNAM5= <>
##$DBPNAM6= <>
##$DBPNAM7= <>
##$DBPOAL= (0..7)
0.5 0.5 0.5 0.5 0.5 0.5 0.5 0.5 
##$DBPOFFS= (0..7)
$$ [...]
##$SUBNAM2= <"">
##$SUBNAM3= <"">
##$SUBNAM4= <"">
##$SUBNAM5= <"">
##$SUBNAM6= <"">
##$SUBNAM7= <"">
##$SUBNAM8= <"">
##$SUBNAM9= <"">
##$SW= 18.0517328524113
##$SWIBOX= (0..15)
0 0 2 0 0 0 0 0 0 0 0 0 0 0 0 0 
##$SW_h= 3612.71676300578
##$TD= 16384
##$TD0= 1
##$TE= 0
##$TE2= 300
##$TE3= 300
##$TEG= 300
##$TL= (0..7)
0 120 120 120 120 120 120 120 
##$TP= (0..7)
150 150 150 150 150 150 150 150 
##$TP07= 0
##$TPNAME0= <>
##$TPNAME1= <>
##$TPNAME2= <>
##$TPNAME3= <>
##$TPNAME4= <>
##$TPNAME5= <>
##$TPNAME6= <>
##$TPNAME7= <>
##$TPOAL= (0..7)
0.5 0.5 0.5 0.5 0.5 0.5 0.5 0.5 
##$TPOFFS= (0..7)
0 0 0 0 0 0 0 0 
##$TUNHIN= 0
##$TUNHOUT= 0
##$TUNXOUT= 0
##$USERA1= <user>
##$USERA2= <user>
##$USERA3= <user>
##$USERA4= <user>
##$USERA5= <user>
##$V9= 5
##$VALIST= <valist>
##$VCLIST= <CCCCCCCCCCCCCCC>
##$VD= 0
##$VDLIST= <DDDDDDDDDDDDDDD>
##$VPLIST= <PPPPPPPPPPPPPPP>
##$VTLIST= <TTTTTTTTTTTTTTT>
##$WBST= 1024
##$WBSW= 4
##$XGAIN= (0..3)
0 0 0 0 
##$XL= 0
##$YL= 0
##$YMAX_a= 183899
##$YMIN_a= -186856
##$ZGOPTNS= <>
##$ZL1= 120
##$ZL2= 120
##$ZL3= 120
##$ZL4= 120
##$ABSF1= 0
##$ABSF2= 0
##$ABSG= 0
##$ABSL= 0
##$ALPHA= 0
##$AQORDER= 0
##$ASSFAC= 0
##$ASSFACI= 0
##$ASSFACX= 0
##$ASSWID= 0
##$AUNMP= <proc_1d>
##$AZFE= 0.1
##$AZFW= 0.1
##$BCFW= 0
##$BC_mod= 2
##$BYTORDP= 0
##$COROFFS= 0
##$CY= -3
##$DATMOD= 1
##$DC= 0
##$DFILT= <>
##$DTYPP= 0
##$F1P= 0
##$F2P= 0
##$FCOR= 1
##$FTSIZE= 16384
##$FT_mod= 6
##$GAMMA= 0
##$GB= 0
##$INTBC= 1
##$INTSCL= 3.241238e-09
##$ISEN= 128
##$LB= 0.25
##$LEV0= 0
##$LPBIN= 0
##$MAXI= 10000
##$MC2= 0
##$MEAN= 0
##$ME_mod= 0
##$MI= 1.114404
##$NCOEF= 0
##$NC_proc= -6
##$NLEV= 6
##$NOISF1= 3.799351
##$NOISF2= 2.8
##$NSP= 0
##$NTH_PI= 0
##$NZP= 0
##$OFFSET= 15.50449
##$PC= 1
##$PHC0= -7264.547
##$PHC1= 21.42198
##$PH_mod= 1
##$PKNL= yes
##$PPARMOD= 0
##$PSCAL= 0
##$PSIGN= 0
##$REVERSE= no
##$SF= 200.130003444607
##$SI= 16384
##$SIGF1= 3
##$SIGF2= 2
##$SINO= 0.751879
##$SIOLD= 32768
##$SREGLST= <19F.Aceton>
##$SSB= 0
##$STSI= 16384
##$STSR= 0
##$SW_p= 3612.71676300578
##$SYMM= 0
##$S_DEV= 0
##$TDeff= 16384
##$TDoff= 0
##$TI= <>
##$TILT= no
##$TM1= 0
##$TM2= 0
##$TOPLEV= 0
##$USERP1= <user>
##$USERP2= <user>
##$USERP3= <user>
##$USERP4= <user>
##$USERP5= <user>
##$WDW= 1
##$XDIM= 16384
##$YMAX_p= 285808055
##$YMIN_p= -556794
$$ End of Bruker specific parameters
$$ ---------------------------------
##NTUPLES= NMR SPECTRUM
##VAR_NAME=  FREQUENCY,     SPECTRUM/REAL,   SPECTRUM/IMAG
##SYMBOL=    X,             R,               I
##VAR_TYPE=  INDEPENDENT,   DEPENDENT,       DEPENDENT
##VAR_FORM=  AFFN,          ASDF,            ASDF
##VAR_DIM=   16384,         16384,           16384
##UNITS=     HZ,            ARBITRARY UNITS, ARBITRARY UNITS
##FACTOR=    0.220516191357247, 1,           1
##FIRST=     3102.91361683003, 0,            0
##LAST=      -509.803146175749, 0,           0
##MIN=       -509.803146175749, -556794,     0
##MAX=       3102.91361683003, 285808055,    0
$$ Real data points
##PAGE= N=1
##DATA TABLE= (X++(R..R)), XYDATA
$$ [...]
6887A6989k17n0969j6163O5872j80846k3547J39323k5930N5811J7731o5253N7763
$$ 16989 16772 -34197 -50360 15512 -165334 -188881 -49558 -75488 -19677 -1946 -67199 -9436
6875i436Q0271J5595J3373j6310j59446K1492O5261r0380N4886Q3770p4753n6105
$$ -9436 70835 86430 99803 83493 -75953 -54461 10800 -79580 -24694 59076 -15677 -71782
6863g1782k6363l9378M6673P1495p7737L166N1739p5769J37027j8070O974M9947
$$ -71782 -98145 -137523 -90850 -19355 -97092 -93926 -42187 -117956 19071 1001 7975 57922
6851E7922m8322j90595K1048O3213l8963N0505L1388L6024M9565j19623p115Q5794
$$ 57922 9600 -180995 -159947 -96734 -135697 -85192 -53804 -17780 31785 -87838 -94953 -9159
6839i159r6085j16598J05523Q4839l9951j215J0651N3602N426p8595p5933N4906
$$ -9159 -105244 -221842 -116319 -31480 -71431 -72646 -61995 -8393 -2967 -81562 -157495 -102589
6827a02589k5768L3092J33620l0836p0630R9148o829p8886M2195j7955L654N4415
$$ -102589 -128357 -95265 38355 7519 -63111 36037 29208 -49678 -7483 -25438 -21784 32631
6815C2631m8271q5810O5648j8816J2462K0153n9681N625P2669m6903L3126R0303
$$ 32631 -15640 -101450 -35802 -54618 -42156 -22003 -81684 -76059 -3390 -50293 -17167 73136
6803G3136q8389J6346m8931l9664j7048k7217j2570J04960k0650K586P1988m9689
$$ 73136 -15253 1093 -47838 -87502 -104550 -131767 -144337 -39377 -60027 -57441 14547 -35142
6791c5142n380j271J3890l591j08732M9872m3254P8326L7553n9173J23114J8404
$$ -35142 -40522 -41793 -27903 -31494 -140226 -90354 -133608 -55282 -17729 -76902 46212 64616
6779F4616j38647O917J0329P6074Q4589j74627o0053P2673q406K5337O3377k2104
$$ 64616 -74031 -67114 -56785 19289 103878 -70749 -130802 -58129 -66535 -41198 22179 75
6767G5L2000j13742m7742n8442L4969O6942J2954J58121j11794j16573J01123
$$ 75 32075 -81667 -129409 -187851 -152882 -85940 -72986 85135 -26659 -143232 -42109
6756d2109J3194n950r25K5401l3807k3704R5480O966m145n0462M7422j03350n2057
$$ -42109 -28915 -34865 -35790 -10389 -44196 -67900 27580 34546 30401 -20061 27361 -75989 -128046
6743a28046O5637R5049J1676p1943N2266j31489N1388k1280p8997J18351j1609
$$ -128046 -62409 32640 44316 -27627 24639 -106850 -55462 -76742 -155739 -37388 -48997
6732d8997l2800J14799j26720q325M7815N2265N033N0596j03817j2723Q8765j07579
$$ -48997 -81797 33002 -93718 -102043 -54228 -1963 3070 53666 -50151 -62874 25891 -81688
6720h1688J04764L2922o3774j11286K1504M581m0565M2605N726k0890O03j03269
$$ -81688 23076 55998 -7776 -119062 -97558 -92977 -133542 -90937 -85211 -106101 -105498 -208767
6708b08767O2530M0393K7714n5968O7272N3160m2076O4635n6640J28473k1653
$$ -208767 -146237 -105844 -78130 -134098 -66826 -13666 -55742 8893 -47747 80726 59073
6697E9073j72880j6946L3726M8465M5578Q7326p8756j0688p2614m6863P7205J6975
$$ 59073 -113807 -130753 -97027 -48562 -2984 84342 5586 -5102 -77716 -124579 -47374 -30399
6685c0399n9213J6499O5244L4216j566k0769J901M3030p832o8639L9107p1539
$$ -30399 -89612 -73113 -7869 26347 24781 4012 5913 48943 41111 -27528 11579 -59960
6673e9960m5327L3231O1060N7797j4458l4647Q090L0978n9336m8087P3230N3839
$$ -59960 -105287 -72056 -10996 46801 32343 -2304 5786 36764 -22572 -70659 2571 56410
6661E6410k5180q3191Q7832j2762m1058m9474k5074N0877J7599l9107O9189r4925
$$ 56410 31230 -51961 35871 23109 -17949 -67423 -92497 -41620 -24021 -63128 6061 -88864
6649h8864L7336J7732r3472k5231L7798N3450P5374l6024k0735J9843O0429k8112
$$ -88864 -51528 -33796 -127268 -152499 -114701 -61251 14123 -21901 -42636 -22793 37636 9524
6637I524N6067M980j46412J01988l3943J265K4203J1051m1460K8805p4841p6350
$$ 9524 65591 70571 -75841 26147 -7796 -6531 17672 28723 -12737 16068 -58773 -135123
6625a35123K3140N1894K0802P5388l585r135m92l0107k519J587l1660n5443J11330
$$ -135123 -111983 -60089 -39287 36101 32516 23381 22889 -7218 -9737 -8150 -39810 -95253 16077
6612A6077j3173j01229J09011M0595j22326Q3915J4139q9962Q3368j1311J8696
$$ 16077 2904 -98325 10686 51281 -71045 12870 27009 -62953 20415 9104 27800
6601B7800N1477o0632J7259o781j1073r5265N3402o00o9707J34831j12897p647
$$ 27800 79277 18645 35904 29123 18050 -77215 -23813 -24413 -94120 40711 -72186 -79833
6589g9833M452j9157J44576Q779k3676k0192n1107J5483q5776J29437J0221O3315
$$ -79833 -75381 -94538 50038 58817 35141 14949 -36158 -20675 -106451 22986 33207 96522
6577I6522j3278n9426N6155p2345N820Q497p1186m5711P421N7667o5766K5191
$$ 96522 83244 23818 79973 7628 13448 21945 -49241 -94952 -87531 -29864 -95630 -70439
6565g0439N8627n5251n0956l3943R6632J5685Q6324j6247M8024o5039j61375J18776
$$ -70439 -11812 -67063 -118019 -151962 -55330 -39645 46679 30432 78456 13417 -147958 -29182
6553b9182M7524j02982L053N0434m7787j872L9513L2989O9823L9855r1502o0738
$$ -29182 18342 -84640 -81587 -31153 -78940 -80812 -41299 -8310 61513 101368 9866 -50872
6541e0872n0932P1502J9138L4558O0078n0539j8692q4292j7164l7720l3012L3491
$$ -50872 -101804 -30302 -11164 23394 83472 32933 14241 -70051 -87215 -124935 -157947 -124456
6529a24456O050J9134J08079k8731J3935J1856k3453k1748K074o8004J914L9455
$$ -124456 -118406 -99272 8807 -19924 -5989 5867 -17586 -39334 -37260 -105264 -103350 -63895
6517f3895L0928J5898l7202n6974k5399Q228J8719Q5478O388l2148m478o722J282
$$ -63895 -32967 -17069 -54271 -111245 -136644 -128416 -109697 -24219 -17831 -49979 -54457 -61179 -59897
6504e9897L1574N3391l6401O574K2552j43844J09982K6872J6539J2492r3241K6726
$$ -59897 -28323 25068 -11333 -4759 17793 -126051 -16069 10803 27342 39834 -53407 -26681
6492b6681Q564M006n0923Q2221l0430m7280L9117N2071J8933o3008l6389M3586
$$ -26681 -18117 -14111 -65034 17187 -13243 -60523 -21406 30665 49598 -13410 -49799 -6213
6480f213m7997j2926M4912K6122K2039p3463J1774L0011k3331k6491m9404k0374
$$ -6213 -54210 -67136 -22224 3898 25937 -47526 -35752 -5741 -29072 -55563 -104967 -125341
6468a25341P3023l7735Q0393J4282o1702L2573J9602J05609l1818j07209m5815
$$ -125341 -52318 -90053 -9660 4622 -57080 -24507 -4905 100704 68886 -38323 -84138
6457h4138N9898M2227m4243P9307m6873k5724k3599j602l7041n7888J11891k6503
$$ -84138 -24240 17987 -26256 53051 6178 -19546 -43145 -44747 -81788 -139676 -27785 -54288
6445e4288K2749K0347p1052O6552M0008N763Q698l9500k9571l6595O2470j5926
$$ -54288 -31539 -11192 -82244 -15692 24316 30079 38777 -723 -30294 -66889 -4419 -20345
6433b0345Q0608J8326n2641j06564L886P2106M156J2635n231J5308l5422r3623
$$ -20345 60263 78589 25948 -80616 -76730 -4624 -468 12167 6936 22244 -13178 -106801
6421a06801L4905M7752L7988L3654n3095L3064p8777M4927N7171J4493r0359n199
$$ -106801 -71896 -24144 13844 47498 -5597 27467 -51310 -6383 50788 65281 -25078 -30277
6409c0277j0523q8109O1740J7112M9077l175K6270k6128l7958j9492q3740O8870
$$ -30277 -40800 -128909 -67169 -50057 -980 -4155 22115 -4013 -41971 -61463 -145203 -76333
6397g6333N3582m9075P1382R395p884O1775j4560L9778k8607p4112r8615L0743
$$ -76333 -22751 -71826 -444 8951 1067 62842 48282 88060 59453 -14659 -113274 -82531
6385h2531L6052P2765L57n8323k8614M878N1726n6461J7806P556J142K2625l5322
$$ -82531 -46479 26286 26643 -31680 -60294 -55416 -3690 -60151 -42345 -34789 -33647 -11022 -46344
6372d6344N8791k54r5665J0827K8617n8285j0586M1427R1485M360m9129K8164
$$ -46344 12447 12193 -83472 -72645 -44028 -102313 -112899 -71472 20013 24373 -24756 3408
6360C408J2664p4599p9046l861K9375j0561K3861O3763K1954j8254l4023J4830
$$ 3408 16072 -58527 -137573 -141434 -112059 -122620 -98759 -34996 -13042 -31296 -65319 -50489
6348e0489j444K3767p2524O8872M4197o3832q66M3085m4911j3815O02K3706L6663
$$ -50489 -51933 -28166 -100690 -31818 12379 -51453 -52319 -9234 -54145 -67960 -67358 -43652 -6989
6335f989o3832m506q68k0353m1782J10448K6957o1364m6301O9666k9406n7876
$$ -6989 -70821 -75327 -76195 -96548 -138330 -27882 -925 -62289 -108590 -38924 -68330 -126206
6323a26206M2784K3536J8245k0157O932L3376j21558j2880O3152Q2844o9912j5232
$$ -126206 -83422 -59886 -41641 -61798 -54866 -21490 -143048 -155928 -92776 -9932 -79844 -95076
6311i5076J3990m5546K0754Q066Q7297k1599k8067p1906M4898O9058q4489P5123
$$ -95076 -81086 -126632 -105878 -97812 -10515 -32114 -60181 -132087 -87189 -18131 -102620 -27497
6299b7497J6082o5106K3202l7889R409K9188m094m6617N4653j4462l0127O9516
$$ -27497 -11415 -76521 -53319 -91208 -81799 -52611 -56705 -103322 -48669 -63131 -93258 -23742
6287b3742k0659L7770l4856m8572r419o1053J46457n0143J03622n1085n6722K6664
$$ -23742 -44401 -6631 -41487 -90059 -99478 -160531 -14074 -64217 39405 -11680 -68402 -41738
6275d1738o1299L3370N0377L5500O0945r884k4673q9641M1899j7303r547Q552
$$ -41738 -103037 -69667 -19290 16210 77155 67271 42598 -47043 -5144 -22447 -31994 -23442
6263b3442K5770Q8252o1229j161l134P8414q0249n2423m242O451K6552p4936N696
$$ -23442 2328 90580 29351 28190 25056 103470 23221 -29202 -33444 -26993 -441 -75377 -69681
6250f9681O2781q7118k352l8164M4215J2032m0839M9667Q668p0644k3933J45849
$$ -69681 -6900 -94018 -96370 -134534 -90319 -78287 -119126 -69459 -60791 -131435 -155368 -9519
6238i519J5394j6092m0164L1637n0694p3600P1861J01973K7744n0301p9579O0501
$$ -9519 5875 -10217 -50381 -18744 -69438 -143038 -71177 30796 58540 8239 -71340 -10839
6226a0839r252j00039K0270R6746o618n0658N8906J7087j0429L534p189j221j4847
$$ -10839 -20091 -120130 -99860 -3114 -9732 -60390 -1484 15603 5174 8708 1519 298 -14549
6213a4549m6872n4807J8093N6074k018M8619n0433L8509k1868o2160q6681K34423
$$ -14549 -61421 -116228 -98135 -42061 -44079 4540 -45893 -7384 -29252 -91412 -178093 56330
6201E6330M7059j36023L3822J450K0707M1660m8018l8386J5584m9341J222j47
$$ 56330 103389 -32634 1188 2638 23345 65005 16987 -21399 -5815 -55156 -53934 -54081
6189e4081k3006O5206N398o2100l364n7520k0811R9255Q2568j8469n7804J09166
$$ -54081 -77087 -11881 -6483 -68583 -71947 -129467 -150278 -51023 31545 13076 -44728 64438
6177F4438n2628n5023K8833K207m4559J6038k0469N7036j657n9688O5311K6557
$$ 64438 11810 -43213 -14380 -12173 -56732 -40694 -61163 -4127 -5784 -65472 -161 26396
6165B6396m7467p6591M5404j35732O6412M8570J9621M9889M910r6716M9601J8227
$$ 26396 -21071 -97662 -52258 -187990 -121578 -73008 -53387 -3498 1412 -95304 -45703 -27476
6153b7476j1512N6610L8361j30397J2038J12842j84578J07865N3855p7873m3569
$$ -27476 -38988 17622 55983 -74414 -62376 50466 -134112 -26247 27608 -50265 -93834
6142i3834p0722O4527M5630M7611Q971J00852j3244j74050L7542N5071j2673j390
$$ -93834 -164556 -100029 -54399 -6788 2183 103035 89791 -84259 -46717 8354 -4319 -5709
6130e709k3871J6483M661o8541l37N5628K1350r6945O8349k8260M7578p494n1027
$$ -5709 -29580 -13097 -8436 -76977 -77314 -21686 -336 -97281 -28932 -57192 -9614 -17108 -68135
6117f8135M620k3627L5857L9015O9477j12448m0125R3621j27484M3159O4292m5639
$$ -68135 -63515 -87142 -51285 -12270 57207 -55241 -95366 -1745 -129229 -86070 -21778 -67417
6105f7417L6444j1208j5459j5987P7526j60243L7280R9402J8125R4210l3400j70838
$$ -67417 -30973 -42181 -57640 -73627 3899 -156344 -119064 -19662 -1537 92673 59273 -111565
6093a11565L373J29159j24933l5306Q9277l6391M0937J3917o1081N6499N0650
$$ -111565 -108192 20967 -103966 -139272 -49995 -86386 -45449 -31532 -92613 -36114 14536
6082A4536r1516k0083M6113Q264K3817K8233q0250R2322p119j00016L2893m1405
$$ 14536 -76980 -97063 -50950 -42686 -18869 9364 -70886 21436 14317 -85699 -52806 -94211
6070i4211q0996P1712N7574p8726j1703L3091l8733O7741Q5251R173n6700j4254
$$ -94211 -175207 -103495 -45921 -124647 -136350 -103259 -141992 -74251 11000 20173 -36527 -50781
6058e0781j1065K7793N2957r2949P3860P609q4832J7944j8259k0326P9427r5142
$$ -50781 -61846 -34053 18904 -74045 -185 7424 -77408 -59464 -77723 -98049 -18622 -113764
6046a13764J7324M5509o9854q530J01199K0546K1132J19293j23433q7959N8174
$$ -113764 -96440 -50931 -120785 -129315 -28116 -7570 13562 132855 9422 -78537 -20363
6035b0363L4740n986N5348o1391p4351O2049q9423k1790J21120r0143l5179K0842
$$ -20363 14377 8391 63739 2348 -72003 -9954 -99377 -121167 -47 -90190 -125369 -104527
6023a04527N9184K0803K8311L5688L1186r1328o9274N7852m1801j8113o2843J79442
$$ -104527 -45343 -24540 3771 39459 70645 -20683 -89957 -32105 -73906 -92019 -154862 24580
6011B4580m2930j30939K7938Q742k1815O0057k5386O7663L195j07763J09398O8908
$$ 24580 -18350 -149289 -121351 -112609 -134424 -74367 -99753 -32090 -28895 -136658 -27260 41648
5999D1648k0116O1769M7673q0995M685k2091q1208J06218p2362j50154R9786l186
$$ 41648 21532 83301 130974 49979 54664 32573 -48635 57583 -14779 -164933 -65147 -68333
5987f8333P0201K5873K075l5554R9944M7113p5106L5789m1355l9335j3740j6745
$$ -68333 1868 27741 29816 -5738 94206 141319 66213 102002 60647 21312 7572 -9173
5975i173J2689k0414K3183J4130Q9123k3422o7419J76289p4690J3302L6349k0834
$$ -9173 3516 -16898 6285 20415 109538 86116 18697 194986 120296 133598 169947 149113
5963A49113j6362m024o0421j01334L7181K1086o5472K17268L718j06919o1532
$$ 149113 132751 128727 68306 -33028 4153 25239 -40233 177035 180753 73834 12302
5952A2302O2235J15444k351O32M0114R1455j59459n2021K7531J4497M1405n6992
$$ 12302 74537 189981 187630 188262 228376 319831 160372 108351 135882 150379 191784 134792
5940A34792j00796L9433j2183L3845P118R9358r0713p1470J6549o0874J09123
$$ 134792 33996 73429 61246 95091 102209 201567 110854 39384 55933 -4941 104182
5929A04182K5191m8043p0619M7071Q233k2733k7224K2140L8163k9945p1729o1388
$$ 104182 129373 81330 10711 57782 66015 43282 16058 38198 76361 46416 -25313 -86701
5917h6701L9434K3974o899N6261J789n5491l8694J9346O1959m898l4876K9025
$$ -86701 -47267 -23293 -30192 26069 27858 -27633 -66327 -46981 14978 10080 -24796 4229
5905D229k6337m8097M7899N611O2755n7852M5736P4011m9743q0376Q5954j257
$$ 4229 -22108 -70205 -22306 -16695 46060 -11792 33944 107955 58212 -22164 63790 62533
5893F2533l2335p8337J6195M3497j08300J44164K9725k4551m7907K0211k9577
$$ 62533 30198 -48139 -31944 11553 -96747 47417 77142 52591 4684 24895 -4682
5882d682Q6790q821J6640O0470j00012p4423m9798M9487n9147J18816m2535l5960
$$ -4682 82108 73287 89927 150397 50385 -24038 -73836 -24349 -83496 35320 -7215 -43175
5870d3175K2742k7529k1265K1354O067M7103N9758J6970l1093L460n8680R718
$$ -43175 -20433 -47962 -69227 -47873 -41806 5297 65055 82025 50932 54392 -4288 5430
5858E430J4697j36562q6061R2433N1397k4549J62882o4499l343M3929k5695q534
$$ 5430 20127 -116435 -202496 -110063 -58666 -83215 79667 15168 11825 55754 30059 21525
5846B1525J21678l2112N250q0047k8946m5699P5545p4027k8024J02242L944O1807
$$ 21525 143203 111091 116341 36294 7348 -38351 37194 -36833 -64857 37385 41329 103136
5834A03136j6256k4727l8706J07397k6101L983m9823r3987J30646L4213k6690
$$ 103136 86880 62153 23447 130844 104743 108726 58903 -35084 95562 129775 103085
5823A03085P0616j00267Q944q7299P0558J6108K6033J9825o1778n6820j8777N0578
$$ 103085 173701 73434 82378 -4921 65637 81745 107778 127603 65825 9005 -9772 40806
5811D0806p91P2958n0687L1564Q6388r7416j6488P4618p7936O4599m7466Q317
$$ 40806 40015 112973 62286 93850 180238 82822 66334 140952 63016 127615 80149 88466
5799H8466K8178K963N7345J2736q864j48120K6745J44976K2797j6049O5060M1797
$$ 88466 116644 119607 176952 189688 180824 32704 59449 204425 227222 211173 276233 318030
5787C18030n5770j478K1724r419O7725J5408J22899n9631k0410P8704N6254l4262
$$ 318030 262260 260782 282506 273087 340812 356220 479119 419488 399078 477782 534036 499774
5775D99774J9084J08686N6951R7438J12130J02154J51868J51910J32055K40818
$$ 499774 518858 627544 684495 781933 894063 996217 1148085 1299995 1432050 1672868
5765A672868L50223L40961M86711R15160J491864K262207K901381L219188K725431
$$ 1672868 2023091 2364052 2850763 3765923 5257787 7519994 10421375 13640563 16365994
5756A6365994J308992M2299n15057j341294j791835j989911j931506j823688j490915
$$ 16365994 17674986 17717285 17202228 15860934 14069099 12079188 10147682 8323994 6833079
5747F833079j319064j183341q90633m84781m00161l21427k59867j80356j12186
$$ 6833079 5514015 4330674 3440041 2955260 2555099 2233672 1973805 1793449 1681263
5738A681263k78386j34822o1057j06769j09300K9864k7169r8108j34206n6370
$$ 1681263 1402877 1268055 1206998 1100229 990929 1020793 993624 895516 761310 704940
5728G04940Q227P910l1076p3218L2636q2046l7932K753l6122K2858K4813m9442
$$ 704940 713167 721077 690001 616783 649419 567373 529441 532194 496072 518930 543743 494301
5716D94301M8206J8707o7618M7406M2152p4004j1849K9911o3985O545M1964J5538
$$ 494301 542507 561214 493596 541002 583154 509150 497301 527212 463227 469772 511736 527274
5704E27274m2620l8786Q894J9158j27673l9220J1958K3041m1752L60l4230K4569
$$ 527274 484654 445868 454762 473920 346247 307027 318985 342026 300274 300634 266404 290973
5692B90973k5659O8072K9727l4882j6691p9604J9542l2740j604P7238p9917J3484
$$ 290973 265314 333386 363113 328231 311540 231936 251478 218738 217134 294372 214455 227939
5680B27939N0120l2405j5073o4713N276R274K8460j09874L1697J20853p2950l3828
$$ 227939 278059 245654 230581 165868 171144 180418 208878 99004 130701 251554 178604 144776
5668A44776Q0019l2418p2542Q6348k0161l5004K014p7691L4077K4060j7614j1161
$$ 144776 224795 192377 119835 206183 186022 151018 153032 75341 109418 133478 115864 104703
5656A04703k376M0656n0388N3820j117P227K9524m4981J7911r2900J0394m2323
$$ 104703 102327 142983 92595 146415 145298 152525 182049 137068 154979 62079 72473 30150
5644C0150K9282K3181J2005J02639j07123m130K0003j42158J11546o936N2412
$$ 30150 59432 82613 94618 197257 90134 86004 106007 -36151 75395 68459 120871
5633A20871J8391l9869Q0798m9107J14623j7545K7491r6469n1595L2923N6668
$$ 120871 139262 99393 180191 131084 245707 228162 255653 159184 107589 140512 197180
5622A97180R8909n3844m6609k6866m5281L5042m661R1703P165Q0719M5155O25
$$ 197180 296089 242245 195636 168770 123489 158531 153870 245573 252738 333457 378612 379237
5610C79237M6003L1351P8774L9953K5611j26096n9975p1665k2757O1336Q5752
$$ 379237 425240 456591 535365 575318 600929 474833 414858 343193 320436 381772 467524
5599D67524K7097O8240j03143K8942m5217m8719O6962p3396k2286j0206j10552
$$ 467524 494621 562861 459718 488660 443443 394724 461686 388290 366004 355798 245246
5588B45246K3474K1350n1396Q4552j5699p4072o2348L6118J549O9002p455k8026
$$ 245246 268720 290070 238674 323226 307527 233455 171107 207225 208774 277776 270321 242295
5576B42295J2655n6047j8414N0510L4798J1634j3780j8231L79k5119K86J1893
$$ 242295 254950 198903 180489 230999 265797 277431 263651 245420 245799 220680 220966 232859
5564B32859N9162n7156j1331m3029J11830M0918J07239k622o3265K2382l6618
$$ 232859 292021 234865 223534 180505 292335 333253 440492 437870 374605 396987 360369
5553C60369l3654R0245P3155M3243P1812P721Q0290R5196L4241J35664L30478
$$ 360369 326715 416960 490115 533358 605170 612891 693181 788377 822618 958282 1288760
5542A288760J82457K87110K58981L02200J38015K2691M768R3346p629k9300J25555
$$ 1288760 1471217 1758327 2017308 2319508 2457523 2480214 2484982 2578328 2570699 2541399 2666954
5531B666954Q1239N6167N8968l353k3904j52537o2782j53481k09212j79309l02364
$$ 2666954 2748193 2804360 2863328 2859975 2836071 2683534 2620752 2467271 2258059 2078750 1776386
5520A776386j95209l18639j60599r3984n1354r0884j45258K971m5874j64519J5431
$$ 1776386 1581177 1262538 1101939 1007955 956601 865717 720459 723430 677556 513037 528468
5509E28468j9084M2543j09905k9703j8724m1964R0900o8776K8489K5443J5408
$$ 528468 509384 551927 442022 412319 393595 351631 442531 373755 402244 427687 443095
5498D43095m213L7614m3075N6136k1449n3266o8916m2516L4437J47275r174j9698
$$ 443095 438882 476496 433421 489557 468108 414842 345926 303410 337847 485122 475948 456250
5486D56250o5577m7860p5607r6566J57518r4595K6936O7900l7232J2858K3397
$$ 456250 390673 342813 267206 170640 328158 233563 260499 328399 291167 304025 327422
5475C27422K1541l131j15428j9997P1232O8353p569K3735Q4909J16603O2866l0950
$$ 327422 348963 345832 230404 210407 281639 349992 342423 366158 451067 567670 630536 599586
5463E99586p3271j22j3443r6721P358J6284l7436M3590o8055j22879P1280K4664
$$ 599586 526315 526193 512750 416029 423387 439671 402235 445825 377770 254891 326171 350835
5451C50835l6627N6083r8751l8883O0106j0115K7215L0834j36770m8980R7253
$$ 350835 314208 370291 271540 232657 292763 282648 309863 340697 203927 154947 252200
5440B52200P3113O1746J64725O518q2138J06912J8331L813Q193p0358k8175Q7924
$$ 252200 325313 387059 551784 558302 476164 583076 601407 605220 613413 543055 514880 602804
5428F02804j66055J9440K5965K5858j48335N096m756J9629O0795l3716K2275N0607
$$ 602804 436749 456189 482154 508012 359677 364773 360017 379646 440441 406725 429000 479607
5416D79607K5720m5346j1165m1055J6478P1498l0680n8627J4295l8192P7374P7990
$$ 479607 505327 459981 448816 407761 424239 495737 465057 406430 420725 382533 459907 537897
5404E37897l1026N992J07215n5974J15372J8545m9934m2669M0188n9715L4272
$$ 537897 506871 512863 620078 564104 679476 698021 648087 605418 645606 585891 620163
5393F20163m1491L2190P7711r8225o1267k0067R8843j4810J21832J39638l4806
$$ 620163 578672 610862 688573 590348 529081 509014 607857 593047 714879 854517 819711
5382H19711j0438k6365p2995L5168O2452J0014J19508M2721j05607M523m1500
$$ 819711 809273 782908 709913 745081 807533 817547 937055 979776 874169 878692 837192
5371H37192k4730Q08K9106j0965L1918m8098N3846J39189k6638j22167J02299
$$ 837192 812462 813270 842376 831411 863329 815231 869077 1008266 981628 859461 961760
5360I61760r584q3796R7816k6900O695J6627J2035k4774J45282m1949r580M9196
$$ 961760 952176 868380 966196 939296 945991 962618 974653 949879 1095161 1053212 1043632 1092828
5348A092828l8621J30311P4227o367n026l2427K5345L32Q2772R9619Q6198J62440
$$ 1092828 1054207 1184518 1258745 1252378 1247352 1214925 1240270 1240602 1323374 1422993 1509191 1671631
5336A671631n9646J65661J43058j4398J70368Q1638j17109J39030K40134J36812
$$ 1671631 1611985 1777646 1920704 1906306 2076674 2158312 2041203 2180233 2420367 2557179
5326B557179J62801J97749J20292K86366K28390J30651L47566L66649K03081K79442
$$ 2557179 2719980 2917729 3038021 3324387 3552777 3683428 4030994 4397643 4600724 4880166
5316D880166M51361L62870N42072O72669Q37095J110823J182274J317756J782300
$$ 4880166 5331527 5694397 6236469 6909138 7746233 8857056 10039330 11357086 13139386
5307A3139386K144120L115185M887887P455731R661963J0988947J0367622P327904
$$ 13139386 15283506 18398691 23286578 30742309 40404272 51393219 61760841 69088745
5299F9088745L402692M65169j670245l646036m001928k860854j22718K806870
$$ 69088745 72491437 72956606 71286361 67640325 63638397 60777543 60654825 63461695
5291F3461695N145056O006247M528236J192946j649106l767057o005059p556668
$$ 63461695 68606751 74612998 79141234 80334180 78685074 74918017 68912958 61356290
5283F1356290q062090p688418o899049o189839n438773m340524l427446k429657
$$ 61356290 53294200 45605782 38706733 32516894 27078121 22737597 19310151 16880494
5275A6880494j796444j547830j192477r84960r89594q33215o57216o11789n62314
$$ 16880494 15084050 13536220 12343743 11358783 10369189 9535974 8878758 8266969 7704655
5266G704655m41327l90074k72073k14466k65757k88610k49047j67010k06680j80416
$$ 7704655 7263328 6873254 6601181 6386715 6120958 5832348 5583301 5416291 5209611 5029195
5256E029195k48047o7264j28974j76114n5782o065j27122j67370p3291j96362
$$ 5029195 4781148 4713884 4584910 4408796 4353014 4346949 4219827 4052457 3979166 3782804
5246C782804K2205q3633j08575M155j3044j92662j31122j47292j1841j09899p5874
$$ 3782804 3805009 3721376 3612801 3616956 3603912 3411250 3280128 3132836 3120995 3011096 2935222
5235B935222j7019K0032o6706j62543L2070k9705j51087k8309j62089M857j5072
$$ 2935222 2918203 2938235 2871529 2708986 2741056 2711351 2560264 2531955 2369866 2374723 2359651
5224B359651j48801k0728j2880L5082q0792n4606k8608qo1021l5109n4305p779
$$ 2359651 2210850 2190122 2177242 2212324 2131532 2076926 2048318 2048310 1987289 1952180 1897875 1890096
5212A890096j15968k6853M6465l2474j33625L132q2919n3377m2773j03423P7429
$$ 1890096 1774128 1747275 1793740 1761266 1627641 1630773 1547854 1494477 1451704 1348281 1425710
5201A425710J35765q7675k9103m336p4020j08129J06746p0998q0509J99985R01
$$ 1425710 1561475 1473800 1444697 1440361 1366341 1258212 1364958 1293960 1213451 1413436 1414337
5190A414337o1634j52232K1040J0206M9987p1199n5540N5156N101M4660O411P4713
$$ 1414337 1352703 1200471 1221511 1231717 1281704 1210505 1154965 1210121 1215222 1259882 1266293 1341006
5178A341006j13462j85014k1401j6773o675J18615r155J9774k0984M3138m1244
$$ 1341006 1227544 1042530 1021129 1004356 997681 1116296 1107141 1126915 1105931 1149069 1107825
5167A107825l0453j6253m5274M4015j692j5752k5898J1316n866J133L1601n6890
$$ 1107825 1077372 1061119 1015845 1059860 1058168 1042416 1016518 1027834 1021968 1023101 1054702 997812
5155I97812o9211J4250k1678J06571n3779L1128j8247L4798q1110k8463Q4497
$$ 997812 928601 942851 921173 1027744 973965 1005093 986846 1021644 940534 912071 996568
5144I96568l4721m5214l8791m2648j1990Q1208O655k0936k5076p0609l4943Q1426
$$ 996568 961847 916633 877842 835194 823204 904412 911067 890131 865055 794446 759503 840929
5132H40929l2417N0904P0133M0098r6095M0209n4636P9446n3168l0739p479L6916
$$ 840929 808512 859416 929549 969647 873552 913761 859125 938571 885403 854664 847185 884101
5120H84101N6491Q1254M3619n0064K1367j18199m4019q7912J07069N7265L045
$$ 884101 940592 1021846 1065465 1015401 1036768 918569 874550 786638 893707 950972 954017
5109I54017J796J04370j6795j16131p4736J1775j04365O6226L5812m7434p068
$$ 954017 955813 1060183 1043388 927257 852521 864296 759931 826157 861969 814535 807467
5098H07467M0347O3828N7836o845j11810l8202J6549j6342j7588P3236K0454J2996
$$ 807467 847814 911642 969478 962633 850823 812621 829170 812828 795240 868476 888930 901926
5086I01926q087k2388n9971m0325l6510J04443R751o2905P3059k5252J7544J2606
$$ 901926 893839 871451 811480 771155 734645 839088 848839 785934 858993 833741 851285 863891
5074H63891L7702J1389J9462q0334Q0456P1118Q237j0014o511J2950p9715Q5668
$$ 863891 901593 912982 932444 852110 932566 1003684 1011921 1001907 995396 1008346 928631 1014299
5062A014299Q4693j14119m4214m0562K9337P0211L7525O9883o2225J486n1164
$$ 1014299 1098992 984873 940659 900097 929434 999645 1037170 1107053 1044828 1046314 995150
5051I95150P0699q1361j106J2720K5840M5322K0199o6260n3447K9285J3739j9363
$$ 995150 1065849 984488 983382 996102 1021942 1067264 1087463 1021203 967756 997041 1010780 991417
5039I91417M710l831m9714O4562m6809j8956o937P2824m1788l8104L4361P317
$$ 991417 996127 992296 942582 1007144 960335 941379 934442 1007266 965478 927374 961735 969052
5027I69052J3800J3019M3376L1347n9242O4173j7801M1265J16q066j2342m0258
$$ 969052 982852 995871 1039247 1070594 1011352 1075525 1057724 1098989 1099105 1091039 1078697 1038439
5015A038439L8103k5214O2364O8405K7802k0169M5665J6930n715M3048N2093n2821
$$ 1038439 1076542 1051328 1113692 1182097 1209899 1189730 1235395 1252325 1246610 1289658 1341751 1288930
5003A288930J02241k8884j8664L1766N5184K13366J12278Q3656R8826J88677K32980
$$ 1288930 1391171 1362287 1343623 1375389 1430573 1643939 1756217 1839873 1938699 2127376 2360356
4992B360356K82553K78511J86521N0658N2640k7155j24453k19002k09813j28193
$$ 2360356 2642909 2921420 3107941 3158599 3211239 3184084 3059631 2840629 2630816 2502623
4982B502623j24033l37825j05730O1745J27m660M7087j9800j01325p699l3204
$$ 2502623 2378590 2040765 1935035 1996780 1996907 1992247 2039334 2019534 1918209 1910510 1877306
4971A877306o410n5835j9370j04733M9035j06416n4891j9890n1N5298o2830n1785
$$ 1877306 1870896 1815061 1795691 1690958 1739993 1633577 1578686 1558796 1558745 1614043 1551213 1499428
4959A499428J40905o3684j3339J10080m6521m1536O2449j06975O1258J07603l7234
$$ 1499428 1640333 1576649 1563310 1673390 1626869 1585333 1647782 1540807 1602065 1709668 1672434
4948A672434Q43K7351M0496j27726O0281J2501J0409O3739Q562M5377P6193n5198
$$ 1672434 1673277 1700628 1741124 1613398 1673679 1686180 1696589 1760328 1768890 1814267 1890460 1835262
4936A835262n7060J05395m9769q7893J23841r1874q7065J22608k9453M4008P2224
$$ 1835262 1778202 1883597 1833828 1745935 1869776 1777902 1690837 1813445 1783992 1828000 1900224
4925A900224m6723J326M3611j9519M8193N5879L8457O850l1544n5904J10066P5787
$$ 1900224 1853501 1854827 1898438 1878919 1927112 1982991 2021448 2028298 1996754 1940850 2050916 2126703
4913B126703J6117M2408l7211p6522m4933J32399m4059J10040M5796N6742J8128
$$ 2126703 2142820 2185228 2148017 2071495 2026562 2158961 2114902 2224942 2270738 2327480 2345608
4902B345608l8585l8356m7474Q5660P411P1545K0511K1756J03776l4036j01547
$$ 2345608 2307023 2268667 2221193 2306853 2314264 2385809 2406320 2428076 2531852 2497816 2396269
4891B396269m929n6843J4238P818J19525L1454J11758J7772o4489J9029o3010
$$ 2396269 2391340 2334497 2348735 2356553 2476078 2507532 2619290 2637062 2572573 2591602 2528592
4880B528592M8394J06194m8420m3912J03796l30M1456J19609J3482n1113O7362
$$ 2528592 2576986 2683180 2634760 2590848 2694644 2694314 2735770 2855379 2868861 2817748 2885110
4869B885110j14799M884n3420J23933M4931J18056P444M1397J47191k0175J1021
$$ 2885110 2770311 2775195 2721775 2845708 2890639 3008695 3016139 3057536 3204727 3184552 3195573
4858C195573P9680l7710J30683K18735J19692J74913L15424K34609J55481J54272
$$ 3195573 3275253 3237543 3368226 3586961 3706653 3881566 4196990 4431599 4587080 4741352
4848D741352p578Q8976N0676r7959j14466K3115n9899j65017p0104m1168k5778
$$ 4741352 4733774 4822750 4873426 4775467 4661001 4684116 4624217 4459200 4389096 4347928 4322150
4837D322150L3201k2584J44877J47226N3622K46636J43005N2993K37733L15795
$$ 4322150 4355351 4332767 4477644 4624870 4678492 4925128 5068133 5121126 5358859 5674654
4827E674654L84831P48557J282712J810003K325236K303037J709027P26273k10756
$$ 5674654 6059485 6808042 8090754 9900757 12225993 14529030 16238057 16964330 16753574
4818A6753574o05420j079724j295787j274317j241381j147644j033292p90331
$$ 16753574 16148154 15068430 13772643 12498326 11256945 10109301 9076009 8285678
4810H285678p73274n10097k84499k92072j82234M0949k34605o0951L4315m0233
$$ 8285678 7512404 7002307 6717808 6425736 6243502 6284451 6049846 5988895 6023210 5982977
4800E982977j56469o7962n2722l5878K9574L8009k678n646J01362j4838Q7977
$$ 5982977 5826508 5758546 5705824 5669946 5699520 5737529 5734851 5729205 5830567 5815729 5903706
4789E903706k4740p6268N5322j5125j0143O4884J11474R2173P9009L3459M7986
$$ 5903706 5878966 5802698 5858020 5842895 5832752 5897636 6009110 6101283 6180292 6213751 6261737
4778F261737J37736j22661M1615R6887k6855J45327R0849K8048P8166O8915j07090
$$ 6261737 6399473 6276812 6318427 6415314 6388459 6533786 6624635 6652683 6730849 6799764 6692674
4767F692674J78353L3954j14542P5997J31255R4570J35380K1127K8900J05387
$$ 6692674 6871027 6904981 6790439 6866436 6997691 7092261 7227641 7248768 7277668 7383055
4757G383055l7726K8765J41415j8855j2508J88203K5052J640O8425J31499J75570
$$ 7383055 7345329 7374094 7515509 7496654 7484146 7672349 7697401 7699041 7767466 7898965 8074535
4746H074535M1984q5755k0265O2932O8706N8148K32448N0231P2459N8751J7867
$$ 8074535 8116519 8030764 8010499 8073431 8142137 8200285 8432733 8482964 8555423 8614174 8632041
4735H632041P3362M1658R7766N3255R7237N464J87597M2697N1004J85248P235
$$ 8632041 8705403 8747061 8844827 8898082 8995319 9000783 9188380 9231077 9282081 9467329 9474564
4724I474564j05911J39740Q9381M7471K3658K32457J21184N1851R1971k8691R4147
$$ 9474564 9368653 9508393 9597774 9645245 9668903 9901360 10022544 10074395 10166366 10137675 10231822
4713A0231822J228j194R8902J38697J4523J97301J46795R3286j2168N4345P5345
$$ 10231822 10233050 10231856 10330758 10469455 10483978 10681279 10828074 10921360 10909192 10963537 11038882
4702A1038882Q4500k1883Q9800J22434M6334Q9296J12066j8347k6468Q0521J32910
$$ 11038882 11123382 11101499 11191299 11313733 11360067 11449363 11561429 11543082 11516614 11597135 11730045
4691A1730045J0095J03075R4086k9554P7143Q1427R2931J28040o680K467J82576
$$ 11730045 11740140 11843215 11937301 11907747 11984890 12066317 12159248 12287288 12280608 12283075 12465651
4680A2465651K6527p4262J37801L2013Q7952k2763J0178J67025R356o8726K8752
$$ 12465651 12492178 12417916 12555717 12587730 12675682 12652919 12663097 12830122 12839478 12770752 12799504
4669A2799504J08320n0213K991J00035O4823J43136N2428K9078j4847n372L8090
$$ 12799504 12907824 12857611 12860602 12960637 13025460 13168596 13221024 13250102 13235255 13229883 13267973
4658A3267973M4445m491q2502J5660K2885M3077J533m2855p7438J44719K8562
$$ 13267973 13312418 13307927 13225425 13241085 13263970 13307047 13308580 13265725 13188287 13333006 13361568
4647A3361568p2735N5079Q0057j16479N5569L8082K0785P3966m486q3042J5014
$$ 13361568 13288833 13343912 13423969 13307490 13363059 13401141 13421926 13495892 13491406 13408364 13423378
4636A3423378J47745n2333N0593P7457O1417K26511K12727L19395P00669O07199
$$ 13423378 13571123 13518790 13569383 13646840 13708257 13934768 14147495 14466890 15167559 15774758
4626A5774758O40695M93557L0968l0126j60781m05915m61210l41550l63402k82805
$$ 15774758 16415453 16909010 16939978 16909852 16749071 16343156 15881946 15540396 15176994 14894189
4616A4894189j98140l03382q5148K4003R1708K18642M32693L43046L01910K55023
$$ 14894189 14696049 14392667 14307519 14331522 14423230 14641872 15074565 15417611 15719521 15974544
4606A5974544J45602L34466K42878K34915N31867O42509M50939M19949L96842
$$ 15974544 16120146 16454612 16697490 16932405 17464272 18106781 18557720 18977669 19374511
4597A9374511J47589J68864K05231K03903N27010N13882K86920J87788l3097l31319
$$ 19374511 19522100 19690964 19896195 20100098 20627108 21140990 21427910 21615698 21582601 21251282
4587B1251282l79151k99425k70286k52520k40365m58353l02950m59858n90765
$$ 21251282 20872131 20572706 20302420 20049900 19809535 19351182 19048232 18588374 17997609
4578A7997609m54811n05271n26322l90556m86063o35195m03379n41151n80312
$$ 17997609 17542798 17037527 16511205 16120649 15634586 14999391 14596012 14054861 13474549
4569A3474549l60208m32347l99451l15941k73475k49641k28362k20084k03662
$$ 13474549 13114341 12681994 12282543 11966602 11693127 11443486 11215124 10995040 10791378
4560A0791378n5406k6835j57182N8035p9001n5176j96219j34859M9417N2756j14554
$$ 10791378 10735972 10709137 10551955 10609990 10530989 10475813 10279594 10144735 10194152 10246908 10132354
4549A0132354m4588J42963q4278r0869r823j84295j70632j06780k06920m4563
$$ 10132354 10087766 10230729 10146451 10055582 10045759 9861464 9690832 9584052 9377132 9332569
4539I332569q2693j76200m0964J3833k60835j17304q2956j44037j05053p1151
$$ 9332569 9249876 9073676 9032712 9046545 8785710 8668406 8585450 8441413 8336360 8265209
4529H265209j79169O1109N4379o1026Q8046j7557m6605M1032P8185L8484J93425
$$ 8265209 8086040 8147149 8201528 8140502 8228548 8210991 8164386 8205418 8283603 8322087 8515512
4518H515512Q7590J50834L94287L78459L38716M92785Q87471J247077J954629
$$ 8515512 8603102 8753936 9148223 9526682 9865398 10358183 11245654 12492731 14447360
4509A4447360K363952K702227K598848J770200P65675M11483K1797k45346j15217
$$ 14447360 16811312 19513539 22112387 23882587 24648262 25059745 25081542 24836196 24720979
4500B4720979N38413J710059K957541L654942L824949K669450O00866o32535j188127
$$ 24720979 25259392 26969451 29926992 33581934 37406883 40076333 40677199 40044664 38856537
4491C8856537j929204k713668k541561j996652j200951m37689j98736l09668n21437
$$ 38856537 36927333 34213665 31672104 29675452 28474501 28036812 27838076 27528408 27006971
4482B7006971j137762j339128j469673j972640k029125j900559j910458j523664
$$ 27006971 25869209 24530081 23060408 21087768 19058643 17158084 15247626 13723962
4474A3723962j484038j158809p30807o65757o80146m01200l19444m03888k06784
$$ 13723962 12239924 11081115 10350308 9684551 9004405 8603205 8283761 7879873 7673089
4465G673089j23745j67744j70913j15306k67574j05278j66089j23093k03496j43273
$$ 7673089 7549344 7381600 7210687 7095381 6827807 6722529 6556440 6433347 6229851 6086578
4455F086578j29665n0843N2131k3699K8290j28132j39366j34606k41333n4734
$$ 6086578 5956913 5906070 5958201 5934502 5962792 5834660 5695294 5560688 5319355 5264621
4445E264621N4007R27l2254j9933j30160j27541k3913j48289p0967j27053q1034
$$ 5264621 5318628 5319555 5287301 5267368 5137208 5009667 4985754 4837465 4766498 4639445 4558411
4434D558411p5940Mk5113j4070j2666j00208j6542k7747j46803j80772k1858l4184
$$ 4558411 4482471 4482475 4457362 4443292 4430626 4330418 4313876 4286129 4139326 3958554 3936696 3902512
4422C902512L0781q0592n5217j9412j10172j53635R031M5012o2128K365k4536
$$ 3902512 3933293 3852701 3797484 3778072 3667900 3514265 3523296 3568308 3506180 3508545 3484009
4411C484009o8008J7682J0771q4895o7773P663o3285p9395M8228p3505O0536p3882
$$ 3484009 3416001 3433683 3444454 3359559 3291786 3299449 3236164 3156769 3204997 3131492 3192028 3118146
4399C118146J3613j465p5982q8623K6868l3553j9884K2494o0488N2406M8452p4743
$$ 3118146 3131759 3130294 3054312 2965689 2992557 2959004 2939120 2961614 2901126 2953532 3001984 2927241
4387B927241j25085P735j6717q017L8732Q8359p2676o7230l1444N9366L7119r0106
$$ 2927241 2802156 2809891 2793174 2785157 2823889 2912248 2839572 2772342 2740898 2800264 2837383 2747277
4375B747277j4088J4440j64104k4311M5845r497J7312l4373n7406L8849m3062
$$ 2747277 2733189 2747629 2583525 2559214 2605059 2595562 2612874 2578501 2521095 2559944 2516882
4364B516882j10121L6968N7487m4177M445N7968q9738n7659J2479N0978J7728
$$ 2516882 2406761 2443729 2501216 2457039 2461484 2519452 2429714 2372055 2384534 2435512 2453240
4353B453240k1624K5245J94235J35301O2134J48505R2560Q6L5257j5077j68325
$$ 2453240 2431616 2456861 2651096 2786397 2848531 2997036 3089596 3089682 3124939 3109862 2941537
4342B941537j38699j50785o2738N590n0479j13422k0940j12621l3315M9668o2516
$$ 2941537 2802838 2652053 2589315 2594905 2544426 2431004 2410064 2297443 2264128 2313796 2251280
4331B251280n7810J4306N8514m0387j9912o5113N4201q2526n3115N1146M6837
$$ 2251280 2193470 2207776 2266290 2225903 2205991 2140878 2195079 2112553 2059438 2110584 2157421
4320B157421k7800O358n0910O233O1162Q782j04939J61773M8875j04937K4085
$$ 2157421 2129621 2135979 2085069 2091302 2152464 2161246 2056307 2218080 2266955 2162018 2186103
4309B186103q819k5837K2055N1472n1992J5286q1010K2965O4035Q352n7961K0161
$$ 2186103 2177284 2151447 2173502 2224974 2172982 2188268 2107258 2130223 2194258 2202610 2144649 2164810
4297B164810m4187J7493N1314j7490K8J03088r6085N1843J4185n4514J3378K5395
$$ 2164810 2120623 2138116 2189430 2171940 2171968 2275056 2178971 2230814 2244999 2190485 2203863 2229258
4285B229258O682m2532O0966P643j6280N4023J3528k7515O0029O9246l7550k0808
$$ 2229258 2235940 2193408 2254374 2262017 2245737 2299760 2313288 2285773 2345802 2415048 2377498 2356690
4273B356690K3480P2732J45740p5337j7840O3291j51373k3923Q8134q2681R4782
$$ 2356690 2380170 2452902 2598642 2523305 2505465 2568756 2417383 2393460 2481594 2398913 2493695
4262B493695L2157O1676m51N8566k5386o4213N8521q7167m8084J01229J6755J349
$$ 2493695 2525852 2587528 2587077 2645643 2620257 2556044 2614565 2527398 2479314 2580543 2597298 2598647
4250B598647J34804P9331m8137P1489n0340k2246N5850R963K6280N4693O2763
$$ 2598647 2733451 2812782 2764645 2836134 2785794 2763548 2819398 2829361 2855641 2910334 2973097
4239B973097N2057J05824L455o0807L609Q340J00849M8833O3824J17337J27565
$$ 2973097 3025154 3130978 3134433 3073626 3077235 3085575 3186424 3235257 3299081 3416418 3543983
4228C543983R6917N0890J43521J34018J82291O5431J04779J34467K40718K06531
$$ 3543983 3640900 3691790 3835311 3969329 4151620 4217051 4321830 4456297 4697015 4903546
4218D903546K96319K09591K44310K75713K75216K97273M29023M21647N30975N49586
$$ 4903546 5199865 5409456 5653766 5929479 6204695 6501968 6930991 7352638 7883613 8433199
4208H433199P15932O09195O05646O59262O62836Q57867R35269R61987J244307
$$ 8433199 9149131 9758326 10363972 11023234 11686070 12543937 13479206 14441193 15685500
4199A5685500J161746J171092J302508J279045J204957J377680J502397J496009
$$ 15685500 16847246 18018338 19320846 20599891 21804848 23182528 24684925 26180934
4191B6180934J485373J630933J792323J785851J885919J873496K002160J915465
$$ 26180934 27666307 29297240 31089563 32875414 34761333 36634829 38636989 40552454
4183D0552454J940031J925663J947565J818110J823600J751784J583387J598627
$$ 40552454 42492485 44418148 46365713 48183823 50007423 51759207 53342594 54941221
4175E4941221J559970J483870J553466J433012J450481J472675J331426J148370
$$ 54941221 56501191 57985061 59538527 60971539 62422020 63894695 65226121 66374491
4167F6374491R81716P39855N48986K60719J92574K2036j49070k29118k41076k48405
$$ 66374491 67356207 68096062 68645048 68905767 69098341 69120377 68971307 68742189 68501113 68252708
4157F8252708l39643m84581n48458p64280r23489j030726j188463j398187j349195
$$ 68252708 67913065 67428484 66880026 66115746 65192257 64161531 62973068 61574881 60225686
4148F0225686j513466j587920j645702j727428j715903j657388j706925j734747
$$ 60225686 58712220 57124300 55478598 53751170 52035267 50377879 48670954 46936207
4140D6936207j637649j699431j613437j608995j623677j565680j633135j729664
$$ 46936207 45298558 43599127 41985690 40376695 38753018 37187338 35554203 33824539
4132C3824539j647534j648701j596791j495610j342599j429957j316595j060198
$$ 33824539 32177005 30528304 28931513 27435903 26093304 24663347 23346752 22286554
4124B2286554j135643j075160j127151j029013r47944q08958q43218q84662o24324
$$ 22286554 21150911 20075751 18948600 17919587 16971643 16162685 15319467 14434805 13810481
4115A3810481p32565p24508n56955o34018o19463n04475n08246m59371l13131
$$ 13810481 13077916 12353408 11796453 11162435 10542972 10038497 9530251 9070880 8757749
4106H757749l81057l93997j79754k98997k28030k65356k75585k19634j96416k44669
$$ 8757749 8376692 7982695 7802941 7503944 7275914 7010558 6734973 6515339 6318923 6074254
4096F074254j95197n7121r0023r0355n3911j23227n7159l2776n5572l3522R308
$$ 6074254 5879057 5821936 5731913 5641558 5587647 5464420 5407261 5374485 5318913 5285391 5294699
4085E294699O4223J71761J97338m8421J8180P6510k706l3026q9648q1782J19186
$$ 5294699 5358922 5530683 5728021 5679600 5697780 5774290 5771584 5738558 5648910 5567128 5686314
4074E686314n9731o6431O8786p862r3265j8851j69908o0833p92r0493j5052o7898
$$ 5686314 5626583 5560152 5628938 5621076 5527811 5508960 5339052 5278219 5277427 5186934 5171882 5103984
4062E103984r1989j38877p7532j40965j07156q0553L8968q9978N4739j10002r0781
$$ 5103984 5011995 4873118 4795586 4654621 4547465 4466912 4505880 4415902 4470641 4360639 4269858
4051D269858L1563o5798o7415Q2136p0678J2086K7798j03290l7696N2452l5849
$$ 4269858 4301421 4235623 4168208 4250344 4179666 4191752 4219550 4116260 4078564 4131016 4095167
4040D095167j08441j9979j16925q3739J3593o6259o9491l1140j06935l7895j0321
$$ 4095167 3986726 3966747 3849822 3766083 3779676 3713417 3643926 3612786 3505851 3467956 3457635
4029C457635j24555j11616P4067q1811j6439N8753j20674j0815o3199q5880L7750
$$ 3457635 3333080 3221464 3295531 3213720 3197281 3256034 3135360 3124545 3061346 2975466 3013216
4018C013216k4196o7709r1207k0490J5019m9825K9689l0225p241O0006j82202
$$ 3013216 2989020 2921311 2830104 2809614 2824633 2774808 2804497 2774272 2767031 2827037 2644835
4007B644835l4694P023l8469N6749K0627n4699J5556o4096L1717P817q3299l3762
$$ 2644835 2610141 2617164 2578695 2635444 2656071 2601372 2616928 2552832 2584549 2592366 2509067 2475305
3995B475305l870K412o911k6380L1717j13063j9383M2156j40898Q4100J8960k6541
$$ 2475305 2471435 2473847 2466936 2440556 2472273 2359210 2339827 2381983 2241085 2325185 2344145 2317604
3983B317604m4858n1721R214O250m7996j16490k2484K9683m2009J03417n2022
$$ 2317604 2272746 2221025 2230239 2236489 2188493 2072003 2049519 2079202 2037193 2140610 2088588
3972B088588j06102j1894o245P3553K8103J431p0365k0109J5263J2347J17882
$$ 2088588 1982486 1970592 1964347 2037900 2066003 2067434 1997069 1976960 1992223 2004570 2122452
3961B122452L561Q2583R6415n8688O1982N8966J7485O0565J47406m950J17788
$$ 2122452 2126013 2208596 2305011 2246323 2308305 2367271 2384756 2445321 2592727 2587777 2705565
3950B705565J27564J7837K43626M16282L51877L56803M07776J43370P0453J3108
$$ 2705565 2833129 2850966 3094592 3510874 3862751 4219554 4627330 4770700 4841153 4854261
3940D854261j22518R354j1925r4906L8145J58931M8230J62287K58619M4670J32810
$$ 4854261 4731743 4741097 4729172 4634266 4672411 4831342 4879572 5041859 5300478 5345148 5477958
3929E477958Q6829l1854J04007N7495p7634Q407J49235m5351k3381Q2891N0984
$$ 5477958 5564787 5532933 5636940 5694435 5616801 5625208 5774443 5729092 5705711 5788602 5839586
3918E839586J44658K76732J98250K53510K49293J00899k3733k06584l73981l48995
$$ 5839586 5984244 6260976 6459226 6712736 6962029 7062928 7039195 6832611 6458630 6109635
3908F109635l95465m04787l61364l06326k70275j75820j40709k55829r9054r5455
$$ 6109635 5714170 5309383 4948019 4641693 4371418 4195598 4054889 3799060 3700006 3604551
3898C604551l7271M1483r1140n1644J12421j7128j9735L5251K0588J9845J24238
$$ 3604551 3567280 3608763 3517623 3465979 3578400 3561272 3541537 3576788 3597376 3617221 3741459
3887C741459M16l3536J93985J6757P5901J82819K8428O7598J69695N7238J9520
$$ 3741459 3741875 3708339 3902324 3919081 3994982 4177801 4206229 4273827 4443522 4500760 4520280
3876D520280J60658K04510J68990J82456J23353J32850L36045K29560J51990L48623
$$ 4520280 4680938 4885448 5054438 5236894 5360247 5493097 5829142 6058702 6210692 6559315
3866F559315L25778M00127M74070L84324M67224N96659N60177O08375M54364M56701
$$ 6559315 6885093 7285220 7759290 8143614 8610838 9207497 9767674 10376049 10830413 11287114
3856A1287114N37142N15462L92416M60634N48631L93943M76133N93599M37513
$$ 11287114 11824256 12339718 12732134 13192768 13741399 14135342 14611475 15205074 15642587
3847A5642587M22916N68060M24980M91023M45042L12251L07624K81115K7710n368
$$ 15642587 16065503 16633563 17058543 17549566 17994608 18306859 18614483 18895598 18923308 18917940
3837A8917940j14964j18374q7171j9838j61421k6502j6814k4211J61212q6278
$$ 18917940 18802976 18684602 18597431 18577593 18416172 18389670 18372856 18348645 18509857 18423579
3827A8423579j81904l5450n7220j51372K9781O2055l3523J34693J50786K18017
$$ 18423579 18241675 18206225 18149005 17997633 18027414 18089469 18055946 18190639 18341425 18559442
3817A8559442L27853L86144M76886O65884Q23198R53846J316632J595537J766926
$$ 18559442 18887295 19273439 19750325 20416209 21239407 22193253 23509885 25105422 26872348
3808B6872348K158570K392063K622838K969584L151698L393499L709811L814669
$$ 26872348 29030918 31422981 34045819 37015403 40167101 43560600 47270411 51085080
3800E1085080L996258M310851M518965M675784N089147N431050N862762O266696
$$ 51085080 55081338 59392189 63911154 68586938 73676085 79107135 84969897 91236593
3792I1236593O412492O683647O839950O511339O207290O087873N322288M809615
$$ 91236593 97649085 104332732 111172682 117684021 123891311 129979184 135301472 140111087
3784A40111087M494876M021210L858105L860516L848107M167268M328791M496270
$$ 140111087 144605963 148627173 152485278 156345794 160193901 164361169 168689960 173186230
3776A73186230M694729M845353M728869M971631N228250N647320O293822P230828
$$ 173186230 177880959 182726312 187455181 192426812 197655062 203302382 209596204 216827032
3768B16827032Q151585R279909J0051790J0072487R640939Q455936O679650M475170
$$ 216827032 224978617 234258526 244310316 254382803 264023742 272479678 279159328 283634498
3760B83634498K173557j71375j990402l443437m536840m725437m701156m188959
$$ 283634498 285808055 285636680 283646278 280202841 275666001 270940564 266239408 262050449
3752B62050449l523104l184784k944949l457814m652408o404198q362628j0506823
$$ 262050449 258527345 255342561 252397612 248939798 244287390 237883192 229520564 219013741
3744B19013741j2516053j3893425j4832811j5236672j4819575j4082730j2890338
$$ 219013741 206497688 192604263 177771452 162534780 147715205 133632475 120742137
3737A20742137j1481280j0038885q565058p171492o110252m926213l988463l344684
$$ 120742137 109260857 99221972 90656914 83485422 77375170 72448957 68460494 65115810
3729F5115810k579315j856862j332080o44925j05673O44734J136719J732291K163036
$$ 65115810 62536495 60679633 59347553 58702628 58596955 59241689 60378408 62110699 64273735
3720F4273735K436024K648367K469527K281237J818479J235993P90500L33136
$$ 64273735 66709759 69358126 71827653 74108890 75927369 77163362 77953862 78286998
3712G8286998k11539n39147p26330p49894q12210o39636p14984n52393o85930
$$ 78286998 78075459 77536312 76809982 76060088 75247878 74608242 73893258 73340865 72654935
3703G2654935j018153j357279j761994k375533k853772l185143l503543l683846
$$ 72654935 71636782 70279503 68517509 66141976 63288204 60103061 56599518 52915672
3695E2915672l641171l663638l401133l126155l100514k712036k369789k093400
$$ 52915672 49274501 45610863 42209730 39083575 35983061 33271025 30901236 28807836
3687B8807836j792314j577840j447965j143462j034208j032753q57268p67878
$$ 28807836 27015522 25437682 23989717 22846255 21812047 20779294 19922026 19154148
3679A9154148p90111o59056n48092n81253n32692m86472l14539l89878k97098
$$ 19154148 18364037 17704981 17156889 16575636 16042944 15556472 15241933 14852055 14554957
3670A4554957l63982l38891l31606k73410k38908k92044k50661k00426k40643
$$ 14554957 14190975 13852084 13520478 13247068 13008160 12716116 12465455 12265029 12024386
3661A2024386k95061j47876j71981j67843j86907k02845k04801j70282j21654
$$ 12024386 11729325 11581449 11409468 11241625 11054718 10851873 10647072 10476790 10355136
3652A0355136l4852k99574k04537r3558j32175k66469k41048p8439p1801k39156
$$ 10355136 10320284 10020710 9816173 9722615 9590440 9323971 9082923 9004484 8932683 8693527
3642H693527j72372j42231j4698j10946j27435k7598n6242j24900k11273n5216
$$ 8693527 8521155 8378924 8364226 8253280 8125845 8098247 8042005 7917105 7705832 7650616
3632G650616o7821k66754j80356O0171n83m9888j43651p2877j27257k23066j82820
$$ 7650616 7582795 7316041 7135685 7195856 7195273 7145385 7001734 6928857 6801600 6578534 6395714
3621F395714L9993O592j22504K1782o9734j02900q0987j64785j37415j01352r0642
$$ 6395714 6435707 6442299 6319795 6341577 6271843 6168943 6087956 5923171 5785756 5684404 5593762
3610E593762j1877j1609p6836m7010q1388p3570j13963j08165m9375q2197j625
$$ 5593762 5581885 5570276 5493440 5446430 5365042 5291472 5177509 5069344 5019969 4937772 4936147
3599D936147n4682p6701q6686r0520n7870p532j9758n7222k8601r2250m7731j1015
$$ 4936147 4881465 4804764 4718078 4627558 4569688 4562156 4542398 4485176 4456575 4364325 4316594 4305579
3587D305579K9416l5930K3819o2690M088k5666j65200k4536K4539o0526q6931
$$ 4305579 4334995 4299065 4322884 4260194 4264282 4238616 4073416 4048880 4073419 4012893 3925962
3576C925962P9350o6015j7878n6578n1965j92863l4633n6286J7472Q7830q1476
$$ 3925962 4005312 3939297 3921419 3864841 3812876 3620013 3585380 3529094 3546566 3634396 3552920
3565C552920K6162J09033j65992j13073j5504m5187j3024p4057J4997P8172J22346
$$ 3552920 3579082 3688115 3522123 3409050 3393546 3348359 3335335 3261278 3276275 3354447 3476793
3554C476793p9380j48315m4012j3030j93544k1397n8763P3771R5773r4247J7219
$$ 3476793 3397413 3249098 3205086 3192056 2998512 2977115 2918352 2992123 3087896 2993649 3010868
3543C010868M3535q9388p0102K2922q7041M5476j02j6146J12020J0526p3091r5151
$$ 3010868 3054403 2965015 2894913 2917835 2830794 2876270 2876168 2860022 2972042 2982568 2909477 2814326
3531B814326P3739k4340j30779o4815P0088N6128m3889n7650J61735K3480q1057
$$ 2814326 2888065 2863725 2732946 2668131 2738219 2794347 2750458 2692808 2854543 2878023 2796966
3520B796966m6056J008l8895J9062J03223k1669N3293o2278K7994J92917m5416
$$ 2796966 2750910 2751918 2713023 2732085 2835308 2813639 2866932 2804654 2832648 3025565 2980149
3509B980149n8058J18066O0792j7360R8876N4058j331J41808n7854O6878J28775
$$ 2980149 2922091 3040157 3100949 3083589 3182465 3236523 3235192 3377000 3319146 3386024 3514799
3498C514799m7184l4722L0431P199L3957P1959N394P9879J02561p0008M0587J76073
$$ 3514799 3467615 3432893 3463324 3470523 3504480 3576439 3581833 3661712 3764273 3694265 3734852 3910925
3486C910925J8488O8136P7231O3328J59755J67069n0834M7776J15146k9188J10087
$$ 3910925 3929413 3997549 4074780 4138108 4297863 4464932 4414098 4461874 4577020 4547832 4657919
3475D657919J80494J08859J18684J40865K13739K17052J27702J16935K63122K27402
$$ 4657919 4838413 4947272 5065956 5206821 5420560 5637612 5765314 5882249 6145371 6372773
3465F372773P9889J44237J95667J36023K30133M3797k0831K8553j35188k03864
$$ 6372773 6452662 6596899 6792566 6928589 7158722 7202519 7181688 7210241 7075053 6871189
3455F871189j02259j13081j19136o7569o0464o8956p4796j73547r6377L3704k7813
$$ 6871189 6768930 6655849 6536713 6469144 6408680 6339724 6264928 6091381 5995004 6028708 6000895
3444F000895r6534K785l8235j74891M4513o0383n7778j44583k56999k50283k17478
$$ 6000895 5904361 5907146 5868911 5694020 5738533 5678150 5620372 5475789 5218790 4968507 4751029
3433D751029k41995j93343j81391j48955k22131n1092j94097j46237n2593j40995
$$ 4751029 4509034 4315691 4134300 3985345 3763214 3712122 3518025 3371788 3319195 3178200
3423C178200j1512l0703m1956q7683l4625l4091r521j27892j12060n0528J5355
$$ 3178200 3166688 3135985 3094029 3006346 2971721 2937630 2928109 2800217 2688157 2637629 2652984
3412B652984p0530l0632m0741m5848L6525n6475n7232Q624l3613q6239O2873l4088
$$ 2652984 2582454 2551822 2511081 2465233 2501758 2445283 2388051 2396675 2363062 2276823 2339696 2305608
3400B305608j73160l9191O5372r5230k8764j18437K9946M8424m2115p8289l351
$$ 2305608 2132448 2093257 2158629 2063399 2034635 1916198 1946144 1994568 1952453 1874164 1870813
3389A870813K7909L2755m1693m9896Q324r5682N511K7830O7648j43843j2923j3646
$$ 1870813 1898722 1931477 1889784 1839888 1848212 1752530 1758041 1785871 1853519 1709676 1696753 1683107
3377A683107l8203o778K3568n9231L4870J4504p4445J9999P3244O4689q6032L8603
$$ 1683107 1644904 1638126 1661694 1602463 1637333 1651837 1577392 1597391 1670635 1735324 1649292 1687895
3365A687895m2994N8198K9907r225J5694J9941m5130O717K0573j0056p0678Q5600
$$ 1687895 1644901 1703099 1733006 1723781 1739475 1759416 1714286 1721003 1741576 1731520 1660842 1746442
3353A746442N0753j06212k9917k8601M0847o0371j01512j13446R2059n938j1238
$$ 1746442 1797195 1690983 1661066 1632465 1673312 1612941 1511429 1397983 1490042 1484104 1472866
3342A472866r415L9287N1850p9836K1170J0819n3616j2005R0479J58858K6622
$$ 1472866 1463451 1502738 1554588 1474752 1495922 1506741 1453125 1441120 1531599 1690457 1717079
3331A717079K9780L7183j956r958J5498p6442j46468N9472J0900k5252k7520Q5453
$$ 1717079 1746859 1784042 1782086 1772128 1787626 1711184 1564716 1624188 1635088 1609836 1582316 1667769
3319A667769k7059n5742j06683m1069J08452l3402p4196L070M5170q7345Q7403
$$ 1667769 1640710 1584968 1478285 1437216 1545668 1512266 1438070 1441140 1486310 1398965 1486368
3308A486368o9577o6720j4955J22215K6730J65669J15752J21031J32395m1098
$$ 1486368 1416791 1350071 1335116 1457331 1484061 1649730 1765482 1886513 2018908 1977810
3298A977810p3507L639l8614r1715r9931p7013j9239l6402k4963j875M1993j03221
$$ 1977810 1904303 1907942 1869328 1777613 1677682 1600669 1581430 1545028 1520065 1518190 1560183 1456962
3286A456962M622L2290K8295j35792j5411J1747Q5956p3612k5726L3234j1354
$$ 1456962 1461584 1493874 1522169 1386377 1370966 1382713 1468669 1395057 1369331 1402565 1391211
3275A391211l4789n0161K4950L6296R421R7535J17585L5139j1508p9913p4928
$$ 1391211 1356422 1306261 1331211 1367507 1376928 1474463 1592048 1627187 1615679 1535766 1460838
3264A460838m2977o4867o5100l6124M9786k5365k3724R278N659K3945q0772m3045
$$ 1460838 1417861 1352994 1287894 1251770 1301556 1276191 1252467 1261745 1267404 1291349 1210577 1167532
3252A167532M8151n212L4458M9364o5836N661k4703k7412J1833m4474r8439J5209
$$ 1167532 1215683 1210471 1244929 1294293 1228457 1234118 1209415 1182003 1193836 1149362 1050923 1066132
3240A066132R6288K5052p2300k4080M8788R0202n6425n5463N7508M5835p0362
$$ 1066132 1162420 1187472 1115172 1091092 1139880 1230082 1173657 1118194 1175702 1221537 1151175
3229A151175L6284L1256m4751l3887p551j0120N150n8591J5656O9192N116m3428
$$ 1151175 1187459 1218715 1173964 1140077 1132526 1122406 1127556 1068965 1084621 1153813 1158929 1115501
3217A115501j5209L4402M2971L8232n3803o9629j9438p9394J4669M5495K8283
$$ 1115501 1100292 1134694 1177665 1215897 1162094 1092465 1073027 993633 1008302 1053797 1082080
3206A082080K4695K057o2621n2769Q2851l1814Q3653o8101l7875P2163N1225K3732
$$ 1082080 1106775 1108832 1046211 993442 1076293 1044479 1128132 1060031 1022156 1094319 1145544 1169276
3194A169276k3911p3716k9854n697K1524j2549O746O2935K1976n7382k3563N6506
$$ 1169276 1145365 1071649 1041795 1036098 1057622 1045073 1051819 1114754 1136730 1079348 1055785 1112291
3182A112291N7713o5322n4064N0782J9570J7640K5851Q681n3871o1880P1311J4455
$$ 1112291 1170004 1104682 1050618 1101400 1120970 1138610 1164461 1173142 1119271 1057391 1128702 1143157
3170A143157q230J8622L2531L6496n3375J3197j5016N9601L4349n9913K9476P2976
$$ 1143157 1134927 1153549 1186080 1222576 1169201 1182398 1167382 1226983 1261332 1201419 1230895 1303871
3158A303871M0027m1227L6027J23539j6038Q2086J34355P4157N8236K9390J09567
$$ 1303871 1343898 1302671 1338698 1462237 1446199 1528285 1662640 1736797 1795033 1824423 1933990
3147A933990J19526K4880O8953J779K6904N9620o9693j33278M0714P3658O2519
$$ 1933990 2053516 2078396 2147349 2149128 2176032 2235652 2165959 2032681 2073395 2147053 2209572
3136B209572k2723k132J5101l2188l1686k2925N9952P7680P366K4881l7150k542
$$ 2209572 2186849 2184717 2199818 2167630 2135944 2113019 2172971 2250651 2258017 2282898 2245748 2243206
3124B243206P9553P7116J51641R0490K82720L44693L63760Q4407O0934P3088r6724
$$ 2243206 2322759 2399875 2551516 2642006 2924726 3269419 3633179 3717586 3778520 3851608 3754884
3113C754884k40890j74376k51939j55737j70153j73825j48859l8781j76264j49219
$$ 3754884 3513994 3339618 3087679 2931942 2761789 2587964 2439105 2400324 2224060 2074841
3103B074841L6622p9108l7274o000j9911m9681J02009j9848j0144j1109r8130
$$ 2074841 2111463 2032355 1995081 1989081 1969170 1919489 2021498 2001650 1991506 1980397 1882267
3092A882267j770J01429l2188K7360R5657P5174j3378l7741M405O5097p4734j29806
$$ 1882267 1880497 1981926 1949738 1977098 2072755 2147929 2134551 2096810 2101215 2166312 2091578 1961772
3080A961772m2557p872j52339o7268K9674n3217j50920K5198L1771j06692l4723
$$ 1961772 1919215 1911343 1759004 1691736 1721410 1668193 1517273 1542471 1574242 1467550 1432827
3069A432827j45266O0379L2955j377R6152p6665k8563O116o8890j88200J6137
$$ 1432827 1287561 1347940 1380895 1379518 1475670 1399005 1370442 1376558 1307668 1119468 1135605
3058A135605J8825M3015p147K0948k537L1449k3027q4871N017l8740o0410J10616
$$ 1135605 1154430 1197445 1190298 1211246 1208709 1240158 1217131 1132260 1137277 1098537 1038127 1148743
3046A148743J6103q2677J3743m3089N681M3878o4091j08085P1847k3728O7613
$$ 1148743 1164846 1082169 1095912 1052823 1058504 1102382 1038291 930206 1002053 978325 1045938
3035A045938n3220P0457p8619P4006l7308M900r4322o7233n3462R4502J02239
$$ 1045938 992718 1063175 984556 1058562 1021254 1026154 931832 864599 811137 905639 1007878
3024A007878k8492R673o6219O3284J4164m4932n3060M8086r0845r127m6087K0375
$$ 1007878 979386 989059 922840 986124 1000288 955356 902296 950382 859537 850410 804323 824698
3012H24698K4158R0898O804J3156r3238p3598J331k080N134O4361l4193O2421
$$ 824698 848856 939754 946558 959714 866476 792878 794209 792129 797263 861624 827431 889852
3000H89852N3953q7036m9375k3153P4696j49538P3242L6039K5725P1963l7299
$$ 889852 943805 856769 807394 784241 858937 709399 782641 818680 844405 916368 879069
2989H79069n4844L363N2363n6817M9387o4835Q0451J1360K4465n2183O318n7762
$$ 879069 824225 827588 879951 823134 872521 807686 888137 899497 923962 871779 878097 820335
2977H20335j9883n4806o1746K0407M5689n526R347M001n151L0807K9537n9383
$$ 820335 800452 745646 683900 704307 749996 744470 753817 757818 752667 783474 813011 753628
2965G53628O522q987k35J83192j02500J5054J9977m4627j43786M6460k9479O9269
$$ 753628 760150 751163 750928 934120 831620 846674 866651 822024 678238 724698 695219 764488
2953G64488l6298k0136J1281J2388P2756l4248l8916P3343J8416q0975l9348j00254
$$ 764488 728190 708054 719335 731723 804479 770231 731315 804658 823074 742099 702751 602497
2941F02497J22158n9444j2814P5452l4636j0810r273N9135l92O595p4337N1767
$$ 602497 724655 665211 652397 727849 693213 682403 673130 732265 731873 738468 664131 715898
2929G15898M0950K3219n2417R36J0085o7622m7295J09181J8022o0759m0151P6306
$$ 715898 756848 780067 727650 728586 738671 671049 623754 732935 750957 690198 650047 726353
2917G26353N728p8456j2023J4302P1499J5498j659m8731Q8182l0547L6527l6889
$$ 726353 732081 653625 641602 655904 727403 742901 741242 692511 780693 750146 786673 749784
2905G49784p6514n517n688K614l8799N2645Q0793m4329J556j896K2527J1127n6489
$$ 749784 673270 667753 662065 664679 625880 678525 759318 714989 716545 714649 737176 748303 691814
2892F91814m1616Q1075O551m6429N5750K7333p5348j9611J814j9626k4702q8597
$$ 691814 650198 731273 737824 691395 747145 774478 699130 679519 681333 661707 637005 548408
2880E48408J25895o665L2507N9950M1187r9598l8123j1412o4215j8107N1125L3760
$$ 548408 674303 667638 700145 760095 801282 701684 663561 652149 587934 569827 620952 654712
2868F54712M7550l7491m9085N1071Q5295k5888j12077J4182L4443K4973l1625
$$ 654712 702262 664771 615686 666757 752052 726164 614087 628269 662712 687685 656060
2857F56060J7482m8373q4050P7699J32383o1421k759l0335L4471L0220O5818j06532
$$ 656060 673542 625169 541119 618818 751201 689780 687021 656686 691157 721377 787195 680663
2845F80663p0930j7379L4889K838J0927M147r0739L4681P8179j02078n524K8918
$$ 680663 609733 592354 627243 630081 641008 645155 554416 589097 667276 565198 559674 588592
2833E88592K8680K8581l1402M2625J9910q742l276o0386j1266J589O5021k7648
$$ 588592 617272 645853 614451 657076 676986 668244 664968 604582 593316 594905 659926 632278
2821F32278J7127L7934k5174r7137R2809L9351n3106m6547l4505O4431O1372j17151
$$ 632278 649405 687339 662165 565028 657837 697188 644082 597535 563030 627461 688833 571682
2809E71682j6705J21803q3546k0787J4425P3986n360o4617o8916N0811N1P957
$$ 571682 554977 676780 593234 572447 586872 660858 655498 590881 521965 572776 572827 580784
2797E80784l968M2255Q736M3194j4638r2021q3076J32035o5632j2728M7358N7728
$$ 580784 576816 619071 627807 671001 656363 564342 481266 613301 547669 534941 582299 640027
2785F40027K6237o7948m2287q4825k5267O7918Q6050P3746j2456J1155p663j6061
$$ 640027 666264 598316 556029 471204 445937 513855 599905 673651 661195 672350 664687 648626
2773F48626p0447J3864J3665o6161J02151J00K0448n775j1486m4068l3955m3023
$$ 648626 578179 592043 605708 539547 641698 641798 662246 656471 644985 600917 566962 523939
2761E23939K7913j3080j5271O5029L6335n4291l6216Q788q7101J3305N4428P561
$$ 523939 551852 538772 523501 588530 624865 570574 534358 543146 456045 469350 523778 531339
2749E31339K348r614M7408J0411K7598j7121Q810n3578l7131Q1071L551k7271
$$ 531339 533687 524073 571481 581892 609490 592369 601179 547601 510470 591541 595092 567821
2737E67821l6597L8251J9320M3626l0110n731P5271m6302k1790N136l0340O00
$$ 567821 531224 569475 588795 632421 602311 596580 671851 625549 603759 608895 578555 579155
2725E79155K9407L2556o2796K0395m5439j01213J2530Q9653K274O0781L647J0266
$$ 579155 608562 641118 578322 598717 553278 452065 464595 554248 556522 617303 620950 631216
2713F31216K489q3475J7929O4436m6706l6683O1639l1050o0024L0883m6066M9351
$$ 631216 633705 550230 568159 632595 585889 549206 610845 579795 519771 550654 504588 553939
2701E53939k4017J234n8494k5486Q0303R134J41782j00727n0914l1772K2334J7760
$$ 553939 529922 531156 472662 447176 527479 536613 678395 577668 526754 494982 517316 535076
2689E35076m8294n7053J26828r431n5871O3711M8550n4733L9450l9373j008j8031
$$ 535076 486782 429729 556557 547126 491255 554966 603516 548783 588233 548860 547852 529821
2677E29821m5841L4325L2876J5733m9381j6077L0324m5604M881m5967J2261L4898
$$ 529821 483980 518305 551181 566914 517533 501456 531780 486176 491057 445090 457351 492249
2665D92249j8065M9910L7564k4646n9388j2143P1754m4806m8851m1514j2104J12875
$$ 492249 474184 524094 561658 537012 477624 465481 537235 492429 443578 402064 389960 502835
2653E02835J3049k4959O2653P6192j04626n8928l0358Q4807N7265l6340m8549
$$ 502835 515884 490925 553578 629770 525144 466216 435858 520665 577930 541590 493041
2642D93041J12847q0963o0586J9300N1519j06217O4044K9857L2758L1253J05945
$$ 493041 605888 524925 464339 483639 535158 428941 492985 522842 555600 586853 692798
2631F92798p2889n9118r9033k394M3658j2546k028N0874L9767k7980m2249n8717
$$ 692798 619909 560791 461758 459364 503022 490476 488448 539322 579089 551109 508860 450143
2619D50143J9647j0448Q1044o3098M1316n0514K3336J1828O7029q4727K5095j23074
$$ 450143 469790 459342 540386 477288 518604 468090 491426 503254 570283 485556 510651 387577
2607C87577Q0709J6096J2079J6094K2144m7894K4894M0572q8431J29099R7408
$$ 387577 468286 484382 496461 512555 534699 486805 511699 552271 463840 592939 690347
2596F90347j5059j10013k0556J1449K2189j0952j5706L851L4216o7361R768n2115
$$ 690347 675288 565275 544719 556168 578357 567405 551699 555550 589766 522405 532173 480058
2584D80058O211J24244R9288J28264Q3012M7734q8566O9056k6712j34943K092
$$ 480058 486269 610513 709801 838065 921077 968811 880245 949301 922589 787646 789738
2573G89738k1960j63779P5220L3374n1538m6282q5541M3802M5722o4081q6027
$$ 789738 767778 603999 679219 712593 661055 614773 529232 573034 618756 554675 468648
2562D68648R8653Q0326j9781r5544K5490q2122K566l2186L5690L1049L6864r8533
$$ 468648 567301 647627 627846 532302 557792 475670 478236 446050 481740 512789 549653 451120
2550D51120O1297m1667l4939P4410K4789m6695M1287L316q7730J12397l2075q851
$$ 451120 512417 470750 435811 510221 535010 488315 529602 532918 445188 557585 525510 516659
2538E16659J926j5965m0622Q216k0400J3719L4003o5055k2085J58315l9593o378
$$ 516659 518585 502620 461998 470214 449814 463533 497536 432481 410396 568711 529118 522740
2526E22740P697n1729n5986J452M4141M744L4054m2650q470O5745o2780l7927
$$ 522740 530437 478708 422722 424174 468315 473059 507113 464463 455993 521738 458958 421031
2514D21031R1611L8875q847k4640J7828o7903j8313l6589N6314M0486m8634K0820
$$ 421031 512642 551517 542670 518030 535858 467955 449642 413053 469367 509853 461219 482039
2502D82039m0751P7633o2186j0187R502M1330l4229n9959N2200p000n2068P023
$$ 482039 441288 518921 456735 446548 456050 497380 463151 403192 455392 448392 396324 403347
2490D03347M4126m582n8803m7488J01950L9400m429j9016P3669n9877K1344P4547
$$ 403347 447473 442891 384088 336600 438550 477950 473521 454505 528174 468297 489641 564188
2478E64188J896j29676N5274m6685n1817L1511k9174L184P9520l4579l7394l1310
$$ 564188 566084 436408 491682 444997 393180 424691 395517 398701 478221 443642 406248 374938
2466C74938j0682L7802N8383Q194j7935Q3801K26j41270q021Q1624k9420K1454
$$ 374938 364256 402058 460441 468635 450700 534501 534727 393457 385436 467060 437640 459094
2454D59094m8783J6627o5633o0327L2503M3168l8224K3475N756R5662J0548l52
$$ 459094 410311 426938 361305 300978 333481 376649 338425 361900 367656 463318 473866 473514
2442D73514k13R9038P329o4068K0767k760q8762K238R2053J948q8708P4682l158
$$ 473514 473301 572339 579668 515600 536367 533607 444845 447083 539136 541084 452376 527058 523900
2429E23900K4488k4936k231r453o4787k8481l0170L1669K2498J03382k7574l1149
$$ 523900 548388 523452 521221 511768 446981 418500 388330 419999 442497 545879 518305 487156
2417D87156j1451l4062n8109N7219O7333k687R9350m9249L7634J06819q1488q8979
$$ 487156 475705 441643 383534 440753 508086 505399 604749 555500 593134 699953 618465 529486
2405E29486m6528q189l2495L8378J2973R0628O0774k5911o5438M8295n0542M9685
$$ 529486 482958 474769 442274 480652 493625 584253 645027 619116 553678 601973 551431 601116
2393F01116r9966K3402J05781r5394j534j7903J3262m9180N6620M4544j09792
$$ 601116 501150 524552 630333 534939 533405 515502 528764 479584 536204 580748 470956
2382D70956L3340O157O2582K4104k0017j3024N9248P6408k6183p3104p051m0057
$$ 470956 504296 510453 573035 597139 577122 564098 623346 699754 673571 600467 593416 553359
2370E53359M0654J5835j1922Q0126m6593M4014N3064j4968l4530M3454q0490l078
$$ 553359 594013 609848 597926 678052 631459 675473 728537 713569 679039 722493 642003 638925
2358F38925R0619L8281M2843M1739j58402l6367J17773M9458j0026J70426R8870
$$ 638925 729544 767825 810668 852407 694005 657638 775411 824869 814843 985269 1084139
2347A084139P3419O0712k4534N3937N8390K1158K0439J52381K7481J31769J67305
$$ 1084139 1157558 1218270 1193736 1247673 1306063 1327221 1347660 1500041 1527522 1659291 1826596
2336A826596M5232K10856K08116J88060L74667N38746N68212N86586N87734M63756
$$ 1826596 1871828 2082684 2290800 2478860 2853527 3392273 3960485 4547071 5134805 5598561
2326E598561N84986N28074O67084Q34015J000410J314156K147008L461450O183025
$$ 5598561 6183547 6711621 7378705 8212720 9213130 10527286 12674294 16135744 22318769
2317B2318769R844377J2674029J3827967J1889873N791392Q7681j821351n202951
$$ 22318769 32163146 44837175 58665142 70555015 76346407 76434088 74612737 69409786
2309F9409786p634139q117786q044288p268588o505654n794044m971069l456740
$$ 69409786 61775647 53657861 45613573 38344985 31839331 26045287 21074218 17617478
2301A7617478k149186j390259j019673r72317r35372q80700r47775p83994p11196
$$ 17617478 15468292 14078033 13058360 12086043 11150671 10269971 9322196 8538202 7827006
2292G827006p04494n76213l87717m29152l94483k04850k84448j54824k30225j80243
$$ 7827006 7122512 6546299 6158582 5729430 5334947 5130097 4845649 4690825 4460600 4280357
2282D280357j32958j60359j67072p2211p9058j65423p8149K1748m6343p5307p4190
$$ 4280357 4147399 3987040 3819968 3747757 3668699 3503276 3425127 3446875 3400532 3325225 3251035
2271C251035j16959q2142q9313q0725q026P1564j18785Q2166j42278m7445o4465
$$ 3251035 3134076 3051934 2962621 2881896 2873870 2945434 2826649 2908815 2766537 2719092 2654627
2260B654627r4133j40848K509j07600j00650Q614j4272j33601o6158L0886n7150
$$ 2654627 2560494 2419646 2422155 2314555 2213905 2222519 2208247 2074646 2008488 2039374 1982224
2249A982224L3516o6447k3806k8532O3991r4517P8173L879j99667K4146m9759
$$ 1982224 2015740 1949293 1925487 1896955 1960946 1866429 1944602 1948481 1748814 1772960 1723201
2238A723201k4821p2514m0045j84055N4114O2355p6556J2904P077k6876j6333
$$ 1723201 1698380 1625866 1585821 1401766 1455880 1518235 1441679 1454583 1461660 1434784 1418451
2227A418451j12900j0823R3230K5996k6963K6884K1824j26774J9761L1753r4040
$$ 1418451 1305551 1294728 1387958 1413954 1386991 1413875 1435699 1308925 1328686 1360439 1266399
2216A266399l5036j06094o2358R6912r6628K1462O36O6207o2517P8625M119L8955
$$ 1266399 1231363 1125269 1062911 1159823 1063195 1084657 1085293 1151500 1088983 1167608 1171727 1210682
2204A210682n7293q8802K1378L5934q4909K3226N5753q1810j141j2333j05722
$$ 1210682 1153389 1064587 1085965 1121899 1036990 1060216 1115969 1034159 1033018 1020685 914963
2193I14963j7381P7130l7582J31248j9987m2260N679J5648q7660K6019k3496o4585
$$ 914963 897582 974712 937130 1068378 1048391 1006131 1011810 1027458 939798 965817 942321 877736
2181H77736R0308J4394j20850O6944M3370r1048M9235O579n590k6232J6589p1955
$$ 877736 968044 982438 861588 928532 971902 880854 930089 936668 931078 904846 921435 849480
2169H49480P4001n3542L8100J6706l0448N715L8160K7028p8151l0387q4519K4967
$$ 849480 923481 869939 908039 924745 894297 900012 938172 965200 887049 856662 772143 797110
2157G97110l7708p9034j2691P9076n1467L5441p170m4619P8919R1375r3600L2671
$$ 797110 759402 680368 667677 746753 695286 730727 723557 678938 757857 849232 755632 788303
2145G88303J37501m2556m9920m5734J07502k19l601j45035p115K0814n8079K1750
$$ 788303 925804 883248 833328 787594 895096 894877 891276 746241 739126 759940 701861 723611
2133G23611J5417m8113P5364j9403N308K5544O235o3084N039R2780k1297j03065
$$ 723611 739028 690915 766279 746876 752184 777728 783963 720879 725918 818698 797401 694336
2121F94336k8602Q910k783K605q7271N6362M9188l5780l4524O4059o9460j7314
$$ 694336 665734 674644 671861 674466 587195 643557 692745 656965 622441 686500 617040 599726
2109E99726N6278Q0165M203j00493k5950l2051O154p9642O3960P1114j03383M1731
$$ 599726 656004 736169 740372 639879 613929 581878 588032 508390 572350 643464 540081 581812
2097E81812J5413q874L7637q3839q437J40750j781m0696l2791j5238k5148J1853
$$ 581812 597225 588351 625988 542149 533712 674462 672681 631985 599194 583956 558808 570661
2085E70661j3068Q8280l9689q044K2450K3907r2568R16k3726J09088j1747K6548
$$ 570661 557593 645873 606184 598140 620590 644497 551929 552845 529119 638207 626460 653008
2073F53008q0966L8798J66138m1877m5182m2926o034j55984m9J08630J5792L4217
$$ 653008 572042 610840 776978 735101 689919 646993 640959 484975 484926 593556 609348 643565
2061F43565m4710k8942L6122j16404l9683M9118J3742m8104N2258j5307J24141
$$ 643565 598855 569913 606035 489631 449948 499066 512808 464704 516962 501655 625796
2050F25796L9733m8565J06721L1242m337J12834Q1632L141l4799m6233m9409n3567
$$ 625796 665529 616964 723685 754927 750590 863424 945056 948197 913398 867165 817756 764189
2038G64189K3143p1560q0071P023m6702m2470K4111J16077o036o5610l6646P2099
$$ 764189 787332 715772 635701 642724 596022 553552 577663 693740 687704 622094 585448 657547
2026F57547m3913m5131O7676j7863k0152j73o7815p8706R2816l3345n0334J3801
$$ 657547 613634 568503 636179 618316 598164 597991 530176 451470 544286 510941 460607 474408
2014D74408k7132K7903J04921Q147l8867m863N0432L8444m8664r1527K4251M8043
$$ 474408 447276 475179 580100 588247 549380 544517 594949 633393 584729 493202 517453 565496
2002E65496j0008j3579j4417P6551O2577m2031j23974m4736M7892m924m8283R3085
$$ 565496 555488 541909 527492 604043 666620 624589 500615 455879 503771 498847 450564 543649
1990E43649l1905j2024M3381M2578r3592p205J3244j3579J302j1692P3652k4442
$$ 543649 511744 499720 543101 585679 492087 484882 498126 484547 485849 474157 547809 523367
1978E23367M1285J8897n9079L1565n1413J1386l5619j8571K1073N121M6871J3142
$$ 523367 564652 583549 524470 556035 504622 516008 480389 461818 482891 488012 534883 548025
1966E48025j200K1119k5221l1524q1145Q7519N2959Q994r075o207L8575l9600
$$ 548025 546825 567944 542723 511199 430054 517573 570532 579526 570451 564244 602819 563219
1954E63219q5845J09075l6266j37505P9720L8767o4711N5520K6809m145K8879
$$ 563219 477374 586449 550183 412678 492398 531165 466454 521974 548783 544638 573517
1943E73517o2346k8227k5965K935k9426J66212n8731j74357L8252J50113q8378
$$ 573517 511171 482944 456979 459914 430488 596700 537969 363612 401864 551977 463599
1932D63599K2104q543m2035k5908o689j2272J42838j9292l0019r0155r058Q0384
$$ 463599 485703 477160 435125 409217 402528 390256 533094 513802 483783 393628 384570 464954
1920D64954q937l4037Q626K4555j5010Q2976N6599k3826j04306J6409M1225M8965
$$ 464954 456017 421980 430606 455161 440151 523127 579726 555900 451594 468003 509228 558193
1908E58193O9931j10883j10691J01704k619k9954j7355M6031m320K0631p9884
$$ 558193 628124 517241 406550 508254 505635 475681 458326 504357 500037 520668 440784
1897D40784k9552O6341q627P9647J3966l3352M5205n7272j01488L2495j9328o4975
$$ 440784 411232 477573 468946 548593 562559 529207 574412 517140 415652 448147 428819 363844
1885C63844P7687J10547p0614p2738R5887m0177j14550l458P7615L0371j5735
$$ 363844 441531 552078 481464 408726 504613 464436 349886 346428 424043 454414 438679
1874D38679k4196Q5058j8311o9633N9854K7355q9088M3755Q2837n0855K714k7118
$$ 438679 414483 499541 481230 411597 471451 498806 409718 453473 536310 485455 488169 461051
1862D61051m3167Q2767n5454J0217J6090p3812j33O3199O4594j27680J35083J3381
$$ 461051 417884 500651 445197 455414 471504 397692 397559 460758 525352 397672 532755 546136
1850E46136j03528P2399m2808K7839r858k573J12676n5644q6814J7765O7669n3439
$$ 546136 442608 515007 472199 500038 490180 487607 600283 544639 457825 475590 543259 489820
1838D89820m3068J17648j22945l6194J01141o6913R2339P9214o2139p9484Q7114
$$ 489820 446752 564400 441455 405261 506402 439489 531828 611042 548903 469419 556533
1827E56533p9561k1493L6193q8172n1130O107j9657O8742m506k1212N9008N9998
$$ 556533 476972 455479 491672 403500 352370 358477 338820 407562 403056 381844 440852 500850
1815E00850p3925l074P2849p368N9844k0842k0512l0484K8982j20869j20J05670
$$ 500850 426925 423851 496700 489332 549176 528334 507822 477338 506320 385451 385331 491001
1803D91001r736j16561R3999J4357J3763k9548m8980N9897j4779J6730P5969M0123
$$ 491001 481265 364704 458703 473060 486823 457275 408295 468192 453413 470143 546112 586235
1791E86235o1330P2499r7752o3452R3095j53554L3127O0629j6990r4115l4579
$$ 586235 524905 597404 499652 436200 529295 375741 408868 469497 452507 358392 323813
1780C23813J4631K9590J50132m2660J480J13778r3667r9471J19531q0668j01386
$$ 323813 338444 368034 518166 475506 476986 590764 497097 397626 517157 436489 335103
1769C35103K1360J3474J3420k20p4302J22570L4849j39256j640M7944J3604L4396
$$ 335103 356463 369937 383357 383137 308835 431405 466254 326998 325358 373302 386906 421302
1757D21302K5578J270J0702O9590j21477n2175Q0102r3716N2351j6365m3833L5682
$$ 421302 446880 448150 458852 528442 406965 354790 434892 341176 393527 377162 333329 369011
1745C69011P1877l3673J17995m4029j27100J31221k076j09866K0506J021k1125
$$ 369011 440888 407215 525210 481181 354081 485302 483226 373360 393866 394887 373762
1734C73762J14339n1207r7796M7629l1358j11095R8409M6918k1482R5168R404
$$ 373762 488101 436894 339098 386727 355369 244274 342683 389601 368119 463287 472691
1723D72691m0901K9982p3220o2673Q3486k2450o6706J21806n3367O8091J01694
$$ 472691 431790 461772 388552 325879 409365 386915 320209 442015 388648 456739 558433
1712E58433n8946n9297J3911k1448q6035R8720j8040l4057L3449K7929L1466K5155
$$ 558433 499487 440190 454101 432653 346618 445338 427298 393241 426690 454619 486085 511240
1700E11240p0947m2276N261k0072r636J44817p1161L8813M9225l3193K3429m4044
$$ 511240 440293 398017 403278 383206 373570 518387 447226 486039 535264 502071 525500 481456
1688D81456j01919l154M5627r7154P2702q218l3610N4687j8614L3439J7268n8247
$$ 481456 379537 376383 422010 324856 397558 389340 355730 410417 391803 425242 442510 384263
1676C84263k5852j1032Q6567o6847K4808Q2087l2009p1963m5839l8673N2491k1521
$$ 384263 358411 347379 433946 367099 391907 473994 441985 370022 324183 285510 338001 316480
1664C16480k7317Q0596L0870K0119P0712Q2192j42613K4123o8914j630K9913l2993
$$ 316480 289163 369759 400629 420748 491460 573652 431039 455162 386248 384618 414531 381538
1652C81538k183J10606K0335j54151N2011j0805l7905L3960M147l9521J64805
$$ 381538 379355 489961 510296 356145 408156 397351 359446 393406 397553 358032 522837
1641E22837M9114r5107m3502J865n5115M8696r2133k8381L9314n7087P5188N7656
$$ 522837 571951 476844 433342 435207 380092 428788 336655 308274 347588 290501 365689 423345
1629D23345l9396K6452P7285k9253o4520Q1489m0971k5229J8940j71847N8186
$$ 423345 383949 410401 487686 458433 393913 475402 434431 409202 428142 256295 314481
1618C14481J35178r8297M1538K4307m4999n2216N5832L9606Q3533J8351j2042
$$ 314481 449659 351362 392900 417207 372208 319992 375824 415430 498963 517314 505272
1607E05272o071j9785q8715K0011k3016p2267J43591L7785j69610O949J75300
$$ 505272 499201 479416 390701 410712 387696 315429 459020 496805 327195 334144 509444
1596E09444j22822l128J2514n078K0499M765l5534N3147m505N4134J227j26092
$$ 509444 386622 383494 396008 390930 411429 416194 380660 433807 429302 483436 484663 358571
1584C58571q2934K7082j2473N2939O7878O83p202K3479k5029J3474J0591o2219
$$ 358571 275637 302719 290246 343185 411063 411746 404544 428023 402994 416468 427059 364840
1572C64840K3823N6152j36403M3162Q4442l4740p1635J0691R879K2804k601j856
$$ 364840 388663 444815 308412 351574 436016 401276 329641 340332 350211 373015 370414 368558
1560C68558N9625m552r4586O3757J9887J9056M5580m328j30459R2925l1176j19421
$$ 368558 428183 423631 329045 392802 412689 431745 477325 472997 342538 435463 404287 284866
1548B84866M8095R3701o5104N7989L9863k4532m7894K1925o247n023j8907q2413
$$ 284866 332961 426662 361558 419547 459410 434878 386984 408909 402662 397639 378732 296319
1536B96319J80397q3343K0849k388O1466n8291k3852k1129O110J1888J7240k3022
$$ 296319 476716 393373 414222 411834 473300 415009 391157 370028 376138 388026 405266 382244
1524C82244J53189j21043o0742n7K2461q0831N2101O1479o3864O4830J9315m6580
$$ 382244 535433 414390 353648 353591 376052 295221 347322 408801 344937 409767 429082 382502
1512C82502o933M781M1573j15380O2618P1519l4338p860j06882R3654j47382P5784
$$ 382502 375569 380350 421923 306543 369161 440680 406342 398482 291600 385254 237872 313656
1500C13656J09096o2300j8664j9724N6282k2152J9940J2879o2027k808m3193J12559
$$ 313656 422752 360452 341788 322064 378346 356194 376134 389013 326986 324178 280985 393544
1488C93544J36540p5379n4917j1519K5819o1479k6842J2623m259K0233J2096N2553
$$ 393544 530084 454705 399788 388269 414088 352609 325767 338390 334131 354364 366460 419013
1476D19013n3392M4880K5799o2659o8311P5928J29205J3404p7117k8109m3651
$$ 419013 365621 410501 436300 373641 305330 381258 510463 523867 446750 418641 374990
1465C74990l3496J14999o483j14691J2029J9796J063M3955J8964L610L8236J202
$$ 374990 341494 456493 450010 335319 347348 367144 368207 412162 431126 434736 472972 474174
1453D74174j9625r7243n5176K2561j7289O8737J578P0613J257l1282r5550K9893
$$ 474174 454549 357306 302130 324691 307402 376139 377717 448330 449587 418305 322755 352648
1441C52648K9331l9663K1665P0315k099m5206N7660P5258j31581j14098N4725
$$ 352648 381979 342316 363981 434296 432197 386991 444651 519909 388328 274230 328955
1430C28955n866N61j7469O7590J8173k3178M519O7478q8240j20634Q0353L9585
$$ 328955 323089 323650 306181 373771 391944 368766 373285 440763 352523 231889 312242 351827
1418C51827j9495J4398j7750J40592N814m4157j16436K8155j8911k8202l4215
$$ 351827 332332 346730 328980 469572 475386 431229 314793 342948 324037 295835 261620
1407B61620O2541P4150O5749m4963n6444j8875q1600J4909K1778M2997j4060j998
$$ 261620 324161 398311 464060 419097 362653 343778 262178 277087 298865 341862 327802 325804
1395C25804N0580P4739l9840p7072L5203K21j3145k814q354M7719N8037J2828
$$ 325804 376384 451123 411283 334211 369414 369635 356490 353676 345322 393041 451078 463906
1383D63906j42472N6971P86n6822j4725L5637M0387l9660J25143o0374l5122M3993
$$ 463906 321434 378405 379191 322369 307644 343281 383668 344008 469151 408777 373655 417648
1371D17648Q336m3695j05862L7894K2031J4111K3705O050O0470n4411O025N1761
$$ 417648 425984 382289 276427 314321 336352 350463 374168 380218 440688 386277 392302 444063
1359D44063r5195N1695j6574k9077J0223J0984l203P5657K1504q0956p5515k1606
$$ 444063 348868 400563 383989 354912 365135 376119 372916 448573 470077 389121 313606 292000
1347B92000L389N481p4142J6699P0425M1543r795J8089k6523q9009Q7780Q302
$$ 292000 295389 300870 226728 243427 313852 355395 345600 363689 337166 248157 335937 344239
1335C44239j0617J2246Q6556k208K5654j0658P473p922l9080k9970o675o4974
$$ 344239 333622 345868 432424 430216 455870 445212 452685 444763 405683 375713 369038 304064
1323C04064q269R4139j1413J9808k4593J4475j42000r433L3312N2801O8874K8321
$$ 304064 295795 389934 378521 398329 373736 388211 246211 236778 270090 322891 391765 420086
1311D20086N4756j2968q2450K9903k4119j6342j8122M5564P822K7895O1941r0189
$$ 420086 474842 461874 379424 409327 385208 368866 350744 396308 404130 432025 493966 403777
1299D03777K6724n55l9498n1170M0477M1617J38315K7179j58606o5807l9813m8
$$ 403777 430501 429946 390448 339278 379755 421372 559687 586866 428260 362453 322640 322592
1287C22592M6138l2625K2277R8005n3547J3166l6920R1900l3970K3032p6213q9444
$$ 322592 368730 336105 358382 456387 402840 416006 379086 470986 437016 460048 383835 294391
1275B94391M2712M1150j219j2381M0420q3002N9230r433l003j8402j12101O798
$$ 294391 337103 378253 377034 364653 405073 322071 381301 371868 368865 350463 238362 245160
1263B45160P2613j22753J52245Q8073l0082J023P5855r6715j9531K9187m0413
$$ 245160 317773 195020 347265 435338 405256 406279 482134 385419 365888 395075 354662
1252C54662m3337J3708K2240q707K2050q7622j8649m1645L2379m066R2335j4100
$$ 354662 311325 325033 347273 338566 360616 272994 254345 212700 245079 241013 333348 319248
1240C19248M4144O5611K7367M601m6480n9929p1199j8922m1057Q7263R9039m6141
$$ 319248 363392 429003 456370 460971 414491 354562 283363 264441 223384 310647 409686 363545
1228C63545o720K4951q1588j6749L1232O3055J5511K9365m2007K9218j4343Q711
$$ 363545 356825 381776 300188 283439 314671 377726 393237 422602 380595 409813 395470 404181
1216D04181M3036j03635L0147O0967j1085N9509p7074n9500l6487j1635j0633
$$ 404181 447217 343582 373729 434696 423611 483120 406046 346546 310059 298424 287791
1205B87791n4932J07357L3402J07434n2035m2893K4806j9274n2599L947P7447
$$ 287791 232859 340216 373618 481052 429017 386124 410930 391656 339057 343004 420451
1194D20451l7023K0805L724l847k872o5071m7165N199J6443J0806k3820Q0746
$$ 420451 383428 404233 407957 404110 401238 336167 289002 294201 310644 321450 297630 378376
1182C78376p2516M5257N8896r0153R1841K9783j24319k8030N5886j01023k7407
$$ 378376 305860 351117 410013 319860 411701 441484 317165 289135 345021 243998 216591
1171B16591J17608K1965k4731q979l0375Q98k6321n6071J18920N2629l1988J2336
$$ 216591 334199 356164 331433 322454 292079 292977 266656 210585 329505 382134 350146 362482
1159C62482P573O2394L688r0103p709R5128l4219r2479n465M8477m7754L1604
$$ 362482 370055 432449 436137 346034 338325 433453 399234 306755 301290 349767 302013 333617
1147C33617P2661p7665m0594L5716o5746j7124Q3795J08886R110L084K3199l121
$$ 333617 406278 328613 288019 323735 257989 240865 324660 433546 442656 445740 468939 465818
1135D65818p6622j10698Q1726o4473O2865J9222l019l957k031M1122k908n4994
$$ 465818 389196 278498 360224 295751 358616 377838 374819 370862 368831 409953 407045 352051
1123C52051m5870J10318O2276o1668j5972L8183p0132M0323j7564n2291n2898
$$ 352051 306181 416499 478775 417107 401135 439318 369186 409509 391945 339654 286756
1112B86756K034j4286j8605N2409N2265K0849J4444J8448K3505q6141k3976K6955
$$ 286756 288790 274504 255899 308308 360573 381422 395866 414314 437819 351678 327702 354657
1100C54657p8809Q245M6473j1346j3037L8184o3761M1552j3126p0018M5861M1294
$$ 354657 275848 284093 330566 319220 306183 344367 280606 322158 309032 239014 284875 326169
1088C26169M085k939O6519n808Q609n9372J5504n1200L1168l6295K000M5393K2197
$$ 326169 330254 327315 393834 388026 396635 337263 352767 301567 332735 296440 298440 343833 366030
1075C66030k5999l3056k2820M5831J13767n3494k7267n1385K3512Q0201l5041
$$ 366030 340031 306975 284155 329986 443753 390259 362992 311607 335119 415320 380279
1064C80279J1782J9910J2802j2750k3289o8077j08428J5669J0986J08062M568
$$ 380279 392061 411971 424773 412023 388734 320657 212229 227898 238884 346946 351514
1053C51514r1414r702l726O2009n7437j0500N5569j1727M2909L6393K0817j618
$$ 351514 260100 250398 246672 308681 251244 240744 296313 284586 327495 363888 384705 383087
1041C83087j7231m8694M5607k1072j7817O8233O831l776Q338l350p7921j02261
$$ 383087 365856 317162 362769 341697 323880 392113 398944 395168 403506 400156 322235 219974
1029B19974Q1193L4890k1305k7106K3554J60837j21113K0640k8184l4295O697
$$ 219974 301167 336057 314752 287646 311200 472037 350924 371564 343380 309085 315782
1018C15782M8463J7159o9644O3575k5212K552p816j5088k6772R998L9802O7480
$$ 315782 364245 381404 311760 375335 350123 352675 344859 329771 302999 312997 352799 420279
1006D20279Q216K2176o2747O6815j06195k2349m0412j2303J01309r47j7670n3356
$$ 420279 428495 450671 387924 454739 348544 326195 285783 273480 374789 373842 356172 302816
994C02816j3464l7501l9777N7287L6882M0999m658j7890j6194J9648N2163m6020
$$ 302816 289352 251851 212074 269361 306243 347242 342584 324694 308500 328148 380311 334291
982C34291L5511N0010r401K053m1920r347l9004j6793M9992k7191p1973L8819
$$ 334291 369802 419812 410411 412464 370544 361197 322193 305400 355392 328201 256228 295047
970B95047k2791m0941O4389m280n9654O5310J20397P1388n7404q4909n8543k263
$$ 295047 272256 231315 295704 291424 231770 297080 417477 488865 431461 346552 288009 285746
958B85746o5879O8856R7086R33N2996j1842m6271m0980l444j0044J7736o0649
$$ 285746 219867 288723 385809 386742 439738 427896 381625 340645 337201 327157 344893 284244
946B84244M3357O8523K8398o439J070r6150M5422J5638m1955j9123n091L4120
$$ 284244 327601 396124 424522 418083 419153 323003 368425 384063 342108 322985 317894 352014
934C52014J6887n1544j06919R6763L9822l1572k7382P1630q3324o0258J29560
$$ 352014 368901 317357 210438 307201 347023 315451 288069 359699 276375 216117 345677
923C45677R9467l8263q3739N0504k9719p3987j5214P4779N2862J9489n4837M497
$$ 345677 445144 406881 323142 373646 343927 269940 254726 329505 382367 401856 347019 351516
911C51516j21432K254N5273N6794r0385j162J05981R213N9417K1561o4019L699
$$ 351516 230084 232338 287611 344405 254020 252858 358839 368052 427469 449030 385011 388710
899C88710n3654k3098o9873Q5371r2882l4139M6623p3368J22916L6588q79j09411
$$ 388710 335056 311958 242085 327456 234574 200435 247058 173690 296606 333194 332315 222904
887B22904J03683J8360o1905N7403N6441k1164p5048N0689M5936j07538j31286
$$ 222904 326587 344947 283042 340445 396886 375722 300674 351363 397299 289761 158475
876A58475P415Q4372l2620K5524R7458n7772J7281J3056j0433K227J5395l6600
$$ 158475 165890 250262 217642 243166 340624 282852 300133 313189 302756 304983 320378 283778
864B83778m2936P3495N8885L9960n6008r2912K1879r4798o6370R1870M8230P7425
$$ 283778 240842 314337 373222 413182 357174 264262 286141 191343 124973 216843 265073 342498
852C42498K9755j8532l1009j8761R379M4967n1239l3753o7921R6400N9851j23109
$$ 342498 372253 353721 322712 303951 313330 358297 307058 273305 205384 301784 361635 238526
840B38526M9656L7589o5576l2562p989l998m0629M3485K7124R7207P3877j3320
$$ 238526 288182 325771 260195 227633 219644 215646 175017 218502 245626 342833 416710 403390
828D03390l9958j2965j5041J3250n4042M305J37061p2971j8940l9380O2015l1343
$$ 403390 363432 350467 335426 348676 294634 298939 436000 363029 344089 304709 366724 335381
816C35381o6817j19580K978R2697j00864J18925R7054l2359m6787J07416p3577
$$ 335381 268564 148984 151962 244659 143795 262720 359774 327415 280628 388044 314467
805C14467o7433R1154K7718m7504O5420n8393k8097L934k4554M0594m4310j39309
$$ 314467 247034 338188 365906 318402 383822 325429 297332 301266 276712 317306 272996 133687
793A33687O9998J14912k5089M5596R5476r1698N3958L2927l5731L7382l7932O441
$$ 133687 203685 318597 293508 339104 434580 342882 396840 429767 394036 431418 393486 399927
781C99927l9450o0775r4849P8507J6653m2998J9969n0455n8576M8319N7136M4548
$$ 399927 360477 299702 204853 283360 300013 257015 276984 226529 167953 216272 273408 317956
769C17956M9174N6262J2941J7311k1587p2697m43m9251j03785P985m9742K5560
$$ 317956 367130 423392 436333 453644 432057 359360 358917 309666 205881 213866 164124 189684
757A89684Q5071M0732k6401K9357k5463n4231J00942l8408N0586N3086j04012
$$ 189684 274755 315487 289086 318443 292980 238749 339691 301283 351869 404955 300943
746C00943m3203K9532o4298l0115J49775n6277L0905N8369n6972j7375k7307n8911
$$ 300943 257740 287272 222974 192859 342634 286357 317262 375631 318659 301284 273977 215066
734B15066j6249O5070M9244r750O0697l7804L0471N7027j40084k0439P4474p8890
$$ 215066 198817 263887 313131 303381 364078 326274 356745 413772 273688 253249 327723 248833
722B48833k985J20755l2249M7943K7419j33291l0445K2578o799J21040j7344j01751
$$ 248833 245848 366603 334354 382297 409716 276425 245980 268558 261759 382799 365455 263704
710B63704M1598K4337l7506n0029Q3282K2032N0216n4316j5967M2029l167m5177
$$ 263704 305302 329639 292133 242104 325386 347418 397634 343318 327351 369380 366213 321036
698C21036L261N651p3674J1070j1297o6261O9472O1850k9271K0440N7633q0771
$$ 321036 324297 329948 256274 267344 256047 189786 259258 321108 291837 312277 369910 289139
686B89139J1605O7607m6397M5655q2150j3677O0834p9977J9176J10912p2055j32085
$$ 289139 300744 368351 321954 367609 285459 271782 332616 252639 271815 382727 310672 178587
674A78587R0935j0601k6237Q6579L5750P0068K9320j38625l8278J80820m8289
$$ 178587 269522 258921 232684 319263 355013 425081 454401 315776 277498 458318 410029
663D10029j36353L7559j8667P769R5466p311l8176K2387o5654q2984O8079l4402
$$ 410029 273676 311235 292568 300337 395803 388492 350316 372703 307049 224065 292144 257742
651B57742Q404P9667P2145l6075L5789j53493m4980J1848p9012j19376J70517
$$ 257742 266146 345813 417958 381883 417672 264179 219199 231047 152035 32659 203176
640B03176N2601N268M7778m2821l367j240m9000J11335J6486o2562N9516N9045
$$ 203176 255777 261045 308823 266002 262635 261395 212395 323730 340216 277654 337170 396215
628C96215k2563m4600L4369q1110j4172j8932k1012Q10L329N428K2992q5781J18434
$$ 396215 373652 329052 363421 282311 268139 249207 228195 229005 232334 237762 260754 174973 293407
615B93407Q9060r819j78199R6059P4716r4080j9459P9325N1242r3049J8424M3545
$$ 293407 382467 372648 194449 290508 365224 271144 251685 331010 382252 289203 307627 351172
603C51172n0603k2019n2456j596P552p0885R4635O4866J0239K9579o8298k0829
$$ 351172 300569 278550 226094 224498 232050 161165 255800 320666 330905 360484 292186 271357
591B71357K9125J4102n8770O7892O2245M476M673p3128j0821p0494q501j9104
$$ 271357 300482 314584 255814 323706 385951 390427 395100 321972 311151 240657 232156 213052
579B13052L4883L4909o9028O0354M8937P0285o6261k2848O2193q4470p1844N4595
$$ 213052 247935 282844 213816 274170 323107 393392 327131 304283 366476 282006 210162 264757
567B64757Q9703PL2531j02167j1425q4328j4264j1343N5844N8634M5270n1409
$$ 264757 354460 354467 386998 284831 273406 189078 174814 163471 219315 277949 323219 271810
555B71810N1211J403n1963R6384k6545k5070j552q568l2235J06532q4236K4802
$$ 271810 323021 324424 272461 368845 342300 317230 315678 307110 274875 381407 297171 321973
543C21973N7995k7331q2077J4502J5336k0742r1166O0731M0739Q319J3422J1507
$$ 321973 379968 352637 270560 285062 300398 279656 188490 249221 289960 298279 311701 323208
531C23208P9834n7968m4516N3719p3443n1851P3807K3146l7020j866n5152k3500
$$ 323208 403042 345074 300558 354277 280834 228983 302790 325936 288916 287050 231898 208398
519B08398M2903o5853Q0279N6050L3790o2620N0112M7719M482P7921O33j37016
$$ 208398 251301 185448 265727 321777 355567 292947 343059 390778 395260 473181 473814 336798
507C36798k3828j1204j07722J04471M8671K6115K1826q3981k3234R2210j15809
$$ 336798 312970 301766 194044 298515 347186 373301 395127 311146 287912 380122 264313
496B64313J5683J7466L7065K6549m9982K3184m1141J209o5157P2747n9739k5074
$$ 264313 279996 297462 334527 361076 311094 334278 293137 294346 229189 301936 242197 217123
$$ [...]
##END NTUPLES=NMR SPECTRUM
##END=
