##TITLE=1H_DE-80H_X3
 200.13MHz, d2o
 8 sc
 
 19ns.26.2.2025
##JCAMPDX= 6.0         $$ Bruker NMR JCAMP-DX V2.0
##DATA TYPE= NMR SPECTRUM
##DATA CLASS= NTUPLES
##ORIGIN= UXNMR, Bruker Analytische Messtechnik GmbH
##OWNER= pz
$$ XWIN-NMR		Version 3.5
$$ Mon Jul 20 14:26:53 2026 Russian Standard Time (UT+4h)  Yarkov@DPX200
##.OBSERVE FREQUENCY= 200.1313
##.OBSERVE NUCLEUS= ^1H
##.ACQUISITION MODE= SIMULTANEOUS
##.ACQUISITION SCHEME= undefined
##.AVERAGES= 8
##.DIGITISER RES= 18
##SPECTROMETER/DATA SYSTEM= spect
##.PULSE SEQUENCE= zg30
##.SOLVENT NAME= DMSO
##.SHIFT REFERENCE= (INTERNAL, DMSO, 0, 15.5012)
##AUDIT TRAIL= $$ (NUMBER, WHEN, WHO, WHERE, WHAT)
$$ ##TITLE= Audit trail, XWIN-NMR		Version 3.5
$$ ##JCAMPDX= 5.01
$$ ##ORIGIN= Bruker BioSpin GmbH
$$ ##OWNER= Yarkov
$$ C:/Bruker/XWIN-NMR/data/yarkov2/nmr/H-C/1/pdata/1/auditp.txt
$$ ##AUDIT TRAIL=  $$ (NUMBER, WHEN, WHO, WHERE, WHAT)
(   1,<2026-07-20 14:25:46.78 +0400>,<Yarkov>,<DPX200>,
      <created by zg, POWCHK disabled, PULCHK disabled
       configuration hash MD5:
       00 E9 B6 7A A2 85 ED C7 34 08 36 98 17 FE 4E 26
       data hash MD5: 16K
       F7 1D D4 A2 9A 09 98 CF AF 11 78 D2 91 43 42 A4>)
(   2,<2026-07-20 14:25:52.70 +0400>,<Yarkov>,<DPX200>,
      <Start of raw data processing
       efp BC_mod = 2 LB = 0.25 FT_mod = 6 PKNL = 1 PHC0 = -7255.922 PHC1 = 7.421964 SI = 16K 
       data hash MD5: 16K
       CC 88 B5 5D ED 36 AA CD 8D 5E 30 F2 21 FC 96 D9>)
(   3,<2026-07-20 14:25:58.65 +0400>,<Yarkov>,<DPX200>,
      <abs ABSG = 5 
       data hash MD5: 16K
       35 23 CA D5 5B D4 96 BB 4E 7F C5 09 2D C5 59 15>)
$$ ##END=
$$ 
$$ hash MD5
$$ 16 E1 9D F3 01 E5 22 46 F3 76 93 B8 73 97 5D 41
##$RELAX= 
##$RELAX= 
##$RELAX= 
##$RELAX= 
##$RELAX= 
##$RELAX= 
$$ Bruker specific parameters
$$ --------------------------
##$DU= <C:/Bruker/XWIN-NMR>
##$EXPNO= 1
##$NAME= <H-C>
##$PROCNO= 1
##$TYPE= <nmr>
##$USER= <yarkov2>
##$AMP= (0..31)
100 100 100 100 100 100 100 100 100 100 100 100 100 100 100 100 100 100 
100 100 100 100 100 100 100 100 100 100 100 100 100 100 
##$AQSEQ= 0
##$AQ_mod= 1
##$AUNM= <au_zg>
##$AUTOPOS= <>
##$BF1= 200.13
##$BF2= 200.13
##$BF3= 200.13
##$BF4= 200.13
##$BF5= 200.13
##$BF6= 200.13
##$BF7= 200.13
##$BF8= 200.13
##$BYTORDA= 1
##$CFDGTYP= 0
##$CFRGTYP= 5
##$CHEMSTR= <none>
##$CNST= (0..31)
1 1 145 1 1 1 1 1 1 1 1 1 1 1 1 1 1 1 1 1 1 1 1 1 1 1 1 1 1 1 1 1 
##$CPDPRG= <>
##$CPDPRG1= <>
##$CPDPRG2= <>
##$CPDPRG3= <>
##$CPDPRG4= <mlev>
##$CPDPRG5= <mlev>
##$CPDPRG6= <mlev>
##$CPDPRG7= <mlev>
##$CPDPRG8= <mlev>
##$CPDPRGB= <>
##$CPDPRGT= <>
##$D= (0..31)
0 0.7 0 0 0 0 0 0 0 0 0 0.03 0 0 0 0 0 0 0 0 0 0 0 0 0 0 0 0 0 0 0 0 
##$DATE= 1784543146
##$DBL= (0..7)
120 120 120 120 120 120 120 120 
##$DBP= (0..7)
150 150 150 150 150 150 150 150 
##$DBP07= 0
##$DBPNAM0= <>
##$DBPNAM1= <>
##$DBPNAM2= <>
##$DBPNAM3= <>
##$DBPNAM4= <>
##$DBPNAM5= <>
##$DBPNAM6= <>
##$DBPNAM7= <>
##$DBPOAL= (0..7)
0.5 0.5 0.5 0.5 0.5 0.5 0.5 0.5 
##$DBPOFFS= (0..7)
0 0 0 0 0 0 0 0 
##$DE= 6
$$ [...]
##$SUBNAM3= <"">
##$SUBNAM4= <"">
##$SUBNAM5= <"">
##$SUBNAM6= <"">
##$SUBNAM7= <"">
##$SUBNAM8= <"">
##$SUBNAM9= <"">
##$SW= 18.0517328524113
##$SWIBOX= (0..15)
0 0 2 0 0 0 0 0 0 0 0 0 0 0 0 0 
##$SW_h= 3612.71676300578
##$TD= 16384
##$TD0= 1
##$TE= 0
##$TE2= 300
##$TE3= 300
##$TEG= 300
##$TL= (0..7)
0 120 120 120 120 120 120 120 
##$TP= (0..7)
150 150 150 150 150 150 150 150 
##$TP07= 0
##$TPNAME0= <>
##$TPNAME1= <>
##$TPNAME2= <>
##$TPNAME3= <>
##$TPNAME4= <>
##$TPNAME5= <>
##$TPNAME6= <>
##$TPNAME7= <>
##$TPOAL= (0..7)
0.5 0.5 0.5 0.5 0.5 0.5 0.5 0.5 
##$TPOFFS= (0..7)
0 0 0 0 0 0 0 0 
##$TUNHIN= 0
##$TUNHOUT= 0
##$TUNXOUT= 0
##$USERA1= <user>
##$USERA2= <user>
##$USERA3= <user>
##$USERA4= <user>
##$USERA5= <user>
##$V9= 5
##$VALIST= <valist>
##$VCLIST= <CCCCCCCCCCCCCCC>
##$VD= 0
##$VDLIST= <DDDDDDDDDDDDDDD>
##$VPLIST= <PPPPPPPPPPPPPPP>
##$VTLIST= <TTTTTTTTTTTTTTT>
##$WBST= 1024
##$WBSW= 4
##$XGAIN= (0..3)
0 0 0 0 
##$XL= 0
##$YL= 0
##$YMAX_a= 298634
##$YMIN_a= -342386
##$ZGOPTNS= <>
##$ZL1= 120
##$ZL2= 120
##$ZL3= 120
##$ZL4= 120
##$ABSF1= 15.49127
##$ABSF2= -2.560579
##$ABSG= 5
##$ABSL= 3
##$ALPHA= 0
##$AQORDER= 0
##$ASSFAC= 0
##$ASSFACI= 0
##$ASSFACX= 0
##$ASSWID= 0
##$AUNMP= <proc_1d>
##$AZFE= 0.1
##$AZFW= 0.1
##$BCFW= 0
##$BC_mod= 2
##$BYTORDP= 0
##$COROFFS= 0
##$CY= -3
##$DATMOD= 1
##$DC= 0
##$DFILT= <>
##$DTYPP= 0
##$F1P= 0
##$F2P= 0
##$FCOR= 1
##$FTSIZE= 16384
##$FT_mod= 6
##$GAMMA= 0
##$GB= 0
##$INTBC= 1
##$INTSCL= 3.241238e-09
##$ISEN= 128
##$LB= 0.25
##$LEV0= 0
##$LPBIN= 0
##$MAXI= 10000
##$MC2= 0
##$MEAN= 0
##$ME_mod= 0
##$MI= 1.114404
##$NCOEF= 0
##$NC_proc= -6
##$NLEV= 6
##$NOISF1= 3.799351
##$NOISF2= 2.8
##$NSP= 0
##$NTH_PI= 0
##$NZP= 0
##$OFFSET= 15.50119
##$PC= 1
##$PHC0= -7255.922
##$PHC1= 7.421964
##$PH_mod= 1
##$PKNL= yes
##$PPARMOD= 0
##$PSCAL= 0
##$PSIGN= 0
##$REVERSE= no
##$SF= 200.13000410551
##$SI= 16384
##$SIGF1= 3
##$SIGF2= 2
##$SINO= 0.751879
##$SIOLD= 32768
##$SREGLST= <19F.Aceton>
##$SSB= 0
##$STSI= 16384
##$STSR= 0
##$SW_p= 3612.71676300578
##$SYMM= 0
##$S_DEV= 0
##$TDeff= 16384
##$TDoff= 0
##$TI= <>
##$TILT= no
##$TM1= 0
##$TM2= 0
##$TOPLEV= 0
##$USERP1= <user>
##$USERP2= <user>
##$USERP3= <user>
##$USERP4= <user>
##$USERP5= <user>
##$WDW= 1
##$XDIM= 16384
##$YMAX_p= 304582797
##$YMIN_p= -596882
$$ End of Bruker specific parameters
$$ ---------------------------------
##NTUPLES= NMR SPECTRUM
##VAR_NAME=  FREQUENCY,     SPECTRUM/REAL,   SPECTRUM/IMAG
##SYMBOL=    X,             R,               I
##VAR_TYPE=  INDEPENDENT,   DEPENDENT,       DEPENDENT
##VAR_FORM=  AFFN,          ASDF,            ASDF
##VAR_DIM=   16384,         16384,           16384
##UNITS=     HZ,            ARBITRARY UNITS, ARBITRARY UNITS
##FACTOR=    0.220516191357247, 1,           1
##FIRST=     3102.25325547379, 0,            0
##LAST=      -510.463507531992, 0,           0
##MIN=       -510.463507531992, -596882,     0
##MAX=       3102.25325547379, 304582797,    0
$$ Real data points
##PAGE= N=1
##DATA TABLE= (X++(R..R)), XYDATA
$$ [...]
6835D1870j13K1243j7020l4991O0816k3072r00P814j1096K2643j5858p8892N8519
6822C0963j2418O7151m7092M318J2871l6733L5718o6459J7612r704J2315j2309
6810c767R619J3571p5665K9697m1958K7068L5022p4665k3082R273J08162k4477
6798a1202m3192N4409M5954k5378j3614j352j7721N085J3048R738M5525j6722
6786D4578J9979K9200j6127l5211m1513Q179O5175l3360k7791P4856n5746J8710
6774E0929L324k3940M1943q0676J8719j9148Q5274J0853p9040J1152M8425k6453
6762D1362n6413n3142Q7244K9994o6757o4489K2094M3704K6655J6518M9294J1588
6750H7652p1358j8445O4952P9541p4541j1992m3503J2697O4078m7053o962O7825
$$ plain form
6835 41870 41757 63000 45980 10989 71805 48733 47833 55647 44551 67194 51336 -27556 30963
6822 30963 18545 85696 38604 42922 55793 19060 54778 -11681 5931 -3773 8542 -3767
6810 -3767 5852 19423 -56242 -26545 -68503 -41435 -6413 -81078 -104160 -94887 13275 -11202
6798 -11202 -54394 15 45969 20591 6977 5625 -12096 -7011 6037 15775 61300 44578
6786 44578 64557 93757 77630 42419 906 9085 74260 40900 13109 87965 32219 50929
6774 50929 54253 30313 72256 -8420 10299 -8849 76425 87278 8238 19390 67815 41362
6762 41362 -15051 -68193 19051 49045 -17712 -82201 -60107 -16403 10252 26770 76064 87652
6750 87652 16294 -2151 62801 142342 67801 55809 12306 25003 89081 42028 35066 102891
6738A02891Q867k4446n8514L730j6505J6088N0735K2292m7351j1465K7776j4998
6726E9100o15J6450n1799j2018k8517K0350k3396l1921L669K9158N1322j242r071
6713B1470l8716k067L4870q012n1640L7627j207M2468L7128k2222r2748j3937
6701e6986L5337P9156J5128J2053k5091k2499M2010l4391J2857l7159j4202L2542
6689C8755j9345o972P3357J8439m4193n7724m6642J04832M9144p8673l5348M144
6677b26K9192L8133l5425Q7082l3883j2928k2661n9618R9728k057m2300l1189
6665A3848m515L2161J9805K8138q047n8620K1865j4698K5432m8809M6914j0677
6653D2797l4790M4826j6224k5781O7536l5749r50p109k3454k8435L2316L7187
$$ plain form
6738 102891 111758 87312 28798 32528 16023 32111 82846 105138 57787 46322 74098 59100
6726 59100 58485 74935 23136 11118 -17399 2951 -20445 -52366 -48697 -19539 31783 30541 21470
6713 21470 -17246 -19313 15557 7545 -44095 -6468 -7675 34793 71921 49699 -43049 -56986
6701 -56986 -21649 57507 72635 84688 59597 37098 79108 44717 57574 20415 6213 38755
6689 38755 19410 12438 85795 104234 60041 2317 -44325 60507 109651 30978 -4370 -226
6677 -226 28966 67099 31674 118756 84873 71945 49284 -10334 89394 87337 45037 13848
6665 13848 9333 41494 61299 89437 81390 22770 44635 29937 55369 6560 53474 42797
6653 42797 8007 52833 36609 10828 78364 42615 41665 34556 11102 -17333 14983 52170
6641E2170O390j4233l2780L3010J2419j226R10k4644p6689j4262J169N6285M8840
6628D7359O6159n5997o2214J0434k9092O4156k704j4003j9340K2707K5038J4340
6616F6843m1328m0109m404O9763O4879n6064j4835K7158n1069m0720K0005k3007
6604b2888l0805r049K7837R09P6534k7751M5919J9144j378l4739o3609m7197O4642
6591b431J1422j1961M0910L7411J5350q280l1081q723O6958q1833L1993Q138q825
6578E9048p396k3678j5389k1777N4086m8662L3866j2149M6889K5041N4607p3467
6566G1019p5912k1013P2100o31k0914J1411K833J3352l5339k3724K2078Q3901
6554I9161m6557J7930K8380J0390j3135l2638k1249k7907K2649Q23n5188N025
$$ plain form
6641 52170 58560 44327 11547 44557 56976 55750 56660 32016 -44673 -58935 -57766 -1481 47359
6628 47359 113518 57521 -4693 5741 -23351 40805 38101 24098 4758 27465 52503 66843
6616 66843 25515 -14594 -18998 50765 115644 59580 44745 71903 20834 -19886 119 -22888
6604 -22888 -53693 -62742 -34905 -33996 42538 14787 60706 79850 78472 43733 -19876 -67073 -2431
6591 -2431 8991 -2970 37940 75351 90701 82421 51340 42617 109575 27742 59735 67873 59048
6578 59048 51652 27974 12585 -9192 44894 -3768 30098 17949 64838 89879 144486 71019
6566 71019 -4893 -25906 46194 45563 24649 36060 38893 52245 16906 -6818 15260 99161
6554 99161 52604 70534 98914 109304 96169 63531 42282 14375 37024 37847 -17341 -12316
6542a2316K2965l8626K7651K4968P879J7604L1674M9445J8767j0862o9311k0199
6530D9639q0438r459L1275J8894N2868J9702q765k0518Q195N3322o9687N2451
6518I7479q712k7967k9733P3473j3334k0140J4091K6300L9934o4017j420j7157
6506F8797k4964P2539p5167j7794k0352m0603J29312K3808l5055n099K0062r561
6494H5923p6329m0540O7192K0552K9548k7095r407J0864k5365l55N0075P3617
6482A58680m2127o7404l2992N1536L8612p27L9596p8025l2218l2506l225J5274
6470A4474K6097J3967j442N3209l7277j7049Q9502L8088m9352o4283n4052L1009
6458D2891J4206M0733J4727l2683l7008m8535n4772M1197P1654q0593R0821K9414
$$ plain form
6542 -12316 10649 -27977 -326 24642 32521 50125 81799 131244 150011 139149 69838 49639
6530 49639 -30799 -40258 -8983 9911 62779 82481 73716 53198 61393 114715 45028 97479
6518 97479 88767 60800 31067 104540 91206 71066 85157 111457 151391 87374 85954 68797
6506 68797 43833 116372 41205 23411 3059 -37544 91768 115576 80521 75422 95484 85923
6494 85923 9594 -30946 36246 56798 86346 59251 49844 60708 35343 34988 85063 158680
6482 158680 116553 49149 16157 67693 106305 105578 145174 67149 34931 2425 -800 14474
6470 14474 40571 54538 53096 106305 69028 51979 141481 179569 130217 65934 11882 42891
6458 42891 57097 97830 112557 79874 42866 -5669 -60441 -19244 52410 -28183 62638 92052
6446I2052j9998m578q9337n287L0650m1134L1031K8797n9655M4506j498O790M1494
6433E3833P0091J3983k9773n9040r172l167J6192N385k9907k1971K2656N7135
6421H6245j5157l0520n4233M2075P765K8373J2849j1697L9264m0261l8564J6627
6409D2766O2659k0797m9510N6655M7807p016p0611n285j0282N4156l5643k4858
6397D0041P2393k6238N272j2652n2496N9840k2481J8886m7107q6270N5774R3053
6385I8015j3508L9903l8812J4964J3876M84M6296o4108K9544L9717R68l8781o8288
6372F0270n1354K6104J1127K7275K009J9542L3759O4801k9003j8134R440q3416
6360G2420n6103M2044P6277m8635q696K163J4091M2048P539n1514k0934N137k1260
$$ plain form
6446 92052 72054 67476 -21861 -27148 3502 -37632 -6601 22196 -37459 7047 5549 12339 53833
6433 53833 123924 137907 108134 49094 39922 36755 52947 58332 28425 6454 29110 86245
6421 86245 71088 40568 -13665 28410 36175 64548 77397 65700 104964 64703 26139 42766
6409 42766 105425 84628 35118 91773 139580 132564 61953 56668 46386 100542 64899 40041
6397 40041 112434 86196 91468 78816 26320 86160 63679 82565 35458 -50812 4962 98015
6385 98015 84507 124410 85598 100562 114438 114922 161218 97110 126654 166371 167339 128558 60270
6372 60270 8916 35020 46147 73422 75431 94973 128732 193533 164530 146396 155836 72420
6360 72420 16317 58361 134638 86003 77307 79470 93561 135609 143148 91634 70700 75837 54577
6347E4577m6451O2527J2982K2204l449q3627K7616M4160L9200j8441j3461j6367
6335H1470O9500L7261k3243m2997l1429l3152O530J3676N7916n9534j1452P869
6323G2415K7514L8493L2515l4068J2060O588m8835j5375M1918R479j0567k2984
6311A09153k9847o960J704j7663J32104K9641j44525q0406O8910O5494l6870K2115
6299A12850N1562M7768m4012j1099k4541j9235k6184k1881K2820M0704l9625k2965
6287F6162R2686N826k8613l4009o166m919k0099J3627P1463p5432J7734l5713
6275F2547l617O9949l7784L2511m4360j8743j7823O0886n2446N6019M2201L8108
6263A87448k2500R886m3561n5826n123O1886N4559m7822L4932Q36p4283Q077j0720
$$ plain form
6347 54577 8126 70653 83635 105839 102390 18763 46379 90539 129739 111298 97837 81470
6335 81470 150970 188231 164988 121991 90562 57410 63940 77616 135532 75998 64546 72415
6323 72415 99929 138422 170937 136869 148929 155517 106682 91307 133225 142704 132137 109153
6311 109153 79306 72346 74050 56387 188491 218132 73607 -6799 62111 127605 90735 112850
6299 112850 164412 212180 168168 157069 132528 113293 87109 65228 88048 128752 89127 66162
6287 66162 158848 164674 136061 102052 95886 90967 70868 84495 155958 80526 98260 62547
6275 62547 58930 128879 91095 123606 79246 60503 42680 103566 51120 107139 149340 187448
6263 187448 164948 174834 131273 75447 70324 132210 186769 138947 173879 174715 100432 108509 97789
6250I7789N9806k4220R781P052l1203n0111O1350k2305j9267K2334P020J1682
6238A29708K8702M621r6323N3858J8302M034m12j1853K4710k5669p6322O3629
6226A16985k2338m9444J0903m8273Q1814P8069k2062K1221j06484N46J7888J6566
6214I5391k0159j2250l104m1464J8608K1203k0792O2050O4460M1176n4452l0269
6202A20398j8076K1748k7255m8564L2152K0100J5494K9867l093Q867L9636k1433
6190A69841m2671N7420l2426m1718P377j6925O2198l2244J6453j0430l2613L0530
6178A34792J0349j9509k579L2886k196m970K5166M788L1239j4585l8032N1225
6166B08574M9417L2302n1151j07028j4550N0863N4339l7715l7388n7657J4611
$$ plain form
6250 97789 157595 133375 143156 150208 119005 68894 130244 107939 88672 111006 118026 129708
6238 129708 158410 163031 66708 120566 138868 142902 142490 130637 155347 129678 53356 116985
6226 116985 94647 45203 56106 7833 89647 167716 145654 166875 60391 60937 78825 95391
6214 95391 75232 62982 59878 18414 37022 58225 37433 99483 163943 205119 150667 120398
6202 120398 102322 124070 96815 48251 80403 100503 115997 145864 142771 151638 191274 169841
6190 169841 127170 184590 152164 110446 117823 100898 163096 130852 147305 136875 104262 134792
6178 134792 145141 125632 123053 155939 153743 148773 173939 178727 209966 195381 157349 208574
6166 208574 257991 290293 239142 132114 117564 168427 222766 185051 147663 90006 104617
6155A04617O9842p1300r668j1111M5695Q3024m78J3059J8575k7944k5954K7292
6143B15649M4945k5813l5751l0294M0261l9102J9067K4589o5655L3936l664P5894
6131B54062k89j3471j9489L1850k6072m3350p9527L2470O7074m4884M7981J6382
6119B22737o4575n4191L2045L2348R288O8994Q991k5223l8429j07194m16O1321
6107A45696J7847j5392q9628n538J09445J5845l7291L510J5608o8624N5699M0473
6095A87650P3213L3541p9462j7013p5840j1537m5613J9161k4000n382O1570O0202
6083A76490k7080l4449L0526m6006N5528M9255l1481L6714J2600q1337j0604m0315
6071H9841j2849P8736j9708j8418p159j6098L7737L9837k1328P615l325K6981
$$ plain form
6155 104617 174459 103159 93491 82380 128075 211099 210621 223680 242255 214311 188357 215649
6143 215649 260594 234781 199030 168736 208997 169895 188962 213551 147896 181832 178168 254062
6131 254062 253773 240302 220813 252663 226591 183241 103714 136184 203258 158374 206355 222737
6119 222737 158162 103971 136016 168364 177652 246646 255637 230414 191985 84791 84375 145696
6107 145696 163543 148151 58523 52985 162430 178275 140984 144494 160102 91478 147177 187650
6095 187650 260863 294404 214942 197929 122089 110552 64939 84100 60100 54718 116288 176490
6083 176490 149410 114961 145487 99481 155009 204264 172783 209497 222097 140760 130156 89841
6071 89841 76992 155728 136020 117602 110443 94345 132082 171919 150591 158206 154881 181862
6059A81862l6445L5348J35639m2928j08346M1887k4228k9516j1945K8033j1557
6048A57804O5278M9178P229J7837n9214k7663l6434j2501j1753j7035J1290N7087
6036B01103k1498q968P3372J1617p6405N1024j6252K1834K3770l4786R983M308
6024B39102M684k6136P278o663n8164k0640j04924L7760M1803R8485k7958j9294
6012A65333P124M2049K9734n305j4813Q017k5986P6336k4074q0543J6836J27218
6000C21926K2161r4917o5056K0733J8573n4230l8246r059P7744k3044J3928O781
5988A97294Q9178J9495p7960J012m1522k0739n8037L4388N3824K865N892K5223
5976B30913M3720r1109P8793L210O2993j0486o64L6387k1098p8476p1601K5168
$$ plain form
6059 181862 145417 180765 316404 273476 165130 207017 182789 153273 141328 169361 157804
6048 157804 223082 272260 279489 297326 238112 210449 174015 161514 149761 132726 144016 201103
6036 201103 179605 170637 244009 255626 179221 230245 213993 235827 259597 224811 234794 239102
6024 239102 243786 217650 224928 218265 160101 139461 34537 72297 114100 212585 184627 165333
6012 165333 172457 214506 244240 238935 224122 232139 206153 282489 258415 177872 194708 321926
6000 321926 344087 249170 184114 204847 223420 169190 130944 121885 199629 176585 190513 197294
5988 197294 286472 305967 228007 229019 187497 166758 108721 143109 196933 199798 205690 230913
5976 230913 274633 183524 262317 265527 328520 318034 317370 353757 332659 254183 182582 207750
5964B07750L476j0260O971l6400L9640m6531M713O1006j2182J4254M4602L0312
5952C07351q8895l180m54J9112J9783k8565P078L4228L6549j4385J3817l3172
5940B69267M5949K2442k0973J0955K3496M3258P9551k2659k3909k5450m0829L7459
5928C98557m876m2605j6018Q7472k1432l9117K0743K1568J3214n3070N806j8609
5916C51633m2018K3606Q7678o4371M2580N5639M293K8826j3228M8934M4894p8977
5904D89489m0488m2263k4605J6005M7014J9381q0341K7909M388J1734o2129Q0079
5892D46173Q5384o5896l5964j6051m9342K1012L3422n115K3509o0206k9853Q0089
5880D27162K8295j7272K2735L0439l5549N3983n5095l0276j0166R656J0770J15411
$$ plain form
5964 207750 211226 200966 207937 171537 211177 164646 169359 230365 218183 232437 277039 307351
5952 307351 218456 215276 214822 233934 253717 225152 232230 266458 303007 288622 302439 269267
5940 269267 315216 337658 316685 327640 351136 394394 473945 451286 427377 401927 361098 398557
5928 398557 393681 351076 335058 422530 401098 361981 382724 404292 417506 364436 370242 351633
5916 351633 309615 333221 420899 356528 399108 454747 459040 487866 474638 523572 568466 489489
5904 489489 449001 406738 382133 398138 445152 464533 384192 412101 416489 428223 366094 446173
5892 446173 531557 465661 429697 413646 364304 385316 418738 413623 437132 376926 347073 427162
5880 427162 455457 438185 460920 491359 455810 509793 454698 424422 414256 423912 434682 550093
5868E50093N1369k8815N3845k9215J98336N6993P2467O2858N347R9800J38472
5857A231550J18205N107Q5739R7338M8730O9731j6202p2268M8651J15902m430
5846A728053j5700J2954k5919j6180n4513m3376p1165r2409n3250p2313j16488
5835A179694J9840p8835q9077l3514o0965j05050l0215M6476p929L8217M2397
5824I21039m6575l2531J3990M6152K6266m2023q714P4001k0880j9861J5679j3187
5812I13356l8832M511P6077L5910l5278l6462o6746j1453K4322n094m9158P758
5800H18911k4266O6663n93j0710R4936l5500m0653l9323L4578J60936j8359k2203
5788I84417P1531k466q70L8440K63N5806L6073j5416N9322M1043l601j9517P9116
$$ plain form
5868 550093 601462 572647 626492 597277 795613 852606 925073 987931 993278 1093078 1231550
5857 1231550 1349755 1354862 1440601 1537939 1586669 1656400 1640198 1567930 1616581 1732483 1728053
5846 1728053 1712353 1725307 1699388 1683208 1628695 1585319 1514154 1421745 1368495 1296182 1179694
5835 1179694 1199534 1120699 1031622 998108 937143 832093 801878 848354 840425 878642 921039
5824 921039 874464 841933 855923 902075 928341 886318 877604 951605 930725 910864 926543 913356
5812 913356 874524 879035 955112 991022 955744 919282 852536 841083 865405 860311 811153 818911
5800 818911 794645 861308 860715 850005 944941 909441 868788 829465 864043 1024979 1006620 984417
5788 984417 1055948 1053482 1052612 1091052 1091315 1147121 1183194 1167778 1227100 1268143 1264542 1245025 1324141
5775A324141J00742O6859O3905J17258P3381P3592J32370J72470K22199L20221
5765B667138L50116M90942P49434J055813J740045K433129K959008K892865J650309
5756A6988799Q13786J13897p02670j749167k224458k136167j752675j632674j509229
5747F209442j100333q24041n46220m46172l40952k74077k50225j87256j00846
5738B139320j30646j48031m3264j8546n2332p1216P632l9266j7346o800n0251
5727A569254p1005j7636M1161m5298l6555L5998j8056o780L2537L4243M5664o3968
5715A499559k8577K8350K358J1985k2449K2803p1722q6076M4275n4426j5933k3295
5703A306852J6844K0857M1186J8485O7471L2653J0127M5173N0863p8298J3932
$$ plain form
5775 1324141 1424883 1491742 1555647 1672905 1746286 1819878 1952248 2124718 2346917 2667138
5765 2667138 3017254 3508196 4257630 5313443 7053488 9486617 12445625 15338490 16988799
5756 16988799 17802585 17916482 17213812 15464645 13240187 11104020 9351345 7718671 6209442
5747 6209442 5109109 4285068 3738848 3292676 2951724 2677647 2427422 2240166 2139320
5738 2139320 2008674 1860643 1817379 1798833 1746501 1675285 1682917 1643651 1626305 1619505 1569254
5727 1569254 1498249 1480613 1521774 1476476 1439921 1475919 1457863 1451083 1483620 1517863 1563527 1499559
5715 1499559 1470982 1499332 1501690 1513675 1491226 1514029 1442307 1356231 1400506 1346080 1330147 1306852
5703 1306852 1323696 1344553 1385739 1404224 1471695 1504348 1514475 1559648 1610511 1532213 1546145
5692A546145n0936k1434P8664L7184N2701L2981K3085k3551K8821K3441l3078
5681A694023O0118J7286o8399r4737M9903K855r1332L6939N9771M1380l8701r207
5669A659899J1538L3662J03192L1653J865j0686M7666P7011M4140M0451M8448
5658B088839M6546L2635R7576L0118j402K4672R8830O0711O5638N0413K0071K0256
5646B634903L2192N906M1309R0932j6213M5735P0911M2797P6869J00295O7141
5635C192777K3519K7408Q9311J40068L4120J52626L4788Q8455J16406R1870N197
5624C996545Q3215J12290j1J1193k6191N9046Q1852P3190O1236M4821L822J3801
5612D514809p1072Q8021k1218N767Q2877J09633J04724J27793P2610J12077J31732
$$ plain form
5692 1546145 1495209 1473775 1552439 1589623 1642324 1675305 1698390 1674839 1703660 1727101 1694023
5681 1694023 1754141 1771427 1703028 1608291 1658194 1661049 1569717 1606656 1666427 1707807 1669106 1659899
5669 1659899 1671437 1705099 1808291 1839944 1841809 1831123 1878789 1955800 1999940 2040391 2088839
5658 2088839 2135385 2168020 2265596 2295714 2294312 2318984 2417814 2478525 2544163 2594576 2614647 2634903
5646 2634903 2667095 2673001 2714310 2805242 2789029 2834764 2905675 2948472 3025341 3125636 3192777
5635 3192777 3216296 3243704 3333015 3473083 3507203 3659829 3694617 3783072 3899478 3991348 3996545
5624 3996545 4079760 4192050 4192039 4203232 4177041 4236087 4317939 4391129 4452365 4497186 4501008 4514809
5612 4514809 4443737 4531758 4510540 4516307 4599184 4708817 4813541 4941334 5013944 5126021 5257753
5601E257753J18907O2319K29875J98328J16643J01788J38430K23687K23073J93284
5591F864087J65696J19221J33738K55054J69693J72178J75515J53628K62473K63495
5581H734778K48268L76810L15223L65202M54933M66123M14342M10384M55531N26526
5571A2768120N04771N45305N87433O62628P37587P89588Q92421J035539J162853
5562A9686245J307073J442827J588640J701631J851781K021244K268276K593606
5554C4461323L123675L782823M553237N768683P382625R572177J2408189J5887328
5546I6940060J9758988K3064777K4829702K4099638K0672040J5390718R398323
5539B34154246L634194o58191k524178j337630J520401M246051N759052N068348
$$ plain form
5601 5257753 5376660 5438979 5668854 5867182 5983825 6085613 6224043 6447730 6670803 6864087
5591 6864087 7029783 7149004 7282742 7537796 7707489 7879667 8055182 8208810 8471283 8734778
5581 8734778 8983046 9359856 9675079 10040281 10495214 10961337 11375679 11786063 12241594 12768120
5571 12768120 13272891 13818196 14405629 15068257 15805844 16595432 17487853 18523392 19686245
5562 19686245 20993318 22436145 24024785 25726416 27578197 29599441 31867717 34461323
5554 34461323 37584998 41367821 45921058 51689741 59072366 68644543 81052732 96940060
5546 96940060 116699048 139763825 164593527 188693165 209365205 224755923 234154246
5539 234154246 237788440 237130249 234606071 233268441 234788842 239034893 244793945 249862293
5531B49862293J927961k986907q902946j4495764j9101981k2242269k3030648
5524A61029739k2012817k0392276j8037405j5198416j2414329j0038491q167217
5517E4768788o775792n554354m726377l964818l282094k815836k289703k002097
5509B3357717j724686j515216j289197j148017j040762j008579q77700q01110
5501A3952450p68252o28457n83552n72325m25074m83129l70380l54074k75122
5492I492085k83974l97496k91648l16106l20049k18797j92053l34538k68940k64333
5482F604151l07896k07988j77279k13688j80753j32347j30198j79568k48868j36501
5472D689065r1348o8182j10085r1313j29146m8371m9353q9806j21800j22816j21329
$$ plain form
5531 249862293 251790254 248803347 239900401 225404637 206302656 184060387 161029739
5524 161029739 139016922 118624646 100587241 85388825 72974496 62936005 54768788
5517 54768788 47992996 42438642 37712265 33747447 30465353 27649517 25359814 23357717
5509 23357717 21633031 20117815 18828618 17680601 16639839 15631260 14753560 13952450
5501 13952450 13184198 12555741 11972189 11399864 10974790 10491661 10121281 9767207 9492085
5492 9492085 9208111 8810615 8518967 8202861 7882812 7664015 7471962 7137424 6868484 6604151
5482 6604151 6296255 6088267 5910988 5697300 5516547 5384200 5254002 5074434 4825566 4689065
5472 4689065 4597717 4529535 4419450 4328137 4198991 4150620 4101267 4011461 3889661 3766845 3645516
5461C645516j55001j70001j2453r6446j59047p2306j24951j24662j41674j08273
5451B480702m5359r6747n9924q7379j04806m4622j01840j1457P531p7465q7218
5440A771416K7126J4611k6787j4749N9825J3517J3195j8318n9782m8587P926p8970
5428A660423m0104K2554m2297n8346o7448j2537L5572l3474j1148L7238l7446
5417A452987j5242l9620L5852q062n772L1444L9438P7253J5647j06510j5349J49479
5405A611545O8871l6369K1199O1849k0916n7458l4794L4713L5152k9006q5523
5394A569263l6629l8976k2816K5248n8032m9387K1174m3662m1996r1325n0209
5383A182653M3495R082K1986j087q0804k9354K7686k3800L2096J5607j8788k9036
$$ plain form
5461 3645516 3490515 3320514 3308061 3211615 3052568 2980262 2855311 2730649 2588975 2480702
5451 2480702 2435343 2338596 2278672 2191293 2086487 2041865 1940025 1928568 1936099 1858634 1771416
5440 1771416 1798542 1813153 1786366 1771617 1831442 1844959 1858154 1839836 1780054 1731467 1739393 1660423
5428 1660423 1620319 1642873 1600576 1542230 1474782 1462245 1497817 1464343 1453195 1490433 1452987
5417 1452987 1437745 1398125 1433977 1425915 1420143 1451587 1491025 1568278 1583925 1477415 1462066 1611545
5405 1611545 1680416 1644047 1665246 1727095 1706179 1648721 1613927 1648640 1683792 1654786 1569263
5394 1569263 1532634 1493658 1470842 1496090 1438058 1388671 1409845 1366183 1324187 1232862 1182653
5383 1182653 1226148 1235230 1257216 1256129 1175325 1145971 1173657 1149857 1181953 1197560 1178772 1149736
5371A149736L815P7504m1988p55K2234J5204K3807o753n2457K6448l0496m4837
5359A141462j0770n0650N5250M2231M7350L266j2135j4694k49j8836J04315K5240
5347A311780N0058K7161p764P3867j8544J405J06797N0839J4964R5649J36134
5336A842346L4471Q3519Q1264J4989J02818J53400J98352J24097J63309J64014
5326B962579K79931L26660M39938N09040P12761R73670J370057J819359J961587
5317A1355582J783183J206981O93813K42055k87151n79455o31458m68085n7299
5308A3258166L43232Q03050R95766N43788J46978k21934p43259j196088j434139
5299A2495560j531282j485208j384714j274203j068152r03398o24035m68298m04150
$$ plain form
5371 1149736 1153551 1231055 1189067 1188312 1210546 1225750 1249557 1242804 1190347 1216795 1186299 1141462
5359 1141462 1130692 1080042 1135292 1177523 1224873 1228139 1216004 1201310 1201061 1182225 1286540 1311780
5347 1311780 1361838 1388999 1381235 1455102 1436558 1437963 1544760 1595599 1610563 1706212 1842346
5336 1842346 1876817 1960336 2041600 2056589 2159407 2312807 2511159 2635256 2798565 2962579
5326 2962579 3242510 3569170 4009108 4518148 5230909 6204579 7574636 9393995 11355582
5317 11355582 13138765 14345746 15039559 15281614 14994463 14415008 13783550 13315465 13258166
5308 13258166 13601398 14404448 15400214 15944002 16090980 15869046 15125787 13929699 12495560
5299 12495560 10964278 9479070 8094356 6820153 5752001 4848603 4224568 3756270 3352120
5290C352120l39845l11129j88608j76485j50524j55997j01457p6671k2000j8235
5280A811169j07821o0351j5491m2265j17133j9167j1017n3319k9486m0634r179
5269A305306J0172q233l4392l9820P520J1463k0198n9247m0500M1882k7781p4152
5257A072020J9425M3356P181n0049k5627L2889K9209M8089o3304p3799p913k2366
5245A009111J0983O5736N0938l4743N6281K2812k064J3041L0378N5683j5206L2226
5233A295176R8842J18873Q4772Q717J72520N9775O9767P7127J19057R4013O6978
5222B265617J6670N2102K8060K7414M697K2104n4308R9258J19725l5462o0155
5211B485722j28452m647l5396m6983o7247j57113j02630m1863r6428j6836N3072
$$ plain form
5290 3352120 3012275 2701146 2512538 2336053 2185529 2029532 1928075 1851404 1829404 1811169
5280 1811169 1703348 1642997 1627506 1585241 1468108 1448941 1437924 1384605 1355119 1314485 1305306
5269 1305306 1315478 1307245 1272853 1233033 1240553 1252016 1231818 1172571 1132071 1173953 1146172 1072020
5257 1072020 1091445 1134801 1141982 1091933 1066306 1099195 1128404 1176493 1113189 1039390 1031477 1009111
5245 1009111 1020094 1085830 1136768 1102025 1158306 1181118 1179054 1192095 1222473 1278156 1262950 1295176
5233 1295176 1394018 1512891 1597663 1606380 1778900 1838675 1908442 1985569 2104626 2198639 2265617
5222 2265617 2282287 2334389 2362449 2389863 2394560 2416664 2362356 2461614 2581339 2545877 2485722
5211 2485722 2357270 2352623 2317227 2270244 2202997 2045884 1943254 1901391 1804963 1788127 1841199
5200A841199p399n3183L3234o010M308j7024k6749l0739J8780j641l5945j933
5188A716898L0174J1703j7366n0599R5467J17j6596Q517K6435Q3866l4658K435
5176A856393M6182j944O4007R874O390l615N7830J07503L3995j1014m810O2610
5164B223401j1831M1168J61440L9902M1426J9476K014o217L4854M6348O5208J39605
5152B796794K8384K5307K7662O7162J04692L3838K2141P6329J4763M7009J22352
5141C366433Q2535O3483L2173P6035N0562R2776R0194J33245N9122O6215J89407
5130D302180J41720J46478J38379O0548J07373J95568J91710K46511J53071J76835
5120E860373K62963R8061J69206K63656K78638K38261K31665K66988K71854K62364
$$ plain form
5200 1841199 1833800 1780617 1813851 1807841 1812149 1795125 1768376 1737637 1756417 1754776 1718831 1716898
5188 1716898 1747072 1758775 1741409 1690810 1786277 1786394 1769798 1778315 1804750 1888616 1853958 1856393
5176 1856393 1902575 1900631 1964638 1974512 1980902 1977287 2035117 2142620 2176615 2165601 2160791 2223401
5164 2223401 2211570 2252738 2414178 2454080 2495506 2514982 2516996 2510779 2545633 2591981 2657189 2796794
5152 2796794 2825178 2850485 2878147 2945309 3050001 3083839 3105980 3182309 3197072 3244081 3366433
5141 3366433 3448968 3512451 3544624 3620659 3671221 3763997 3854191 3987436 4046558 4112773 4302180
5130 4302180 4443900 4590378 4728757 4789305 4896678 5092246 5283956 5530467 5683538 5860373
5120 5860373 6123336 6221397 6390603 6654259 6932897 7171158 7402823 7669811 7941665 8204029
5110H204029K71820L33882K90406L87251L57555L28762L29141L35103L25704K99428
5100A1463081L71993N06322M02421M01883M30558M94221M42547M73253N17736
5091A5504015N05472O40081O14557O08276N92516P28571O35044O61012P76209
5082B1265753Q30974P62104P43674Q16026Q44541Q22306Q47035Q43674O81070
5073B8457157P24091O72492O94334N95201N44542M88779N17860M39152L59267
5064C3492875L63896L79998K65726K56332K58215K13451J53244J40016M7790r2269
5054C5479274j5698j32317j90477k42848l63371m77073m88757n64723o45616p47655
5044C1610739p87856p58166q40250q98110r90042r97215j027134r85322r44469
$$ plain form
5110 8204029 8475849 8809731 9100137 9487388 9844943 10173705 10502846 10837949 11163653 11463081
5100 11463081 11835074 12341396 12743817 13145700 13576258 14070479 14513026 14986279 15504015
5091 15504015 16009487 16649568 17264125 17872401 18464917 19193488 19828532 20489544 21265753
5082 21265753 22096727 22858831 23602505 24418531 25263072 26085378 26932413 27776087 28457157
5073 28457157 29181248 29853740 30548074 31143275 31687817 32176596 32694456 33133608 33492875
5064 33492875 33856771 34236769 34502495 34758827 35017042 35230493 35383737 35523753 35571543 35479274
5054 35479274 35463576 35331259 35140782 34897934 34534563 34057490 33568733 33004010 32358394 31610739
5044 31610739 30822883 30064717 29224467 28326357 27336315 26339100 25311966 24326644 23382175
5035B3382175r41497r82133r07441q98786r06105p87222p96432p62233p68904
5026A5631422o74551o32302o54591n77987n73797n65147n15689m80986m86400
5017A0469972m66985l66514l58239l49031l67656k80328l49653k58543k94817
5008G378206k90187k74169j97311j44942j62968j40734k31366q4339j97718k74050
4998E380422j11966j08272j81395m5185k9405m3593j09734j3694j5566k9797j45471
4987D546344j89256j88587j63285j37940k01069k03859r2395m7335m4996m7950
4977C229672j04604j06088j08418r2919n8056r2924r5570p314n0969o9883p6020
4966B366907J4311p714o6657K906l1379p3052j23946j35225M5716l0189P8237
$$ plain form
5035 23382175 22440678 21458545 20551104 19652318 18746213 17958991 17162559 16400326 15631422
5026 15631422 14956871 14324569 13669978 13091991 12518194 11953047 11437358 10956372 10469972
5017 10469972 10002987 9636473 9278234 8929203 8561547 8281219 7931566 7673023 7378206
5008 7378206 7088019 6813850 6616539 6471597 6308629 6167895 5936529 5852190 5654472 5380422
4998 5380422 5268456 5160184 4978789 4933604 4904199 4860606 4750872 4737178 4721612 4691815 4546344
4987 4546344 4357088 4168501 4005216 3867276 3666207 3462348 3369953 3322618 3277622 3229672
4977 3229672 3125068 3018980 2910562 2817643 2759587 2666663 2571093 2563779 2512810 2442927 2366907
4966 2366907 2381218 2373504 2306847 2309753 2278374 2205322 2081376 1946151 1991867 1961678 2039915
4955B039915k4159o9132N3820q2694r2004J2600n8381P696l6365j4960l4276m3331
4943A658729k0728r4746r297M2822o4331j6631q0721l0260Q2629k4493K4914q971
4931A458916j39762l7335N8959k5092M4104J1793o0688l166J0423l2057p2455
4920A213640k1746j823q5985M4900J18408N4582p4759k3054L6846m5390M9206
4909A264825n6500j4606r217J6171m5066L1006j2437r0458K5727k7813L9426r7548
4897A023510n4500P9252J3951m2231P5632O946j31564O150n4342q055P511m1800
4885H80460L8363M5386j1316q322M9233j7476k0869j8479o1129P44k6420P6772
4873I26947J2240K8295J0423l3004J4121l4359M2148n5785j8884k738L8347J9322
$$ plain form
4955 2039915 2015756 1946624 2000444 1917750 1825746 1838346 1779965 1787661 1751296 1736336 1702060 1658729
4943 1658729 1638001 1543255 1533958 1576780 1512449 1495818 1415097 1384837 1467466 1442973 1467887 1458916
4931 1458916 1319154 1281819 1340778 1315686 1359790 1371583 1310895 1307729 1318152 1286095 1213640
4920 1213640 1191894 1190071 1104086 1148986 1267394 1321976 1247217 1224163 1261009 1215619 1264825
4909 1264825 1208325 1193719 1184502 1200673 1155607 1186613 1174176 1083718 1109445 1081632 1121058 1023510
4897 1023510 969010 1048262 1062213 1019982 1095614 1102560 970996 977146 922804 914749 922260 880460
4885 880460 918823 964209 952893 944571 993804 976328 955459 936980 875851 876595 850175 926947
4873 926947 939187 967482 977905 944901 959022 924663 966811 911026 892142 889404 927751 947073
4861I47073L3328l7618P4115L6856k949K8686O7346P8487R5571J10910J25056
4850A556861J3978J09603j8677Q590M346j31779r8340m9298k1659j1329q757Q3847
4838A437386R1775j3936k593J10889J10362J53918J39271K14753J45446K29634
4828B616905L88910O71262J050793J562733J843805K077560J667273P45780L45055
4819A2970076k70219r74828j481010j552920j360633j190347j153009r75951o25387
4810C385772l86054m41908k00698j62949k57598j19281p9698j11883j25441p8466
4800A421796m1080o2730J2342q0888m9442o5255k3742n2009N7057k4949r3625
4789I97475p458M5540l7028k4200k5349m65O614K9738p3882K5032P2109K6725
$$ plain form
4861 947073 980401 942783 1016898 1053754 1050805 1079491 1146837 1225324 1320895 1431805 1556861
4850 1556861 1570839 1680442 1661765 1670355 1674701 1542922 1444582 1395284 1373625 1362296 1353539 1437386
4838 1437386 1529161 1515225 1512632 1623521 1733883 1887801 2027072 2241825 2387271 2616905
4828 2616905 3005815 3677077 4727870 6290603 8134408 10211968 11879241 12625021 12970076
4819 12970076 12699857 11725029 10244019 8691099 7330466 6140119 4987110 4011159 3385772
4810 3385772 2999718 2557810 2357112 2194163 1936565 1817284 1737586 1625703 1500262 1421796
4800 1421796 1380716 1317986 1330328 1249440 1199998 1134743 1111001 1058992 1116049 1091100 997475
4789 997475 990017 1035557 998529 974329 948980 948515 955129 984867 910985 936017 1008126 1034851
4777A034851l3920r823q0352l1708J906O902L3128l4634K2995m3460L7380N6725
4765I59990o1304m44n8736l4994J43610O9343R788P88n9201j609n2538o0132J3238
4752H67799k5503m2909k37Q1202l1950j7627O2684J03087j7527p2973k7897Q65
4740H79014q70L870J1565l5892M3756M6162J22169L391q7822M1362o1495j3440
4728I51770J694l7781P0342P931k2699N1356O2678k9675m9727K5141N2712L5604
4716A119346j58742N084N7407j1924L2944j2446K5351J3480N197P7280J8888q224
4704A163641M7894N824J6892N1999K9801m4600l3184K8978K8054m1076J2859J3339
4692A280421k0882J770Q909L3978k5653j8047M4882K2664M4189q912m2284M628
$$ plain form
4777 1034851 1000931 991108 910756 879048 880954 887856 920984 886350 909345 865885 903265 959990
4765 959990 898686 898242 839506 804512 948122 1017465 1027253 1028041 968840 967231 914693 854561 867799
4752 867799 842296 799387 799150 880352 848402 830775 893459 996546 979019 906046 878149 879014
4740 879014 878144 882014 893579 857687 901443 947605 1069774 1073165 985343 1026705 965210 951770
4728 951770 953464 915683 986025 993956 971257 1022613 1085291 1055616 1005889 1031030 1083742 1119346
4716 1119346 960604 965688 1023095 1011171 1044115 1031669 1057020 1070500 1075697 1152977 1171865 1163641
4704 1163641 1211535 1217359 1234251 1286250 1316051 1271451 1238267 1267245 1295299 1254223 1267082 1280421
4692 1280421 1259539 1261309 1270218 1304196 1278543 1260496 1305378 1328042 1372231 1363319 1321035 1325663
4680A325663J4898M5579q303M6413j9492J04909M059M9343M9780n9345J1250J03694
4668A668448M767P9076P0182L3398J18059O5969K3106P6789K7294J11009M4314
4657B322411L9913P8176O1926O6031R3224O1330m8271M3327k3735m3102K9193
4646B680423L0427M7445K930l0788K5691N397N6338J6192K9164K8298j4907R5503
4634B972113J49727J13259J52493J50938L04823L95569O32520O74599N76187K92569
4624F414797J65785O2749j42781l32343m54949l12354k12928k29872j71366o858
4614D779880Q8279J26450J77863K94297L74323M41444L75973L89118L60950L99457
4604G808034L60263M81117N95953O67101N84741M62981M40635L30703L22140L19666
$$ plain form
4680 1325663 1340561 1386140 1377837 1424250 1404758 1509667 1513726 1563069 1612849 1553504 1564754 1668448
4668 1668448 1673215 1752291 1822473 1855871 1973930 2039899 2063005 2139794 2167088 2278097 2322411
4657 2322411 2362324 2440500 2502426 2568457 2661681 2723011 2674740 2718067 2694332 2651230 2680423
4646 2680423 2710850 2758295 2761225 2730437 2756128 2761525 2817863 2834055 2863219 2891517 2876610 2972113
4634 2972113 3121840 3235099 3387592 3538530 3843353 4238922 4871442 5546041 6122228 6414797
4624 6414797 6580582 6643331 6500550 6168207 5713258 5400904 5187976 4958104 4786738 4779880
4614 4779880 4868159 4994609 5172472 5466769 5841092 6282536 6658509 7047627 7408577 7808034
4604 7808034 8168297 8649414 9245367 9912468 10497209 10960190 11400825 11731528 12053668 12373334
4594A2373334M00046N20685O08844M28279K33857J5221l591j26647j63972q9563
4584A4196493M1801J0730j30822j80133j49743j87727k11743j92570j37067p3907
4574A2985312K495M448N9064J99071J94038K54690M37549O47376P65201J099531
4564A6648775J545068K018038K713096L435208M116017M914351N726006O170551
4556D7287110O214862N989105N436592M738442M275442M330930M727762N460748
4548H8460993O321421P067174O885511N299609L136286J249890o05571k656672
4540A15158641m224349n027787n371065n239293n137504n089076m958608n028947
4532G5082012n132882n229604n616909n818375n757588n602876n109819m598526
$$ plain form
4594 12373334 12773380 13294065 13902909 14331188 14565045 14580266 14576675 14450028 14286056 14196493
4584 14196493 14238294 14249024 14118202 13938069 13788326 13600599 13388856 13196286 13059219 12985312
4574 12985312 12987807 12992255 13051319 13250390 13444428 13699118 14136667 14784043 15549244 16648775
4564 16648775 18193843 20211881 22924977 26360185 30476202 35390553 41116559 47287110
4556 47287110 53501972 59491077 64927669 69666111 73941553 78272483 83000245 88460993
4548 88460993 94782414 101849588 108735099 114034708 117170994 118420884 117815313 115158641
4540 115158641 110934292 105906505 100535440 95296147 90158643 85069567 80110959 75082012
4532 75082012 69949130 64719526 59102617 53284242 47526654 41923778 36813959 32215433
4524C2215433m014864l445113k733667k229984j719110j249590j035803p78256
4516A5009046n00531l90356k23016l53337n40682m13837k86056k13026k82821
4507A1805384m64467n43957n42247n17200l75446l11148m47936m41319k92902
4498G868762k34433k24905m35602m28783l83497m58941l42682l53139k50900k24570
4488D531310k26979j81052j53211j59370k50330q4926k3472j36988k5608p9695
4478C209679j05645k5919n1075r9862j00823j06045r753L514j39737m7058o5105
4467B462171j16710j35591k0424m7767l1668n1167k508L043m3522j08716n7980
4456A849161p884l2507p5939l3926o168n9272J8071O9474J640N7139M428l7134
$$ plain form
4524 32215433 28200569 24755456 22021789 19791805 18072695 16823105 15787302 15009046
4516 15009046 14508515 14118159 13895143 13541806 13001124 12587287 12301231 12088205 11805384
4507 11805384 11340917 10796960 10254713 9737513 9362067 9050919 8602983 8161664 7868762
4498 7868762 7634329 7409424 6973822 6545039 6161542 5702601 5359919 5006780 4755880 4531310
4488 4531310 4304331 4123279 3970068 3810698 3560368 3475442 3451970 3314982 3289374 3209679
4478 3209679 3104034 3078115 3027040 2927178 2826355 2720310 2710557 2714071 2574334 2527276 2462171
4467 2462171 2345461 2209870 2189446 2141679 2110011 2058844 2056336 2059379 2015857 1907141 1849161
4456 1849161 1841277 1808770 1732831 1698905 1692737 1633465 1651536 1721010 1722650 1779789 1784217 1747083
4444A747083J0155J19611k6956N5854l471O664M9801N4353O2251N3982P9384m8248
4432B160463L7146k6733l9044k2377l4377p8392l1617M0755n4809p3072k4343
4421A853600P70o6246k3262j0299p1574Q3085k4295p4821k0641j864o5358o250
4409A572845Q017q0146O647J5731q64J1526K5808m187n5371J10850m5994j18790
4397A446072N071K3284l6095j8927M5504L0574m0361k2781j6484m1791K0140k6246
4385A367960j0194O5789J4373J6123L7428l513j0411j1492l3581J4615L1200j4721
4373A463576P4273q770j7363K5786j4935p387m4109M6543L9344l1864m8485N5500
4361A532109O4417K110L3113K2238O0816N5332N3740M1907J20584J45573J54591
$$ plain form
4444 1747083 1757238 1876849 1849893 1905747 1902276 1908940 1958741 2013094 2075345 2129327 2208711 2160463
4432 2160463 2197609 2170876 2131832 2109455 2075078 1996686 1965069 2005824 1951015 1877943 1853600
4421 1853600 1854370 1788124 1764862 1754563 1682989 1766074 1741779 1666958 1646317 1644453 1579095 1572845
4409 1572845 1580862 1500716 1507363 1523094 1522230 1533756 1559564 1555377 1500006 1610856 1564862 1446072
4397 1446072 1451143 1474427 1438332 1419405 1464909 1495483 1455122 1432341 1415857 1374066 1394206 1367960
4385 1367960 1357766 1423555 1437928 1454051 1491479 1487966 1477555 1466063 1432482 1447097 1478297 1463576
4373 1463576 1537849 1529079 1511716 1537502 1522567 1515180 1471071 1517614 1556958 1525094 1476609 1532109
4361 1532109 1596526 1598636 1631749 1653987 1714803 1770135 1823875 1865782 1986366 2131939 2286530
4350B286530K33870Q7577R5825L5159p1429j28289j81151o4773q5222j45122k9438
4339B033537o9459o2990l1694K189M2037K1870j2745r122J1420K8504M4843n092
4327A993298P2708J3273J0707L8581o9659J576Q6057N5232M2021J548P546J1710
4315B264598Q2242Q1016J9380J6076R406L7475J0829Q6471O4326J06261M3860
4304B821940M3870l8939Q4653O0005k1432Q9957Q0349R2954O2527K4916j2835
4293C287965N1444N4287R9197K6344j1009Q2777J37471N3952k6377R7387N1681
4282C905119k8782O6114R9726P7069Q312K3946N078J39253M0439n0130R7364P7935
4270D461443j2620O6644O1044K6414M9040J6576J25501J27611J44491J17087J01160
$$ plain form
4350 2286530 2520400 2607977 2703802 2738961 2667532 2539243 2358092 2293319 2208097 2062975 2033537
4339 2033537 1964078 1901088 1869394 1871583 1913620 1935490 1922745 1913623 1925043 1953547 1998390 1993298
4327 1993298 2066006 2079279 2089986 2128567 2058908 2060484 2146541 2201773 2243794 2245342 2252888 2264598
4315 2264598 2346840 2427856 2447236 2463312 2472718 2510193 2521022 2607493 2671819 2778080 2821940
4304 2821940 2865810 2826871 2911524 2971529 2950097 3040054 3120403 3213357 3275884 3300800 3287965
4293 3287965 3339409 3393696 3492893 3519237 3508228 3591005 3728476 3782428 3756051 3853438 3905119
4282 3905119 3876337 3942451 4042177 4119246 4127558 4151504 4156582 4295835 4336274 4286144 4383508 4461443
4270 4461443 4448823 4515467 4576511 4602925 4651965 4668541 4794042 4921653 5066144 5183231 5284391
4259E284391J15770J69524J68789J44761K04133J62527J64650J89917K77780K47572
4249G129814K11850K86421L44562L19806M11682M06834N26313N03658M72046N72874
4239A1185860O57844O44519P64450Q25368Q45583R77102R91707J198791J261146
4230A9352370J303280J410984J494755J684108J903337J923170J961887K094070
4222C3127961K200918K210231K288342K379090K513074K682092K706798K821597
4214E2930103K808257K944285L097861L178428L133180L156726K997540K955752
4206G7202132K870267K628404K406588K285618K250331K129608K089206J992543
4198I5854697J882753J820563J740661J563319J371987J102825Q92996M25776
$$ plain form
4259 5284391 5400161 5569685 5738474 5883235 6087368 6249895 6414545 6604462 6882242 7129814
4249 7129814 7341664 7628085 7972647 8292453 8704135 9110969 9637282 10140940 10612986 11185860
4239 11185860 11843704 12488223 13252673 14078041 14923624 15900726 16892433 18091224 19352370
4230 19352370 20655650 22066634 23561389 25245497 27148834 29072004 31033891 33127961
4222 33127961 35328879 37539110 39827452 42206542 44719616 47401708 50108506 52930103
4214 52930103 55738360 58682645 61780506 64958934 68092114 71248840 74246380 77202132
4206 77202132 80072399 82700803 85107391 87393009 89643340 91772948 93862154 95854697
4198 95854697 97737450 99558013 101298674 102861993 104233980 105336805 106229801 106655577
4190A06655577J07492j59803l64879o26470p91842r36086j149392j218900j319512
4181A00196185j435426j655932j675455j890378k166598k322409k560174k680384
4173H3809429k844410k904701k903367k951395k878722k859661k835573k780091
4165F0851509k704032k715977k653726k555445k518672k571449k484711k372675
4157D0274822k265002k246332k108183j978298j975886j824899j746534j573546
4149B4556142j506076j398063j271494j142004j167406j096459r95165q85042
4141A5094433p94943q46657q02812o89081o57002o55145m97421n14903n18911
4132I117558l43777m13864l30008l71216k97790k32051k27145k59639k49747l02499
$$ plain form
4190 106655577 106763069 106603266 106238387 105611917 104820075 103883989 102734597 101515697 100196185
4181 100196185 98760759 97104827 95429372 93538994 91372396 89049987 86489813 83809429
4173 83809429 80965019 78060318 75156951 72205556 69326834 66467173 63631600 60851509
4165 60851509 58147477 55431500 52777774 50222329 47703657 45132208 42647497 40274822
4157 40274822 38009820 35763488 33655305 31677007 29701121 27876222 26129688 24556142
4149 24556142 23050066 21652003 20380509 19238505 18071099 16974640 15979475 15094433
4141 15094433 14299490 13452833 12650021 11960940 11303938 10648793 10151372 9636469 9117558
4132 9117558 8773781 8359917 8029909 7658693 7360903 7128852 6901707 6642068 6392321 6089822
4122F089822j44642j39526j86731j40008k08709r4367p6401j06268p2693j64372
4112D756105m9147n8712q9359m0011j12309n0049l9571j84927m7457J1411n6181
4101D039793j8195k0181m3416j40570K1373L4808R6168N930L2520k4528k0021
4090C963681P6245P0948K7484o447J05045J47045J23428P2432P1797k4628J10225
4079D737255L1084R1292J67615K5245N4502R6772O8163Q5304P8743O4632N607
4068E506214N8605J03118p2635j276J05376M9855j9513l423L6668J11843J8860
4057E893692j722K9632O0348N4873L340J7283P2717Q315J09226K1323O2772m793
4045F327006J7306J9593j5336l1398k2360k027p5044k5609j626J2593r786q702
$$ plain form
4122 6089822 5945180 5805654 5618923 5478915 5270206 5175839 5099438 4993170 4920477 4756105
4112 4756105 4706958 4648246 4558887 4518876 4406567 4356518 4316947 4132020 4084563 4095974 4039793
4101 4039793 4021598 4001417 3958001 3817431 3838804 3873612 3969780 3975710 4008230 3983702 3963681
4090 3963681 4039926 4110874 4138358 4131911 4236956 4384001 4507429 4579861 4651658 4627030 4737255
4079 4737255 4768339 4859631 5027246 5052491 5106993 5203765 5271928 5357232 5435975 5500607 5506214
4068 5506214 5564819 5667937 5595302 5594026 5699402 5749257 5729744 5726321 5762989 5874832 5893692
4057 5893692 5891970 5921602 5981950 6036823 6040163 6057446 6130163 6138478 6247704 6269027 6331799 6327006
4045 6327006 6344312 6363905 6348569 6317171 6294811 6292784 6217740 6192131 6190505 6203098 6193312 6184610
4033F184610P8180j7540J3449J1030K7749R4502M2116L5426K8317J09256J00888
4022F707983Q7470J20533P0899J28788N8730M0299P6616K1485Q3033J23419R1254
4011G610509M2351N740Q1310R7847J18947J78195J28191M2167J38758J83046J60019
4000H787080J18924J0442R8322J90249K55283J86402K18523J89548K46082K47503
3990A0548358K83219K20853K60969M46192L80396K83332K94115L34377L39560
3981A3391371L67896L41698K80593L33603L19710L13756L66683M13585M28368
3972A6557263M45909N18431N30853N50965O23558O58812P31794P39496O35985
3963B1993066P38910Q70637R44694J000635J119528J215421J404631J637936J855934
$$ plain form
4033 6184610 6262790 6245250 6258699 6269729 6297478 6391980 6434096 6469522 6497839 6607095 6707983
4022 6707983 6795453 6915986 6986885 7115673 7174403 7214702 7291318 7312803 7395836 7519255 7610509
4011 7610509 7652860 7658600 7739910 7837757 7956704 8134899 8263090 8305257 8444015 8627061 8787080
4000 8787080 8906004 8916446 9014768 9205017 9460300 9646702 9865225 10054773 10300855 10548358
3990 10548358 10831577 11052430 11313399 11759591 12139987 12423319 12717434 13051811 13391371
3981 13391371 13759267 14100965 14381558 14715161 15034871 15348627 15715310 16128895 16557263
3972 16557263 17003172 17521603 18052456 18603421 19226979 19885791 20617585 21357081 21993066
3963 21993066 22731976 23602613 24547307 25547942 26667470 27882891 29287522 30925458 32781392
3954C2781392K093774K510071K818592L156144L784981M351331N098019N932482
3946F2526786O987839Q099134R518748J1448269J3798535J6261750J9045741K1561428
3938A69248230K3389515K3999550K3123445K0870863J7302459J3016232Q522782
3931B99473076M268318Q41403j490088k759725l128578k488449j349432j37683
3923B93228842R27055J243361M56302j381184m125070p690863j1451981j5015369
3915B56191093j8090155k0036780k1063578k0943989k0033245j8653688j6697383
3908A20672275j4690213j2643510j0838216r203330p831082o590811n570222m651922
3900D8652969m011978l401725k799896k367053k024497j797423j559110j368714
$$ plain form
3954 32781392 34875166 37385237 40203829 43359973 47144954 51496285 56594304 62526786
3946 62526786 69514625 77613759 87132507 98580776 112379311 128641061 147686802 169248230
3938 169248230 192637745 216637295 239760740 260631603 277934062 290950294 299473076
3931 299473076 303741394 304582797 303092709 300332984 297204406 294715957 293366525 293228842
3923 293228842 294155897 295399258 295855560 294474376 290349306 282658443 271206462 256191093
3915 256191093 238100938 218064158 197000580 176056591 156023346 137369658 120672275
3908 120672275 105982062 93338552 82500336 73297006 65465924 58875113 53304891 48652969
3900 48652969 44640991 41239266 38439370 36072317 34047820 32250397 30691287 29322573
3892B9322573j209407j189179q73798q47165p62305n97468n57291m65795m10980
3883B2409185l40240l56349l23376l16957k68637j82964k85287k34615j33290
3874A9967470l54251j94379j26587j46127j44663q9169j9075N7516j07J21755
3864A9072383J34561J36950K48516J51944J66438K59334K14314J98522K71626
3855B0854588J99773J92510J92274K18664J35370J68601K15595L24087L47203
3846B2848665K58833L04555L12545L03418J82655K80842J16043L1247r176l8953
3836B4590674o1396N002N415N1392J40724J43739K01374K69210K62196K11944
3826B5820274L54024L57467L79985M00038N23743O12324P74213Q32014R82870
$$ plain form
3892 29322573 28113166 26923987 26050189 25203024 24440719 23843251 23285960 22820165 22409185
3883 22409185 22068945 21712596 21389220 21072263 20803626 20620662 20335375 20100760 19967470
3874 19967470 19613219 19418840 19292253 19146126 19001463 18912294 18893219 18950735 18950628 19072383
3864 19072383 19206944 19343894 19592410 19744354 19910792 20170126 20384440 20582962 20854588
3855 20854588 21054361 21246871 21439145 21657809 21793179 21961780 22177375 22501462 22848665
3846 22848665 23107498 23412053 23724598 24028016 24210671 24491513 24607556 24638803 24629627 24590674
3836 24590674 24529278 24534280 24539695 24591087 24731811 24875550 25076924 25346134 25608330 25820274
3826 25820274 26174298 26531765 26911750 27311788 27835531 28447855 29222068 30054082 31036952
3817C1036952J236514J460986J666497J869263K167528K637598L045288L383970
3809D8504596L977307M536372N328270N926128O871960P921223Q979527J0015696
3801A02061079J1099772J2045378J2651005J3139977J2941217J2423505J1583365
3794A87945298J0432703R353549Q566331P994104P786558P958871Q355723Q654386
3786B57047523Q937156Q879076Q293620P373655N882223M234097K535181O12838
3778C03795369j184239l035914m530837n823975p066998p981559q685731r305643
3770B56180473r765815r888408r903853r951980r876720r831601r894875j0002580
3762A77064641j0103712j0270161j0441662j0452657j0572949j0534108j0297947
$$ plain form
3817 31036952 32273466 33734452 35400949 37270212 39437740 42075338 45120626 48504596
3809 48504596 52481903 57018275 62346545 68272673 75144633 83065856 92045383 102061079
3801 102061079 113160851 125206229 137857234 150997211 163938428 176361933 187945298
3794 187945298 198378001 207731550 216297881 224291985 232078543 240037414 248393137 257047523
3786 257047523 265984679 274863755 283157375 290531030 296413253 300647350 303182531 303795369
3778 303795369 302611130 299575216 295044379 289220404 282153406 274171847 265486116 256180473
3770 256180473 246414658 236526250 226622397 216670417 206793697 196962096 187067221 177064641
3762 177064641 166960929 156690768 146249106 135796449 125223500 114689392 104391445
3755A04391445r905169r303928q599438p852962p017161o165435n495042m667442
3747D5384868l976294l296740k787141k389004j999937j557718j286924j157151
3739B6933959r97317r15077p22584p38204o76872n69387o36868n00921m39201
3730B0737528l35581l18008k09386j32390r789j9345j83705j84318k26728l03607
3720A8814671m47111n56481n65086n49275o07866o20877o24867n08453m09232
3711A3925423l70359m26059m00999l78445m05180m85977m57109m93497n72191
3702I935607m94197m84009n31126m93502m15199l92007m67449l05434k03477k19182
3692E930025l27908k37616k45293k38323j65325j23032o0044j62545p8572q6520
$$ plain form
3755 104391445 94486276 85182348 76582910 68729948 61712787 55547352 50052310 45384868
3747 45384868 41408574 38111834 35324693 32935689 30935752 29378034 28091110 26933959
3739 26933959 25936642 25021565 24298981 23560777 22883905 22314518 21677650 21176729 20737528
3730 20737528 20401947 20083939 19874553 19742163 19732374 19713029 19529324 19345006 19118278 18814671
3720 18814671 18367560 17811079 17245993 16696718 16088852 15467975 14843108 14334655 13925423
3711 13925423 13555064 13129005 12728006 12349561 11944381 11458404 11001295 10507798 9935607
3702 9935607 9441410 8957401 8426275 7932773 7517574 7125567 6658118 6352684 6149207 5930025
3692 5930025 5602117 5364501 5119208 4880885 4715560 4592528 4532484 4369939 4291367 4204847
3682D204847n5026m0521k74400r7200Q5113r0883m7324n9672j11200q5723R777
3671C437788o4958p9036l4020K2433r7117o4454M0492o7487M0456j9677n7719
3660C056701J846Q39l3916M5338l3759N199L6651l5211Q2156J1685P2811P7952
3648C288292J16313K0390R0159M6600K0964N4021J4373Q38k292N4440l7028o5357
3636C601713m3560L8378l8092l8996O141l110l2687j20851n7756K7599j04983
3625C233796n2200q8480q8184o7724j20737j15130n1640k2257o1133r0185q9671
3614B386455o4093p0582p085j474q9N395o7797J954l950k3276J9178Q168p989
3601B174815K6776R899K0534P8160J9628J1026J3640N6320L1662j4060R4114n077
$$ plain form
3682 4204847 4149821 4109300 3834900 3737700 3822813 3731930 3684606 3624934 3513734 3428011 3437788
3671 3437788 3372830 3293794 3259774 3282207 3185090 3120636 3161128 3093641 3134097 3114420 3056701
3660 3056701 3058547 3059386 3025470 3070808 3037049 3042248 3078899 3043688 3125844 3137529 3210340 3288292
3648 3288292 3404605 3424995 3515154 3561754 3582718 3636739 3651112 3651950 3649658 3704098 3667070 3601713
3636 3601713 3558153 3596531 3558439 3519443 3525584 3522474 3489787 3368936 3311180 3338779 3233796
3625 3233796 3181596 3093116 3004932 2937208 2816471 2701341 2649701 2627444 2566311 2476126 2386455
3614 2386455 2322362 2251780 2244695 2243221 2243132 2248527 2180730 2182684 2178734 2155458 2174636 2182804 2174815
3601 2174815 2201591 2211490 2232024 2310184 2329812 2340838 2354478 2410798 2442460 2428400 2522514 2517437
3589B517437J02839J02453j1073P0058J35805M898j2046J34813P5501K4660K3585
3578C168930R6568L0602O4876J02889J0975R4752J42496K12523J36431N7324J18496
3567D236862J71841Q4281R9153J20722O4651Q9640J64247J07299J66296J23500
3557E428492J47597J98070J25944J76650J84458K02164J60740K07804K54074L43830
3547G429823K86378L10279L57839L53139L07413L70994L01609L19009L15342K63089
3537A0614914K51965K72479J17559J56120N1549R9197P6474O7319N9549J23180
3527A1890305J83066K09012K65686K31112L55659L88215L72961N34353O92887
3518A5123256P80372Q04987Q24899Q59186P93100Q46011Q50819Q55104P59261
$$ plain form
3589 2517437 2620276 2722729 2711656 2781714 2917519 2922417 2910371 3045184 3120685 3145345 3168930
3578 3168930 3265498 3296100 3360976 3463865 3474840 3569592 3712088 3924611 4061042 4118366 4236862
3567 4236862 4408703 4492984 4592137 4712859 4777510 4867150 5031397 5138696 5304992 5428492
3557 5428492 5576089 5774159 5900103 6076753 6261211 6463375 6624115 6831919 7085993 7429823
3547 7429823 7716201 8026480 8384319 8737458 9044871 9415865 9717474 10036483 10351825 10614914
3537 10614914 10866879 11139358 11256917 11413037 11464586 11563783 11640257 11707576 11767125 11890305
3527 11890305 12073371 12282383 12548069 12779181 13134840 13523055 13896016 14430369 15123256
3518 15123256 15903628 16708615 17533514 18392700 19185800 20031811 20882630 21737734 22496995
3509B2496995P42691Q05748P65292P19723O59936P03237P05524O05648N92577
3500B8797371N49566N23791N00875N76595O79688O93378P89634R48929J076858
3491C5136685J252979J421242J551088J589425J630142J636043J607685J516684
3483D7341973J444788J476978J632339J694675J925031K284554K771330L339334
3475F3911002M137071M839523N715229O424338P102401P602620P770209P743979
3467A15246372P130277O123967M787924L128928J218472q27888k759640m135009
3459A29913403n199644n877945o164995o131122n838334n530925n094995m817326
3451H5258117m536912m279454m077188l913208l764566l639181l506050l403478
$$ plain form
3509 22496995 23239686 24045434 24810726 25530449 26190385 26893622 27599146 28204794 28797371
3500 28797371 29346937 29870728 30371603 30948198 31627886 32321264 33110898 34059827 35136685
3491 35136685 36389664 37810906 39361994 40951419 42581561 44217604 45825289 47341973
3483 47341973 48786761 50263739 51896078 53590753 55515784 57800338 60571668 63911002
3475 63911002 68048073 72887596 78602825 85027163 92129564 99732184 107502393 115246372
3467 115246372 122376649 128500616 133288540 136417468 137635940 136808052 134048412 129913403
3459 129913403 124713759 118835814 112670819 106539697 100701363 95170438 90075443 85258117
3451 85258117 80721205 76441751 72364563 68451355 64686789 61047608 57541558 54138080
3443E4138080l208613l074639l064874k853248k738091k667235k477462k328059
3435C1725859k176427j931841j850031j595972j388445j257944j146295j006724
3427A9372180q41124q22116p89400p17902p48990o57315o43404p03296n83130
3418A2865503n85188n58562n68179m80786l74392l66181l46612l36253k92641
3409H956709l37277l14315k10009k62908l11574k13271k34478k58742k25503j98288
3399F390344k74023j97310j80768k55034k81724j86826j99472k03193j72525j22722
3389D316747j61075j45170j78432j04228j90056j32826k8995j23113q7495j49716
3379C015641j22828r3128m9413j38873o1459l0168l8438q3902l6013o6216m0193
$$ plain form
3443 54138080 50929467 47854828 44789954 41936706 39198615 36531380 34053918 31725859
3435 31725859 29549432 27617591 25767560 24171588 22783143 21525199 20378904 19372180
3427 19372180 18531056 17708940 16919540 16201638 15452648 14795333 14151929 13448633 12865503
3418 12865503 12280315 11721753 11153574 10672788 10298396 9932215 9585603 9249350 8956709
3409 8956709 8619432 8305117 8095108 7832200 7520626 7307355 7072877 6814135 6588632 6390344
3399 6390344 6116321 5919011 5738243 5483209 5201485 5014659 4815187 4611994 4439469 4316747
3389 4316747 4155672 4010502 3832070 3727842 3537786 3404960 3375965 3252852 3165357 3015641
3379 3015641 2892813 2799685 2750272 2611399 2549940 2519772 2481334 2397432 2361419 2295203 2255010
3368B255010k4819m0756J4296j03435L5350L2191p5850j1833m8392j8937l0702
3357A982123m9892l4211n8245n1142l3813K490P021k5521o5488j43505l7990R3982
3345A585809j6945j3311m8806Q163J3088m3643k362L556N5080p4920p9103L9564
3333A426170P557l778Q5235n5022Q611M3895m2085k1789k1502n5279k7945N438
3321A349506m4850l7725m0002o4848m1874k2297p814M0999n6407m7593L7864q7561
3309I77398k2516K5286K2229J15989k7961n0674r444m2728m0263J0999M8997k5409
3297I81903o708J04027K8043p7250J5435J2867q27l7260j8046m4280j89m4120
3285I13595n1244M1364L06M8700l0731J7314k2787m8504Q5344M9807m769k052
$$ plain form
3368 2255010 2230191 2189435 2203731 2100296 2135646 2167837 2091987 2080154 2031762 2012825 1982123
3357 1982123 1932231 1898020 1839775 1788633 1754820 1757310 1764331 1738810 1673322 1529817 1491827 1585809
3345 1585809 1568864 1555553 1506747 1514910 1527998 1484355 1481993 1485549 1540629 1465709 1386606 1426170
3333 1426170 1433727 1429949 1515184 1460162 1468773 1512668 1470583 1448794 1427292 1372013 1344068 1349506
3321 1349506 1304656 1266931 1226929 1162081 1120207 1097910 1090096 1131095 1074688 1027095 1064959 977398
3309 977398 954882 980168 1002397 1118386 1090425 1039751 1030307 987579 947316 958315 1007312 981903
3297 981903 975195 1079222 1107265 1030015 1045450 1058317 1057490 1020230 1002184 957904 957715 913595
3285 913595 862351 903715 904021 952721 921990 939304 916517 868013 953357 1003164 998395 996343
3273I96343M1329M1866K3160L6826N016j5848N9062J232M6553R9310P7993J05589
3261A518431R8589j5723J0434m1641k9577N9545j9386K1582j01244j2324m8729
3250A439957K2036J1092l2400M2356Q3911l9273L3522P5573L1696M4384R3688
3239A806542M4359O9304J18381M1243J06088J29873M3011J40405P9836n3004p534
3228B518504k6166j224o787K4268m3547n7802j3901J30577K9417o828L6574M6953
3216B630038M303J06286R0373J00999J01696Q0225J14298O2995J16416O1833J03903
3205C573365P5704L2136J61035O0377N1433N4548o147R4042R6445P9712N7444
3194D330094J05843R6987P0995Q5464J10215L7532J02371J97355J19026J87835
$$ plain form
3273 996343 1037672 1079538 1102698 1139524 1144540 1128692 1187754 1188986 1235539 1334849 1412842 1518431
3261 1518431 1617020 1601297 1611731 1570090 1540513 1600058 1580672 1602254 1501010 1488686 1439957
3250 1439957 1461993 1473085 1440685 1483041 1566952 1527679 1561201 1636774 1668470 1712854 1806542
3239 1806542 1850901 1920205 2038586 2079829 2185917 2315790 2358801 2499206 2579042 2526038 2518504
3228 2518504 2492338 2491114 2484327 2508595 2465048 2407246 2393345 2523922 2553339 2546511 2583085 2630038
3216 2630038 2634341 2740627 2831000 2931999 3033695 3113920 3228218 3291213 3407629 3469462 3573365
3205 3573365 3649069 3681205 3842240 3902617 3954050 4008598 4002451 4096493 4192938 4272650 4330094
3194 4330094 4435937 4532924 4603919 4689383 4799598 4837130 4939501 5136856 5255882 5443717
3184E443717J58111J02890K06810J48639J49923K34261K43651K09082K22869K22274
3174G342227K94009L49112L61206L71045M52694N62109M45167N60934O23702O88230
3164A2050435P55695P74218Q50015J014467J188338J335993J467090J758187K070460
3155B3264898K195723K488319K802659K874209K845574K751266K258954J764904
3147D3246506J417791Q82925M86763J20635o0831j41134j63205j46221j98368
3138D5444861j95854j96932q4442n6115L8432J77087K96798L76857O15467J024421
3128D7440580J500030K128823L119146M749918O834622Q494012R558530Q991787
3120I2817448O529477L559199M44832k782884n760299p629651q090536p790287
$$ plain form
3184 5443717 5601828 5704718 5911528 6060167 6210090 6444351 6688002 6897084 7119953 7342227
3174 7342227 7636236 7985348 8346554 8717599 9170293 9732402 10177569 10738503 11362205 12050435
3164 12050435 12806130 13580348 14430363 15444830 16633168 17969161 19436251 21194438 23264898
3155 23264898 25460621 27948940 30751599 33625808 36471382 39222648 41481602 43246506
3147 43246506 44664297 45547222 46033985 46154620 46093789 45952655 45789450 45643229 45444861
3138 45444861 45249007 45052075 44967633 44911518 44949950 45127037 45423835 45800692 46416159 47440580
3128 47440580 48940610 51069433 54188579 58938497 65773119 74267131 83825661 92817448
3120 92817448 99346925 102906124 103350956 100568072 94807773 87178122 79087586 71297299
3112G1297299p498177o660407n582936m558855l547123k796627k332621j971929
3104C6348624j688249j431190j021810o23417l45345j50897R4336M34046P25955
3095C2342053J042167J298303J618615J659618J514413J141978O48038L4810p77937
3086D0522058j469480k046288k424351k574310k649531k603002k525812k210420
3078B2018864j955751j767990j493249j436583j260989j088120q75341r34581
3070A1206260q08005o98909o58585o24498n63098n07904m40647m18110l38522
3061F147982k84433k20927l08148k66512j84899k25752k27022k13867j21344q7976
3051D007102j27979j89576j59686j70189j18737j06082j07702j32765j54630j52364
$$ plain form
3112 71297299 63799122 57138715 51555779 46996924 43449801 40653174 38320553 36348624
3104 36348624 34660375 33229185 32207375 31583958 31238613 31087716 31182052 31616098 32342053
3095 32342053 33384220 34682523 36301138 37960756 39475169 40617147 41265185 41299995 40522058
3086 40522058 39052578 37006290 34581939 32007629 29358098 26755096 24229284 22018864
3078 22018864 20063113 18295123 16801874 15365291 14104302 13016182 12140841 11206260
3070 11206260 10398255 9699346 9040761 8416263 7853165 7345261 6904614 6486504 6147982
3061 6147982 5863549 5642622 5334474 5067962 4883063 4657311 4430289 4216422 4095078 4007102
3051 4007102 3879123 3689547 3529861 3359672 3240935 3134853 3027151 2894386 2739756 2587392
3041B587392n5647p9772j31182j38054q3911r7544j23535n7441j44602k8733p0023
3030A576948j5997J7866l8987r5119p97n3877k0099m809m2311n6444j09449J2209
3018A169134L6935k442j53363r4824m427l1400p9520R830Q170o0518L2453r849
3006H20179q1200m8618R418n3524l1801n1885m6948m4806K4162R528o5623k2108
2994D16774P390K381K7231M1023k9731l3858j063o532l7493P508l5592j1268K5034
2981C71804K446Q550j1882l8375J5389N5762J2204j17065m7735M4065r143n1837
2969B34183k0314n8674P160q0175M5892J9161K5502J0931n1769K2427R080p3650
2957H9754L0993k4918P4943m666p7915j14341K1092M2837K8685K0106n3194k7674
$$ plain form
3041 2587392 2531745 2451973 2320791 2182737 2098826 2001282 1877747 1820306 1675704 1646971 1576948
3030 1576948 1560951 1578817 1539830 1444711 1443914 1390037 1369938 1365129 1322818 1266374 1156925 1169134
3018 1169134 1206069 1203627 1050264 955440 951013 919613 840093 849923 858093 797575 830028 820179
3006 820179 738979 690361 699779 646255 614454 562569 515621 470815 494977 504505 438882 416774
2994 416774 424164 426545 453776 494799 465068 431210 430147 423615 386122 393630 358038 346770 371804
2981 371804 374250 382800 370918 332543 347932 403694 415898 298833 251098 295163 286020 234183
2969 234183 213869 155195 162355 82180 128072 147233 172735 183666 131897 154324 163404 89754
2957 89754 120747 95829 170772 166106 88191 -26150 -5058 37779 66464 86570 33376 5702
2945E702M6230o781n6092l6759l2060J00937n260l0606p453j410j02312J2822
2933a13042K7782R649L7455K1704l9025L3538J9327p472o0383K2439k7129m8343
2921a23500L198l4333m804k6452k365J2787J9267J3359M4532M8652J6233o8716
2909a02142m9047n601j8054L1198K6583r2774l4961N4706l906J8155O9339L6475
2897g0029p2591K7122m4243n789N1440r534J0670L009j2603l8583m5546M7838
2885a58839o088k3091N2763L8342p6652m7087R039m7797j4938N9297K8892j7519
2873b03678K7155L1993M6556O5814L1257l0306j31262Q6395K4917m5932L9943
2862e7148L2260k6904K5823M6181l85m9481n7947J3174J7884J6880o978k4444
$$ plain form
2945 5702 51932 45151 -10941 -47700 -79760 21177 15917 -14689 -22142 -23552 -125864 -113042
2933 -113042 -85260 -75611 -38156 -16452 -55477 -21939 -2612 -10084 -70467 -48028 -75157 -123500
2921 -123500 -120302 -154635 -159439 -185891 -188256 -175469 -156202 -142843 -98311 -49659 -33426 -102142
2909 -102142 -151189 -156790 -174844 -143646 -117063 -209837 -244798 -190092 -193998 -175843 -106504 -70029
2897 -70029 -142620 -115498 -159741 -165530 -114090 -123624 -112954 -109945 -122548 -161131 -206677 -158839
2885 -158839 -164927 -188018 -135255 -96913 -173565 -220652 -211613 -259410 -274348 -215051 -186159 -203678
2873 -203678 -176523 -144530 -97974 -32160 -903 -31209 -162471 -76076 -51159 -97091 -57148
2862 -57148 -24888 -51792 -25969 20212 19827 -29654 -87601 -74427 -56543 -39663 -46641 -71085
2850g1085k555K2945m3841Q0853J9498n8802M4125k8905L8055P0851K9500N7095
2838A57734O6208N5243N36Q2535o0829k7864M606r7996o4639j4771j30074j4795
2826d4106o0130K2887M6095q3626N1281m980K7079m9255k8073k3398J6447j2412
2814a42191l7617J1682N5724M2997J6744M2342l6622k2967Q9453Q951k5235j5064
2802a1803m4390L4576k9490l1724j6107l9102J1907l5445Q50J4836j8773n8102
2790b22767j232j2946j7738N2349K0526K6605o6326L2243j5985J5268J1331q386
2778a87058L895Q324n8418n569o298L5495k9930m0800j3840K5045N8540l8038
2766b48652m6216K3531J30895r5883k0559K4728j3219L5291l7518J486m5684L6935
$$ plain form
2850 -71085 -73640 -50695 -94536 -13683 5815 -52987 -8862 -37767 288 71139 100639 157734
2838 157734 223942 279185 279721 362256 301427 273563 278169 180173 115534 100763 -29311 -44106
2826 -44106 -104236 -81349 -35254 -118880 -67599 -72579 -45500 -94755 -122828 -146226 -129779 -142191
2814 -142191 -179808 -168126 -112402 -69405 -52661 -10319 -46941 -69908 19545 28496 3261 -11803
2802 -11803 -56193 -21617 -51107 -82831 -98938 -138040 -126133 -161578 -160728 -145892 -164665 -222767
2790 -222767 -223999 -236945 -254683 -202334 -181808 -155203 -221529 -189286 -205271 -190003 -178672 -187058
2778 -187058 -183163 -174839 -233257 -238826 -245124 -209629 -239559 -280359 -294199 -269154 -210614 -248652
2766 -248652 -294868 -271337 -140442 -236325 -256884 -232156 -245375 -210084 -247602 -246116 -291800 -254865
2754b54865P7451p0284l5541k9077j3692K6342J6926k0941K5538P36l8j0148L4333
2741b53260J3213Q761j2146K1958K0215l1073j3792P655J00370p3589q0403j1783
2729c03874L5255j4820P563p753K0078M5973j3404R419l1670J1887l2274q1684
2717c55304Q7322M4278k8015N7494O2468K6269o0257m2737L0931j5595K5517n9284
2705b26913J3375oj5983k0508J0405O9439j7634m3490k8258k2686l0498R8408
2693b14349K2679l1936R6564m3128l5868J2105j1378M733l3732P5057n879J6537
2681a48595k7921l261L2358j3062j6991n0210J7792J2406J8593J7029k9426o6974
2669b58262n644P4691q196O6406j4986l2339j4465L2205L649K6484m6807R700
$$ plain form
2754 -254865 -177414 -247698 -283239 -312316 -326008 -299666 -282740 -303681 -278143 -277407 -277445 -287593 -253260
2741 -253260 -240047 -231286 -243432 -221474 -201259 -232332 -246124 -238469 -138099 -211688 -292091 -303874
2729 -303874 -268619 -283439 -275876 -283629 -263551 -217578 -230982 -221563 -253233 -241346 -273620 -355304
2717 -355304 -267982 -223704 -251719 -194225 -131757 -105488 -165745 -208482 -177551 -193146 -167629 -226913
2705 -226913 -213538 -213544 -229527 -250035 -239630 -170191 -187825 -231315 -259573 -282259 -312757 -214349
2693 -214349 -191670 -223606 -127042 -170170 -206038 -193933 -205311 -200578 -234310 -159253 -165132 -148595
2681 -148595 -176516 -179777 -147419 -160481 -177472 -227682 -209890 -197484 -178891 -161862 -191288 -258262
2669 -258262 -263906 -189215 -197411 -131005 -145991 -178330 -192795 -160590 -156941 -130457 -177264 -167564
2657a67564o4134J6643N5967r9468k093N6953J6071k9819m1418K4568J9418K5263
2645a89613O440k7923o567K3777p5655k336O3989L460M0192O777m02K3262Q531
2632a26068k1394P5369J5412j1931o3746m9039j2406J0142K1975j13183o5011
2621c39880N4822M3040J15851k2675p37o367J2273m488L0781K7726q0176j9393
2609a89223k0418n1465o175J25163l921j08396M1367N9993K5370O546r656q388
2597a39203K4724n699J8247J3501j6682J8864l6144L8807J14052P6347J0290o1003
2585E6101J8580K7766M9338Q2536m7175l3062j9185k6441k4311j30399L6522N1735
2573D2005j02963k049o5966l6204M1282L2241J03025j4907r4917N0763L665l1929
$$ plain form
2657 -167564 -231698 -215055 -159088 -258556 -260649 -203696 -187625 -217444 -258862 -234294 -214876 -189613
2645 -189613 -183173 -211096 -217663 -193886 -269541 -271877 -207888 -204428 -164236 -157459 -157861 -134599 -126068
2632 -126068 -147462 -72093 -56681 -68612 -132358 -181397 -193803 -183661 -161686 -274869 -339880
2621 -339880 -285058 -242018 -126167 -148842 -149579 -155946 -143673 -148161 -117380 -89654 -169830 -189223
2609 -189223 -209641 -261106 -267281 -142118 -146039 -254435 -213068 -153075 -127705 -121159 -130815 -139203
2597 -139203 -114479 -120178 -101931 -88430 -105112 -86248 -122392 -83585 30467 106814 117104 56101
2585 56101 74681 102447 151785 234321 187146 154084 134899 108458 84147 -46252 -9730 42005
2573 42005 -60958 -63007 -128973 -165177 -123895 -91654 11371 -3536 -98453 -47690 -44025 -75954
2561g5954r8163k6418J5388q268O5L3969o220p5460Q6515j7955j5303M5607j6382
2548a58579J4503l9525M8384K2809j2250p72L966M481K6147q077l1778o70O028
2535a25333K3653J3996K8882L2501K7913j4009r0525p2012N5037m067p5029L2378
2523a66615Q0074q0883k5453l605K598l9883O8130M3704J706M0567j5831p2730
2511a68221O9499j6307l6645J2755P2442N779J0410n3761l121n760j2834l4202
2499a59966k0115O3678n21J2670n4162k7417p276L3234J28273K7308q375l9681
2487e2350l3038j1638j8791l7264k9099j8894l1919N2821K6224O6889K6446N6678
2475c935o8582J3319j2507P4683n0211N2405O868m8397J3769J3599n3343K7220
$$ plain form
2561 -75954 -174117 -200535 -185147 -193415 -193350 -159381 -165601 -241061 -154546 -172501 -187804 -142197 -158579
2548 -158579 -144076 -183601 -135217 -112408 -124658 -125430 -121464 -116983 -90836 -98913 -130691 -131361 -125333
2535 -125333 -101680 -87684 -58802 -26301 1612 -12397 -102922 -174934 -119897 -123964 -198993 -166615
2523 -166615 -86541 -167424 -192877 -196482 -193884 -233767 -165637 -121933 -120227 -79660 -95491 -168221
2511 -168221 -98722 -115029 -151674 -138919 -66477 -60698 -50288 -104049 -107170 -112930 -125764 -159966
2499 -159966 -180081 -116403 -116924 -104254 -158416 -185833 -193109 -159875 -31602 -4294 -12669 -52350
2487 -52350 -85388 -97026 -115817 -153081 -182180 -201074 -232993 -180172 -153948 -87059 -60613 -3935
2475 -3935 -72517 -59198 -71705 2978 -47233 5172 12040 -36357 -22588 -8989 -62332 -35112
2463c5112M322l450J5361L9503K0367p8958J5177o2594J3314l1456N0580n597
2451e8543m7587O1243N2442L7129j4252l895M2026L6876k4995j13558j9592K7971
2439b4735J0182M8434K6489K417M6514K2051l2083k1874R2576J0133l7098L413
2427A46419L3869j2658k3073O8491k1422o940N2027L666j7016k4176m6122K2116
2415A75181J5250k8668J4732M9000J0750P4081k4472k1506N9683Q0424j0446m7755
2403C46254J2625J5919K9215l4772l889J6131l4998K7194l5688K7786O1788j2350
2391D15215q6997L1903l0394l4914m00R3012N7244l2497L6967j6915K1941O3770
2379E17935j5903m011K2565K8951J9346l075N7789L1804J9520N0924l920L2495
$$ plain form
2463 -35112 -30790 -34240 -18879 20624 40991 -37967 -22790 -85384 -72070 -103526 -52946 -58543
2451 -58543 -106130 -44887 7555 44684 30432 26537 68563 105439 80444 -33114 -52706 -24735
2439 -24735 -14553 33881 60370 62787 109301 131352 99269 77395 169971 180104 143006 146419
2427 146419 180288 167630 144557 213048 191626 184686 236713 240379 223363 199187 153065 175181
2415 175181 190431 161763 176495 225495 236245 310326 285854 264348 324031 404455 394009 346254
2403 346254 358879 374798 404013 369241 365352 381483 346485 373679 337991 365777 427565 415215
2391 415215 328218 360121 329727 294813 294413 387425 444669 412172 449139 432224 454165 517935
2379 517935 502032 498021 520586 549537 568883 565808 623597 655401 674921 725845 721925 754420
2367G54420J6004j3678M0263P5996O3761L8137R1737l3643k1366P8532K6381j2130
2355A104414l3305K5159J25399N7222L6140J43585J47768P9157J95722J05790
2345A987051R0683R4074Q5797L2917J30935J90536R0772J91123K54270L07524
2335C455682L78260N34870N65981O26580N96576N56592M80243M66537N59367O43420
2325H864108R19458J362886J896843K956068M675995P781454J0738306J2184337
2317E1379455J2320948P666197L557546L5034l523905p414795j0104298r397030
2309D4519152p502197p132935o619784m639638l316562k186013j448283j133990
2301A0539750j091843r55419r12039o77029p14692o68761m79882l33704m68895
$$ plain form
2367 754420 770424 756746 797009 873005 936766 974903 1066640 1032997 1011631 1090163 1116544 1104414
2355 1104414 1071109 1096268 1221667 1278889 1315029 1458614 1606382 1685539 1881261 1987051
2345 1987051 2077734 2171808 2257605 2290522 2421457 2611993 2702765 2893888 3148158 3455682
2335 3455682 3833942 4368812 4934793 5561373 6157949 6714541 7194784 7661321 8220688 8864108
2325 8864108 9783566 11146452 13043295 15999363 20675358 28456812 39195118 51379455
2317 51379455 63700403 71366600 74924146 74959180 71435275 64020480 53916182 44519152
2309 44519152 37016955 29884020 23264236 18624598 15308036 13122023 11673740 10539750
2301 10539750 9447907 8492488 7580449 6903420 6188728 5519967 5040085 4706381 4237486
2292D237486k94701l95576l35821k49047k05665j91774j23379j22903j56322j18745
2282B043553j00705j3507n2101m8120l6365q3002l6367J805q421q1571o2394j17136
2270A405669l3004r7444j4898n1145n2515l6393L2993j08490r2558L8329l1686
2259I58858q6669n9633r9660m4839J1616L1157k0152m5675l1697J4279l2864J6690
2247F11411j4675k3538M4922o783l3418k4680n897o0008m0049j8732L1054j0215
2235D49392k7846p5353m5783j04774J888M3816m0979o2041k0971P3915M6195k1473
2223B15986o6950K2511P0933m4380n9408k2059M4776j1836m9136k8865N5666l1302
2211I5936k8016J0757m157j6573n506J0947m5013O3794O8707m5299K6699j38515
$$ plain form
2292 4237486 3942785 3547209 3211388 2962341 2756676 2564902 2441523 2318620 2162298 2043553
2282 2043553 1942848 1929341 1877240 1829120 1792755 1709753 1673386 1675191 1666770 1585199 1522805 1405669
2270 1405669 1372665 1275221 1260323 1209178 1156663 1120270 1153263 1044773 952215 990544 958858
2259 958858 872189 812556 712896 668057 679673 710830 690678 645003 613306 627585 594721 611411
2247 611411 596736 573198 618120 611337 577919 553239 547342 487334 447285 428553 459607 449392
2235 449392 421546 346193 300410 195636 197524 241340 200361 138320 117349 191264 237459 215986
2223 215986 149036 171547 242480 198100 138692 116633 161409 149573 100437 71572 127238 95936
2211 95936 67920 78677 74520 57947 52441 63388 18375 82169 150876 105577 132276 -6239
2199f239l6233P2594L6439O740m0663J8243L1738N5272j3815p1490k8152M2472
2187F6906L7364n0037n0410O4379J3334L8040Q168l0063k2158K6598N929N6045
2175A64095j6923m3779q377J1687m1350L7941k2172q1248M4830k4068n6509q4201
2163a20074p914L1702N2544J7099o2184l0192K5129R7406k1221m6711J2790J7241
2151c4385l6808K6624L3652o5982O8996k4888p8898m6816J1473L0422k6873m3340
2139a86823R95L4335M3587m682J1948J4763J5286M9166m6450k9551j7644q3180
2127a98250M4736j3485O7031J2142m2738j9855N1445L8820o7293M460k2457P4458
2115g0986j2850m8551J7121M450K2618J3741o7923P1942K4617n6328J9573j5965
$$ plain form
2199 -6239 -42472 30122 66561 73301 32638 50881 82619 137891 124076 52586 24434 66906
2187 66906 104270 54233 3823 68202 81536 119576 127744 97681 75523 102121 108050 164095
2175 164095 147172 103393 95016 106703 65353 103294 81122 -126 44704 20636 -35873 -120074
2163 -120074 -127988 -96286 -43742 -26643 -88827 -119019 -93890 3516 -17705 -64416 -51626 -34385
2151 -34385 -71193 -44569 -10917 -76899 -7903 -32791 -111689 -158505 -147032 -116610 -143483 -186823
2139 -186823 -185828 -151493 -107906 -112588 -100640 -85877 -70591 -21425 -67875 -97426 -115070 -198250
2127 -198250 -153514 -166999 -99968 -87826 -130564 -150419 -98974 -60154 -127447 -122987 -145444 -70986
2115 -70986 -83836 -132387 -115266 -110816 -88198 -74457 -142380 -70438 -45821 -102149 -82576 -98541
2103i8541M43r6929J6193N3949k6095L9131Q701J8642K7283N3463J860l8644l6708
2090g7252o7841N5924K7690j2395J5J8360r6771n3460k611j2572L3119R1215L9891
2077e6688P860q7368j1109N0981M1469j0188m6468n9945N5188P730K3115K177
2065h3246l87N2050q3915L2144N3117j537p264j1007K5706m2076k8161l304L7013
2052f0867O9488L3909K9945K3274J8416P2772M4638K4775L9606k0691m0304o5688
2040A69273n6787k6754n0544n4800o2163J4701k6762q3845k3428J9600M3976P97
2028a36736P4713n7008l388l252Q244k7121l8955j9125m1698m2960J1913J6788
2016b58585O4780M5381P9855n832l4548q495N8532o1133j0502M1336L1437o2721
$$ plain form
2103 -98541 -98098 -195027 -178834 -124885 -150980 -111849 -103148 -84506 -57223 -3760 -1900 -40544 -77252
2090 -77252 -145093 -89169 -61479 -73874 -73859 -55499 -152270 -205730 -208341 -220913 -187794 -96579 -56688
2077 -56688 -48828 -136196 -147305 -96324 -54855 -65043 -111511 -171456 -116268 -108538 -85423 -83246
2065 -83246 -83633 -31583 -115498 -83354 -30237 -31774 -39038 -50045 -24339 -66415 -94576 -97880 -60867
2052 -60867 8621 42530 72475 95749 114165 186937 231575 256350 295956 275265 234961 169273
2040 169273 112486 85732 35188 -19612 -81775 -67074 -93836 -177681 -201109 -181509 -137533 -136736
2028 -136736 -62023 -119031 -122419 -125671 -117427 -144548 -183503 -202628 -244326 -287286 -275373 -258585
2016 -258585 -193805 -148424 -68569 -74401 -108949 -117444 -58912 -120045 -130547 -89211 -57774 -120495
2004a20495P344k7719O5594L1499r248m027O4140p0498M4313k2705m6449J778
1992h6473r190l190m2187J17k2021K9788k9947N5935k8027M6148M6707l959r5935
1979a42234o313N4771P2559p164l2134J3726m3607k2567K5387m620n6851l401
1967a52448P1632k8826j0106j4405r90K34j1576N729O4696j9481L4541p8026l4901
1954a73927m1307l9112O2666J7867n6028J407P0469j0173L624p966l97N294k1194
1941a88777M6546O5242l0798n1295j9413J4160K5254m9789P3234Q3690o4486j7965
1929a14397l2767q947K6708J6658L555J8931L9554o7773J4597K1610k8681k8489
1917a39441L4507k4629m910K0944k942K1047k3165k3684q161j0904M7995Q8952
$$ plain form
2004 -120495 -113151 -140870 -75276 -43777 -53025 -57052 7088 -63410 -19097 -41802 -88251 -86473
1992 -86473 -95663 -98853 -141040 -140923 -162944 -133156 -163103 -107168 -135195 -89047 -42340 -46299 -142234
1979 -142234 -148547 -93776 -21217 -28381 -60515 -46789 -90396 -112963 -87576 -92196 -149047 -152448
1967 -152448 -80816 -109642 -119748 -134153 -135143 -134909 -146485 -140756 -76060 -95541 -61000 -139026 -173927
1954 -173927 -215234 -254346 -191680 -173813 -229841 -228434 -157965 -168138 -164514 -172480 -172877 -167583 -188777
1941 -188777 -142231 -76989 -107787 -159082 -178495 -164335 -139081 -188870 -115636 -31946 -96432 -114397
1929 -114397 -147164 -156111 -129403 -112745 -109190 -90259 -50705 -118478 -103881 -82271 -110952 -139441
1917 -139441 -104934 -129563 -134473 -113529 -116471 -95424 -118589 -142273 -150434 -161338 -113343 -24391
1905b4391j3780o4039L4690K5022k2805l151L8973j3475r1318K0168J7370o3570
1893a60306r815K9441K3523j1977L2453L6084o2569K5385J1776L092M1220j5294
1881e6987k360M7573m0030j802k1576p1519P6628M4054p097M967m1585k5824j9488
1868a15046n1185m374K1870l1208K2377N5115j9146J5786j9235K6305L7272p3447
1856a34916M1885J6957j9601L2771m5615O6069p0254p0895M1738L1872J6624j2430
1844a05795O0453k5178o3856n4613q991L708M1040K0728k7234P3247J8302j7334
1832h5523l0117N4692L2365j7272j4618k5136l769k7888J2555m1321J0846N8197
1820g6989q570J651p287k2223N131M6866m2835j7727L1462m0637L9161r0437M8313
$$ plain form
1905 -24391 -38171 -102210 -67520 -42498 -65303 -68454 -29481 -42956 -134274 -114106 -96736 -160306
1893 -160306 -170121 -140680 -117157 -129134 -96681 -60597 -123166 -97781 -86005 -82913 -41693 -56987
1881 -56987 -59347 -11774 -51804 -53606 -75182 -146701 -70073 -26019 -33116 -28149 -69734 -95558 -115046
1868 -115046 -166231 -170605 -148735 -179943 -157566 -102451 -121597 -105811 -125046 -98741 -61469 -134916
1856 -134916 -93031 -76074 -95675 -62904 -108519 -42450 -112704 -183599 -141861 -109989 -93365 -105795
1844 -105795 -45342 -70520 -134376 -188989 -197980 -194272 -153232 -132504 -159738 -86491 -68189 -85523
1832 -85523 -115640 -60948 -28583 -45855 -60473 -85609 -89378 -117266 -104711 -146032 -135186 -76989
1820 -76989 -85559 -83908 -91195 -113418 -108287 -61421 -104256 -121983 -90521 -131158 -91997 -182434 -134121
1807a34121R5736o6106l7792K1684j7851P0700r530k6283Q79J9620K4954J7462
1795d0648M3798n9052j7693J8877L0166L718K1441m3573j9369j8702l5320L1907
1783h4450k63j4341L0739K2321R090r83n6354o6632K1457O0513l4395N5158O237
1770e1903L1287q7531J6309k9270K2517J8947O5661j7633l2368J7925O806p1438
1758a10691L4054J3373l1234q7330j8154N0623N8517M5355q46j7477L7161M5098
1746A8449k2279q0563j22128O6116m7606K8558P4671L6155J7132N1196q1196M707
1734e6788p891J9184k2980j168K3653J1943J9437j4507L1002n1468l0635N9001
1722b1217P216o1008m2539L1795l4610L4276j0424M530l352K4272n4448L761m3112
$$ plain form
1807 -134121 -38385 -104491 -142283 -120599 -138450 -67750 -77280 -103563 -102684 -83064 -58110 -40648
1795 -40648 3150 -55902 -73595 -54718 -24552 -20834 607 -42966 -62335 -81037 -116357 -84450
1783 -84450 -84713 -99054 -68315 -45994 -36904 -37887 -94241 -160873 -139416 -78903 -113298 -58140 -51903
1770 -51903 -20616 -108147 -91838 -121108 -98591 -79644 -13983 -31616 -63984 -46059 -39253 -110691
1758 -110691 -76637 -63264 -94498 -181828 -199982 -149359 -90842 -45487 -46333 -63810 -26649 18449
1746 18449 -3830 -84393 -206521 -140405 -188011 -159453 -84782 -48627 -31495 19701 -61495 -56788
1734 -56788 -64679 -45495 -68475 -69643 -45990 -34047 -14610 -29117 1885 -49583 -80218 -21217
1722 -21217 -14001 -75009 -117548 -85753 -120363 -86087 -96511 -91981 -95333 -71061 -125509 -121748 -164860
1709a64860L2706j8918Q0252K1827k1817k5963J3627k4741L7691L0608O989o0912
1697i3511m6849L7104L5532k4825L5859J2203r3476l0205J6188L2002m7602K4226
1685a43354J3575K7254Q7818p0610j2493P8943q6329J9425J793m6396j0456j7063
1673a57893k4931M7769l5758J3950K7716L2601n3565J12773O5532j29121J0136
1662i0791k7016q61O0429r7940L3460J0478N576K8440l4265q552P024q3M2069
1649g2032k5402k2349K8187L8871k2324O70M0380m8439j1818L3767J9147J2563
1637b8779R549J7146r133n826j7234J5390l7034J3701J4302M6505k1202k3241
1625b5856m3068p4862M8502L5787j7125l5437m7446o200P1496O8070J1844l681
$$ plain form
1709 -164860 -132154 -151072 -70820 -48993 -70810 -96773 -83146 -107887 -70196 -39588 -32599 -93511
1697 -93511 -140360 -103256 -67724 -92549 -56690 -44487 -137963 -168168 -151980 -119978 -167580 -143354
1685 -143354 -129779 -102525 -14707 -85317 -97810 -18867 -105196 -85771 -83978 -130374 -140830 -157893
1673 -157893 -182824 -135055 -170813 -156863 -129147 -96546 -150111 -37338 28194 -100927 -90791
1662 -90791 -117807 -118668 -58239 -156179 -122719 -112241 -106665 -78225 -112490 -121042 -114018 -114101 -72032
1649 -72032 -97434 -119783 -91596 -52725 -75049 -74379 -33999 -82438 -94256 -60489 -41342 -28779
1637 -28779 -19230 -2084 -11217 -17043 -34277 -18887 -55921 -42220 -27918 18587 -2615 -25856
1625 -25856 -68924 -143786 -95284 -59497 -76622 -112059 -159505 -165705 -94209 -26139 -14295 -17976
1613a7976J7268J1288L4754J6781j4007j2182l4479j5483Q0115o6287q892p4135
1601h3235Q673J5235N318R3278o1631j9989l0499l0336m3863J00352Q1771o4053
1589b8979m6776j9223m1252N8692O9563j0807l4107n720P878j2952O8728k3313
1577a8268p5811K4147L0597P0312K0181j02270l4299j287L1873j7335L3016L4285
1565d859K4605k954l6943o4977o7577J30782j4242m5837R596j7018Q2185k6694
1553c3933j5391Q266j9210m0783N4395k3937p626M7526n396o3129L8099L0081
1541c1038k6588Q523n8802l2344N4996L2620P4602j289l2148m4893M749K5073
1529b6539n6150L6077o2132P2847m2650N842R9824l4845k2570Q2120j3871m1180
$$ plain form
1613 -17976 -708 10580 45334 62115 48108 35926 1447 -14036 66079 -208 -9100 -83235
1601 -83235 -74562 -59327 -54009 39269 -22362 -42351 -72850 -103186 -147049 -46697 35074 -28979
1589 -28979 -75755 -94978 -136230 -77538 -7975 -18782 -52889 -58609 -50731 -63683 5045 -18268
1577 -18268 -94079 -69932 -39335 30977 51158 -51112 -85411 -86698 -54825 -72160 -39144 -4859
1565 -4859 19746 16792 -20151 -85128 -152705 -21923 -36165 -82002 -72406 -89424 -7239 -33933
1553 -33933 -49324 -41058 -60268 -101051 -46656 -70593 -78219 -30693 -36089 -99218 -61119 -31038
1541 -31038 -57626 -49103 -107905 -140249 -85253 -52633 21969 20680 -11468 -56361 -51612 -26539
1529 -26539 -82689 -46612 -108744 -35897 -78547 -72705 27119 -7726 -30296 51824 37953 -3227
1517c227O1588q761r8647N8182r404m6075R95O4085k6553n9572p890j0241M450
1504h1070R787L6122j1175q282n1618O5848j9051J8070J3020M1170N7402Q625
1492G8848p7487J7764M1320l462o4137p7747N7238k4169M8132K8099J1376j0941
1480B4834n146j8026r532J8960P829k1817k9092L1815q903l6256p0135P7326M3081
1467D938l2438L4199n8074m6995N956j9087l8437p914O4448K3435K3527l6417
1455h2859L351J742n83L3081J0152N2047J6633M679m5312m933k9049L7368P6001
1442G2318n0084l1323k683K2756l2173m5652K8422M1553j8947l9543o6355K8764
1430i2947J36096o2136l9838M991k4596J5770k1849J100L9336N4495O848n2848
$$ plain form
1517 -3227 58361 49600 -49047 9135 -269 -46344 -45349 18736 -7817 -67389 -75279 -85520 -81070
1504 -81070 -71283 -35161 -46336 -54618 -106236 -40388 -59439 -41369 -28349 12821 70223 78848
1492 78848 1361 19125 60445 56983 -7154 -84901 -27663 -51832 -3700 24399 35775 24834
1480 24834 19688 1662 -7870 11090 18919 -2898 -31990 -175 -9078 -45334 -115469 -38143 4938
1467 4938 -27500 6699 -51375 -98370 -92414 -111501 -149938 -157852 -93404 -69969 -46442 -82859
1455 -82859 -79508 -77766 -78349 -45268 -35116 16931 33564 38243 -7069 -12002 -41051 -3683 72318
1442 72318 22234 -9089 -11772 10984 -21189 -66841 -38419 3134 -15813 -55356 -121711 -92947
1430 -92947 43149 -18987 -58825 -53834 -78430 -62660 -84509 -83409 -44073 10422 17270 -35578
1418c5578O903k603q761J2788Ro3032k8236K6857Q9510P006J6653j1888m5070
1405c5442l0221k8284M1483j6536k019K0272k2748k2325M9508J9221p7499N427
1393i9163N8579O9615n048o5383k532m2808Q0339M7235n4289k5066O6158o9584
1381d1947j9083L99M6908q354q1030k8349J00131R492K362k6194J0827K9598P0731
1368F5491m7775r7713K2941O1877K2162l4778m3446q013L2419R702M1683o0410
1356c5860N5770J3469k6237k7128l178K8708n2206K665l1314m2079J00299N963
1344a1128J6997m0921j2614J8960M7755k8067j8346k4654j3657P881l2256N0656
1332c9394l6251n7618P659N0275j0943k739P5731M532J5828K5672J589k7367j704
$$ plain form
1418 -35578 -28675 -31278 -40039 -27251 -27242 -90274 -118510 -91653 -2143 4863 21516 9628 -35442
1405 -35442 -65663 -93947 -52464 -69000 -71019 -50747 -73495 -95820 -46312 -27091 -104590 -99163
1393 -99163 -40584 29031 23983 -41400 -43932 -86740 -6401 40834 -13455 -38521 27637 -41947
1381 -41947 -61030 -60631 -13723 -22077 -103107 -131456 -31325 -21833 -19471 -45665 -34838 -5240 65491
1368 65491 17716 -79997 -57056 4821 26983 -7795 -51241 -59254 -26835 -17133 24550 -35860
1356 -35860 19910 33379 7142 -19986 -23164 5544 -46662 -43997 -75311 -117390 -17091 -11128
1344 -11128 5869 -35052 -47666 -28706 19049 -9018 -27364 -52018 -65675 -57794 -90050 -39394
1332 -39394 -75645 -133263 -125604 -75329 -86272 -89011 -13280 -8748 7080 32752 34341 6974 5270
1319E270k9487J6341o2954r7387J10708N8914k8583N8399j4701N7552p5587J5640
1307A4125K9585l8081L5177K7481j9959l6435l4596o116n510J12707R105m4768
1295D2715j2196l0603K5683p395l7605J579K1447P3125L3482q5168J5464J3195
1283E3723m3534k2709j0858K2645k7341M2566l7669n2514M8197o050M1050j3386
1271e880j4878N7368l8323o5060J5018J6474Q8216m3231P319K73P7p7719K0078
1258d0268L4834N4107O42m7602O6296m3967l0674J9849n6872R1158O732j0031
1246D4204m8886p4292j9388R6383k536n4399M4889m2739M8678j193k0870M624
1234b5525K6748p512K7927j4002K0790j2653j1927M2779j3903j0608K3040p5343
$$ plain form
1319 5270 -24217 -7876 -70830 -168217 -57509 1405 -27178 31221 16520 74072 -1515 14125
1307 14125 43710 5629 40806 68287 48328 11893 -22703 -28819 -34329 78378 87483 42715
1295 42715 30519 -84 25599 18204 -19401 -17822 3625 76750 110232 25064 40528 53723
1283 53723 10189 -12520 -23378 -733 -28074 14492 -23177 -75691 -27494 -33544 7506 -5880
1271 -5880 -20758 36610 -1713 -66773 -51755 -35281 52935 9704 17023 17296 17373 -60346 -40268
1258 -40268 -5434 48673 49315 1713 68009 24042 -6632 13217 -43655 47503 54235 44204
1246 44204 -4682 -78974 -98362 -1979 -4515 -58914 -14025 -56764 -8086 -9279 -30149 -25525
1234 -25525 1223 -6289 21638 7636 28426 15773 3846 46625 32722 22114 45154 -30189
1222c0189m6097P5965j0253l5022o8106M3253N6083N1636l2726j9558L887L7819
1210B6692k3538q5381j8710m7517N1346J25292m0491P2450l4827l0788J1170J7737
1198B3435M0622o5856p9205L0130L3400N833J7745M102M3088l1670n7735N962
1186c0149K8165m5943L0489N1687o6120j9950N6322J7828k3477j1204k3251M0083
1174D480J2187j2221J3376j04456J8771j0139J6727R1681l7314n6181J1554J1965
1162c9570L4915m1117M6414M7723l2608l7164M1075M3808l6775m025m5476k3242
1150d6042n92K434M0084q655m965J4096n6308l6439M4072P1838l2689J2320o880
1137g726o1274O1470P842n8603J1796M9008M4160K9547j9809k2214j924M7634
$$ plain form
1222 -30189 -76286 -321 -10574 -45596 -113702 -70449 -14366 37270 4544 -15014 -11127 26692
1210 26692 3154 -82227 -100937 -148454 -97108 28184 -12307 60143 25316 -5472 5698 23435
1198 23435 64057 -1799 -81004 -50874 -17474 -11641 6104 10206 53294 21624 -36111 -30149
1186 -30149 -1984 -47927 -17438 34249 -31871 -51821 4501 22329 -1148 -12352 -35603 4480
1174 4480 16667 4446 17822 -86634 -67863 -78002 -61275 30406 -6908 -63089 -51535 -39570
1162 -39570 -4655 -45772 642 48365 15757 -21407 19668 63476 26701 22676 -22800 -46042
1150 -46042 -46634 -44200 -4116 -12771 -17736 -3640 -59948 -96387 -52315 19523 -13166 -846 -7726
1137 -7726 -69000 -7530 312 -58291 -46495 2513 46673 76220 56411 34197 32273 79907
1125G9907k8965o4121n5382Q9119n18j0473k1769J7341r0325j2424J1612P7608
1113h390O8010k218m0744l347n815L7718J3788o6162K646L5107K0000k8015M2939
1100F5517q4183r643r224k4324J27833o0806k4288O1384L2500J3944n8511J1584
1088D1783o4811j6939R218j8442J2975m9283L6993M2132N42j1653o84J0423p938
1075a5684J4044J7751m3935O504M2622j4094j21186N5316M2081O014N6501J2922
1063E8856o954k6671K6706j2392r145J6297L1136m2717K3838j05264J3099L660
1051b9551P2749k8209P07j321q083J941J9276J2563l6400K5775M2650m0739k8801
1038B557k5798k0214l8004O0538N9019o3084j2716L808O6082J6621m7629M1134
$$ plain form
1125 79907 50942 -13179 -68561 20558 20040 9567 -12202 5139 -85186 -97610 -85998 -8390
1113 -8390 59620 57402 16658 13311 7496 45214 59002 -7160 -4514 30593 50593 22578 65517
1100 65517 -18666 -28309 -37533 -61857 65976 5170 -19118 42266 74766 88710 30199 41783
1088 41783 -23028 -39967 -30749 -49191 -36216 -85499 -48506 -6374 -5832 -17485 -18169 -7746 -15684
1075 -15684 -1640 16111 -27824 -21320 21302 7208 -113978 -58662 -16581 -10567 45934 58856
1063 58856 51902 25231 51937 39545 30400 46697 77833 35116 58954 -46310 -33211 -29551
1051 -29551 43198 14989 15696 14375 6292 8233 27509 40072 3672 29447 72097 31358 2557
1038 2557 -23241 -43455 -81459 -20921 38098 -24986 -37702 -33894 32188 48809 1180 42314
1026D2314n6458o3206J6591J03174k2645r4751P3169L9782l3428j8333L2514N7467
1014G6190o6941l810j941m1309j0761K8333N9142m8710K7809p501j1122M8416
1002D7795j26820l2161Q0722M2615J4468m4355M8371j8669O0648j0506l8099K9434
990E3443o1095M9975j6689o102O1176m3198j01821p695L9891N7145o465l1063
978a2498j0373R541J7463O995k5970k8424Q2954k5087n9425j1167M2032R996P8890
965G4927l2482J192J0660l5536l8956j2010j4611R795K2967J9823R1195k7663
953F9301p5487N3005K1540K3042m4097p6292J0889l5308n229L7265P835j5167
941b8703k5533L287N6823L5861N6820K717r8064K7332J6533j696j3488j9302k9713
$$ plain form
1026 42314 -14144 -77350 -60759 42415 19770 -74981 -1812 37970 4542 -13791 18723 76190
1014 76190 9249 5439 3498 -37811 -48572 -20239 38903 -9807 18002 10501 -621 47795
1002 47795 -79025 -111186 -30464 12151 26619 -17736 30635 11966 72614 62108 24009 53443
990 53443 -7652 42323 25634 19532 80708 37510 -64311 -72006 -32115 25030 18565 -12498
978 -12498 -22871 -13330 4133 11128 -14842 -43266 39688 14601 -44824 -55991 -13959 -3963 74927
965 74927 42445 43637 54297 18761 -20195 -32205 -46816 -37021 -14054 5769 96964 69301
953 69301 -6186 46819 68359 91401 47304 -28988 -18099 -53407 -58636 -21371 -13536 -28703
941 -28703 -54236 -50949 5874 41735 98555 101272 3208 30540 47073 45377 31889 12587 -17126
928a7126N8099N0044l5348K2380n0767K195P5004r767N121k0569n5248o4711l1306
915g1999N0502K9399J394J6720o6605n0776N9321L284P0367J358J6441P3818l5448
902I7776n367l7397o4067N1670Q6484K9847n9749m0050j0370l2905O116m6622
890b4634l0996m9477N7437M2987k5950p298k9822R9519J06326n1220o0668J3220
878C9424n962k4624j3699J8759k4540o0476M5033N6632J6794q2346o9620J06202
866A577M5671q8092j949J4534q601o3656M3780J05980n1578l6482L6483K3747
854B1414J1673N7949o4849o7168M3516r1481m8847J00786N1613K2656l7007n665
842e410L2962k0920j2452L7891K9564l607L5131j2418o2953L7616L5041j2218
$$ plain form
928 -17126 40973 91017 55669 78049 27282 29477 104481 94714 99835 79266 24018 -40693 -71999
915 -71999 -21497 7902 9296 26016 -40589 -91365 -32044 -28760 41607 42965 59406 133224 97776
902 97776 92409 55012 -9055 42615 129099 158946 99197 59147 48777 15872 21988 -24634
890 -24634 -55630 -105107 -47670 -4683 -30633 -37931 -67753 31766 138092 86872 26204 39424
878 39424 33462 8838 -4861 13898 -10642 -71118 -26085 30547 47341 -35005 -104625 1577
866 1577 47248 -40844 -42793 -28259 -36860 -100516 -56736 49244 -2334 -38816 -2333 21414
854 21414 33087 91036 26187 -40981 2535 -88946 -137793 -37007 14606 37262 255 -5410
842 -5410 27552 6632 -5820 32071 61635 58028 93159 80741 17788 55404 90445 78227
830G8227m7360k2602k3261o0047k7932R8688K0419m5637Q632K9312k0027j5411
818b6999p931J1200K1044K9508K3057n5958L2380O5577m7280N0872l1647n0122
806A3701R924n5839j9332L592k6459j7029O6455J06L5171L9059L9139l6008j3112
793C9368J33980j35274j9684P5473K5078j0494n8757r1357N2201l3299J5701K9810
781B2746p621Q751k5893m2701J9J9800L5619N1816M690l9460L6068J9367l7676
768D5525J848K845l8032o4276K4100J2513Q3092o6124L5856k9864J9542k7048
756b3r974M1628m2107M4552K340M3034J3359j4390o1584J0149K6226k066l1236
743A9908l281M8183k672M810n4795P959K093N3222l7278j4591l7966P5434O3324
$$ plain form
830 78227 30867 8265 -14996 -75043 -102975 -4287 16132 -29505 -20873 8439 -11588 -26999
818 -26999 -34930 -23730 -2686 26822 49879 -6079 26301 91878 44598 95470 63823 13701
806 13701 23625 -32214 -51546 -47954 -74413 -91442 -24987 -24881 10290 49349 88488 52480 39368
793 39368 173348 38074 18390 93863 118941 108447 49690 -41667 10534 -22765 -7064 22746
781 22746 15125 23876 -2017 -44718 -44699 -24899 10720 62536 67226 27766 63834 83201 45525
768 45525 47373 50218 12186 -52090 -27990 -15477 67615 1491 37347 7483 27025 -23
756 -23 -9997 31631 -10476 34076 36416 79450 92809 78419 16835 26984 53210 51144 19908
743 19908 16627 64810 62138 66948 12153 20112 22205 75427 38149 23558 -14408 61026 124350
730A24350m3846m098n8837k1808R9787k1528j3649m8033J6215j0926n0114J429
718c1058l79K3883R358p280n642j539L9928O792j8660K0374k693L6043j7314k607
704D9206R998k2624o4725k622R2130Q3307q6080m0592K3054l125K9961o5641k8599
691b6352K270K0446m724K2385L7777n8264J7345k9967N7661K7356N029k5457r950
678C5555M6908k7280l9204K0145J2996l3062K9165k5576Q306M8788k7682Q529
666E7588J5424j3170Q08k7638J5620l6409J5882K8669N527j5156l9176R2358j1581
653H8746l4091j1698k3624J1852q8609M0496O0866j9681l2n0847L3109J3628J1678
640C1793k8311j2507L6244M4820m5879o4451M0055P2276j6110q686J7888R562
$$ plain form
730 124350 80504 76406 17569 -4239 95548 74020 60371 12338 28553 17627 -32487 -31058
718 -31058 -31437 -7554 1804 -5476 -11118 -12657 27271 34063 15403 35777 33084 69127 51813 49206
704 49206 59204 36580 -28145 -30767 61363 144670 58590 17998 41052 37927 67888 2247 -26352
691 -26352 -24082 -3636 -8360 14025 51802 -6462 10883 -19084 38577 65933 70962 45505 35555
678 35555 82463 55183 15979 36124 49120 16058 45223 19647 27953 76741 49059 57588
666 57588 73012 59842 60650 33012 48632 12223 28105 56774 62301 47145 7969 100327 88746
653 88746 54655 42957 19333 31185 -57424 -16928 43938 24257 24225 -26622 6487 20115 31793
640 31793 3482 -9025 27219 72039 26160 -38291 1764 74040 57930 49244 67132 76694
628G6694j2574o5498p7703K7254N3354R863K7988l2929n076J2138n6055J5230
616b7314j7250L3840N1111j6225L117L5038m1271J2049L2146P580j8693l9147
604A4981P2515K1189l0690k776k8731l1946J8468j8705j829Q0908j1008k1992
592F0384l2024K5356K2599m8535K462l8869k8293N7268L7663P026n7997p1162
580f4122O5172Q958K9149j2733m3006K4364O2601m7973K0116m5149j2594M9929
568C4712O2187j8941p8116m8425J9802K9845n5931N4706M0897n7622J3128J5336
556A1578k3609L2299l9720l5791R2570k379p1960M7781j4790k7455J06786K1492
544I6802m8131L3630j2047J2198L4838n1080m336k5946K4989n294l1672L0868
$$ plain form
628 76694 64120 -1378 -79081 -51827 1527 11390 39378 6449 1373 13511 -42544 -27314
616 -27314 -44564 -10724 40387 24162 27279 62317 21046 33095 65241 72821 54128 14981
604 14981 87496 108685 77995 75219 46488 14542 33010 14305 12476 93384 82376 60384
592 60384 28360 53716 76315 27780 30242 -8627 -36920 20348 58011 65037 7040 -64122
580 -64122 1050 10008 39157 26424 -16582 7782 70383 22410 42526 -2623 -15217 34712
568 34712 96899 77958 -158 -48583 -28781 1064 -54867 -161 40736 -16886 -3758 11578
556 11578 -12031 20268 -19452 -55243 37327 34948 -37012 10769 -4021 -31476 75310 96802
544 96802 48671 82301 70254 82452 117290 66210 61874 35928 60917 55623 23951 54819
532E4819q3521M0630N6838n636q161k4372o774j9485J8862q299k7331l4725M9225
519B070j9401L1129m527j5696O0990l7059M999P892j6791k1677N9871p7313O8028
506D2515m2533J3554M6431m7135l3110O1816L4609k1698L266n1757k6094L1666
$$ plain form
532 54819 -28702 11928 68766 63130 54969 30597 23823 4338 23200 14901 -12430 -47155 2070
519 2070 -17331 13798 9271 -6425 54565 17506 22505 30397 13606 -8071 51800 -25513 42515
506 42515 -18 13536 59967 12832 -20278 41538 76147 54449 57715 5958 -20136 11530
$$ [...]
##END NTUPLES=NMR SPECTRUM
##END=
