##TITLE=1H_DE-80H_X3
 200.13MHz, d2o
 8 sc
 
 19ns.26.2.2025
##JCAMPDX= 6.0         $$ Bruker NMR JCAMP-DX V2.0
##DATA TYPE= NMR SPECTRUM
##DATA CLASS= NTUPLES
##ORIGIN= UXNMR, Bruker Analytische Messtechnik GmbH
##OWNER= pz
$$ XWIN-NMR		Version 3.5
$$ Thu Jul 16 11:12:44 2026 Russian Standard Time (UT+4h)  Yarkov@DPX200
##.OBSERVE FREQUENCY= 200.1313
##.OBSERVE NUCLEUS= ^1H
##.ACQUISITION MODE= SIMULTANEOUS
##.ACQUISITION SCHEME= undefined
##.AVERAGES= 8
##.DIGITISER RES= 18
##SPECTROMETER/DATA SYSTEM= spect
##.PULSE SEQUENCE= zg30
##.SOLVENT NAME= DMSO
##.SHIFT REFERENCE= (INTERNAL, DMSO, 0, 15.4979)
##AUDIT TRAIL= $$ (NUMBER, WHEN, WHO, WHERE, WHAT)
$$ ##TITLE= Audit trail, XWIN-NMR		Version 3.5
$$ ##JCAMPDX= 5.01
$$ ##ORIGIN= Bruker BioSpin GmbH
$$ ##OWNER= Yarkov
$$ C:/Bruker/XWIN-NMR/data/yarkov2/nmr/H-C/1/pdata/1/auditp.txt
$$ ##AUDIT TRAIL=  $$ (NUMBER, WHEN, WHO, WHERE, WHAT)
(   1,<2026-07-16 11:11:52.82 +0400>,<Yarkov>,<DPX200>,
      <created by zg, POWCHK disabled, PULCHK disabled
       configuration hash MD5:
       00 E9 B6 7A A2 85 ED C7 34 08 36 98 17 FE 4E 26
       data hash MD5: 16K
       52 F0 8E 80 F1 52 FF B5 A4 0C CE 4E 23 61 FE 37>)
(   2,<2026-07-16 11:11:58.82 +0400>,<Yarkov>,<DPX200>,
      <Start of raw data processing
       efp BC_mod = 2 LB = 0.25 FT_mod = 6 PKNL = 1 PHC0 = -7255.922 PHC1 = 7.421964 SI = 16K 
       data hash MD5: 16K
       69 99 B0 6E 37 52 79 69 8C 0C FA 89 A8 8D BC 1A>)
(   3,<2026-07-16 11:12:06.71 +0400>,<Yarkov>,<DPX200>,
      <abs ABSG = 5 
       data hash MD5: 16K
       FF F6 1F 5C A6 24 E9 24 84 5E 92 DA F3 A1 21 4E>)
$$ ##END=
$$ 
$$ hash MD5
$$ E7 3A FF A6 6D 91 14 4C 8C BA B5 92 96 04 98 5F
##$RELAX= 
##$RELAX= 
##$RELAX= 
##$RELAX= 
##$RELAX= 
##$RELAX= 
$$ Bruker specific parameters
$$ --------------------------
##$DU= <C:/Bruker/XWIN-NMR>
##$EXPNO= 1
##$NAME= <H-C>
##$PROCNO= 1
##$TYPE= <nmr>
##$USER= <yarkov2>
##$AMP= (0..31)
100 100 100 100 100 100 100 100 100 100 100 100 100 100 100 100 100 100 
100 100 100 100 100 100 100 100 100 100 100 100 100 100 
##$AQSEQ= 0
##$AQ_mod= 1
##$AUNM= <au_zg>
##$AUTOPOS= <>
##$BF1= 200.13
##$BF2= 200.13
##$BF3= 200.13
##$BF4= 200.13
##$BF5= 200.13
##$BF6= 200.13
##$BF7= 200.13
##$BF8= 200.13
##$BYTORDA= 1
##$CFDGTYP= 0
##$CFRGTYP= 5
##$CHEMSTR= <none>
##$CNST= (0..31)
1 1 145 1 1 1 1 1 1 1 1 1 1 1 1 1 1 1 1 1 1 1 1 1 1 1 1 1 1 1 1 1 
##$CPDPRG= <>
##$CPDPRG1= <>
##$CPDPRG2= <>
##$CPDPRG3= <>
##$CPDPRG4= <mlev>
##$CPDPRG5= <mlev>
##$CPDPRG6= <mlev>
##$CPDPRG7= <mlev>
##$CPDPRG8= <mlev>
##$CPDPRGB= <>
##$CPDPRGT= <>
##$D= (0..31)
0 0.7 0 0 0 0 0 0 0 0 0 0.03 0 0 0 0 0 0 0 0 0 0 0 0 0 0 0 0 0 0 0 0 
##$DATE= 1784185912
##$DBL= (0..7)
120 120 120 120 120 120 120 120 
##$DBP= (0..7)
150 150 150 150 150 150 150 150 
##$DBP07= 0
##$DBPNAM0= <>
##$DBPNAM1= <>
##$DBPNAM2= <>
##$DBPNAM3= <>
##$DBPNAM4= <>
##$DBPNAM5= <>
##$DBPNAM6= <>
##$DBPNAM7= <>
##$DBPOAL= (0..7)
0.5 0.5 0.5 0.5 0.5 0.5 0.5 0.5 
##$DBPOFFS= (0..7)
0 0 0 0 0 0 0 0 
##$DE= 6
$$ [...]
##$SUBNAM3= <"">
##$SUBNAM4= <"">
##$SUBNAM5= <"">
##$SUBNAM6= <"">
##$SUBNAM7= <"">
##$SUBNAM8= <"">
##$SUBNAM9= <"">
##$SW= 18.0517328524113
##$SWIBOX= (0..15)
0 0 2 0 0 0 0 0 0 0 0 0 0 0 0 0 
##$SW_h= 3612.71676300578
##$TD= 16384
##$TD0= 1
##$TE= 0
##$TE2= 300
##$TE3= 300
##$TEG= 300
##$TL= (0..7)
0 120 120 120 120 120 120 120 
##$TP= (0..7)
150 150 150 150 150 150 150 150 
##$TP07= 0
##$TPNAME0= <>
##$TPNAME1= <>
##$TPNAME2= <>
##$TPNAME3= <>
##$TPNAME4= <>
##$TPNAME5= <>
##$TPNAME6= <>
##$TPNAME7= <>
##$TPOAL= (0..7)
0.5 0.5 0.5 0.5 0.5 0.5 0.5 0.5 
##$TPOFFS= (0..7)
0 0 0 0 0 0 0 0 
##$TUNHIN= 0
##$TUNHOUT= 0
##$TUNXOUT= 0
##$USERA1= <user>
##$USERA2= <user>
##$USERA3= <user>
##$USERA4= <user>
##$USERA5= <user>
##$V9= 5
##$VALIST= <valist>
##$VCLIST= <CCCCCCCCCCCCCCC>
##$VD= 0
##$VDLIST= <DDDDDDDDDDDDDDD>
##$VPLIST= <PPPPPPPPPPPPPPP>
##$VTLIST= <TTTTTTTTTTTTTTT>
##$WBST= 1024
##$WBSW= 4
##$XGAIN= (0..3)
0 0 0 0 
##$XL= 0
##$YL= 0
##$YMAX_a= 381822
##$YMIN_a= -424646
##$ZGOPTNS= <>
##$ZL1= 120
##$ZL2= 120
##$ZL3= 120
##$ZL4= 120
##$ABSF1= 15.4979
##$ABSF2= -2.553949
##$ABSG= 5
##$ABSL= 3
##$ALPHA= 0
##$AQORDER= 0
##$ASSFAC= 0
##$ASSFACI= 0
##$ASSFACX= 0
##$ASSWID= 0
##$AUNMP= <proc_1d>
##$AZFE= 0.1
##$AZFW= 0.1
##$BCFW= 0
##$BC_mod= 2
##$BYTORDP= 0
##$COROFFS= 0
##$CY= -3
##$DATMOD= 1
##$DC= 0
##$DFILT= <>
##$DTYPP= 0
##$F1P= 0
##$F2P= 0
##$FCOR= 1
##$FTSIZE= 16384
##$FT_mod= 6
##$GAMMA= 0
##$GB= 0
##$INTBC= 1
##$INTSCL= 3.241238e-09
##$ISEN= 128
##$LB= 0.25
##$LEV0= 0
##$LPBIN= 0
##$MAXI= 10000
##$MC2= 0
##$MEAN= 0
##$ME_mod= 0
##$MI= 1.114404
##$NCOEF= 0
##$NC_proc= -6
##$NLEV= 6
##$NOISF1= 3.799351
##$NOISF2= 2.8
##$NSP= 0
##$NTH_PI= 0
##$NZP= 0
##$OFFSET= 15.4979
##$PC= 1
##$PHC0= -7255.922
##$PHC1= 7.421964
##$PH_mod= 1
##$PKNL= yes
##$PPARMOD= 0
##$PSCAL= 0
##$PSIGN= 0
##$REVERSE= no
##$SF= 200.130004762757
##$SI= 16384
##$SIGF1= 3
##$SIGF2= 2
##$SINO= 0.751879
##$SIOLD= 32768
##$SREGLST= <19F.Aceton>
##$SSB= 0
##$STSI= 16384
##$STSR= 0
##$SW_p= 3612.71676300578
##$SYMM= 0
##$S_DEV= 0
##$TDeff= 16384
##$TDoff= 0
##$TI= <>
##$TILT= no
##$TM1= 0
##$TM2= 0
##$TOPLEV= 0
##$USERP1= <user>
##$USERP2= <user>
##$USERP3= <user>
##$USERP4= <user>
##$USERP5= <user>
##$WDW= 1
##$XDIM= 16384
##$YMAX_p= 411847816
##$YMIN_p= -246715
$$ End of Bruker specific parameters
$$ ---------------------------------
##NTUPLES= NMR SPECTRUM
##VAR_NAME=  FREQUENCY,     SPECTRUM/REAL,   SPECTRUM/IMAG
##SYMBOL=    X,             R,               I
##VAR_TYPE=  INDEPENDENT,   DEPENDENT,       DEPENDENT
##VAR_FORM=  AFFN,          ASDF,            ASDF
##VAR_DIM=   16384,         16384,           16384
##UNITS=     HZ,            ARBITRARY UNITS, ARBITRARY UNITS
##FACTOR=    0.220516191357247, 1,           1
##FIRST=     3101.59480264498, 0,            0
##LAST=      -511.121960360803, 0,           0
##MIN=       -511.121960360803, -246715,     0
##MAX=       3101.59480264498, 411847816,    0
$$ Real data points
##PAGE= N=1
##DATA TABLE= (X++(R..R)), XYDATA
$$ [...]
6825i5790J11593J0917m1740K9600K9447j106l8902K0275o8262r2300M6197P6616
$$ -95790 15803 26720 -15020 14580 44027 42921 4019 24294 -43968 -136268 -90071 -13455
6813a3455j1512k272M0705J0351O472o2037M529Q9453k9272j4983L0668K7169
$$ -13455 -24967 -27239 13466 23817 30289 -31748 -27219 62234 32962 17979 48647 75816
6801G5816K7634n879l9475q7836n791j241l762N1024L5226p3891M6669k0624p1386
$$ 75816 103450 97571 58096 -29740 -35531 -36772 -40534 10490 45716 -28175 18494 -2130 -73516
6788g3516j6227P0129Q7346l5091l7717j2492J7709K7487k3889j8583k7974k6834
$$ -73516 -89743 -19614 67732 32641 -5076 -17568 141 27628 3739 -14844 -42818 -69652
6776f9652N8007K7555J0877J1683q7483O0828m4967n3059O7299m2824K2712R513
$$ -69652 -11645 15910 26787 38470 -49013 11815 -33152 -86211 -18912 -61736 -39024 -29511
6764b9511K6715j7476N1006m5059j4923m2315J3349L2761L0769l6720m1680P1808
$$ -29511 -2796 -20272 30734 -14325 -29248 -71563 -58214 -25453 5316 -31404 -73084 -1276
6752a276J1091K6572K8206k0423n8838m4470Q2340p2507L7491K3652J9283n2161
$$ -1276 9815 36387 64593 44170 -14668 -59138 23202 -49305 -11814 11838 31121 -21040
6740b1040k2900J2461O1590j953o2264J4321m2083J5364o1270M2785O7261l274
$$ -21040 -43940 -31479 30111 28158 -34106 -19785 -61868 -46504 -107774 -64989 2272 -1002
6728a002N8218K6168l6024p8068M7294M6335M251o1741n1745J38051j8283m6240
$$ -1002 57216 83384 47360 -30708 16586 62921 67172 5431 -46314 91737 73454 27214
6716B7214j5394J1075n5365J925r043K3231j1434k9526L0868j3151M7943K7930
$$ 27214 11820 22895 -32470 -30545 -39588 -16357 -27791 -57317 -26449 -39600 8343 36273
6704C6273L0774o122j05953M6390P510J0891M8390r5632o3146L0710K7737K5379
$$ 36273 67047 60925 -45028 1362 8872 19763 68153 -27479 -90625 -59915 -32178 -6799
6692f799Q7943p9630o8639J214l0562R6229q39k3163m2147L8401O1605J3042j2656
$$ -6799 81144 1514 -67125 -65911 -96473 -244 -1083 -24246 -66393 -27992 33613 46655 33999
6679C3999m0928O5921O0902k6719q3007l8385O8058q2720l2182O1970N157k2818
$$ 33999 -6929 58992 119894 93175 10168 -28217 39841 -42879 -75061 -13091 -7934 -30752
6667c0752r150p660O3899L687J6262m1384q218k4073L227L4632j4336K0598p001
$$ -30752 -39902 -47562 16337 20024 36286 -5098 -13316 -37389 -34162 470 -13866 6732 -269
6654b69k5282l8866k6950L9485P4411J0407l9672k7561j6261p522J2201l7032
$$ -269 -25551 -64417 -91367 -51882 22529 32936 -6736 -34297 -50558 -58080 -45879 -82911
6642h2911j57L3653R8731p056j0445o315N4127k4324q9913n2082r581K8422M6723
$$ -82911 -83068 -49415 49316 42260 31815 25500 79627 55303 -34610 -86692 -96273 -67851 -21128
6629b1128m9253M5478J8492r534r8971l665Q0665O445o1292m6601K0279J25002
$$ -21128 -70381 -24903 -6411 -15945 -114916 -118581 -37916 -31471 -92763 -139364 -119085 5917
6617E917m8242K1656N8338M4145n1046n4247m4378j6956P6015n6212j8484J14
$$ 5917 -42325 -20669 37669 81814 30768 -23479 -67857 -84813 -8798 -65010 -83494 -83380
6605h3380O9218J9422O8560J0958n1997K974L348M1403k5755o1800m7719o3459
$$ -83380 -14162 5260 73820 84778 32781 35755 39103 80506 54751 -7049 -54768 -118227
6593a18227K6486R3374L6Q671L2866O098q773l0453p807p7414J6875O8824k6361
$$ -118227 -91741 1633 1669 10340 43206 49304 40531 10078 2271 -75143 -58268 10556 -15805
6580a5805K2940N6014n1177K3205o8705k8339Q7381j0292M8800p2108j4944O6466
$$ -15805 7135 63149 11972 35177 -33528 -61867 25514 15222 64022 -8086 -23030 43436
6568D3436p675K6831m1172m2873O851j1647N1186J09827j10141m0619M4373o165
$$ 43436 35761 62592 21420 -21453 -14602 -26249 24937 134764 24623 -15996 28377 22212
6556B2212p556J0007k4060L704J1934j9332P430r975j6048J22452j00919n8559
$$ 22212 14656 24663 603 4307 16241 -3091 4339 -5636 -21684 100768 -151 -58710
6544e8710K7639J3621j14n106P3324m3034q626P474J9146k0669j6505k79l3204
$$ -58710 -31071 -17450 -17564 -22670 50654 7620 -1006 6468 25614 4945 -11560 -11839 -45043
6531d5043l470k2691P8617k0442M3533j8111o943L1681K9716J794l4287l3086
$$ -45043 -48513 -71204 7413 -13029 30504 12393 5450 37131 66847 68641 34354 1268
6519A268k3167j8969l1467M6601N88O0J7142J8370M0890m2586O0123J6434n2315
$$ 1268 -21899 -40868 -72335 -25734 -25146 -25086 -7944 10426 51316 8730 68853 85287 32972
6506C2972m1228j4607L0284K06M9798L7522J6740m344k6362n1008o5483l528N297
$$ 32972 -8256 -22863 7421 7627 57425 94947 111687 107343 80981 29973 -35510 -39038 -33741
6493c3741M4941O1813m6878J8863k4760k0329N77J1596l5315l3074k8714Q0293
$$ -33741 11200 73013 26135 44998 20238 -91 486 12082 -23233 -56307 -85021 -4728
6481d728n1092J2856Q6441l98j9669L0375K700p0961l8518L3642N1801l080J8411
$$ -4728 -55820 -42964 43477 43079 23410 53785 56485 -14476 -52994 -19352 32449 29369 47780
6468D7780m2639k0026M0376k2864M748p876M1877K0539r6515l8955J9819k0149
$$ 47780 5141 -14885 25491 2627 7375 -501 41376 61915 -34600 -73555 -53736 -73885
6456g3885K8891M074N9341P8801j03238l8067P639k7776K0585m875K8267o304
$$ -73885 -44994 -40920 18421 97222 -6016 -44083 -36444 -64220 -43635 -48510 -20243 -26547
6444b6547p931M747J4345m5121J630N3070O7633l8276l1764J2135k306k033j3732
$$ -26547 -34478 -29731 -15386 -60507 -58877 -5807 61826 23550 -8214 3921 1615 -418 -14150
6431a4150n6158K9907O4992M2778N198m7446K0204n3779o8985L4544N4483O604
$$ -14150 -70308 -40401 24591 67369 72567 25121 45325 -8454 -77439 -42895 11588 18192
6419A8192M8831O884K7237J5065J8729n3834l2357k7750n0333N646J6896j1754
$$ 18192 67023 73907 101144 116209 134938 81104 48747 20997 -29336 -23690 -6794 -18548
6407a8548k5820M564M5209M9223L2158k72j38584k9058P7424r69l8510K4419Q9838
$$ -18548 -44368 -39804 5405 54628 86786 86514 -52070 -81128 -3704 -4673 -43183 -18764 71074
6394G1074J5331m1142n4775J9483K7400l8812J05040J7849j30523k3944l2321
$$ 71074 86405 45263 -9512 9971 37371 -1441 103599 121448 -9075 -33019 -65340
6383f5340P275k5622L1034R2096q23J9915K4577o0733m251K8184p6458P340M558
$$ -65340 -58065 -83687 -52653 39443 38620 58535 83112 22379 18128 46312 -30146 -22806 -18248
6370a8248N1114J0420L5471P3164l1903m2137Q2149o9560p4243N5124q3594r989
$$ -18248 32866 43286 78757 151921 120018 77881 160030 90470 16227 71351 -12243 -22232
6358b2232K53M9135N3742m2997p0209O2823L0657L7739j1250o8574N9026p7457
$$ -22232 -21979 27156 80898 37901 -32308 30515 61172 98911 87661 19087 78113 656
6346F56n7021K4717L662O0300K1023p4928L705l4225l0179R5036J5567n218p1603
$$ 656 -56365 -31648 -27986 32314 53337 -21591 -17886 -52111 -82290 12746 28313 23095 -48508
6333d8508N6664M6627m4971M0234k9418m1305M5865j9907L0896m1255k7863m495
$$ -48508 8156 54783 9812 50046 20628 -20677 25188 5281 36177 -5078 -32941 -37436
6321c7436M0470L7739n9369J279Q7389j5444J7576m9202k6495M3846l8571j8342
$$ -37436 3034 40773 -18596 -17317 70072 54628 72204 23002 -3493 40353 1782 -16560
6309a6560P132O1615Q593k7203Q4305J7791k6124n5755j4519j6188J6289K5983
$$ -16560 -9428 52187 60780 33577 117882 135673 109549 53794 39275 23087 39376 65359
6297F5359n6188p9978j6154Q7617O0930m5504M3839l1180J4842q828o214P0171
$$ 65359 9171 -70807 -86961 656 61586 16082 59921 28741 43583 34755 28541 98712
6285I8712k2440m3738P38N3992l4496L219m0017M1305j7541m6785J9545N897r52
$$ 98712 76272 32534 33272 87264 52768 55987 15970 57275 39734 -7051 12494 18391 17439
6272A7439M4103l142L0369J0073o7521m9548R4458M1017p2030j9526J08868l0394
$$ 17439 61542 58400 88769 98842 31321 -18227 76231 117248 45218 25692 134560 104166
6260A04166o8637k7047j2159L8332K8898L435k662J1122L473p6777m7019J0781
$$ 104166 35529 8482 -3677 34655 63553 66988 64326 75448 78921 2144 -44875 -34094
6248c4094J1875Q774n985P4875N238J9799K1650k1911k2309m2792k3370L8074
$$ -34094 -22219 -13445 -19430 55445 60683 80482 102132 80221 57912 15120 -8250 29824
6236B9824K2908J39J341r990J07515k9428m2988Q670k5489p353k627N0652K22
$$ 29824 52732 52871 54212 44222 151737 122309 79321 87991 62502 55149 52522 103174 103396
6223A03396q1462K4063l9536R271R1651k7984j4472Q490N4223k8693p2854K80
$$ 103396 21934 45997 6461 15732 107383 79399 64927 73417 127640 98947 26093 26373
6211B6373k6780r990M5835Q0842j9429M0498J1750l3468j1840M8689l6199o360
$$ 26373 -407 -10397 35438 116280 96851 137349 149099 115631 103791 152480 116281 109921
6199A09921l9727m1353M785l299N6623p854L0833l734o8063K0365j3717o913K9700
$$ 109921 70194 28841 33626 30327 86950 79096 109929 106195 38132 58497 44780 37867 67567
6186F7567J5045Q016r089j4991k5898N938O7793l3626L2377j8683n0755J509L6970
$$ 67567 82612 90628 81539 66548 40650 46588 114381 80755 113132 94449 43694 45203 82173
6173H2173N2531m8298N3784Q557J331l8683K5102N1572l6044o3448N886L1579
$$ 82173 134704 86406 140190 148747 150078 111395 136497 188069 152025 88577 94463 126042
6161A26042p672J6558N1830l2457J4286M362n0219n6875P5451N7010r5150N0644
$$ 126042 118370 134928 186758 154301 168587 172949 122730 65855 141306 198316 103166 153810
6149A53810M4067n8466J0411O1295l6207j9545J0016o082n0266m9571l829j804
$$ 153810 197877 139411 149822 211117 174910 155365 165381 159299 109033 59462 55633 53829
6137E3829P8472p6866O7170N6583j1471J8682j098K823m3151r0664j6843K0112
$$ 53829 132301 55435 122605 179188 167717 186399 185301 188124 144973 54309 37466 57578
6125E7578O0158J6023p8053j2779Q5500j9321j8380j0727K0690N9265J2811j9120
$$ 57578 117736 133759 55706 42927 128427 109106 90726 79999 100689 159954 172765 153645
6113A53645k9930L659l3965L8365O4243k0542j23K438j1022k995K565k0440M0824
$$ 153645 123715 127374 93409 131774 196017 175475 175352 177790 166768 163773 166338 145898 186722
6100A86722L4427l6023K1806J5731m0193m6340K8356k2861m8876O4788K0388m1145
$$ 186722 221149 185126 206932 222663 182470 136130 164486 141625 92749 157537 177925 136780
6088A36780p2332k1150J291N039j8702P1117P3177k4385k7788Q0901l2328k8082
$$ 136780 64448 43298 44589 49628 30926 102043 175220 150835 123047 203948 171620 143538
6076A43538J0878Q55K8505q660k5360J9113J513N1856N170K2084l4663j2598K5990
$$ 143538 154416 155271 183776 175116 149756 168869 170382 222238 227408 249492 214829 202231 228221
6063B28221n7283k878L233j1652L8495K0464P842j3259o8134j2960p9210M8096
$$ 228221 170938 168060 171293 159641 198136 218600 226442 213183 145049 132089 52879 100975
6051A00975M4615j4352J9706J1175n2973L5417K8382M0573m5422r044Q2230P014
$$ 100975 145590 131238 150944 162119 109146 144563 172945 213518 168096 159052 241282 248296
6039B48296l3394J0504r914L1635O591O769j9394k3518J8448k9164M7877N339
$$ 248296 214902 225406 215492 247127 253718 260487 241093 217575 236023 206859 254736 260075
6027B60075j10528L4261K0041q6163l9126L6266j6856J07665p5524J623L3376
$$ 260075 149547 183808 203849 117686 78560 114826 97970 205635 130111 131734 165110
6016A65110L6249K1663l9640k4950j5831k9333J5658j3188M6078r722L4465N395
$$ 165110 201359 223022 183382 158432 142601 113268 128926 115738 161816 152094 186559 191954
6004A91954J7997l4942N900j6724O547O5455l6897J7037O4446l4312r9819r731
$$ 191954 209951 175009 180909 164185 170732 236187 199290 216327 280773 246461 146642 136911
5992A36911P8889p607J1909J6021K2376O2079l3717n9242l0719O186o5991M7467
$$ 136911 215800 208193 220102 236123 258499 320578 286861 227619 196900 203086 137095 184562
5980A84562J9261j4207j0290N986K3061k9093j7962l5998J7632l7811j150J4116
$$ 184562 203823 189616 179326 185312 208373 179280 161318 125320 142952 105141 103991 118107
5968A18107n4308J05362L9301K5446l4916r29k8816k2756M6684L222m4742K6530
$$ 118107 63799 169161 208462 233908 198992 198063 169247 146491 193175 196397 151655 178185
5956A78185q610M2339O6763m1298m5393J3384K166Q7034p3435Q386K3680P591
$$ 178185 169575 211914 278677 237379 191986 205370 207536 294570 221135 229521 253201 260792
5944B60792l9364r779m4712J10r914K1179O9769o301k4661J7739J2812M1495m5602
$$ 260792 221428 211649 166937 167047 157133 178312 248081 241780 217119 234858 247670 289165 243563
5931B43563l2564P6594P3220p1035p2514r195j1477j0551P0197J3182M620k7260
$$ 243563 210999 287593 360813 289778 217264 208069 196592 186041 256238 269420 274040 246780
5919B46780O3102l240K1739K9824j16108j2875j7191m003L275j3905L5541K6905
$$ 246780 309882 306642 328381 358205 242097 229222 212031 208028 211303 197398 232939 259844
5907B59844j4203M1986j0769j6085M5870m4822o2900l5687Q9007j081r4899R5772
$$ 259844 245641 287627 276858 260773 306643 261821 198921 163234 252241 251160 156261 252033
5895B52033O484m0233Q1861L2700k8324m5007j3462n8530M2061M553n4282L1677
$$ 252033 258517 218284 300145 332845 304521 259514 246052 187522 229583 234136 179854 211531
5883B11531j2886P5981P4410J00698j4921k7946m754k073m1666M0336j3071L7930
$$ 211531 198645 274626 349036 449734 434813 406867 402113 400040 358374 398710 385639 423569
5871D23569K0177j7150M7236J7089k2929O8942K261j4321o2173N0175J14787N5835
$$ 423569 443746 426596 473832 490921 467992 536934 539195 524874 462701 512876 627663 683498
5859F83498J04104J88407K2908J11959J69891O0963j7230n6597L3707P2858k2870
$$ 683498 787602 976009 998917 1110876 1280767 1341730 1324500 1267903 1301610 1374468 1351598
5848A351598l5032j132L1164Q1942N7914j8460K3322j482r878j09574p6058n7561
$$ 1351598 1316566 1315434 1346598 1428540 1486454 1467994 1491316 1489834 1479956 1370382 1294324 1236763
5836A236763j7768q4712j54468k1307o8488o8991K514m4854m2698j7867m4391
$$ 1236763 1218995 1134283 979815 958508 890020 821029 823543 778689 735991 718124 673733
5825F73733j1690P993l3052l5664M2988M0760N6808j830l8539n7173J6464L2477
$$ 673733 662043 670036 636984 601320 644308 685068 741876 740046 701507 644334 660798 693275
5813F93275l3351M4445l766j21087J9707M6862K0710m9151l0564k0304K9897n4385
$$ 693275 659924 704369 700603 579516 599223 646085 666795 617644 587080 566776 596673 542288
5801E42288K3537M1551K7715K743O1310J09266k6005k6281P8670Q5544m3388r4873
$$ 542288 565825 607376 635091 637834 699144 808410 782405 756124 834794 920338 876950 782077
5789G82077p6600L4756Q7082P9529n7373L2975p30K2385O4536M9645l1608k5320
$$ 782077 705477 740233 827315 906844 849471 882446 881716 904101 968637 1018282 986674 961354
5777I61354N0882J5646N9329Q0312O9900K38939Q2120M4847J72612O9435J79686
$$ 961354 1012236 1027882 1087211 1167523 1237423 1476362 1558482 1603329 1775941 1845376 2025062
5766B025062J21188K27829L08324M54863P85022J375014K226854K988000L364084
$$ 2025062 2146250 2374079 2682403 3137266 3922288 5297302 7524156 10512156 13876240
5757A3876240K613967J118344j56210q53485j431680k076052k097012j793992
$$ 13876240 16490207 17608551 17452341 16598856 15167176 13091124 10994112 9200120
5749I200120j628093j497661j192723q72709n26819l85086l32038k92961j98427
$$ 9200120 7572027 6074366 4881643 4008934 3482115 3097029 2764991 2472030 2273603
5740B273603k30232j60585j31905j07689j01040n9137l8157j5787n3853R147p7781
$$ 2273603 2043371 1882786 1750881 1643192 1542152 1483015 1444858 1429071 1375218 1384365 1306584
5729A306584k535l9160o2924M4393j5155j9921m2816O310J118J3536q194o8043
$$ 1306584 1304049 1264889 1201965 1246358 1231203 1211282 1168466 1174776 1175894 1189430 1181236 1113193
5717A113193M4072P6308m2767m2566L8090J21385l6147k3218L7399k7041k801
$$ 1113193 1157265 1233573 1190806 1148240 1186330 1307715 1271568 1248350 1285749 1258708 1255907
5706A255907j2111j756P7217q677J854j4963m0663M8912j1891n7267N0846k4080
$$ 1255907 1243796 1242040 1319257 1310580 1312434 1297471 1256808 1305720 1293829 1236562 1287408 1263328
5694A263328N3539K8218m2789r745K3848R2443R9704M6570l0412p6247j2366J6953
$$ 1263328 1316867 1345085 1302296 1292551 1316399 1408842 1508546 1555116 1524704 1448457 1436091 1453044
5682A453044R362L2206L9280q822K6484J3463L3180O067m573J6998J0963K3451
$$ 1453044 1462406 1494612 1533892 1525070 1551554 1565017 1598197 1604264 1599691 1616689 1627652 1651103
5670A651103p40k8139o131J9672m2160l4694J03231K176o0205p9913K087K7868
$$ 1651103 1650363 1622224 1616093 1635765 1593605 1558911 1662142 1664318 1604113 1524200 1526287 1554155
5658A554155j3457P5744N3087K167l4568r728J5403J4668p3818k8665Q0359L2161
$$ 1554155 1540698 1616442 1669529 1671696 1637128 1627400 1642803 1657471 1583653 1554988 1635347 1667508
5646A667508o3843J3458K5977K1346J411k3237j0922j27N188m5776l0791L1340
$$ 1667508 1603665 1617123 1643100 1664446 1665857 1642620 1631698 1631571 1636759 1590983 1560192 1591532
5634A591532Q4665L1071K2046R1567Q9096L3686K4473N3093K7999J22762M9587
$$ 1591532 1676197 1707268 1729314 1820881 1909977 1943663 1968136 2021229 2049228 2171990 2221577
5623B221577K297J03175J20024R9860M1642K1561O6126J5571M7282l6319K6563
$$ 2221577 2223874 2327049 2447073 2546933 2588575 2610136 2676262 2691833 2739115 2702796 2729359
5612B729359J31621M6381P7931k3197m2906M4428P0121m3118j5772M5036L6793
$$ 2729359 2860980 2907361 2985292 2962095 2919189 2963617 3033738 2990620 2974848 3019884 3056677
5601C056677J5787P5619J10924M9713R9991J05759R8629K11287Q2211Q9336J30508
$$ 3056677 3072464 3148083 3259007 3308720 3408711 3514470 3613099 3824386 3906597 3995933 4126441
5590D126441J28294J63320J55355J68498J64806K30452K16954K33811J58424J94685
$$ 4126441 4254735 4418055 4573410 4741908 4906714 5137166 5354120 5587931 5746355 5941040
5580E941040K42966K89874K54619K38186K19478K21187K82820K90493K83442K94136
$$ 5941040 6184006 6473880 6728499 6966685 7186163 7407350 7690170 7980663 8264105 8558241
5570H558241L40416L64536M82998M59732M48630N30502N74189P74541P95612P55129
$$ 8558241 8898657 9263193 9746191 10205923 10654553 11185055 11759244 12533785 13329397 14084526
5560A4084526J007493J075801J302799J421284J665900J918935K136190K503517
$$ 14084526 15092019 16167820 17470619 18891903 20557803 22476738 24612928 27116445
5552B7116445K886244L275412L903848M912630O132742Q042538J0532725J3772201
$$ 27116445 30002689 33278101 37181949 42094579 48227321 56269859 66802584 80574785
5544H0574785J7584311K1348413K3972540K3985847K0847242J5194371Q967900
$$ 80574785 98159096 119507509 143480049 167465896 188313138 203507509 212475409
5537B12475409L368977p98037k355714j455692J407184M866278P037501O695874
$$ 212475409 215844386 215046349 212690635 211234943 212642127 217508405 224545906 231241780
5529B31241780L653679j430182p213517j2207816j6303980j9219589k0358455
$$ 231241780 234895459 233465277 226251760 214043944 197739964 178520375 158161920
5522A58161920j9889002j8666029j6941445j4714177j2103921r741144p983771
$$ 158161920 138272918 119606889 102665444 87951267 75847346 66106202 58122431
5515E8122431o455142n247746m408883l698993l248218k826648k364537k121962
$$ 58122431 51667289 46419543 42010660 38311667 35063449 32236801 29872264 27750302
5507B7750302j828762j596780j435845j269420j131522j027194r46966r16392
$$ 27750302 25921540 24324760 22888915 21619495 20487973 19460779 18513813 17597421
5499A7597421p08777p19096o74751o52566n18654n29639m86717n16542m71612
$$ 17597421 16888644 16169548 15494797 14842231 14323577 13793938 13307221 12790679 12319067
5490A2319067m29568m06085l13294k82568l27474k81401k21975k44076k75391
$$ 12319067 11889499 11483414 11170120 10887552 10560078 10278677 10056702 9812626 9537235
5481I537235k58456j93992k76622k06958j13552j01101j74169k50819j78576j59267
$$ 9537235 9278779 9084787 8808165 8601207 8487655 8386554 8212385 7961566 7782990 7623723
5471G623723j00448q1782k16337j72402m3793j44468j42269j50247j72766j56796
$$ 7623723 7523275 7441493 7225156 7052754 7008961 6864493 6722224 6571977 6399211 6242415
5461F242415j43399j13626j96427j15106j41071k05020k66703j63315q5036j43159
$$ 6242415 6099016 5985390 5788963 5673857 5532786 5327766 5061063 4897748 4812712 4669553
5451D669553j43865q6491j5878o5674j32904j29324r6542m3590m0234m5874K7265
$$ 4669553 4525688 4439197 4423319 4357645 4224741 4095417 3998875 3955285 3915051 3869177 3896442
5440C896442N4428q6440Q6074n0974q7838L0278K9419r4484m2228k9281r4901
$$ 3896442 3950870 3864430 3950504 3899530 3811692 3841970 3871389 3776905 3734677 3705396 3610495
5429C610495j42659q6531q7570M2615j24r5222j25075j04753p2810q8444j8069
$$ 3610495 3467836 3381305 3293735 3336350 3336226 3241004 3115929 3011176 2938366 2849922 2831853
5418B831853l4144m0650m8307j06613m1829k0754p6751o8354n6781P7484p7466
$$ 2831853 2797709 2757059 2708752 2602139 2560310 2539556 2462805 2394451 2337670 2415154 2337688
5407B337688r1202J5238k8958j3766L8357m440p2812K41O563q2417L2923J5865
$$ 2337688 2246486 2261724 2232766 2219000 2257357 2252917 2180105 2180346 2186909 2104492 2137415 2153280
5395B153280n4669o8885o7841j184K3216l219J8740p240K8364M8392K9767k9570
$$ 2153280 2098611 2029726 1961885 1960701 1983917 1980698 1999438 1992198 2020562 2068954 2098721 2069151
5383B069151l1494j5039r2506j8263m8312k3945M9300j6201m4919p0016j6904
$$ 2069151 2037657 2022618 1930112 1911849 1863537 1839592 1888892 1872691 1827772 1757756 1740852
5372A740852j6519l1080L0231n0501l3566K3008j4781j383k7322L5268Q4983n4209
$$ 1740852 1724333 1693253 1723484 1672983 1639417 1662425 1647644 1646261 1618939 1654207 1739190 1684981
5360A684981r828N3972p5977J8560N4761m3921L555P5700O3530L0757J6009n7935
$$ 1684981 1675153 1729125 1653148 1671708 1726469 1682548 1686103 1761803 1825333 1856090 1872099 1814164
5348A814164n1996J10550Q1915R8496K1263Q4639L704j3344Q6990J039K6755J22882
$$ 1814164 1762168 1872718 1954633 2053129 2074392 2159031 2162735 2149391 2236381 2237420 2264175 2387057
5336B387057Q3999K8337L6604O3889J08288J17116M5146J07364J01078O9298R0844
$$ 2387057 2471056 2499393 2535997 2599886 2708174 2825290 2870436 2977800 3078878 3148176 3239020
5325C239020J45181J58051J83375K14976J26861K22131K54398K47806K89934L92751
$$ 3239020 3384201 3542252 3725627 3940603 4067464 4289595 4543993 4791799 5081733 5474484
5315E474484N04751N26062N81030P17467P99755R09531J274279J711168K308540
$$ 5474484 5979235 6505297 7086327 7803794 8603549 9513080 10787359 12498527 14807067
5306A4807067L503745N341575P427667Q723289Q404700O183896K886071Q5110
$$ 14807067 18310812 23652387 31080054 39803343 48208043 54391939 57278010 57363120
5298E7363120j865893l081096l519659k753130o00649J840849M112780N195429
$$ 57363120 55497227 52416131 48896472 46143342 45542693 47383542 51496322 56691751
5290E6691751M315602J757654j103587l323604m893085o095741o409308n962526
$$ 56691751 61007353 62765007 61661420 58337816 53444731 47348990 40939682 34977156
5282C4977156n439829m813909m042695l166059k444393j826951j330404r95379
$$ 34977156 29537327 24723418 20680723 17514664 15070271 13243320 11912916 10917537
5274A0917537j011402r17451p30218o76176n02049l64270l40159k94634k91204
$$ 10917537 9906135 8988684 8258466 7582290 7080241 6715971 6375812 6081178 5789974
5265E789974k37037k33623j82762k41562k16198j92830j30801j29851j33304j53342
$$ 5789974 5552937 5319314 5136552 4894990 4678792 4485962 4355161 4225310 4092006 3938664
5255C938664j62507j74118q3414j52764j43942r4303j05712p0813j06933Q432
$$ 3938664 3776157 3602039 3518625 3365861 3221919 3127616 3021904 2951091 2844158 2852590
5245B852590l2217j22776O8274k9193j34183Q204L734j5001q4177n936k4497k2121
$$ 2852590 2820373 2697597 2765871 2736678 2602495 2610699 2614433 2599432 2515255 2509319 2484822 2462701
5233B462701K2052Q4710k3883Q3803M3617L8634J5493N2685R881O0379M4027L6587
$$ 2462701 2484753 2569463 2545580 2629383 2673000 2711634 2727127 2779812 2789693 2850072 2894099 2930686
5221B930686J9206q7169j6976n8275j7848K2025k9509p7908n7535j729l8598K2266
$$ 2930686 2949892 2862723 2845747 2787472 2769624 2791649 2762140 2684232 2626697 2624968 2586370 2608636
5209B608636m5841j54458j23162j09542j25864j01279j13073j04552j3332l3133
$$ 2608636 2562795 2408337 2285175 2175633 2049769 1948490 1835417 1730865 1717533 1684400
5199A684400n5110o3310j3482M3449j6663j623P096p0353k1829o0920m6256l1781
$$ 1684400 1629290 1565980 1552498 1595947 1579284 1577661 1584757 1514404 1492575 1431655 1385399 1353618
5187A353618n6639j6585M2703L8113J0596k9689l9267M9297p4302j4373K1492
$$ 1353618 1296979 1280394 1323097 1361210 1371806 1342117 1302850 1352147 1277845 1263472 1284964
5176A284964p1906n2511J7824J2307O3851m7388j891P079M569q727p7691N547
$$ 1284964 1213058 1160547 1178371 1190678 1254529 1207141 1205250 1212329 1216898 1208171 1130480 1136027
5164A136027l1674j0517o3750n038Q2081k883o7002l2868m3849N4796o4583k7480
$$ 1136027 1104353 1093836 1030086 1025048 1107129 1104246 1037244 1004376 960527 1015323 950740 923260
5152I23260R262m2357l4267O723O06j5809K5312P3260M0752k4712j34395N4108
$$ 923260 932522 890165 855898 862621 863227 847418 872730 945990 986742 962030 827635 881743
5140H81743L3934l4563l8271L0146O4968k2840J4007O3101J33829K9529j33152
$$ 881743 915677 881114 842843 872989 937957 915117 929124 992225 1126054 1155583 1022431
5129A022431k7495O2881p650k5961N4125N7461P4888P4439l357P5047J9261k487
$$ 1022431 994936 1057817 1050167 1024206 1078331 1135792 1210680 1285119 1281762 1356809 1376070 1373583
5117A373583N0799p6887n512J4538J01005L5681p608O3278R0883P8261r7302q9365
$$ 1373583 1424382 1347495 1341983 1356521 1457526 1493207 1485599 1548877 1639760 1718021 1620719 1531354
5105A531354n1723p4359p6595j3992O3959j032p7915M595J5750L7110l6799n7843
$$ 1531354 1479631 1405272 1328677 1314685 1378644 1377612 1299697 1304292 1320042 1357152 1320353 1262510
5093A262510m1807j28359j9849k1575k6944o773n8176L5872L5268R316J6330q3572
$$ 1262510 1220703 1092344 1072495 1050920 1023976 1017203 959027 994899 1030167 1039483 1055813 972241
5081I72241n1880O6866k7841L612q3706q352q997K7231J40673j3977K7045L9262
$$ 972241 920361 987227 959386 962998 879292 870940 861943 889174 1029847 1015870 1042915 1082177
5069A082177m2662p7716N8683n8132n5278J02630N7080k5714M7291P2632M8342
$$ 1082177 1039515 961799 1020482 962350 907072 1009702 1066782 1041068 1088359 1160991 1209333
5058A209333L3044j7676l4781m0349J6376o5347m905k7177p3219O3508L7069j7743
$$ 1209333 1242377 1224701 1189920 1149571 1165947 1100600 1095695 1068518 995299 1058807 1095876 1078133
5046A078133k6418j0915j6781J4566l391J990o8792j06643M8382O5452J9454K9707
$$ 1078133 1051715 1040800 1024019 1038585 1035194 1037184 968392 861749 910131 975583 995037 1024744
5034A024744j1220M7875j0875l6242N8063r8639j868L8302K2413L4391O9850L816
$$ 1024744 1013524 1061399 1050524 1014282 1072345 973706 971838 1010140 1032553 1066944 1136794 1140610
5022A140610L2639r2486P5716j9039M0777o3419r9985N9743m6351P66R6222M2836
$$ 1140610 1173249 1080763 1156479 1137440 1178217 1114798 1014813 1074556 1028205 1028971 1125193 1168029
5010A168029J0998J8280L228n4961j1930o89J6580R803K1259J01270M5892L6616
$$ 1168029 1179027 1197307 1200535 1145574 1133644 1132955 1149535 1159338 1180597 1281867 1327759 1364375
4998A364375o739k4346K9410M156J748J61332J34976J18431O9430P2104M8329
$$ 1364375 1357636 1333290 1362700 1366856 1368604 1529936 1664912 1783343 1852773 1924877 1973206
4987A973206J00364N2737n9609j30179j02436j14083r2189o5756m588L0499k3020
$$ 1973206 2073570 2126307 2066698 1936519 1834083 1720000 1627811 1562055 1557467 1587966 1564946
4976A564946L3906O3532j6855n3629J2855L1775m7897o4540r5397l1241n1994
$$ 1564946 1598852 1662384 1645529 1591900 1604755 1636530 1588633 1524093 1428696 1397455 1345461
4965A345461N1994M92k6901N4350K563Q5955n7859k9757M0677j7636l4781k2270
$$ 1345461 1397455 1397947 1371046 1425396 1427959 1513914 1456055 1426298 1466975 1449339 1414558 1392288
4953A392288K7004q705K7669R2406N7642L89N5575n472o3920m9692n2625N8780
$$ 1392288 1419292 1410587 1438256 1530662 1588304 1588693 1644268 1638796 1574876 1525184 1472559 1531339
4941A531339M3892p066l7833J9102N3266K7522K5349j2865l0079n2569M9664K3326
$$ 1531339 1575231 1568165 1530332 1549434 1602700 1630222 1655571 1642706 1612627 1560058 1609722 1633048
4929A633048l1127o566L3233n501N4047m5183j0450O4959J4488j01406L8262k015
$$ 1633048 1601921 1595355 1628588 1623087 1677134 1631951 1621501 1686460 1700948 1599542 1637804 1635789
4917A635789k2976m8243J16342J01821n7823j1065N5432K7542L8481j0296o5396
$$ 1635789 1612813 1564570 1680912 1782733 1724910 1713845 1769277 1796819 1835300 1825004 1759608
4906A759608L5367r473j7509M4561J6460J2981M4175J05615K4267m1450q3132
$$ 1759608 1794975 1785502 1767993 1812554 1829014 1841995 1886170 1991785 2016052 1974602 1891470
4895A891470q9616K7407j2117J01268K5556o2903K3691J08799n1558K1514O9679
$$ 1891470 1801854 1829261 1817144 1918412 1943968 1881065 1904756 2013555 1961997 1983511 2053190
4884B053190m2354k3020K3409q8871K2562J2282O4177O7336J9600J02197M8546
$$ 2053190 2010836 1987816 2011225 1922354 1944916 1957198 2021375 2088711 2108311 2210508 2259054
4873B259054l448o4148k6864j8761n7717N4932O3084m7789J7835R0631J2524M9056
$$ 2259054 2255606 2191458 2164594 2145833 2088116 2143048 2206132 2158343 2176178 2266809 2279333 2328389
4861B328389j7989l238K1908N4622L7629m0558L9305M7938M8026J16914J73946
$$ 2328389 2310400 2307162 2329070 2383692 2421321 2380763 2420068 2468006 2516032 2632946 2806892
4850B806892J45945Q8429k7891L1508K5894q0228n1398N3539j9677m6261J977
$$ 2806892 2952837 3041266 3013375 3044883 3070777 2990549 2939151 2992690 2973013 2926752 2928729
4839B928729J24097N5895q36Q4148Q2605L6712M7581J66045J42879L0735R8503
$$ 2928729 3052826 3108721 3107885 3192033 3274638 3311350 3358931 3524976 3667855 3698590 3797093
4828C797093K95490M18499M57619Q30351J364258J948338K340990J983269J181416
$$ 3797093 4092583 4511082 4968701 5799052 7163310 9111648 11452638 13435907 14617323
4819A4617323K03627m47878q44931j257621j462258j312227j159217j074109r93598
$$ 14617323 14820950 14373072 13528141 12270520 10808262 9496035 8336818 7262709 6269111
4810F269111o57377m75102l40155j81317j52633j50868n7133n2170j05500j0346
$$ 6269111 5611734 5136632 4796477 4615160 4462527 4311659 4254526 4202356 4096856 4086510
4800D086510m6971r5436n1577j31341p197j3559R6172k7643l2616k639M2462p989
$$ 4086510 4039539 3944103 3892526 3761185 3753988 3740429 3836601 3808958 3776342 3773703 3816165 3808176
4788C808176m183L3824K0816p080k9641l0624k5048L0334N617K3481J42106M4725
$$ 3808176 3803993 3837817 3858633 3851553 3821912 3791288 3766240 3796574 3802191 3825672 3967778 4012503
4776D012503j3405O5401q1881K1537L4309m065O4061M2332l680k1331P0434J08714
$$ 4012503 3999098 4064499 3982618 4004155 4038464 4034399 4098460 4140792 4137112 4115781 4186215 4294929
4764D294929Q2130K8236K2092K1411n4474R4395L2095L0689N8069J2289Q8024
$$ 4294929 4377059 4405295 4427387 4448798 4394324 4488719 4520814 4551503 4609572 4621861 4709885
4753D709885R251k2352N7254k1248l9337j6321K9037k9170L8482p024J19620M9836
$$ 4709885 4719136 4696784 4754038 4732790 4693453 4677132 4706169 4676999 4715481 4708457 4828077 4877913
4741D877913L5862P7291L0690j2771J932k3954L6241M5097j0724J0002O9994R0002
$$ 4877913 4913775 4991066 5021756 5008985 5010917 4986963 5023204 5068301 5057577 5067579 5137573 5227575
4729E227575P1204L0100J21351M0225O7540N0950R291O939K8112j7332J2425J42248
$$ 5227575 5298779 5328879 5450230 5490455 5557995 5608945 5618236 5625175 5653287 5635955 5648380 5790628
4717E790628J02434K8251J2857l8336O1354M2907R8644o966J9458M1409N7388
$$ 5790628 5893062 5921313 5934170 5895834 5957188 6000095 6098739 6091773 6111231 6152640 6210028
4706F210028J25090M7938Q2652R3193Q8857L6419K696O5235R602K7940O7969O5595
$$ 6210028 6335118 6383056 6465708 6558901 6647758 6684177 6686873 6752108 6761710 6789650 6857619 6923214
4694F923214O1036N0004N5710P9238J0999l610J19494l4741M6897P6009j9616
$$ 6923214 6984250 7034254 7089964 7169202 7180201 7176591 7296085 7261344 7308241 7384250 7364634
4683G364634J19966J47983M4466J34950L9226Q8201M9647Q2148K4045R1845J28728
$$ 7364634 7484600 7632583 7677049 7811999 7851225 7939426 7989073 8071221 8095266 8187111 8315839
4672H315839J47124R1077J70949N6418P8437J00811P1604J8341N6904J64869J42768
$$ 8315839 8462963 8554040 8724989 8781407 8859844 8960655 9032259 9050600 9107504 9272373 9415141
4661I415141P2260R3593Q9410L1584L442J16065R5820O0714m0822O5907Q0777
$$ 9415141 9487401 9580994 9670404 9701988 9705430 9821495 9917315 9978029 9937207 10003114 10083891
4650A0083891O5182J19784M502j809J22807J59840P6157Q2451N0416J39595J45612
$$ 10083891 10149073 10268857 10273359 10271550 10394357 10554197 10630354 10712805 10763221 10902816 11048428
4639A1048428Q0843J28871Q9509J06568J64439J30621K65525J88314K64146L48332
$$ 11048428 11129271 11258142 11347651 11454219 11618658 11749279 12014804 12203118 12467264 12815596
4629A2815596M94094P05167P95121O65727M80857K14979k2540j02657k48117l53877
$$ 12815596 13309690 14014857 14809978 15475705 15956562 16171541 16149001 16046344 15798227 15444350
4619A5444350k41175k23126q8053r9838J5886R0713R1844L12544M24127L93169
$$ 15444350 15203175 14980049 14891996 14792158 14808044 14898757 14990601 15303145 15727272 16120441
4609A6120441M28580M57545M89928M26489L77811M36861N42670O45286O86525
$$ 16120441 16549021 17006566 17496494 17922983 18300794 18737655 19280325 19925611 20612136
4600B0612136O50484N03811M10083L62846L13862L62849O14004N73775N73236
$$ 20612136 21262620 21766431 22176514 22539360 22853222 23216071 23830075 24403850 24977086
4591B4977086N56792K96683K4750Q5909p7390k7203j3362k4033J02524P027j00964
$$ 24977086 25533878 25830561 25855311 25941220 25863830 25836627 25823265 25799232 25901756 25908783 25807819
4580B5807819j68817k45653j09239J5373N6126J43486J23312K53072L73117M80333
$$ 25807819 25639002 25393349 25284110 25299483 25355609 25499095 25622407 25875479 26248596 26728929
4570B6728929P83060R97158J519158K097279K713740L576494M322534N192052
$$ 26728929 27511989 28509147 30028305 32125584 34839324 38415818 42738352 47930404
4562D7930404N721974N894053N518377M632709L819959L191011L014439L477653
$$ 47930404 53652378 59546431 65064808 69697517 73517476 76708487 79722926 83200579
4554H3200579M629565O176079P298008P472544O213743L711712P39029j619734
$$ 83200579 87830144 94006223 101304231 108776775 114990518 118702230 119441259 117821525
4546A17821525l574811m856741n135959m754105m136846l678542l501167l624089
$$ 117821525 114246714 109389973 104254014 99499909 95363063 91684521 88183354 84559265
4538H4559265l971033m453921m940350n279554n475860n434336n102760m605856
$$ 84559265 80588232 76134311 71193961 65914407 60438547 55004211 49901451 45295595
4530D5295595m053582l434130k818187k308939j923726j580971j263665r43700
$$ 45295595 41242013 37807883 34989696 32680757 30757031 29176060 27912395 26968695
4522B6968695p89948o80186n29395m11368l22683k74763k07172j14394M2433K52465
$$ 26968695 26178747 25498561 24969166 24557798 24235115 23960352 23753180 23638786 23681219 23933684
4512B3933684N20113J035296J555227J894491J940175J450213O07289M5329k96758
$$ 23933684 24453797 25489093 27044320 28938811 30878986 32329199 32936488 32981817 32685059
4503C2685059o45565n66666j56962O85282J848327K886918L097591K495910J027817
$$ 32685059 32039494 31472828 31315866 32001148 33849475 36736393 39833984 42329894 43357711
4494D3357711l40908j271089j911121k408291k482831j774196j192145n42098
$$ 43357711 43016803 41745714 39834593 37426302 34943471 33169275 31977130 31435032
4486C1435032N0864J82540r6448n90893j056739j330305j603276j772556j617706
$$ 31435032 31485896 31668436 31571988 30981095 29924356 28594051 26990775 25218219 23600513
4477B3600513j446201j259651j160338r63433o76691n65094m29910m01373l17453
$$ 23600513 22154312 20894661 19734323 18770890 18094199 17529105 17099195 16697822 16380369
4468A6380369l19460k33105k40444k88652k16064k28460k14265j93447k28043
$$ 16380369 16060909 15827804 15587360 15298708 15082644 14854184 14639919 14446472 14218429
4459A4218429j32270r1128j12512j25049j54226k3582j13888j22100K8097l9342
$$ 14218429 14086159 13995031 13882519 13757470 13603244 13579662 13465774 13343674 13371771 13332429
4449A3332429k3026o8317p4505J04605O8476P8063K43623L61735M86689O21793
$$ 13332429 13309403 13241086 13166581 13271186 13339662 13417725 13661348 14023083 14509772 15131565
4439A5131565O13974N41952L71983J95923J17465k58809m52766n90622o04635
$$ 15131565 15745539 16287491 16659474 16855397 16972862 16714053 16261287 15670665 15066030
4430A5066030o64536o54328n96747n84315n26767m02968k71262k38042k93383
$$ 15066030 14401494 13747166 13150419 12566104 12039337 11636369 11365107 11127065 10833682
4421A0833682k36204j54509k54241k03185j77659j31002j48018j71006j3872j20726
$$ 10833682 10597478 10442969 10188728 9985543 9807884 9676882 9528864 9357858 9343986 9223260
4411I223260j56653j31123j54835j1749n122j06133j21665j29062j62574M3231
$$ 9223260 9066607 8935484 8780649 8768900 8763778 8657645 8535980 8406918 8244344 8287575
4401H287575r3069j31872k2051n6737o8121k6940p5940n257n7898n9635j23002
$$ 8287575 8194506 8062634 8040583 7983846 7915725 7888785 7812845 7807588 7749690 7690055 7567053
4390G567053n9429l8622l9624j23297N5859n1914j11907m0342J9586p445r3943
$$ 7567053 7507624 7469002 7429378 7306081 7361940 7310026 7198119 7157777 7177363 7169918 7075975
4379G075975o6044m7935q94j08143J1882l8033j09805j2886M0652J9730o7706
$$ 7075975 7009931 6961996 6961102 6852959 6864841 6826808 6717003 6704117 6744769 6764499 6696793
4368F696793o8135M0418j15365o9287o6889k5854L4474o6804k3256j8661p2062
$$ 6696793 6628658 6669076 6553711 6484424 6417535 6391681 6426155 6359351 6336095 6317434 6245372
4357F245372J1355J15678o1393N4728j4330O9034Q0175O6924J26839Q7905K1006
$$ 6245372 6256727 6372405 6311012 6365740 6351410 6420444 6500619 6567543 6694382 6782287 6803293
4346F803293K8785L3150m2481o1742j00370r7699j56871r045m4400j02524r6530
$$ 6803293 6832078 6865228 6822747 6761005 6660635 6562936 6406065 6397020 6352620 6250096 6153566
4335F153566q5716k5168Q2389J2280j0541j8751l6916J5908K026n3191k0950q1365
$$ 6153566 6067850 6042682 6125071 6137351 6126810 6108059 6071143 6087051 6089077 6035886 6014936 5933571
4323E933571k9173k9289L5044N2357r520K9249J2958p3374j9688J436M6758J4386
$$ 5933571 5904398 5875109 5910153 5962510 5952990 5982239 5995197 5921823 5902135 5903571 5950329 5964715
4311E964715k3638j5533R2926o0635m41K3264O0919N0835J6980o3442l4565P2326
$$ 5964715 5941077 5925544 6018470 5957835 5957394 5980658 6041577 6092412 6109392 6045950 6011385 6083711
4299F083711L1170N280m7100N2159P0335M5122l7481J0747m877N7303N0437R2490
$$ 6083711 6114881 6120161 6073061 6125220 6195555 6240677 6203196 6213943 6209066 6266369 6316806 6409296
4287F409296J5049P0886q449M2063O6947K0076O6484M3169J1326L1472M3161L5764
$$ 6409296 6424345 6495231 6486782 6528845 6595792 6615868 6682352 6725521 6736847 6768319 6811480 6847244
4275F847244R5330l555O9651J8160j6004O3144R273r409N8989M8391N8223J6851
$$ 6847244 6942574 6939019 7008670 7026830 7010826 7073970 7083243 7073834 7132823 7181214 7239437 7256288
4263G256288P0463J51088P3598J9450J56056P8579J62782L0566Q8368J38760J02875
$$ 7256288 7326751 7477839 7551437 7570887 7726943 7805522 7968304 7998870 8087238 8225998 8328873
4252H328873J55054J52820J17371K13720L02858K27782J69382K97945L40930L70382
$$ 8328873 8483927 8636747 8754118 8967838 9270696 9498478 9667860 9965805 10306735 10677117
4242A0677117K73639L57835M71157M48990N87913O48531O52964P10163Q19130
$$ 10677117 10950756 11308591 11779748 12228738 12816651 13465182 14118146 14828309 15647439
4233A5647439R20430J016500R77340J201415J408621J868685K462541L271843
$$ 15647439 16567869 17584369 18561709 19763124 21171745 23040430 25502971 28774814
4225B8774814L734886L716616L147342K086480J388208J246297Q37913P17895
$$ 28774814 32509700 36226316 39373658 41460138 42848346 44094643 44932556 45650451
4217D5650451R48430J198274J330438J644861J960183K348832K554067K751265
$$ 45650451 46598881 47797155 49127593 50772454 52732637 55081469 57635536 60386801
4209F0386801K958661L052973L127747L098289L132042L086415K970868K875613
$$ 60386801 63345462 66398435 69526182 72624471 75756513 78842928 81813796 84689409
4201H4689409K769202K792377K716992K594697K576394K676405K630298K683277
$$ 84689409 87458611 90250988 92967980 95562677 98139071 100815476 103445774 106129051
4193A06129051K489430K443788K383666K052540J800384J557620J364019J091781
$$ 106129051 108618481 111062269 113445935 115498475 117298859 118856479 120220498 121312279
4185A21312279R51843Q71438P50110O29425N68314M05996L66579K10072p6063
$$ 121312279 122264122 123135560 123885670 124515095 125083409 125489405 125855984 126066056 125989993
4176A25989993k09594k95100n76762p50137q50689r92520j109135j136712j249867
$$ 125989993 125780399 125485299 124908537 124158400 123307711 122315191 121206056 120069344 118819477
4167A18819477j280956j342486j410589j492389j516070j525373j599907j593582
$$ 118819477 117538521 116196035 114785446 113293057 111776987 110251614 108651707 107058125
4159A07058125j714052j700901j623309j677162j742677j805487j756122j777484
$$ 107058125 105344073 103643172 102019863 100342701 98600024 96794537 95038415 93260931
4151I3260931j789778j857409j854207j901036j870781j752121j779036j725875
$$ 93260931 91471153 89613744 87759537 85858501 83987720 82235599 80456563 78730688
4143G8730688j812592j865679j835479j859046j868034j971883j983531j850838
$$ 78730688 76918096 75052417 73216938 71357892 69489858 67517975 65534444 63683606
4135F3683606j911530j819540j776983j815523j765169j766777j799167j805061
$$ 63683606 61772076 59952536 58175553 56360030 54594861 52828084 51028917 49223856
4127D9223856j792759j792348j758706j760910j655932j636986j603725j627538
$$ 49223856 47431097 45638749 43880043 42119133 40463201 38826215 37222490 35594952
4119C5594952j503736j445657j398791j271918j218359j273623j203879j174399
$$ 35594952 34091216 32645559 31246768 29974850 28756491 27482868 26278989 25104590
4111B5104590j080934j019820j090194j019404r00795r35181q36164o57746o77657
$$ 25104590 24023656 23003836 21913642 20894238 19993443 19058262 18222098 17564352 16886695
4102A6886695o75373o93180o15710m77716m24410m90723l67029l61149m04127
$$ 16886695 16211322 15518142 14902432 14424716 14000306 13509583 13142554 12781405 12377278
4093A2377278l10051k96167k11750k95563k38588j37454m279j30152j00362K0152
$$ 12377278 12067227 11771060 11559310 11263747 11025159 10887705 10883426 10753274 10652912 10673064
4083A0673064J4916p2712j22826P7357j3454O304l5127m7312o5337K542K66o4164
$$ 10673064 10687980 10615268 10492442 10569799 10556345 10562649 10527522 10480210 10414873 10417415 10417681 10353517
4071A0353517o3352l4959J0182m0140n1996n3989k3190n19r6138j26557j27410
$$ 10353517 10290165 10255206 10265388 10225248 10173252 10119263 10096073 10095554 9999416 9872859 9745449
4060I745449o9473m5065j00737p3874j47120q2237J6135n5631p2443j16497l5025
$$ 9745449 9675976 9630911 9530174 9456300 9309180 9226943 9243078 9187447 9115004 8998507 8963482
4049H963482k4246o5187q0207r1401r2632j06404m2526p4395m9978o7399j34814
$$ 8963482 8939236 8874049 8793842 8702441 8609809 8503405 8460879 8386484 8336506 8269107 8134293
4038H134293r1776j04788j38532o0668r4099m1867o8587j3593o2712o6608j6813
$$ 8134293 8042517 7937729 7799197 7738529 7644430 7602563 7533976 7520383 7457671 7391063 7374250
4027G374250m1585r0365l5358q452J679K1246q562N7151q7677O4827K0863q551
$$ 7374250 7332665 7242300 7206942 7198490 7200169 7221415 7212853 7270004 7182327 7247154 7268017 7259466
4015G259466N0420M669M1049N4160n4457J23764J89477M4141K9678N9472J59314
$$ 7259466 7309886 7314555 7355604 7409764 7355307 7479071 7668548 7712689 7742367 7801839 7961153
4004G961153O5534K0342J09945J41509J39189J77165J73676J64247K38956J60494
$$ 7961153 8026687 8047029 8156974 8298483 8437672 8614837 8788513 8952760 9191716 9352210
3994I352210J43658J22396J48973J52461K17800K82277K36228K17428K15303K71447
$$ 9352210 9495868 9618264 9767237 9919698 10137498 10419775 10656003 10873431 11088734 11360181
3984A1360181J89890K25822K97927J37017P3387J57629J45699K50800K09547K38009
$$ 11360181 11550071 11775893 12073820 12210837 12284224 12441853 12587552 12838352 13047899 13285908
3974A3285908K79274L28566L25534K45513K56121L28922L41604L66459L13523
$$ 13285908 13565182 13893748 14219282 14464795 14720916 15049838 15391442 15757901 16071424
3965A6071424L27284M95832M41677M56878N83946P11801P37434Q35580Q74276
$$ 16071424 16398708 16894540 17336217 17793095 18377041 19088842 19826276 20661856 21536132
3956B1536132R91599J197046J305911J462131J667621J943621K283459K628557
$$ 21536132 22527731 23724777 25030688 26492819 28160440 30104061 32387520 35016077
3948C5016077L079322L710481M471999N113441N985659O832664P942214R417038
$$ 35016077 38095399 41805880 46277879 51391320 57376979 64209643 72151857 81568895
3940H1568895J1321777J3703241J6355145J9051985K1335546K2664712K2568812
$$ 81568895 92890672 106593913 122949058 142001043 163336589 186001301 208570113
3933B08570113K1032947J8228916J4378251J0096202O071542K578675p7302j741352
$$ 208570113 229603060 247831976 262210227 272306429 278377971 280956646 280879344 279137992
3925B79137992k296237k170463j261818K1379J159683K052730J965548P60793
$$ 279137992 276841755 274671292 273409474 273430853 274590536 276643266 278608814 279369607
3917B79369607j433517m655937q225346j1718997j4840321j7292895j8744028
$$ 279369607 277936090 273280153 265054807 253335810 238495489 221202594 202458566
3910B02458566j9028586j8513760j7546236j5933296j4289949j2353257j0668481
$$ 202458566 183429980 164916220 147369984 131436688 117146739 104793482 94125001
3903I4125001r188733p760980o663536n681761m922026m198452l593745l104243
$$ 94125001 84936268 77175288 70511752 64829991 59907965 55709513 52115768 49011525
3895D9011525k724892k353655j983372j714883j467984j381297j203914r24270
$$ 49011525 46286633 43932978 41949606 40234723 38766739 37385442 36181528 35257258
3887C5257258r09488q13899q03822o95346o79229o71731n91133m90383m52836
$$ 35257258 34347770 33533871 32730049 32034703 31355474 30683743 30092610 29602227 29149391
3878B9149391m08830k69680k47329k72827j62573q8056j20799q9474o3499r2691
$$ 29149391 28740561 28470881 28223552 27950725 27788152 27700096 27579297 27489823 27426324 27333633
3868B7333633q0978J03189Q6092R9295R1428K04026L35513L06269M28164M15851
$$ 27333633 27252655 27355844 27441936 27541231 27632659 27836685 28172198 28478467 28906631 29322482
3858B9322482M76465N46227N44816M07980M32133M44247M53660M85223M96863
$$ 29322482 29798947 30345174 30889990 31297970 31730103 32174350 32628010 33113233 33610096
3849C3610096M79031M79251O04738O35032N78239O51733O89529O19563P03287
$$ 33610096 34089127 34568378 35173116 35808148 36386387 37038120 37727649 38347212 39050499
3840C9050499M85882L73553L03916K31063K02723R3344N2475K6746Q8543J14976
$$ 39050499 39536381 39909934 40213850 40444913 40647636 40740980 40793455 40820201 40908744 41023720
3830D1023720P6307K69642L12162K82587K99329K92709K02296K48103K36383K81579
$$ 41023720 41100027 41369669 41681831 41964418 42263747 42556456 42758752 43006855 43243238 43524817
3820D3524817L50074L46370N07354O84873Q35060J072080J387681J661433K036272
$$ 43524817 43874891 44221261 44728615 45413488 46248548 47320628 48708309 50369742 52406014
3811E2406014K374949K854182L447807L978931M512108N204688O029315O836689
$$ 52406014 54780963 57635145 61082952 65061883 69573991 74778679 80807994 87644683
3803H7644683P765791Q717545R731821J0810496J1951987J3106719J4185090J5024106
$$ 87644683 95410474 104128019 113859840 124670336 136622323 149729042 163914132 178938238
3795A78938238J5431504J5605568J5151267J4518511J3794741J2878261J2257594
$$ 178938238 194369742 209975310 225126577 239645088 253439829 266318090 278575684
3788B78575684J2025288J1858178J1886240J1844084J1832793J1780174J1275620
$$ 278575684 290600972 302459150 314345390 326189474 338022267 349802441 361078061
3781C61078061J0443727R314282P985142O561342N134453L708313K496370J385067
$$ 361078061 371521788 380836070 388821212 395382554 400517007 404225320 406721690 408106757
3773D08106757O54962J23009l26762j90901J54158O52081R95267J039673O39572
$$ 408106757 408761719 408884728 408557966 408367065 408521223 409173304 410168571 411208244 411847816
3764D11847816k86611j792554l743489n746335p681445r448415j0741927j1379312
$$ 411847816 411561205 409768651 406025162 400278827 392597382 383148967 372407040 361027728
3756C61027728j1618514j1416957j0668650r840378r098159q519167q645852r037361
$$ 361027728 349409214 337992257 327323607 317483229 308385070 299865903 291220051 282182690
3748B82182690j0148556j1517083j2887052j4058315j4915734j5325033j5082291
$$ 282182690 272034134 260517051 247629999 233571684 218655950 203330917 188248626
3741A88248626j4564221j3558503j2451607j1178717j0102792r049065p999268
$$ 188248626 173684405 160125902 147674295 136495578 126392786 117343721 109344453
3734A09344453p155733o404941n795169n115839m481503l880063l318393k858244
$$ 109344453 102188720 95783779 89988610 84872771 80391268 76511205 73192812 70334568
3726G0334568k313073j853905j508738j071478n99630k90088j13483O749K32627
$$ 70334568 68021495 66167590 64658852 63587374 62987744 62697656 62584173 62590922 62823549
3717F2823549M08575N74651P94222Q71020J138569J611928K207423L116168L998296
$$ 62823549 63232124 63806775 64600997 65472017 66610586 68222514 70429937 73546105 77544401
3708G7544401N077558O261554P304730P987710Q410271Q055748P091119N761797
$$ 77544401 82621959 88883513 96188243 104175953 112586224 120641972 127733091 133494888
3700A33494888M020487K269052O71564n59994j400052j727835j793957j382284
$$ 133494888 137515375 139784427 140455991 139895997 138495945 136768110 134974153 133591869
3692A33591869q04161l47858o232p7819o85357j735395l031828m530910n943148
$$ 133591869 132787708 132439850 132433618 132355799 131670442 129935047 126903219 122372309 116429161
3683A16429161p175577q128077q504676q537122q272634p640275o982140o128723
$$ 116429161 109253584 101125507 92620831 84083709 75811075 68170800 61188660 55059937
3675E5059937n206677m596535l928098l311748k861807k553943k122758j894547
$$ 55059937 49853260 45256725 41328627 38016879 35155072 32601129 30478371 28583824
3667B8583824j591031j449046j196244j083427r89155q61332q12971p32971p27076
$$ 28583824 26992793 25543747 24347503 23264076 22274921 21413589 20600618 19867647 19140571
3658A9140571o41447n50221n17535m54296m53846m85911l62683l19216m19838
$$ 19140571 18499124 17948903 17431368 16977072 16523226 16037315 15674632 15355416 14935578
3649A4935578l20738l65759l13022k56222l87681j87540k38586k79128j90198
$$ 14935578 14614840 14249081 13936059 13679837 13292156 13104616 12866030 12586902 12396704
3640A2396704k39059k28607j78722k72837k01990k87830k58789j71387k18070
$$ 12396704 12157645 11929038 11750316 11477479 11275489 10987659 10728870 10557483 10339413
3631A0339413j75745k74506j63944j34669j85943k14218k21254j92793k39348
$$ 10339413 10163668 9889162 9725218 9590549 9404606 9190388 8969134 8776341 8536993
3622H536993k56518k61501k63814k27519k29482k20120j39805k18631k06747k19551
$$ 8536993 8280475 8018974 7755160 7527641 7298159 7078039 6938234 6719603 6512856 6293305
3612F293305j51453k15782k43180j99030j36835p7707r5946j33258j60449r4145
$$ 6293305 6141852 5926070 5682890 5483860 5347025 5269318 5173372 5040114 4879665 4785520
3602D785520M4708j24460j28118n489m9485l4780o3058j14499n4565n0010k4518
$$ 4785520 4830228 4705768 4577650 4572161 4522676 4487896 4424838 4310339 4255774 4205764 4181246
3591D181246j00693p8600k0576j474j01549n8106j07891J7184M8163j26599j0746
$$ 4181246 4080553 4001953 3981377 3979903 3878354 3820248 3712357 3729541 3777704 3651105 3640359
3580C640359K0858N099o0382k8048m8695m4146j16393l5204q6723p2593L6158
$$ 3640359 3661217 3666316 3605934 3577886 3529191 3485045 3368652 3333448 3246725 3174132 3210290
3569C210290p3925L6673O9421k4836p613j7045L4164k8297k6453r3321p7647K1321
$$ 3210290 3136365 3173038 3242459 3217623 3210010 3192965 3227129 3198832 3172379 3079058 3001411 3022732
3557C022732m448j06980k5056L5451N2047N4938l6633k5882J4432j4190J7381
$$ 3022732 3018284 2911304 2886248 2921699 2973746 3028684 2992051 2966169 2980601 2966411 2983792
3546B983792K2444R865K4214O2056K6414R6051J5574Q7104J07516j4270n257k1036
$$ 2983792 3006236 3016101 3040315 3102371 3128785 3224836 3240410 3327514 3435030 3420760 3415503 3394467
3534C394467l973J08359J7462L6735O1357k342M9300L2976p9612p227l94L2730
$$ 3394467 3390494 3498853 3516315 3553050 3614407 3612065 3661365 3694341 3614729 3607502 3607108 3639838
3522C639838O1217q5762J13052J64713J54318J58430J81509J81759J63308J88457
$$ 3639838 3701055 3615293 3728345 3893058 4047376 4205806 4387315 4569074 4732382 4920839
3512D920839K58339J49917J88188K14673K33087K44999K14481K56884K35511J89046
$$ 4920839 5179178 5329095 5517283 5731956 5965043 6210042 6424523 6681407 6916918 7105964
3502G105964K07338K25397J95185J44889M0577J57151K11353J37099J43287J53322
$$ 7105964 7313302 7538699 7733884 7878773 7919350 8076501 8287854 8424953 8568240 8721562
3492H721562K08551K04426J92564J99566L05055L04058L09616L60005K95751L93695
$$ 8721562 8930113 9134539 9327103 9526669 9831724 10135782 10445398 10805403 11101154 11494849
3482A1494849L73212K46250L44955L23578L55540L87509M04857M52785O06776
$$ 11494849 11868061 12114311 12459266 12782844 13138384 13525893 13930750 14383535 14990311
3473A4990311O62757P62510J081821J370483J423844J568321J689821J693675
$$ 14990311 15653068 16415578 17497399 18867882 20291726 21860047 23549868 25243543
3465B5243543J643253J439454J161953P58156L99510K1674l50191p17672j069434
$$ 25243543 26886796 28326250 29488203 30246359 30645869 30667543 30317352 29599680 28530246
3456B8530246j156489j198795j268097j224644j131619j063922j006322r60182
$$ 28530246 27373757 26174962 24906865 23682221 22550602 21486680 20480358 19520176
3448A9520176q77328p52887p06257p16650n84779o18311o65962o08110o18641
$$ 19520176 18642848 17889961 17183704 16467054 15882275 15263964 14598002 13989892 13371251
3439A3371251n73946p46094p20662n80790o06600n94410n44928n34125n12337
$$ 13371251 12797305 12051211 11330549 10749759 10143159 9548749 9003821 8469696 7957359
3430G957359m62553m71992l21492k87351l27737k10458k73201j87398j46644j86073
$$ 7957359 7494806 7022814 6701322 6413971 6086234 5875776 5602575 5415177 5268533 5082460
3420E082460r5715q5050j29784j09030j52994q2547j30522p1826p1398j49957
$$ 5082460 4986745 4901695 4771911 4662881 4509887 4427340 4296818 4224992 4153594 4003637
3410D003637j02206r7066r3881o2428j02568l1119q3555p16l7919p2236j16089
$$ 4003637 3901431 3804365 3710484 3648056 3545488 3514369 3430814 3430098 3392179 3319943 3203854
3399C203854m3769j29895n8746M462j17358m404n5489j48307j83699n6067q1730
$$ 3203854 3160085 3030190 2971444 2975906 2858548 2854144 2798655 2650348 2466649 2410582 2328852
3388B328852j38717j28062k6148n8528r2162l0064O03n6326n8526n1446k1177
$$ 2328852 2190135 2062073 2035925 1977397 1885235 1855171 1855774 1799448 1740922 1689476 1668299
3377A668299q5821N263q6022j9659j676r8325p653L6853o5547o0888L153q0348
$$ 1668299 1582478 1587741 1501719 1482060 1480384 1382059 1374406 1411259 1345712 1284824 1287977 1207629
3365A207629R6322l8319n2195j7358k7584J05105j9368K1865J04497q2929q9555
$$ 1207629 1303951 1265632 1213437 1196079 1168495 1273600 1254232 1276097 1380594 1297665 1208110
3354A208110R235j4084n8184o0918l3606m520j4305K4269O862q0918L5798l0863
$$ 1208110 1217345 1203261 1145077 1084159 1050553 1046033 1031728 1055997 1062859 981941 1017739 986876
3342I86876k2624k5944o3200l583L4878l3834K0443l8439k6264L6908K7478n4986
$$ 986876 964252 938308 875108 871525 906403 872569 893012 854573 828309 865217 892695 837709
3330H37709K9958P389L4444J1447N2823L3503q3969k8132J7284q5151k1304Q3981
$$ 837709 867667 875056 909500 920947 973770 1007273 923304 895172 912456 827305 806001 889982
3318H89982o1292J4118p0504Q691j310l6683J3356l8062o4839k3404k6124J0611
$$ 889982 828690 842808 772304 780995 779685 743002 756358 718296 653457 630053 603929 614540
3306F14540o307m1616M0474j8878n7239K0674o198L3651K9156j1349L433J7331
$$ 614540 608233 566617 607091 588213 530974 551648 545450 579101 608257 596908 600341 617672
3294F17672p047o882p283K0070n5942n7786m7129L5943J00727K9311m0986K8617
$$ 617672 610625 603743 596460 616530 560588 502802 455673 491616 592343 621654 580668 609285
3282F09285n0982O4550j5913q4726L439n0526l6021O1306r1163J7698M105K5937
$$ 609285 558303 622853 606940 522214 525653 475127 439106 500412 409249 426947 431052 456989
3270D56989J05950K0964J1238n2208K1596K3472M3675L2585J13097J30673J96832
$$ 456989 562939 583903 595141 542933 564529 588001 631676 664261 777358 908031 1104863
3259A104863P2871L2043K8921k520J0308n6427j18614j39630n7015j36166j09658
$$ 1104863 1177734 1209777 1238698 1236178 1246486 1190059 1071445 931815 874800 738634 628976
3248F28976K9762l7085M4365m7877n7596J399M6973n8856q2595J2395M50P5750
$$ 628976 658738 621653 666018 618141 560545 561944 608917 550061 467466 479861 480311 556061
3236E56061Q6318P3033J54485O2040J21015K3155N3586l3211m8013l8299p7208
$$ 556061 642379 715412 869897 931937 1052952 1076107 1129693 1096482 1048469 1010170 932962
3225I32962r3861j25106J366L1960p3322n2736j0145l4373L8115j03792m0722
$$ 932962 839101 713995 715361 747321 673999 621263 611118 576745 614860 511068 470346
3214D70346N1770P57K788J31717K5263k1708p795l6769m2597K2071N2556k4339
$$ 470346 522116 522873 525661 657378 682641 660933 653138 616369 573772 595843 648399 624060
3202F24060P4685m012q56R6480Q7804j0361M970P585n6172K5118Q9028n625n8051
$$ 624060 698745 694733 693877 790357 878161 867800 872770 880355 824183 849301 938329 932704 874653
3189H74653J3389j5820M6589R570O3383J2466O0749L5557j7132M8687J8584r623
$$ 874653 888042 872222 918811 928381 991764 1004230 1064979 1100536 1083404 1132091 1150675 1141052
3177A141052J2243M6314M3902K9260Q6062R0255N8955P2757N1809J02733M6314
$$ 1141052 1153295 1199609 1243511 1272771 1358833 1449088 1508043 1580800 1632609 1735342 1781656
3166A781656N9222J52675J38303Q5272J11764K32948K36608K17295K84409K22643
$$ 1781656 1840878 1993553 2131856 2217128 2328892 2561840 2798448 3015743 3300152 3522795
3156C522795K23905L76845L94051M53739M64963N50362O08624O47862O10558M94983
$$ 3522795 3746700 4123545 4517596 4971335 5436298 5986660 6595284 7243146 7853704 8348687
3146H348687M15116L10891J40454J1719N294J9496j7156J0737m2092o5082k7403
$$ 8348687 8763803 9074694 9215148 9226867 9232161 9251657 9234501 9245238 9203146 9138064 9110661
3135I110661j5284Q555M0809L7763K0617M2655O7333K10590J56868K81578L88140
$$ 9110661 9095377 9103932 9144741 9182504 9203121 9245776 9313109 9523699 9680567 9962145 10350285
3124A0350285N40585Q02040J272557J897163K207967K143364J672110R51909N4282
$$ 10350285 10890870 11692910 12965467 14862630 17070597 19213961 20886071 21837980 21892262
3115B1892262o11088j130525j476510j556105j674994j580542j420162j127526
$$ 21892262 21281174 20150649 18674139 17118034 15443040 13862498 12442336 11314810
3107A1314810q60027p34510n69718n54790m80915l00369k67565k28575j08824
$$ 11314810 10454783 9720273 9150555 8595765 8114850 7814481 7546916 7318341 7209517
3098G209517j06259o3016r410l0736J26224K01068K70806L62920L53127M51725
$$ 7209517 7103258 7040242 7030832 7000096 7126320 7327388 7598194 7961114 8314241 8765966
3088H765966L38037J65505J02207r9423l14404m30963n19552n00021n64364n65802
$$ 8765966 9104003 9269508 9371715 9272292 8957888 8526925 8007373 7507352 6942988 6377186
3078F377186m91622n23388m19352l27196k98109k60384l47869k54967k09505j93571
$$ 6377186 5885564 5362176 4942824 4615628 4317519 4057135 3709266 3454299 3244794 3051223
3068C051223k60009j60582j45725r8431J6757r9243p7068j94347k900l0516j63811
$$ 3051223 2791214 2630632 2484907 2386476 2403233 2303990 2226922 2032575 2029675 1999159 1835348
3057A835348o1383o0233p7756n5338r242n8371r8772J0516n5789o0338p38r670
$$ 1835348 1773965 1713732 1635976 1580638 1571396 1513025 1414253 1424769 1368980 1308642 1307904 1298234
3045A298234p9253q510p7401j37616N1075n9468k9888M1101j14380L4336n5158
$$ 1298234 1218981 1210471 1133070 995454 1046529 987061 957173 998274 883894 918230 863072
3034H63072n0489r8203n1155J2130Q894k6382N4817M0195j01259m8524l0248J42815
$$ 863072 812583 714380 663225 675355 684249 657867 712684 752879 651620 603096 572848 715663
3022G15663K4333p9495q5169q4684R436K5449M830K7851k1383j5606J1987m4251
$$ 715663 739996 660501 575332 490648 500084 525533 530363 558214 536831 521225 533212 488961
3010D88961p6925O1387l7J463k4451m2777l4903j4992L0469l0196N5269N9099
$$ 488961 412036 473423 473386 474849 450398 407621 372718 357726 388195 357999 413268 472367
2998D72367m1172P923p033k1287l3928m0844l465l2241m0518K706p154j0885O9378
$$ 472367 431195 439118 432085 410798 376870 336026 332561 300320 259802 262508 255354 244469 313847
2985C13847k1038m4373P1452p6966j7917m9506J25078M2600j49339Q527K9492
$$ 313847 292809 248436 319888 242922 225005 175499 300577 343177 193838 202365 231857
2974B31857m209P4634M69q3548k0441r8048L1051P3352j03703m4805K3848O225
$$ 231857 227648 302282 302751 219203 198762 100714 131765 205117 101414 56609 80457 86682
2962H6682N6131l9258K3965J1084j10829J00582j4162q9566J1541K9303r687l5302
$$ 86682 142813 103555 127520 138604 27775 128357 114195 24629 36170 65473 55786 20484
2950B0484j5771k312L3071r107R368J5918L3425j4229o6737K3193j1065K1900
$$ 20484 4713 2401 35472 26365 35733 51651 85076 70847 4110 27303 16238 38138
2938C8138p916O024K4311J4277l411k8109j6845j8888l5016n445K5453k5604M6033
$$ 38138 30222 36246 60557 74834 71423 43314 26469 7581 -27435 -32880 -7427 -33031 13002
2925A3002L1179L7288k6194j10361p5579Q2465J0879l1660P221M9896K082o1154
$$ 13002 44181 81469 55275 -55086 -130665 -48200 -37321 -68981 -61760 -11864 -9782 -70936
2913g0936l5037P3876m117L0112R083o2356k0582L9487m4357P7023j9331K8424
$$ -70936 -105973 -32097 -36214 -6102 2981 -59375 -79957 -40470 -84827 -7804 -27135 1289
2901A289P5768K5578l5306m4428L1695m6450n1158J9859M9959m4775n1204K5209
$$ 1289 77057 102635 67329 22901 54596 8146 -43012 -23153 26806 -17969 -69173 -43964
2889d3964Q3985J1422r1192j5043K0656L1534N4924m1524O1630M1695l4606o2501
$$ -43964 40021 51443 -39749 -54792 -34136 -2602 52322 10798 72428 114123 79517 17016
2877A7016l0738M0851M6233q2181n3334k2361J5450M3342n9509K5420Q7281N066
$$ 17016 -13722 27129 73362 -8819 -62153 -84514 -69064 -25722 -85231 -59811 27470 32536
2865C2536l9699K2035J4494n7026o581L3502l6700m490o699R931N3510k9044J5044
$$ 32536 -7163 14872 29366 -27660 -34241 -739 -37439 -41929 -48628 -38697 14813 -14231 813
2852H13L7684l0009K7768R0420j9236n5468m1094o3331J4717J5486r329J03635
$$ 813 38497 8488 36256 126676 107440 51972 10878 -52453 -37736 -22250 -31579 72056
2840G2056m5991m865L7372J8065J6043L1626L949K5787l7136p1020J1094L787
$$ 72056 26065 21200 58572 76637 92680 124306 128255 154042 116906 45886 56980 60767
2828F0767J7358m5112n6745P1095k9732O991O8607j5957P330J1253L2495k3288
$$ 60767 78125 33013 -23732 47363 17631 24622 93229 77272 84602 95855 128350 105062
2816A05062l7424R051k729N02P111L644r253n4249r582N3864K061J6176J1790
$$ 105062 67638 76689 73960 74462 81573 85217 75964 21715 12133 65997 68058 84234 96024
2803I6024m1069k6183n044K0363j3905j6345M5831P8523o0996n3459o2641j5839
$$ 96024 54955 28772 23728 44091 30186 13841 59672 138195 77199 23740 -38901 -54740
2791e4740M5169o041L7343L1385K6033q623n0403k5163K9122k3333M5463M183
$$ -54740 -9571 -15612 21731 53116 79149 70526 20123 -5040 24082 749 46212 50395
2779E0395L0863m5764o4948O080P3406n1487n7369N9600l1015M2117M295j9907
$$ 50395 81258 35494 -29454 -23374 50032 -1455 -58824 776 -30239 11878 16173 -3734
2767c734L1568O370o5211k1757q669J0364l3178O3572n2579l1966N4839Q450p126
$$ -3734 27834 34204 -31007 -52764 -61433 -51069 -84247 -20675 -73254 -105220 -50381 -41931 -49057
2754d9057J5339K215k2442j149K1231l2912l230l9204P4194O821o2554J3022L1263
$$ -49057 -33718 -31503 -53945 -55094 -33863 -66775 -70005 -109209 -35015 -28194 -90748 -77726 -46463
2741d6463J6346m8964k498L9511k9350l8688O1830J409J6373m3990K4551J0215
$$ -46463 -30117 -79081 -81579 -42068 -71418 -110106 -48276 -46867 -30494 -74484 -49933 -39718
2729c9718K322k4821N000K6280l395r3802K0887N9152K3337M5785k0272j2298
$$ -39718 -37396 -62217 -57217 -30937 -34332 -128134 -107247 -48095 -24758 21027 755 -11543
2717a1543M2457m2619p6892l7098P8650J0677p3663N2144k4770L5143K8305p3409
$$ -11543 30914 -11705 -88597 -125695 -47045 -36368 -110031 -57887 -82657 -47514 -19209 -92618
2705i2618q049k735p398L5537Q591j4651n7902K0154o2043M2023N9367O0641k2724
$$ -92618 -100667 -103402 -110800 -75263 -66672 -81323 -139225 -119071 -181114 -139091 -79724 -19083 -41807
2692d1807j4277l864l8126L0986K012n9028J785M2245J2930m3482R84l132k2325
$$ -41807 -56084 -59948 -98074 -67088 -65076 -124104 -122319 -80074 -67144 -110626 -109642 -112774 -135099
2679a35099O4667N8959m7835J6100k9564l3264M2864Q671K748J6467r307n6279
$$ -135099 -70432 -11473 -59308 -43208 -72772 -106036 -63172 -54501 -51753 -35286 -44593 -100872
2667a00872K2856j8816r100J1263J6081p9794r651K2240P8081j8526K6819j2852
$$ -100872 -78016 -96832 -105932 -94669 -78588 -158382 -168033 -145793 -67712 -86238 -59419 -72271
2655g2271M7581l6356j24554P1408Q034l6324L5623j7321O407M3175L1761M7978
$$ -72271 -24690 -61046 -185600 -114192 -106158 -142482 -106859 -124180 -117773 -74598 -42837 5141
2643E141n8952p2451L5356p292k3270K3971j5833N2223m8497J0824J16179j2028
$$ 5141 -53811 -126262 -90906 -98198 -121468 -97497 -113330 -61107 -109604 -98780 17399 5371
2631E371m09o2661o7229M0559j690O388m0915q026J2478n920O6684l4914k6946
$$ 5371 4962 -57699 -124928 -84369 -86059 -79671 -120586 -128612 -116134 -122054 -55370 -90284 -117230
2618a17230P3235j52l0944J453K3542l7660K5124j9295M4467M8742k8117n7346
$$ -117230 -43995 -44147 -75091 -73638 -50096 -87756 -62632 -81927 -37460 11282 -16835 -74181
2606g4181j4326P8779k31j2007l05J9687q180j659K7233K5163L7887l3582n4985
$$ -74181 -88507 -9728 -9959 -21966 -22271 -2584 -10764 -12423 14810 39973 77860 44278 -10707
2593a0707n649l9321K1146q2414N870O8706M6934J6773P4737Q5363R1089J1140
$$ -10707 -16356 -55677 -34531 -116945 -111075 -42369 4565 21338 96075 181438 272527 283667
2581B83667K8250J5851p5065j2757N640r367j16281R5O4626l8213n5344j911n6210
$$ 283667 311917 327768 252703 239946 245586 236219 119938 120033 184659 146446 91102 89191 32981
2568C2981j7529m836j6345k1398p0453K2705O0914m5957j4772R461O0938K361
$$ 32981 15452 10616 -5729 -27127 -97580 -74875 -13961 -59918 -74690 -65229 -4291 -1930
2556a930m6594j420l0149J0733N1935L0718q392q745k6014p413Q4856m9268j7082
$$ -1930 -48524 -49944 -80093 -69360 -17425 13293 4901 -3844 -29858 -37271 47585 -1683 -18765
2543a8765L7567o0954O2015k122j0172l0325j8235O009l7584L9184N4753L2521
$$ -18765 18802 -42152 19863 17741 7569 -22756 -40991 -34982 -72566 -33382 21371 53892
2531E3892n4689l9348o1223R9254k4999k2540J1432m9854O7310J1592K4147k9708
$$ 53892 -797 -40145 -101368 -2114 -27113 -49653 -38221 -88075 -20765 -9173 14974 -14734
2519a4734k9430j288M238k1126K3636k8310k6008K3755K7770N8829J2308k3192
$$ -14734 -44164 -45452 -41214 -62340 -38704 -67014 -93022 -69267 -41497 17332 29640 6448
2507F448k7548j5543L4614L7332l6514j6190K587k2664L5761n8670o15N1173m2750
$$ 6448 -21100 -36643 -2029 35303 -1211 -17401 -14814 -37478 -1717 -60387 -61002 -9829 -52579
2494e2579P4637n2834o8665K6392L4790M3805J16m470o6026p049M8801Q4458o7460
$$ -52579 22058 -30776 -99441 -73049 -38259 5546 5662 1192 -64834 -71883 -23082 61376 -6084
2481f084k7529L8941K5496O0801p0469l8146J48618K7236m3834m3061j4261k9207
$$ -6084 -33613 5328 30824 91625 21156 -16990 131628 158864 115030 71969 57708 28501
2469B8501l0168o321M166L3947J3155K4154N258j5711q408M3414M1656K56r096
$$ 28501 -1667 -7988 -3822 30125 43280 67434 72692 56981 48573 91987 133643 133899 124803
2456A24803M8469m1387j2270o8576P91o652l0307J9946Q0983L4457Q096j4474
$$ 124803 173272 131885 119615 51039 51830 45178 14871 34817 115800 150257 158353 143879
2444A43879l3568j1272j2042p3j4238K5247Q8974q817M931m2294K9135R8152q2565
$$ 143879 110311 99039 86997 86924 72686 97933 186907 178090 183021 140727 169862 268014 185449
2431A85449o0629m013J8598l5262m1676Q9203P3827J5579j9982j8831n2337q8699
$$ 185449 124820 120807 139405 104143 62467 151670 225497 241076 221094 202263 149926 61227
2419F1227o0720Q5010L3635l8604K248k9277N8708K3568L7480P3283m0609o084
$$ 61227 507 85517 119152 80548 82796 53519 112227 135795 173275 246558 205949 199865
2407A99865l2224M55K7387K6528L5685k8295N566j5171M3051J4801m5784Q3601
$$ 199865 167641 168096 195483 222011 257696 229401 234967 219796 262847 277648 231864 315465
2395C15465k3473J9663j947k2053J9929n6195L2453K005n0067M430J1510K3033
$$ 315465 291992 311655 309708 287655 307584 251389 283842 285847 235780 240210 251720 274753
2383B74753m4997r6864P6453L3995O3162N125n7096O5486L9129q683Q8292l0355
$$ 274753 229756 132892 209345 243340 306502 311627 254531 320017 359146 350463 438755 408400
2371D08400K7484O5921Q8707m9602O2209K2585j0247M3306j6287L6227N1646j547
$$ 408400 435884 501805 590512 540910 603119 625704 615457 658763 642476 678703 730349 728802
2359G28802M3574J1794P2439j6926J6328J30476K3622M0240O1931Q1174K5861
$$ 728802 772376 784170 856609 839683 856011 986487 1010109 1050349 1112280 1193454 1219315
2348A219315R886R672R3142j2139J3045P8446N4195J09588o447J28637J25081
$$ 1219315 1229201 1238873 1332015 1319876 1332921 1411367 1465562 1575150 1568703 1697340 1822421
2337A822421J10749J53072K00170K97050L74030M62971O08656O48389O80051M82716
$$ 1822421 1933170 2086242 2286412 2583462 2957492 3420463 4029119 4677508 5357559 5840275
2327E840275N23862M02131M10942N40089Q45487J159042J683218K722155M617632
$$ 5840275 6364137 6766268 7177210 7717299 8562786 9721828 11405046 14127201 18744833
2318A8744833Q215549J1759063J3684095J1776699O428700N56016l003895n201267
$$ 18744833 26960382 38719445 52403540 64180239 70608939 71164955 68161060 62959793
2310F2959793p579363q869207p863847o708821o465096n474315l951464k673794
$$ 62959793 55380430 46511223 38647376 31938555 25473459 19999144 16047680 13373886
2302A3373886j642345j113438r28641q33458p77505q41989p25518o79030n74402
$$ 13373886 11731541 10618103 9689462 8856004 8078499 7236510 6510992 5831962 5257560
2293E257560m44872m87431l38138k97080k38029j31858j53143j93360j67084j26715
$$ 5257560 4812688 4325257 3987119 3690039 3452010 3320152 3167009 2973649 2806565 2679850
2283B679850j98466o7938o0321r9885j69935j85463n5808n677j377j20517j26329
$$ 2679850 2481384 2413446 2353125 2253240 2083305 1897842 1842034 1836357 1834980 1714463 1588134
2272A588134l4497l2251K0668r6752J1688n2774l6423o7408m0325L7132J8627
$$ 1588134 1553637 1521386 1542054 1445302 1456990 1404216 1367793 1300385 1260060 1297192 1315819
2261A315819o2843j00702r6432m5610k2426j6702P6648k0568j15026L8152J1887
$$ 1315819 1252976 1152274 1055842 1010232 987806 971104 1047752 1027184 912158 950310 962197
2250I62197L4230O141l329k7762q2711k8721J0834j4144m2286o7025O779k0072
$$ 962197 996427 1002568 999239 971477 888766 860045 870879 856735 814449 747424 754203 734131
2238G34131o3691p7182K0037q845l5538k1503r2111k0288r019k1383m6673M1494
$$ 734131 670440 593258 613295 604450 568912 547409 455298 435010 425991 404608 357935 399429
2226C99429Q1595m2135p8422N3487k9618k4281m3661L2772J2257L6763l9287K0054
$$ 399429 481024 438889 360467 413954 384336 360055 316394 349166 361423 398186 358899 378953
2214C78953L4013m1634P0634O986l5430j6427n8094K4070q7684L4974L6424j6811
$$ 378953 412966 371332 441966 448952 413522 397095 339001 363071 275387 310361 346785 329974
2202C29974m9038o6220o1637J04K2595M594j4651k8857n6094L299J231K37J5438
$$ 329974 280936 214716 153079 153183 175778 180372 165721 136864 80770 84069 85300 85537 100975
2189A00975Q0753k2500l7174M3673k2988k9778j4447q6792N2117j7239r678M5339
$$ 100975 181728 159228 122054 165727 142739 112961 98514 11722 63839 46600 36922 82261
2177H2261J36730M9525p3962m1654l1094n8420j9506n7703m5311L8615j6037L6824
$$ 82261 218991 268516 194554 152900 121806 63386 43880 -13823 -59134 -20519 -36556 268
2165B68J6224j6131q648N8629P9390k3988J0103j3402n7637k2552N804P1444m1891
$$ 268 16492 361 -8287 50342 129732 105744 115847 102445 44808 22256 28060 99504 57613
2152E7613m7699n0874j8828K4971K9654O5486n9088n3740M6463K3863j7181P502
$$ 57613 9914 -40960 -59788 -34817 -5163 60323 1235 -52505 -6042 17821 640 8142
2140H142l7580K2065O2203p0965N2151J4846q4692l4024K7905L4840l8731J5361
$$ 8142 -29438 -7373 54830 -16135 36016 50862 -33830 -67854 -39949 -5109 -43840 -28479
2128b8479p634j2213Q3091L7466n2373p6883K8466l7343J306l036N1752m691j7768
$$ -28479 -36113 -48326 34765 72231 19858 -57025 -28559 -65902 -64596 -67632 -15880 -20571 -38339
2115c8339K6120M7847P3060j2292j36148O895P406q6976L8597N4468j4520l2586
$$ -38339 -12219 35628 108688 96396 -39752 -32857 -25451 -112427 -73830 -19362 -33882 -66468
2103f6468l3281J06887j579j4305m4648P361J4040K0603J3824M6045q5039r0221
$$ -66468 -99749 7138 5559 -8746 -53394 -46033 -31993 -11390 2434 48479 -36560 -126781
2091a26781J8976O7731N9967m0661M932O08m270m571n8004N2760K8339J5128k9061
$$ -126781 -107805 -40074 19893 -20768 -15836 -15228 -19498 -24069 -82073 -29313 -974 14154 -14907
2078a4907k0746N0670J4126j1563j3016p476k3607J1466k0415o57l0707O5364
$$ -14907 -35653 15017 29143 17580 4564 -2912 -26519 -15053 -35468 -36125 -66832 -1468
2066a468n2362K2456L8652K7955n4164l9374K7554l9680J4143N261j7069M3745
$$ -1468 -53830 -31374 7278 35233 -18931 -58305 -30751 -70431 -56288 -51027 -68096 -24351
2054b4351K6964j404M9704L3782k0652J04521Q7714l4130M8595R30M7703J6009
$$ -24351 2613 1209 50913 84695 64043 168564 256278 222148 270743 271673 319376 335385
2042C35385r3j9572n5935q850J225q0591q2296m7833m3714K860l6737R642N7420
$$ 335385 335292 315720 259785 250935 252160 171569 89273 41440 -2274 586 -36151 -26509 30911
2029C0911j4151R668l9637q451L8409j673j7027o4505m4162L1048K2299k1067
$$ 30911 16760 26428 -13209 -21660 16749 15076 -1951 -66456 -110618 -79570 -57271 -78338
2017g8338J0132k7175J34370J4002m2286M6049J0665j15117r1620j7154N6230
$$ -78338 -68206 -95381 38989 52991 10705 56754 67419 -47698 -139318 -156472 -100242
2006a00242K5838P0769N2533l5711K1849J7060n3989k7071r2311j6533J71r9752
$$ -100242 -74404 -3635 48898 13187 35036 52096 -1893 -28964 -121275 -137808 -137637 -237389
1994b37389O0903M4961N3906N4051K6187k3035M004p2258L4773j8145L146k2836
$$ -237389 -176486 -131525 -77619 -23568 2619 -20416 -16412 -88670 -53897 -72042 -68896 -91732
1982i1732j5855Q2936M5498j7346l210o417O868r5119m9150N7527k5123J215l9678
$$ -91732 -107587 -24651 20847 3501 291 -6126 742 -94377 -143527 -86000 -111123 -109908 -149586
1969a49586P4400j9830N6218M4800J112n884Q206k9952j00753o9094P073k5987
$$ -149586 -75186 -95016 -38798 6002 7114 1230 9436 -20516 -121269 -190363 -183290 -209277
1957b09277J13198P1807k9334p0261L6465Q435J6497j8289k3463p3521q366M8252
$$ -209277 -96079 -24272 -53606 -123867 -87402 -78967 -62470 -80759 -104222 -177743 -186109 -137857
1945a37857n0340J0287R4212M9979Q6687J7956n5294o1017m266K4239N9731L168
$$ -137857 -188197 -177910 -83698 -33719 52968 70924 15630 -45387 -49653 -25414 34317 37485
1933C7485r3132k9459K4954o655k4490Q7721N093k3124L4395n5692l715q355q460
$$ 37485 -55647 -85106 -60152 -66807 -91297 -3576 1517 -21607 12788 -42904 -46619 -54974 -63434
1920f3434P4961L2122j200J3124J6757l3266J0588p0738o78o1808M7473l6011
$$ -63434 11527 43649 42449 55573 72330 39064 49652 -21086 -21764 -83572 -36099 -72110
1908g2110q646Q3227k9454o6370M6210M1541l5237q0598O410L1854q85n77N3582
$$ -72110 -80756 2471 -26983 -93353 -47143 -5602 -40839 -121437 -115027 -83173 -84058 -84635 -31053
1895c1053m5369J03217n28j9989J851M867j956O329p6782m6059L0474j0003k5369
$$ -31053 -76422 26795 26267 6278 8129 12996 11040 17369 -59413 -105472 -74998 -85001 -110370
1882a10370q128J37037j5479j7204j6474m1085j6331j02693M6277N6907k4502
$$ -110370 -118498 18539 3060 -14144 -30618 -71703 -88034 -190727 -144450 -87543 -112045
1871a12045p7724K4068J25258R0264N0945q1027m2045o064l6330j0376M362R414
$$ -112045 -189769 -165701 -40443 49821 100766 19739 -22306 -28370 -64700 -75076 -70714 -61300
1859f1300L4533l6901K0745M0772m4309J1412j8454l196j0374p0470j8668O3259
$$ -61300 -26767 -63668 -42923 -2151 -46460 -35048 -53502 -56698 -67072 -137542 -156210 -92951
1847i2951L5835m8755J9601L4647L6574k2267P29j2106K3735m1476n6842K5977
$$ -92951 -57116 -105871 -86270 -51623 -15049 -37316 -36587 -48693 -24958 -66434 -123276 -97299
1835i7299k2971M0587O5312r250L9688M4705j1599j4602J93k9317m1926m7868
$$ -97299 -120270 -79683 -14371 -23621 16067 60772 49173 34571 34764 5447 -36479 -84347
1823h4347p051k8071O2815M6260M020M932j21603o6435Q7102J9500j02321l254
$$ -84347 -91398 -119469 -56654 -10394 -6374 -1442 -123045 -189480 -102378 -82878 -185199 -188453
1811a88453J09152L3126L0096N39J4063j9653k4631l654l0724k9726o221m7560
$$ -188453 -79301 -46175 -16079 -15540 -1477 -21130 -45761 -49415 -80139 -109865 -116086 -163646
1799a63646K7134j3259N198O0662J9510J8806J1617o6640o228J2871j685J6647
$$ -163646 -136512 -149771 -144573 -83911 -64401 -45595 -33978 -100618 -106846 -93975 -95660 -79013
1787g9013k3654O4570J546o145P5498N785k7084K4534j40248N903N1562m308m8387
$$ -79013 -102667 -38097 -36551 -42696 32802 38587 11503 36037 -104211 -98308 -46746 -51054 -99441
1774i9441N5164M4140n1984K2110P451K5861j3569m2254m7104r962J5069J2550
$$ -99441 -44277 -137 -52121 -30011 -22560 3301 -10268 -52522 -99626 -109588 -94519 -81969
1762h1969J9287m5877j2595P9390K2906l4712p8347P5044M8955j1919l5383j9648
$$ -81969 -62682 -108559 -121154 -41764 -18858 -53570 -131917 -56873 -7918 -19837 -55220 -74868
1750g4868n4301k2532P3948K8990l0703O4634M3849j9906o1266o2762Q337R0123
$$ -74868 -129169 -151701 -77753 -48763 -79466 -14832 29017 9111 -52155 -114917 -106580 -16457
1738a6457N0873q0932O912k9377j3334K3867R256P3320l3787j38740N9508k5510
$$ -16457 34416 -46516 -39604 -68981 -82315 -58448 -49192 24128 -9659 -148399 -88891 -114401
1726a14401Q070O4698j1493K5079J6441N2334J5715L5183l3431j35768m1180N5244
$$ -114401 -106331 -41633 -53126 -28047 -11606 40728 56443 91626 58195 -77573 -118753 -63509
1714f3509N279m8953l3706K1871P2854M1270m5470j1561N7671l3212m5539j05525
$$ -63509 -58230 -107183 -140889 -119018 -46164 -4894 -50364 -61925 -4254 -37466 -83005 -188530
1702a88530M0855L4145j203K8607J3228O6840N894m5679o1554J8436Q156K5340
$$ -188530 -147675 -113530 -114733 -86126 -72898 -6058 -164 -45843 -107397 -88961 -80805 -55465
1690e5465n6353M0359l8517L546J08436k0734J7992n5196m0685j5493n2469k2593
$$ -55465 -111818 -71459 -109976 -106430 2006 -18728 -736 -55932 -96617 -112110 -164579 -187172
1678a87172N2177J17259J9212K7999N940m6679M9902k8671J5264j8303k5451j0267
$$ -187172 -134995 -17736 1476 29475 35415 -11264 38638 9967 25231 6928 -18523 -28790
1666b8790k2465L7185k1289o5535M3850K4025l772K5654N2936K4052m8419j32310
$$ -28790 -51255 -14070 -35359 -100894 -57044 -33019 -36791 -11137 41799 65851 17432 -114878
1654a14878m5794Q9750M6230k1208r4687O0424Q9694q9460M7013m5749m0608K6160
$$ -114878 -160672 -70922 -24692 -45900 -140587 -80163 9531 -79929 -32916 -78665 -119273 -93113
1642i3113K2985M7108n5281j8516l2184R457N1235K3427J1178K6232J4512j1745
$$ -93113 -70128 -23020 -78301 -96817 -129001 -119544 -68309 -44882 -33704 -7472 7040 -4705
1630d705j2978o8338L7779k1492m0400j1784L0954M4698K7516N8295L7320n0312
$$ -4705 -17683 -86021 -48242 -69734 -110134 -121918 -90964 -46266 -18750 39545 76865 26553
1618B6553j01909n0158l573K5091K5543j1121N5134P5934r437j5052K3395O358
$$ 26553 -75356 -125514 -129087 -103996 -78453 -89574 -34440 41494 32057 17005 40400 46758
1606D6758q7407J9956l4649n5777O8744O4933r7033J9372R301j667j5614M3654
$$ 46758 -40649 -20693 -55342 -111119 -42375 22558 -74475 -55103 -45802 -47469 -63083 -19429
1594a9429k1348J7330k7908l6588O7867N400o6471j4212J04025o2499k9877l380
$$ -19429 -40777 -23447 -51355 -87943 -20076 -14676 -81147 -95359 8666 -53833 -83710 -87090
1582h7090K77K8005M8998l3971p3027L782k0684O6050P377j5692L9213J522j7672
$$ -87090 -86813 -58808 -9810 -43781 -116808 -113026 -133710 -67660 -60283 -75975 -36762 -35240 -52912
1569e2912q943m3021R5195O3405m8800j44023J5117N4034O8481J6025j0370l3125
$$ -52912 -61855 -104876 -9681 53724 4924 -139099 -123982 -69948 -1467 14558 4188 -28937
1557b8937J7156K4380p5990m0711l5202N2838m4438l848N9788L2114P0517k5910
$$ -28937 -11781 12599 -63391 -104102 -139304 -86466 -130904 -134752 -74964 -42850 27667 1757
1545A757n4413L8284k2934j3207N7759n787m0189k2440o983Q5955k8850M5009
$$ 1757 -52656 -14372 -37306 -50513 7246 1459 -38730 -61170 -68153 17802 -11048 33961
1533C3961k9992J2211L6838k4019l2889L6881n1579p5921N37N7334o6367Q2664
$$ 33961 3969 16180 53018 28999 -3890 32991 -18588 -94509 -93972 -36638 -103005 -20341
1521b0341L3159m0956L997p875j525Q931K4226R279j9875L3023k5690p7035J1008
$$ -20341 12818 -28138 -24141 -32016 -33541 -24610 -384 8895 -10980 22043 -3647 -80682 -69674
1508f9674j4730L90R4p3022M7586N7742q190L6540j0159M9992L6948O077k6961
$$ -69674 -84404 -84014 -83920 -156942 -109356 -51614 -59804 -23264 -33423 16569 53517 59594 32633
1495C2633J1157l1647n4070j0467K354k7752O4213Q778L4170l4223o5785O5744
$$ 32633 43790 12143 -41927 -52394 -50040 -77792 -13579 -4801 29369 -4854 -70639 -4895
1483d895M3572n9703k2753N994J9607k4980J151K6543m5480j0438N3933J3440
$$ -4895 38677 -21026 -43779 -37785 -18178 -43158 -42007 -15464 -60944 -71382 -17449 -4009
1471d009q2546O163K3478M1618L4028K9771N3667l3579o9042j5621P0698o5182
$$ -4009 -86555 -80392 -56914 -15296 18732 48503 102170 68591 -451 -16072 54626 -10556
1459a0556k6102M3092N164m6195L0109m3642Q1465o139j0348J767k9352o9704
$$ -10556 -36658 6434 11598 -34597 -4488 -48130 33335 27196 16848 18615 -10737 -80441
1447h0441l7029N1775o2226L7532K1665M8813O0253O297l4718P2333J4114r7787
$$ -80441 -117470 -65695 -127921 -90389 -68724 -19911 40342 46639 11921 84254 98368 581
1435E81n4689m4663M0795m1721J8060L6170m8550N9612K6903l8814P271N3527
$$ 581 -54108 -98771 -57976 -99697 -81637 -45467 -94017 -34405 -7502 -46316 -39045 14482
1423A4482n7468n269K6004P3057r555L1549J7280o191o3451l2124K7361k8214
$$ 14482 -42986 -48255 -22251 50806 41251 72800 90080 83889 20438 -11686 15675 -12539
1411a2539l519J4489p75m7338k310k4362J8880N0437O0058Q856l1275K9717n0035
$$ -12539 -16058 -1569 -2344 -49682 -51992 -76354 -57474 -7037 53021 61877 30602 60319 10284
1398A0284o2207N8308j4468m7944k092l2055L5651M4423n6124J03229Q709l5202
$$ 10284 -51923 6385 -8083 -56027 -58119 -90174 -54523 -10100 -66224 37005 45714 10512
1386A0512l6567j0025O6676J0612q261k0349J1617k0201n072o4748m0143M1589
$$ 10512 -26055 -36080 30596 41208 32947 12598 24215 4014 -1058 -65806 -105949 -64360
1374f4360O9708k1255p2938n1469O4683K3728K7579j5373N1322j2079k3780l7322
$$ -64360 5348 -15907 -88845 -140314 -75631 -51903 -24324 -39697 11625 -454 -24234 -61556
1362f1556O601N4431M7774n8779k602M8965o0200Q695K2217k8988M8712k285j878
$$ -61556 -54955 -524 47250 -11529 -14131 34834 -25366 -16671 5546 -23442 25270 22985 21107
1349B1107k1399j05298P2069l2211r282O0145K8571l3812P8484k8754o261l0305
$$ 21107 -292 -105590 -33521 -65732 -75014 -14869 13702 -20110 58374 29620 23359 -6946
1337f946j6545k600q4850N3616K0703N0257l3372M5071J4367O4637m8671o5790
$$ -6946 -23491 -26091 -110941 -57325 -36622 13635 -19737 25334 39701 104338 55667 -10123
1325a0123J8353m2322j1889k9951Q096L4611M5403k2072P3625k2020r8331j4141
$$ -10123 8230 -34092 -45981 -75932 -67836 -33225 12178 -9894 63731 41711 -56620 -70761
1313g0761P8308p558m6319o6477Q6851l343P457N279M1203K9659r4682j0849N8885
$$ -70761 7547 -11 -46330 -112807 -25956 -29299 -21842 -16563 24640 54299 -40383 -51232 7653
1300G653J565R069j1212n5913K5899j4471L6967o1354M5947M1219o9602k5434
$$ 7653 9218 18287 7075 -48838 -22939 -37410 -443 -61797 -15850 25369 -44233 -69667
1288f9667O608l775R222J171N8303n74K5022K3146J8523k3471j8212n2125l3446
$$ -69667 -63059 -66834 -57612 -56441 1862 1288 26310 49456 67979 44508 26296 -25829 -59275
1275e9275J4529j4972L1389k1556P7721J9496k9964L671O5902m7365m600l1594
$$ -59275 -44746 -59718 -28329 -49885 27836 47332 17368 21039 86941 39576 34976 3382
1263C382M4R114q8099K4836J1575o525M940m0294J1091N4099N5420m5663K7175
$$ 3382 3426 12540 -75559 -50723 -39148 -45673 -40733 -81027 -69936 -15837 39583 -6080 21095
1250B1095L5514o9505k7017O3609K1166m3033L2889k1041K1372j637m6503k0047
$$ 21095 56609 -12896 -39913 23696 44862 1829 34718 13677 35049 33412 -13091 -33138
1238c3138l7057l6397n3397N9404k5114N0488J2034K7826J11562m3819M789L9296
$$ -33138 -70195 -106592 -159989 -100585 -125699 -75211 -63177 -35351 76211 32392 37181 76477
1226G6477p2927p4977o885j2975M5924P1995J05489o0116l9589L7033J3764n4414
$$ 76477 3550 -71427 -78312 -91287 -45363 26632 132121 72005 32416 69449 83213 28799
1214B8799l5850k5390J5023J2658p033L8415m1180M6304J9139l9619l9474l056
$$ 28799 -7051 -32441 -17418 -4760 -11793 26622 -14558 31746 50885 11266 -28208 -31264
1202c1264k6915p835p03Q180J1746P686O4853K8292k4582k9828n3662O2696N2987
$$ -31264 -58179 -66014 -66717 -58537 -46791 -39105 25748 54040 29458 -370 -54032 8664 61651
1189F1651q710m4606k3725R344k6172j4631J517J12878o1312o408j3976j3153
$$ 61651 52941 8335 -15390 -6046 -32218 -46849 -45332 67546 6234 -174 -14150 -27303
1177b7303j26821M9036N0640K1301L644J2540L7782N0441m9542N712M4788j0060
$$ -27303 -154124 -105088 -54448 -33147 -29503 -16963 20819 71260 21718 27430 72218 62158
1165F2158m5313j27508M3809R9694r3597Q945J8345l8220J23249q9240q011O5384
$$ 62158 16845 -110663 -66854 32840 -60757 -51812 -33467 -71687 51562 -37678 -45689 19695
1153A9695l8997m4583P8917q2382k690j7856m3310J47401Q278J1871k3674l8546
$$ 19695 -19302 -63885 15032 -67350 -70040 -87896 -131206 16195 24473 36344 12670 -25876
1141b5876k243l155l0374j6186M9751L1670L7816L2898m973k2009o6350O146Q4490
$$ -25876 -28119 -31274 -61648 -77834 -28083 3587 41403 74301 69328 47319 -19031 -12885 71605
1128G1605j3337m4564l4254J8705l6522p597K2068O5386k8975K6492Q395L3761
$$ 71605 58268 13704 -20550 -1845 -38367 -45964 -23896 41490 12515 39007 47402 81163
1116H1163n0513q2131k165L1055L9151k3502M2185q3529j6797N4014k1288p676
$$ 81163 30650 -51481 -53646 -22591 16560 -6942 35243 -48286 -65083 -11069 -32357 -40033
1104d0033r810l9085K6462r366M7278M0629p423N3061l0603m0104j8136j5200
$$ -40033 -49843 -88928 -62466 -71832 -24554 16075 8652 61713 31110 -8994 -27130 -42330
1092d2330M0098J8303o3571M6207k3353R565J7190j8154M0290P3719j5851o3823
$$ -42330 -2232 16071 -47500 -1293 -24646 -15081 2109 -16045 24245 97964 82113 18290
1080A8290k4759k3640j0780J8078J9027J368M4700p2671N0812j707J7020M6476
$$ 18290 -6469 -30109 -40889 -22811 -3784 -2416 42284 -30387 20425 18718 35738 82214
1068H2214p1693m2683m6166K7427M7500O17m7694K816Q2795P3069j5317n4031
$$ 82214 10521 -32162 -78328 -50901 -3401 -2784 -50478 -47662 35133 108202 92885 38854
1056C8854p8089o701O6504m5089o438N0153K1885l732r0350P7196m423l4307J492
$$ 38854 -39235 -45936 20568 -24521 -30959 19194 41079 37347 -53003 24193 19770 -14537 -13045
1043a3045o749P352o956J8509o3877O9894M5110m9850M2506M4585J09n2901m5740
$$ -13045 -19794 -12442 -19398 -889 -64766 5128 50238 388 42894 87479 87588 34687 -11053
1030a1053k2977M855K5786j5864K4292K9745K4579M4427o607n4206P540j1191
$$ -11053 -34030 -29175 -3389 -19253 5039 34784 59363 103790 97183 42977 50517 39326
1018C9326m3958K3234q739k3928L0645J1231q405J9909k1987l2602Q4715o2987
$$ 39326 -4632 18602 9863 -14065 16580 27811 19406 39315 17328 -15274 69441 6454
1006F454o6185L0042R610J6328k5327p045O5037L4027l2776J304J7462m7083n1528
$$ 6454 -59731 -29689 -20079 -3751 -29078 -36123 28914 62941 30165 31469 48931 1848 -49680
993d9680O6813L7350o0483m955j9714k5929O996N0868M8245L5021J9598m0244
$$ -49680 17133 54483 -6000 -10955 -30669 -56598 -49602 1266 49511 84532 104130 63886
981F3886q3575J387k3742M3264P349q29K9210k0214K2318J7481K8457p4629j5925
$$ 63886 -19689 -18302 -42044 1220 8569 7740 36950 16736 39054 56535 84992 10363 -5562
968e562K2440m3425l6573p1079L2613P8802N0310J5382J7627r622L0380n3264
$$ -5562 16878 -26547 -63120 -134199 -101586 -22784 27526 42908 60535 50913 81293 28029
956B8029r4329L40J396K2397k2130j2141M1053P8260l7245Q114k900r1876q709
$$ 28029 -66300 -65960 -64564 -42167 -64297 -76438 -35385 42875 5630 13744 10844 -81032 -89741
943h9741O1482N3374k8472o2657O691L9566M6991k4508j2494P5914j3497m1782
$$ -89741 -28259 25115 -3357 -66014 -59323 -19757 27234 2726 -9768 66146 52649 10867
931A0867r3535k165O2815K9319P6544L8475m6092k8766j3035k6310l1516P879
$$ 10867 -82668 -84833 -22018 7301 83845 122320 76228 47462 34427 8117 -23399 -15520
919a5520J3955N1903P8591p7999k2843o9036L3929L4732n9299K1286L1531o1540
$$ -15520 -1565 50338 128929 50930 28087 -40949 -7020 27712 -31587 -10301 21230 -40310
907d0310m61J9036M724p121J0274K3712L403Q329K3667Q1228o4978k2815n7490
$$ -40310 -40771 -21735 -17011 -24132 -13858 9854 13257 21586 45253 126481 61503 38688 -18802
894a8802n6684K6041J00985J730j16806R6578M2375K8539k4749J4051l0423m5064
$$ -18802 -75486 -49445 51540 53270 -63536 33042 75417 103956 79207 93258 62835 17771
882A7771r4342o508O7984M1344l7347J9209O0768o616n8364k7857m8554p2860
$$ 17771 -76571 -83079 -15095 26249 -11098 8111 68879 62263 3899 -23958 -72512 -145372
870a45372N2244P4902K0378l737Q821L0067K6183l6869M998l8424L4610M5441
$$ -145372 -93128 -18226 2152 -1585 7236 37303 63486 26617 31615 -6809 27801 73242
858G3242O390k4650o0990k6024N7801J6410n675K6675P3525O447n413r0051j776
$$ 73242 79632 54982 -6008 -32032 25769 42179 36504 63179 136704 143151 137738 47687 45911
845D5911m1412l6562R0927N8222r5549o238L6389M9421p7438q9016K3821M1995
$$ 45911 4499 -32063 58864 117086 21537 15299 51688 101109 23671 -65345 -41524 471
833D71k1991P2022K9259p6914p336m939K8234l5055K2520M8638m6600O304R415
$$ 471 -21520 50502 79761 2847 -4489 -9428 18806 -16249 6271 54909 8309 14613 24028
820B4028O235j1889J0782L7642j1985m4604k4570R1462j8180p504o3367r002O228
$$ 24028 30263 18374 29156 66798 54813 10209 -14361 77101 58921 51417 -11950 -20952 -14724
807a4724l8270J1378j4017M3880M7347L3959N5849r050q8265n3309M5166n5584
$$ -14724 -52994 -41616 -55633 -11753 35594 69553 125402 116352 28087 -25222 19944 -35640
795c5640m450Q1910O57j5317P0202K750R949n2839r0550m2742K5482j0906K7112
$$ -35640 -40090 41820 42477 27160 97362 100112 110061 57222 -33328 -76070 -50588 -61494 -34382
782c4382k0131k3009M1243J8701L9507l960J9780L6635m0706r2842N4797k236
$$ -34382 -54513 -77522 -36279 -17578 21929 17969 37749 74384 33678 -59164 -4367 -6603
770f603K8741L2340l1334n024K9119J2499l6018l3319l9116L7683k940M9305K2015
$$ -6603 22138 54478 23144 18120 47239 59738 23720 -9599 -48715 -11032 -13972 35333 57348
757E7348o7336N8897m1013j7771l6039L5077J9177M14q31k5148K7571p549L9434
$$ 57348 -9988 48909 7896 -9875 -45914 -10837 8340 8754 7923 -17225 10346 2797 42231
744D2231K4644Q361m5844O4274n7892k3438o324J2109n4250K0859J16626n0350
$$ 42231 66875 75236 29392 93666 35774 12336 6012 18121 -36129 -15270 101356 51006
732E1006r9801j3175K9370L6816J0310O985M6615m5232m4287J251p676K2124J1851
$$ 51006 -48795 -61970 -32600 4216 14526 21511 68126 22894 -21393 -20142 -27818 -5694 6157
719F157l1499k1637N0868O9357p8338K2438j1213n0675N7022o3639K9992J01243
$$ 6157 -25342 -46979 3889 73246 -5092 17346 6133 -44542 12480 -51159 -21167 80076
707H0076l8979q873l5462k4108O0142M4666Q262m8818q5116l2814K7146M6141
$$ 80076 41097 32224 -3238 -27346 32796 77462 85724 36906 -48210 -81024 -53878 -7737
695g737M7433l0899j779N1029l6435p8684k2448O9187j6583m5918J28945M2884
$$ -7737 39696 8797 7018 58047 21612 -57072 -79520 -10333 -26916 -72834 56111 98995
683I8995k7246j51n5701m845M0978o6214m5726K7097M8886J0710r5888j2957J02193
$$ 98995 71749 71598 15897 11052 52030 -14184 -59910 -32813 16073 26783 -69105 -82062 20131
670B0131K469m1323N8083L9443o7604k7659k7705J1782l743m1106N3536m1572
$$ 20131 22600 -18723 39360 78803 11199 -16460 -44165 -32383 -36126 -77232 -23696 -65268
658f5268L5390n000k4346M528J4782J9195O4220j3014M1406o4689m597p988K0468
$$ -65268 -29878 -34878 -59224 -54696 -39914 -20719 43501 30487 71893 7204 2607 -5381 15087
645A5087r95J5558p196l7919N468J1257K7087N8343P041o2248j6501k2183J1279
$$ 15087 14092 29650 22454 -15465 -9997 1260 28347 86690 93731 31483 14982 -7201 4078
632D078k0063K7003J09943o3224j04424Q2055K2480k3395P41l9767o067M6504
$$ 4078 -15985 11018 120961 57737 -46687 35368 57848 34453 35194 -4573 -10640 35864
620C5864J6230m8886M6371K988o2732L289J7961M0062p1033k6161J00057J2371
$$ 35864 52094 3208 49579 52567 -10165 -6876 11085 51147 -19886 -46047 54010 66381
608F6381p4172K4836j6213N1873n0574l0266L1680M4254r2659M737O1375m1628
$$ 66381 -7791 17045 832 52705 2131 -28135 3545 47799 -44860 -40123 21252 -20376
596b0376k6883O1513Q5091l2918M4562m9926k7161K0525l3084N5565j3379l1931
$$ -20376 -47259 14254 99345 66427 110989 61063 33902 54427 21343 76908 63529 31598
584C1598m6228M199L0430N5288L077p585k7734j9129m1379N2667n2074l2915o54
$$ 31598 -14630 -10431 19999 75287 78364 70779 43045 23916 -17463 35204 -16870 -49785 -50439
571e0439J09043n277o3970P2461L2284L7698m2995j073l9475j0944K7349L0904
$$ -50439 58604 53327 -10643 61818 94102 131800 88805 87732 48257 37313 64662 95566
559I5566J2283k9694n6951Q783m5012J3433K8804K8503o0964l7591k542K8449
$$ 95566 107849 78155 21204 29987 -15025 -1592 27212 55715 -5249 -42840 -45382 -16933
547a6933J9742k0812j8788J3090R0934J0428p7157j6087M380O4297N5969j25009
$$ -16933 2809 -18003 -36791 -23701 67233 77661 504 -15583 -11203 53094 109063 -15946
535a5946m3853P8558K3958p5615N2629N5884k5038l6250M8890Q278R385l3972
$$ -15946 -59799 18759 42717 -32898 19731 75615 50577 14327 63217 71495 80880 46908
523D6908K3845J4352o647n7411L0330j530m9478M88L056L1269R601J17830k1377
$$ 46908 70753 85105 78458 21047 51377 49847 369 857 3913 35182 44783 162613 141236
510A41236p2764p4475j8613J9524N564J0761Q6002j1475o6558j8989P0278m6186
$$ 141236 68472 -6003 -24616 -5092 472 11233 97235 85760 19202 213 70491 24305
498B4305M0783K1710l9883J183J2057J0344l7938L0195P5920M932o608n6598l1038
$$ 24305 65088 86798 46915 48098 60155 70499 32561 62756 138676 143608 137000 80402 49364
485D9364M4327K1926j6029R5440J9633l1475k6604j11234P632p326K3041L0965
$$ 49364 93691 115617 99588 195028 214661 183186 156582 45348 52980 45654 68695 99660
473I9660n2633j8066L2857l439R1172k0516p3831J9733K5249k5855k9121j2386
$$ 99660 47027 28961 61818 58379 149551 129035 55204 74937 100186 74331 45210 32824
461C2824m4975L7966J6797L487j618N3701K7074O950k2981P683L80K4436M1530
$$ 32824 -12151 25815 42612 46099 44481 98182 125256 132206 109225 116908 117288 141724 183254
448A83254q3206n859p824L189L5303M083k5981n5567K9798j4186n6343n8349R1777
$$ 183254 100048 94189 86365 89554 124857 128940 102959 47392 77190 63004 6661 -51688 40089
435D0089J7106l131l3450N6205M5355q2756P989k2527L4191L1921k6525N807p703
$$ 40089 57195 54064 20614 76819 122174 39418 47407 24880 59071 90992 64467 70274 62571
422F2571m6310j9874n317O3365K5286J5232M0079j09854m2978O6881K2424l2803
$$ 62571 16261 -3613 -8930 54435 79721 94953 135032 25178 -17800 49081 71505 38702
$$ [...]
##END NTUPLES=NMR SPECTRUM
##END=
