##TITLE=1H_DE-80H_X3
 200.13MHz, d2o
 8 sc
 
 19ns.26.2.2025
##JCAMPDX= 6.0         $$ Bruker NMR JCAMP-DX V2.0
##DATA TYPE= NMR SPECTRUM
##DATA CLASS= NTUPLES
##ORIGIN= UXNMR, Bruker Analytische Messtechnik GmbH
##OWNER= pz
$$ XWIN-NMR		Version 3.5
$$ Thu Jul 16 11:18:24 2026 Russian Standard Time (UT+4h)  Yarkov@DPX200
##.OBSERVE FREQUENCY= 200.1313
##.OBSERVE NUCLEUS= ^1H
##.ACQUISITION MODE= SIMULTANEOUS
##.ACQUISITION SCHEME= undefined
##.AVERAGES= 8
##.DIGITISER RES= 18
##SPECTROMETER/DATA SYSTEM= spect
##.PULSE SEQUENCE= zg30
##.SOLVENT NAME= DMSO
##.SHIFT REFERENCE= (INTERNAL, DMSO, 0, 15.4979)
##AUDIT TRAIL= $$ (NUMBER, WHEN, WHO, WHERE, WHAT)
$$ ##TITLE= Audit trail, XWIN-NMR		Version 3.5
$$ ##JCAMPDX= 5.01
$$ ##ORIGIN= Bruker BioSpin GmbH
$$ ##OWNER= Yarkov
$$ C:/Bruker/XWIN-NMR/data/yarkov2/nmr/H-C/1/pdata/1/auditp.txt
$$ ##AUDIT TRAIL=  $$ (NUMBER, WHEN, WHO, WHERE, WHAT)
(   1,<2026-07-16 11:17:31.06 +0400>,<Yarkov>,<DPX200>,
      <created by zg, POWCHK disabled, PULCHK disabled
       configuration hash MD5:
       00 E9 B6 7A A2 85 ED C7 34 08 36 98 17 FE 4E 26
       data hash MD5: 16K
       87 43 01 BC 06 BC 97 A7 9C A5 28 FB 0F C2 EE CA>)
(   2,<2026-07-16 11:17:37.26 +0400>,<Yarkov>,<DPX200>,
      <Start of raw data processing
       efp BC_mod = 2 LB = 0.25 FT_mod = 6 PKNL = 1 PHC0 = -7255.922 PHC1 = 7.421964 SI = 16K 
       data hash MD5: 16K
       55 2F 9D C4 F8 66 30 FF 90 8C B5 7F CE 13 20 89>)
(   3,<2026-07-16 11:17:47.82 +0400>,<Yarkov>,<DPX200>,
      <abs ABSG = 5 
       data hash MD5: 16K
       CE 4C 73 35 DE 0E 9A 2E 60 CA 55 7B 61 51 66 AC>)
$$ ##END=
$$ 
$$ hash MD5
$$ 41 55 4A 6E F5 B8 88 9E 47 F1 E5 0F D0 C8 FD 5B
##$RELAX= 
##$RELAX= 
##$RELAX= 
##$RELAX= 
##$RELAX= 
##$RELAX= 
$$ Bruker specific parameters
$$ --------------------------
##$DU= <C:/Bruker/XWIN-NMR>
##$EXPNO= 1
##$NAME= <H-C>
##$PROCNO= 1
##$TYPE= <nmr>
##$USER= <yarkov2>
##$AMP= (0..31)
100 100 100 100 100 100 100 100 100 100 100 100 100 100 100 100 100 100 
100 100 100 100 100 100 100 100 100 100 100 100 100 100 
##$AQSEQ= 0
##$AQ_mod= 1
##$AUNM= <au_zg>
##$AUTOPOS= <>
##$BF1= 200.13
##$BF2= 200.13
##$BF3= 200.13
##$BF4= 200.13
##$BF5= 200.13
##$BF6= 200.13
##$BF7= 200.13
##$BF8= 200.13
##$BYTORDA= 1
##$CFDGTYP= 0
##$CFRGTYP= 5
##$CHEMSTR= <none>
##$CNST= (0..31)
1 1 145 1 1 1 1 1 1 1 1 1 1 1 1 1 1 1 1 1 1 1 1 1 1 1 1 1 1 1 1 1 
##$CPDPRG= <>
##$CPDPRG1= <>
##$CPDPRG2= <>
##$CPDPRG3= <>
##$CPDPRG4= <mlev>
##$CPDPRG5= <mlev>
##$CPDPRG6= <mlev>
##$CPDPRG7= <mlev>
##$CPDPRG8= <mlev>
##$CPDPRGB= <>
##$CPDPRGT= <>
##$D= (0..31)
0 0.7 0 0 0 0 0 0 0 0 0 0.03 0 0 0 0 0 0 0 0 0 0 0 0 0 0 0 0 0 0 0 0 
##$DATE= 1784186250
##$DBL= (0..7)
120 120 120 120 120 120 120 120 
##$DBP= (0..7)
150 150 150 150 150 150 150 150 
##$DBP07= 0
##$DBPNAM0= <>
##$DBPNAM1= <>
##$DBPNAM2= <>
##$DBPNAM3= <>
##$DBPNAM4= <>
##$DBPNAM5= <>
##$DBPNAM6= <>
##$DBPNAM7= <>
##$DBPOAL= (0..7)
0.5 0.5 0.5 0.5 0.5 0.5 0.5 0.5 
##$DBPOFFS= (0..7)
0 0 0 0 0 0 0 0 
##$DE= 6
$$ [...]
##$SUBNAM3= <"">
##$SUBNAM4= <"">
##$SUBNAM5= <"">
##$SUBNAM6= <"">
##$SUBNAM7= <"">
##$SUBNAM8= <"">
##$SUBNAM9= <"">
##$SW= 18.0517328524113
##$SWIBOX= (0..15)
0 0 2 0 0 0 0 0 0 0 0 0 0 0 0 0 
##$SW_h= 3612.71676300578
##$TD= 16384
##$TD0= 1
##$TE= 0
##$TE2= 300
##$TE3= 300
##$TEG= 300
##$TL= (0..7)
0 120 120 120 120 120 120 120 
##$TP= (0..7)
150 150 150 150 150 150 150 150 
##$TP07= 0
##$TPNAME0= <>
##$TPNAME1= <>
##$TPNAME2= <>
##$TPNAME3= <>
##$TPNAME4= <>
##$TPNAME5= <>
##$TPNAME6= <>
##$TPNAME7= <>
##$TPOAL= (0..7)
0.5 0.5 0.5 0.5 0.5 0.5 0.5 0.5 
##$TPOFFS= (0..7)
0 0 0 0 0 0 0 0 
##$TUNHIN= 0
##$TUNHOUT= 0
##$TUNXOUT= 0
##$USERA1= <user>
##$USERA2= <user>
##$USERA3= <user>
##$USERA4= <user>
##$USERA5= <user>
##$V9= 5
##$VALIST= <valist>
##$VCLIST= <CCCCCCCCCCCCCCC>
##$VD= 0
##$VDLIST= <DDDDDDDDDDDDDDD>
##$VPLIST= <PPPPPPPPPPPPPPP>
##$VTLIST= <TTTTTTTTTTTTTTT>
##$WBST= 1024
##$WBSW= 4
##$XGAIN= (0..3)
0 0 0 0 
##$XL= 0
##$YL= 0
##$YMAX_a= 347022
##$YMIN_a= -342184
##$ZGOPTNS= <>
##$ZL1= 120
##$ZL2= 120
##$ZL3= 120
##$ZL4= 120
##$ABSF1= 15.4979
##$ABSF2= -2.553949
##$ABSG= 5
##$ABSL= 3
##$ALPHA= 0
##$AQORDER= 0
##$ASSFAC= 0
##$ASSFACI= 0
##$ASSFACX= 0
##$ASSWID= 0
##$AUNMP= <proc_1d>
##$AZFE= 0.1
##$AZFW= 0.1
##$BCFW= 0
##$BC_mod= 2
##$BYTORDP= 0
##$COROFFS= 0
##$CY= -3
##$DATMOD= 1
##$DC= 0
##$DFILT= <>
##$DTYPP= 0
##$F1P= 0
##$F2P= 0
##$FCOR= 1
##$FTSIZE= 16384
##$FT_mod= 6
##$GAMMA= 0
##$GB= 0
##$INTBC= 1
##$INTSCL= 3.241238e-09
##$ISEN= 128
##$LB= 0.25
##$LEV0= 0
##$LPBIN= 0
##$MAXI= 10000
##$MC2= 0
##$MEAN= 0
##$ME_mod= 0
##$MI= 1.114404
##$NCOEF= 0
##$NC_proc= -6
##$NLEV= 6
##$NOISF1= 3.799351
##$NOISF2= 2.8
##$NSP= 0
##$NTH_PI= 0
##$NZP= 0
##$OFFSET= 15.4979
##$PC= 1
##$PHC0= -7255.922
##$PHC1= 7.421964
##$PH_mod= 1
##$PKNL= yes
##$PPARMOD= 0
##$PSCAL= 0
##$PSIGN= 0
##$REVERSE= no
##$SF= 200.130004762771
##$SI= 16384
##$SIGF1= 3
##$SIGF2= 2
##$SINO= 0.751879
##$SIOLD= 32768
##$SREGLST= <19F.Aceton>
##$SSB= 0
##$STSI= 16384
##$STSR= 0
##$SW_p= 3612.71676300578
##$SYMM= 0
##$S_DEV= 0
##$TDeff= 16384
##$TDoff= 0
##$TI= <>
##$TILT= no
##$TM1= 0
##$TM2= 0
##$TOPLEV= 0
##$USERP1= <user>
##$USERP2= <user>
##$USERP3= <user>
##$USERP4= <user>
##$USERP5= <user>
##$WDW= 1
##$XDIM= 16384
##$YMAX_p= 429273739
##$YMIN_p= -334488
$$ End of Bruker specific parameters
$$ ---------------------------------
##NTUPLES= NMR SPECTRUM
##VAR_NAME=  FREQUENCY,     SPECTRUM/REAL,   SPECTRUM/IMAG
##SYMBOL=    X,             R,               I
##VAR_TYPE=  INDEPENDENT,   DEPENDENT,       DEPENDENT
##VAR_FORM=  AFFN,          ASDF,            ASDF
##VAR_DIM=   16384,         16384,           16384
##UNITS=     HZ,            ARBITRARY UNITS, ARBITRARY UNITS
##FACTOR=    0.220516191357247, 1,           1
##FIRST=     3101.59480264519, 0,            0
##LAST=      -511.121960360587, 0,           0
##MIN=       -511.121960360587, -334488,     0
##MAX=       3101.59480264519, 429273739,    0
$$ Real data points
##PAGE= N=1
##DATA TABLE= (X++(R..R)), XYDATA
$$ [...]
6815I2936q0169m5997k8286q879K4094O5916L19k362L01M5617K315L9302m5231
6802E9876j13467M2139j0217P454K2992M804l353k6931r141K3374n2768j6867
6790g2105M5002R7799M2848n6225o765q433n7717K9914L4228K686j7438K8598
6778F2392J7360J3320l8871n1280O3920K3974l4161l279j0647R6542o7515n3479
6766A8276O4517k5924q6107l8349P5503k695k86L1328p261K9026j0044n2908K5121
6753B0197L9835j0052M3194N94j7182P4063l8104n1448J2709n838P716L338q7038
6740h016J8413O6228L0975m6712n6176L6849o8110N7627L9114j58p407N433j4432
6727E3628m9469L1530q5882l4474O4039l5241L0230N271P4049L6297m4077p1856
$$ y = [92936, 12767, -33230, -61516, -70395, -46301, 19615, 19934, 17572, 17873, 63490, 65805, 105107, 59876, -53591, -11452, -21669, -14215, 8777, 13581, 10228, -16703, -25844, -2470, -55238, -72105, -27103, 70696, 113544, 57319, 50554, 42121, -15596, 14318, 48546, 51232, 33794, 62392, 79752, 93072, 54201, 2921, 66841, 90815, 56654, 53375, 42728, 139270, 71755, 18276, 82793, 56869, -29238, -67587, 7916, 5221, 4935, 36263, 29002, 58028, 47984, -4924, 20197, 60032, 49980, 93174, 93768, 76586, 150649, 112545, 61097, 73806, 67968, 75684, 79022, -8016, 10397, 76625, 107600, 60888, 4712, 41561, -26549, 31078, 70192, 70034, 62627, 68060, 53628, 4159, 35689, -50193, -84667, -20628, -55869, -25639, -20368, 53681, 89978, 45901, -25955]
6715b5955L0958J093N361K8753Q1314K0357o7581n3744l0710P9011m4333m6444
6703b1920N5772N4152m053j07481n402j7482r5021L7205L4995J08764K8524O7184
6691A35237l5010o6857l1645m4100R1390r1540o9295N0644R698P2462o0195M0923
6679A712o3686n4079L3308M4647M2581J13501l6514L1514l9902r4596n8800m5082
6667a25396L9288N1898Q9670n4641M1797L2707j46662n5225k2372l2319J20453
6656f0802J51918J24790r8667n3406j6621k5454m7813j22330N2635J04563L767
6645A2580M26J8879k408l514o3912L6097R506n4123L8981P1396M008r268l492
6632E5156m6338N838l9304k4438J06916N9375P2839p3864p1197j4669k4397l6190
$$ y = [-25955, 5003, 6096, 11457, 40210, 121524, 141881, 74300, 20556, -10154, 68857, 24524, -21920, 33852, 88004, 83951, -23530, -28932, -46414, -141435, -104230, -69235, 39529, 68053, 135237, 100227, 33370, 1725, -42375, 49015, -42525, -111820, -61176, -51478, 20984, -39211, 1712, -61974, -116053, -82745, -38098, 4483, 117984, 81470, 112984, 73082, -21514, -80314, -125396, -86108, -34210, 55460, 819, 42616, 75323, -71339, -126564, -148936, -181255, -60802, 91116, 215906, 117239, 63833, 47212, 21758, -26055, -148385, -95750, 8813, 12580, 13006, 31885, 29477, 25963, -37949, -1852, 7654, -46469, -7488, 63908, 67916, 58648, 55156, 8818, 14656, -24648, -49086, 57830, 117205, 190044, 116180, 44983, 30314, 5917, -30273]
6620c0273N2794R8490J889R2379J0000q2290j14901o9671k34O2450q9814N5757
6608a3424P7070K3856O0050k7448l3205k2796o2591L3384K6906L7948L0162n9044
6596G0868J4192n4907j6113K8436L1092L225l3628K0874P02N239l009j0761k6004
6583C0206J1438j2037K7198L0032j5926o1927K3397k7856j7691j0057m3408O4310
6571b321M8352L4206P7123L5051j03993j19520r016k0850L9093l5401O1271J50967
6559A54962n5336j05459n0795J1095l7640K2202M0694R5813L7176m1829M3808
6548A14691n9405l3196l4495p2420P2937O5835K4863M7293M5119j39191q0760
6537d8729n1566k8258J17246l539M764Q8131J5673j0397m0949N8324l5513m8136
$$ y = [-30273, 22521, 121011, 122900, 215279, 225279, 142989, 28088, -41583, -41817, 20633, -69181, -13424, 63646, 87502, 147552, 120104, 86899, 64103, 1512, 34896, 61802, 99750, 129912, 70868, 85060, 30153, 14040, 42476, 73568, 76793, 43165, 64039, 64741, 69980, 66971, 56210, 30206, 41644, 29607, 56805, 86837, 70911, 8984, 32381, 4525, -13166, -23223, -66631, -2321, 46031, 80237, 157360, 192411, 88418, -31102, -40118, -60968, -21875, -57276, 3995, 154962, 99626, -5833, -56628, -45533, -83173, -60971, -20277, 75536, 112712, 70883, 114691, 55286, 22090, -12405, -84825, -11888, 53947, 78810, 126103, 171222, 32031, -48729, -100295, -128553, -11307, -14846, -10082, 78049, 93722, 83325, 42376, 100700, 65187, 17051]
6525A7051k1518M7532k858m3494K1406l789L9322j05738K5130K2381p864L5761
6513B3322K3759Q5490L0473r8773l8344K767j43668n129Q1761J30984M1315k0231
6501A13726o3628n5460q3105O045K0692j5834N4445O2709O0143J3093k9705o5443
6489A7678q4678k6744l0139P9785L7467L6834K7115p9030O478k3605P0436q0245
6477d8648k0466P4719Q0463O46l2742j8210k3478r974N6662R794l2338p2181J3636
6464b2117N018n56Q5075j4511l9147k0314k6269L0443P1118L2480j3525L8412
6452A26107m554r9417m6536r140R187Q0386o62l701O6392k3649l5952k8303O637
6439C6795o7920J23599N6030r0224p3754O241M5560l3876l5679p835J7699R5031
$$ y = [17051, -4467, 43065, 40207, -3287, 18119, 14330, 53652, -52086, -26956, -4575, -12439, 23322, 47081, 132571, 163044, 64271, 25927, 28694, -114974, -120103, -38342, 92642, 133957, 113726, 50098, -5362, -88467, -82422, -61730, -77564, -23119, 39590, 99733, 112826, 83121, 17678, -67000, -93744, -123883, -44098, -6631, 30203, 57318, -21712, -15234, -38839, 31597, -48648, -69114, 5605, 86068, 86714, 53972, 35762, 12284, 2310, 58972, 68766, 36428, -35753, -22117, -17099, -17655, 67420, 52909, 13762, -6552, -32821, -2378, 68740, 101220, 87695, 126107, 121553, 22136, -24400, -33540, -24353, 56033, 55371, 51670, 118062, 94413, 58461, 30158, 36795, -31125, 92474, 148504, 58280, -15474, -9233, 36327, 2451, -33228, -41063, -23364, 71667]
6427G1667O9450r9091j4609L7386Q336L5868j0150j8817k0644J3136L0486j6923
6415H6095j6074o071N8580l2804j9726k6373j6836R0743k5600J4832j8103J8580
6403A07243K2748M007Q163n3163k674J08427N8986J18479K2660L7756J29548J02315
6391F64495J53685Q8261J09304j4382m3281p4089n8201j28411j34641r0241n4081
6380D18418j50567o9971M9537K2513o6527m1098L541j29163k8394k3193K0801
6369E897L1401O0187J01325k6824q2395l2684j2591J7979j0763L7295l5614K1440
6357G4653M5632m9411O4939k8779j09962o281M3444Q0854l3464J0485P5796l7606
6345A30300l729l2987p7878M4879l0437M9455Q4440P8927q9510o5392o0396o7876
$$ y = [71667, 141117, 42026, 27417, 64803, 73139, 109007, 98857, 80040, 59396, 72532, 103018, 86095, 70021, 63950, 122530, 89726, 70000, 43627, 26791, 117534, 91934, 106766, 88663, 107243, 129991, 133998, 142161, 88998, 86324, 194751, 253737, 372216, 394876, 432632, 562180, 664495, 818180, 906441, 1015745, 1001363, 958082, 883993, 825792, 697381, 562740, 472499, 418418, 267851, 197880, 247417, 269930, 203403, 162305, 165846, 36683, 8289, -14904, 5897, 37298, 97485, 198810, 171986, 89591, 56907, 44316, 62295, 51532, 88827, 53213, 74653, 120285, 70874, 135813, 107034, -2928, -9209, 34235, 115089, 81625, 92110, 167906, 130300, 126571, 93584, 15706, 60585, 30148, 79603, 164043, 242970, 153460, 88068, 27672, -40204]
6333d0204K9169O275O1349N9877J5980n1784J513m2356j19295m3017J25290j1306
6321h509O7384M8144N5213l3064o5779k5545k945J9002Q6247q1406L4592O6193
6309A59527r4410k3731m2198P4729o1102m9886Q8489R0269K1591l5039K2734r4961
6297E6012l1354j6738j361J11187L6992l2639O0520o9415n0821j2655K3131o218
6285F6641M5060N3603J7449M2109o3412p1222o7950p1910N243L1942J9769O8635
6273G5957r143q3455K4048J8693o3217K4826J04868Q5060K5953J4451p541l141
6261B07359n6199l1621L8181M786N3041N8412M4650q322m1037j0364q4033m1808
6249A33045p6106J05298M0989K2997J947j9940n0855r4203j03594J07288O1913
$$ y = [-40204, -11035, -4760, 56589, 116466, 132446, 80662, 82175, 39819, -79476, -122493, 2797, -8509, 58875, 107019, 162232, 129168, 63389, 37844, 34899, 53901, 140148, 58742, 93334, 159527, 65117, 41386, -812, 73917, 12815, -37071, 51418, 141687, 163278, 128239, 150973, 56012, 24658, 7920, 6559, 117746, 154738, 122099, 182619, 113204, 62383, 49728, 72859, 66641, 111701, 165304, 182753, 224862, 161450, 90228, 22278, -49632, -44389, -12447, 7322, 75957, 66814, -16641, 7407, 26100, -37117, -12291, 92577, 177637, 203590, 218041, 210500, 207359, 151160, 119539, 157720, 162506, 215547, 273959, 318609, 310287, 269250, 258886, 174853, 133045, 56939, 162237, 203226, 226223, 228170, 208230, 157375, 63172, -40422, 66866, 128779]
6238A28779M9687L8704O4270m4090r1121k5035K0867o824K0728Q9919J40531J7516
6226D03931K2140K2583q7851L6229o0734j4755M7967J07657O6436L549j15813
6215D31339q3089j3110j27889l4934P4278J0840M6887j9854k415K1495j14590
6204A88958q3014r966O349O8188O0844R6818N0856n9666p0235k615P1155j673
6192C15999J63799J21948J4121j8394J6910n0075q7983j20556J0525P419p1736
6181C01977N7480J855p973m8445j4669R793Q9284m7843J8323J13719k0370l4902
6169D18229M523p1539k5525k2652M4350K5735R7337J9951K015q6168j38807j3294
6157B54155M9363K59j2391j5127O137L8176j490m0436o2989m0696p507k0467J06538
$$ y = [128779, 178466, 217170, 281440, 237350, 146229, 121194, 142061, 135237, 155965, 245884, 386415, 403931, 426071, 448654, 360803, 397032, 336298, 321543, 369510, 477167, 543603, 547152, 431339, 348250, 335140, 207251, 172317, 246595, 257435, 304322, 284468, 282053, 303548, 188958, 105944, 95978, 102327, 170515, 231359, 328177, 379033, 319367, 249132, 246517, 317672, 315999, 479798, 601746, 615867, 597473, 614383, 564308, 476325, 355769, 366294, 373713, 301977, 359457, 361312, 353339, 304894, 290225, 300018, 389302, 341459, 359782, 473501, 453131, 418229, 422752, 351213, 325688, 303036, 347386, 373121, 470458, 490409, 492424, 406256, 267449, 254155, 303518, 303777, 291386, 276259, 282396, 320572, 319082, 278646, 215657, 174961, 167454, 146987, 253525]
6144B53525r927L879m1063o1816M8811p0865Q8193L6839j0160K3699l1188O8813
6132B98740l6885j02361j01522J06913N9873n7970J04621K3166k7771q9941r2296
6121H4567J0702N5554K5421J9376J4880M4831l7509q6745o2274J1217J07370M5325
6109B32715N679M867o1874l8125o332L7252j2213Q6339o695L781O1458o6843j0311
6096B29698m0973p8500O0961o934n5731P2767L9406K5196J0801n1367l8020N3169
6084B20473Q6936q571M4179N0954J5329j02576l6778n8458n0499n410R8111Q4780
6072C38470K9641k8945R007j02461k9578p1694k5233N3886Q0974J14857k9460
6061C39464K0064l3535q0152j24565J5705R4259l4900J8817J03715l8721k7935
$$ y = [253525, 243598, 247477, 206414, 144598, 193409, 122544, 210737, 247576, 237416, 261115, 229927, 298740, 261855, 159494, 57972, 164885, 224758, 166788, 271409, 294575, 266804, 176863, 84567, 95269, 150823, 176244, 195620, 210500, 255331, 217822, 131077, 68803, 80020, 187390, 232715, 238394, 243261, 181387, 143262, 136930, 174182, 161969, 248308, 241613, 245394, 306852, 240009, 229698, 188725, 110225, 171186, 164252, 108521, 181288, 220694, 245890, 256691, 205324, 167304, 220473, 307409, 298838, 343017, 393971, 409300, 306724, 269946, 211488, 160989, 155579, 253690, 338470, 368111, 339166, 348173, 245712, 216134, 144440, 119207, 173093, 254067, 368924, 339464, 359528, 325993, 245841, 121276, 136981, 231240, 196340, 215157, 318872, 280151, 252216]
6050B52216p5239K7369Q5316o9998N5588N7102k7175l5101m504l0233r5255M954
6038A45040N3845P1312J9252J3604N030O4974q4731j10854o7679M7514Q5782O7340
6026C10429J6695O2389L9675j07090j23807Q2322r946j3749J17890J04456p6701
6015D02563q0108l6703L3958j28K464j3699K488M2491K21J9982L1349k1406r2020
6002B91452P7613K007r561r16R7084J22163m0632m2985J1611k354K3723r908r063
5989E10234K6370P3349K8735m8345R124N1993M2885J28268J25983J17319J44717
5978A210632K65969L47392N58801Q09210Q72851O81601K71043k2856j34378l62508
5968D497757m43754l29516p5282J74328L98522O07357M47628K7591j82257l09322
$$ y = [252216, 176977, 204346, 289662, 219664, 275252, 332354, 305179, 270078, 265574, 235341, 140086, 145040, 198885, 270197, 289449, 303053, 308083, 373057, 288326, 177472, 109793, 157307, 243089, 310429, 327124, 389513, 429188, 322098, 198291, 280613, 270667, 256918, 374808, 479264, 402563, 322455, 285752, 319710, 319582, 322046, 308347, 310835, 353326, 353547, 373529, 404878, 383472, 291452, 369065, 371072, 361511, 360595, 457679, 579842, 539210, 496225, 507836, 505482, 529205, 519297, 510234, 536604, 609953, 638688, 590343, 599467, 651460, 694345, 822613, 948596, 1065915, 1210632, 1476601, 1823993, 2382794, 3192004, 4064855, 4746456, 5017499, 4994643, 4860265, 4497757, 4054003, 3724487, 3649205, 3823533, 4222055, 4829412, 5277040, 5304631, 5122374, 4813052]
5958D813052n19570n80631n12933n15259l96585l10460k97303j72799j97550j46043
5948A163919j15690o9098k0561k2654k064q1618j0915j0687j8717J3017n858l2217
5936G86857j06563q6221O5158M6397m9025m2504j3218J0012o9049m0673k0696
5925D80475p3053j331J47R4905o048k0931O443r5178N1525N6570m2110l999n4281
5912C93134k9261J11119P9310q0325j1451L2755m1318L8490l5012O261L6319M226
5900E04247J7701K8381n8467n7514n4276J3015j2753N0549L0549N0030N2623m8538
5888E15547k5213q0010q1902m19K4792O9968K2605k6291O106l4010R29l3194L4306
5875C93214N4942j9229P5550J2826K2927k3175j051k6333n6103Q8258L7035N9733
$$ y = [4813052, 4293482, 3712851, 3199918, 2684659, 2288074, 1977614, 1680311, 1507512, 1309962, 1163919, 1048229, 979131, 958570, 935916, 933852, 852234, 841319, 830632, 811915, 824932, 819074, 786857, 680294, 594073, 659231, 705628, 656603, 614099, 600881, 610893, 541844, 501171, 480475, 407422, 406091, 406238, 501143, 495095, 474164, 480607, 385429, 436954, 493524, 451414, 447415, 393134, 363873, 474992, 554302, 473977, 462526, 495281, 453963, 492453, 457441, 463702, 500021, 504247, 521948, 550329, 491862, 434348, 380072, 393087, 380334, 430883, 461432, 511462, 564085, 515547, 490334, 410324, 328422, 328003, 352795, 422763, 445368, 419077, 425183, 391173, 392102, 358908, 393214, 448156, 428927, 504477, 517303, 540230, 517055, 516004, 489671, 433568, 521826, 558861, 618594]
5863F18594M023o349k3943p8217M5902J0309J8710k9546M0013J56289q6249m5723
5851F23813j0505K3573N5207p2099J0269R9546j6256N7129J4109j4209p4662L966
5839F99881M3365j7990j8585K9103j6557K6108L6501P6984L9822J089Q2248J8901
5827A000870J64847j695l6142m7217l1267o2252r1373M4571N232L4519M552l2828
5815I51817K6802m282M8289j1329K0039M3826J16451O3661K7759P0504J19246
5804A472783J71818L12949L51546M52493N20349K44561L9190j36772j98652k04781
5794C025484l34390l37316k42976q1262n5646o1707o9676o1807O1198K982M4412
5783A889296N9215O2025J42981J89620J96646K02404L99694O84553R58505J207923
$$ y = [618594, 622617, 616268, 592325, 514108, 560010, 570319, 589029, 559483, 599496, 755785, 669536, 623813, 613308, 636881, 692088, 619989, 630258, 729804, 713548, 770677, 784786, 770577, 695915, 699881, 743246, 725256, 706671, 735774, 719217, 745325, 781826, 858810, 898632, 899721, 981969, 1000870, 1165717, 1164022, 1127880, 1080663, 1049396, 987144, 895771, 940342, 945574, 980093, 984645, 951817, 978619, 974337, 1022626, 1011297, 1031336, 1075162, 1191613, 1255274, 1283033, 1353537, 1472783, 1644601, 1957550, 2309096, 2761589, 3281938, 3526499, 3565689, 3428917, 3230265, 3025484, 2691094, 2353778, 2110802, 2029540, 1973894, 1912187, 1842511, 1780704, 1841902, 1844884, 1889296, 1948511, 2010536, 2153517, 2343137, 2539783, 2742187, 3141881, 3826434, 4784939, 5992862]
5773E992862J318624J025626M26797n5815k74740m42593o92764n98883m90158
5764F208956k92690k23832l1613K12606N13162J161149K311836L408089L506862
5755A6774525K585632P96288l38952r23506j810982k006653j540662q67218k42763
5746A2425709J09461L21697J79533l75606o29447j020059j244450j282912j263704
5737G220222j014757r67403p37626n57415l96219k50229j92029o6781j03311j42249
5727B792203o8866n3683N4379J84095J23691K29296M30384P86765J126082J216571
5717F820917R50195N17364j1031l63426o34792q40947p82487p92497p19784m98638
5707C644874m70361m57212k66903k20479o1844p7552j25062j10943k5043J3347
$$ y = [5992862, 7311486, 8337112, 8763909, 8708094, 8433354, 7990761, 7297997, 6699114, 6208956, 5916266, 5692434, 5660821, 5873427, 6386589, 7547738, 9859574, 13267663, 16774525, 19360157, 20156445, 19817493, 18893987, 17083005, 15076352, 13535690, 12668472, 12425709, 12535170, 12856867, 13036400, 12660794, 12031347, 11011288, 9766838, 8483926, 7220222, 6205465, 5238062, 4500436, 3943021, 3546802, 3296573, 3104544, 3037763, 2934452, 2792203, 2723337, 2669654, 2724033, 2908128, 3031819, 3261115, 3691499, 4478264, 5604346, 6820917, 7771112, 8288476, 8277445, 7914019, 7279227, 6438280, 5655793, 4863296, 4143512, 3644874, 3174513, 2717301, 2450398, 2229919, 2168075, 2090523, 1965461, 1854518, 1829475, 1842822]
5697A842822j4131N7578m2618R7898K76498L88252M80257M18483K89330J78540
5687C972909n6875k05071l59547l03175l45160l27098j79536l49887j52230j34314
5677A560016q5395j09011j07772l8311m3166k4777M664m5115J7976m9196n6015
5666A023898K6565R4481J16691J0765K1141N8820N0080k8236j19930k2131p0023
5655A162121k2921p265j12144J0134k5706q4747k3120k8785M2200N4731m00o8896
5643H95202k0526J08498O2686p4249r8105j9758J12824J8238j6708j01942Q937
5632H75097N2703n4135J4752J0082Q5441j5627j9722l1411l8146O718P126N611
5620H98489O0671L5539O6764n6210j2290K0120M1479M0003N0752N5876J11166
$$ y = [1842822, 1828691, 1886269, 1843651, 1941549, 2218047, 2606299, 3086556, 3505039, 3794369, 3972909, 3916034, 3710963, 3351416, 3048241, 2703081, 2375983, 2196447, 1846560, 1694330, 1560016, 1474621, 1365610, 1257838, 1219527, 1176361, 1151584, 1156248, 1111133, 1129109, 1079913, 1023898, 1050463, 1144944, 1261635, 1272400, 1293541, 1352361, 1402441, 1374205, 1254275, 1232144, 1162121, 1139200, 1131935, 1019791, 1029925, 1004219, 919472, 896352, 867567, 909767, 964498, 964098, 895202, 874676, 983174, 1045860, 971611, 873506, 853748, 966572, 984810, 968102, 866160, 875097, 927800, 873665, 888417, 898499, 983940, 968313, 948591, 917180, 879034, 885752, 892878, 898489, 959160, 994699, 1061463, 1005253, 992963, 1013083, 1054562, 1094565, 1145317, 1201193, 1312359]
5609A312359R9662M8561k0587J9350M931k2252n6656o4056l4628M4040J47791
5598A478515L2118J22198j7224k9171o2810j07415n5983M254k1145n2455j08633
5587A182249L770k1786L5082O4180j04473O1226Q1728Q9595k896k0633n7406L7766
5575A348402K1585M2504Q6770P2908O8075L9778k1967m3751K8329J7731J16338
5564A776702Q1441R1831J44541J1083J31028J00220J39198J52655L511K39219
5554B871429K01577K46760J95553K27655L15617M30943M66568M13768O81297R03435
5544F954602J111261J504855J787831K254561K590210K579234K251487J503405
5536B2537446P87991J50483k38307m82450l04215J56697O30487Q41140P33614
$$ y = [1312359, 1412021, 1460582, 1439995, 1459345, 1464276, 1442024, 1385368, 1321312, 1286684, 1330724, 1478515, 1510633, 1632831, 1615607, 1586436, 1523626, 1416211, 1360228, 1364482, 1343337, 1290882, 1182249, 1186019, 1164233, 1199315, 1263495, 1159022, 1220248, 1301976, 1391571, 1388675, 1368042, 1310636, 1348402, 1369987, 1412491, 1499261, 1572169, 1640244, 1680022, 1658055, 1614304, 1642633, 1660364, 1776702, 1858143, 1949974, 2094515, 2105598, 2236626, 2336846, 2476044, 2628699, 2632210, 2871429, 3073006, 3319766, 3515319, 3742974, 4058591, 4489534, 4956102, 5369870, 6051167, 6954602, 8065863, 9570718, 11358549, 13613110, 16203320, 18782554, 21034041, 22537446, 23325437, 23475920, 23237613, 22755163, 22450948, 22607645, 23238132, 24079272, 24812886]
5527B4812886L52139j54466q85483j550093j934735k168630k221130k193950j966602
5518A2089936j686314j467520j110705j043379p28641o65316n39850l50058l98232
5509D099921l22357k57624j38307k31983k10736j31202r2712o1136j1786j52633
5499B489445j01971q6007m5321o7662l6389j0769o5490k9010j7876k1531l7565
5488A969854O84l9162j05437p9688L2848Q0862o7182p4936M767p58k8138n5467
5476A638247j0130J9426p0609J9237J0524p7004N6455k6907N5804Q42p3062L0137
5464A572960J3290Q948p8754l9571J4815j0928o3681P1905o535l3673K4240M7028
5452A520044R4825j8559k7967o2807k4356M4724J4532m8978n1509K7782j2131
$$ y = [24812886, 25165025, 25010559, 24125076, 22574983, 20640248, 18471618, 16250488, 14056538, 12089936, 10403622, 8936102, 7825397, 6782018, 6053377, 5388061, 4848211, 4498153, 4099921, 3777564, 3519940, 3381633, 3149650, 2938914, 2807712, 2715000, 2653864, 2642078, 2489445, 2387474, 2301467, 2256146, 2188484, 2152095, 2141326, 2075836, 2046826, 2028950, 2007419, 1969854, 1970538, 1931376, 1825939, 1746251, 1779099, 1859961, 1792779, 1717843, 1722610, 1721852, 1693714, 1638247, 1628117, 1647543, 1576934, 1596171, 1606695, 1529691, 1586146, 1559239, 1615043, 1615885, 1542823, 1572960, 1586250, 1595198, 1516444, 1476873, 1491688, 1480760, 1417079, 1488984, 1482449, 1448776, 1473016, 1520044, 1614869, 1596310, 1568343, 1505536, 1481180, 1525904, 1540436, 1491458, 1439949, 1467731, 1455600]
5441A455600o5098j09433o5871J51371J8678J2721Q4107K3479l160P9336n4419
5430A527311r5742Q8917o834l5860K7927L4552O9313K9651n4875n7414n4688J10481
5418A582739J46998j8496l4008P8516M4493L2416n0503o3998J12421J59015N6888
5407B046481M2699L4816J20718R4611J8072Q6885J92965L88707L16063M60752
5397C802769M75868M53376L27791R0033o8526j42239o7039j22370j25397K6781
5387D651047K51920K26759K46506O6059k322p6823k00800l26473l93741k85695
5377D156437l36554l31057k14420j89147j89390p0969o5682p1614P659j1157q7823
5366B596283m7448j06673R7218R1268L0069j1662j9898J85925k4349l4111J9184
$$ y = [1455600, 1390502, 1281069, 1215198, 1366569, 1385247, 1397968, 1482075, 1505554, 1502394, 1581730, 1527311, 1431569, 1520486, 1513652, 1477792, 1505719, 1540271, 1609584, 1639235, 1584360, 1526946, 1472258, 1582739, 1729737, 1711241, 1677233, 1755749, 1800242, 1832658, 1782155, 1718157, 1830578, 1989593, 2046481, 2089180, 2123996, 2244714, 2339325, 2357397, 2444282, 2637247, 3025954, 3342017, 3802769, 4278637, 4732013, 5059804, 5149837, 5081311, 4939072, 4872033, 4749663, 4624266, 4651047, 4902967, 5129726, 5376232, 5442291, 5439969, 5363146, 5162346, 4835873, 4442132, 4156437, 3819883, 3488826, 3274406, 3085259, 2895869, 2824900, 2759218, 2687604, 2695263, 2684106, 2596283, 2548835, 2442162, 2539380, 2630648, 2660717, 2649055, 2629157, 2815082, 2790733, 2756622, 2775806]
5355B775806K5840M1092R1337Q7294P0486J0961K7068N1207M6205L5210O3776
5344C326282J72790M7816J14898J49672M6079M4740q865R3520L6761J69110J80777
5333D373580J2603J77430J99796J8100L0891P0561R2326K46581J96089K34140
5323E652097L15691L75487M12422M41035L81733M63490N36529N24293M46233N13021
5313A0062031O69189Q50823J018205J282599J626406K055370K440992K901766
5305B2907381L734108N304942Q330014J2638974J5976235J5938564J1647065N130501
5297A01607784Q2384l611858o728346p342196n673983k342723K661350P855073
5289H6507485J0631636R004911L620880k129635n952755r492876j1853506j1785867
$$ y = [2775806, 2801646, 2842738, 2934075, 3021369, 3091855, 3102816, 3129884, 3181091, 3227296, 3262506, 3326282, 3499072, 3546888, 3661786, 3811458, 3857537, 3902277, 3893412, 3986932, 4023693, 4192803, 4373580, 4386183, 4563613, 4763409, 4781509, 4812400, 4882961, 4975287, 5221868, 5417957, 5652097, 5967788, 6343275, 6755697, 7196732, 7578465, 8041955, 8578484, 9102777, 9549010, 10062031, 10731220, 11582043, 12600248, 13882847, 15509253, 17564623, 20005615, 22907381, 26641489, 31946431, 40276445, 52915419, 68891654, 84830218, 96477283, 101607784, 101690168, 98078310, 91349964, 84007768, 78333785, 75991062, 78652412, 86507485, 97139121, 106144032, 109764912, 107635277, 101682522, 92189646, 80336140, 68550273]
5281F8550273j0643015r265638q118043o869271n380011m062550l047775k349039
5273A8814931j923541j761264j420103j173685r12116q12254p20818n11639m74611
5264I104900m32314m65904k54999k47809l19204l20306k67390k22216k14475l30954
5254F029329k73811k36843r6277p3613k34173j86327j23589q7175j22732j85774
5244D409015k20854k9925j03056o7238l3688n1065n4817l0601j22321j52593j04488
5233C438369K8788q1538j21469J1775j8033K929k6272p0215j02753K6766k8694
5222C059653q5979M6779K2069j8789q7973o5230l155K1008q7075r0820l2282n4074
5210B624132K6863M1658p8955j74495o6938P4731k3449o0721n37k514p1609n3337
$$ y = [68550273, 57907258, 48641620, 40523577, 33654306, 28274295, 24211745, 21163970, 18814931, 16891390, 15130126, 13710023, 12536338, 11624222, 10811968, 10091150, 9579511, 9104900, 8672586, 8206682, 7951683, 7703874, 7384670, 7064364, 6796974, 6574758, 6360283, 6029329, 5755518, 5518675, 5422398, 5348785, 5114612, 4928285, 4804696, 4717521, 4594789, 4409015, 4188161, 4158236, 4055180, 3987942, 3954254, 3903189, 3848372, 3817771, 3695450, 3542857, 3438369, 3467157, 3385619, 3264150, 3275925, 3257892, 3260821, 3234549, 3164334, 3061581, 3088347, 3059653, 2973674, 3020453, 3042522, 3023733, 2935760, 2870530, 2867375, 2888383, 2801308, 2710488, 2678206, 2624132, 2650995, 2692653, 2613698, 2439203, 2372265, 2446996, 2423547, 2362826, 2362289, 2359775, 2288166, 2234829]
5198B234829m9204k9925k1807p7868n4442J4169j9923R0453O5883m8391p4182
5187B029592o7503j4073q2061J4224M027L6322K5531R456n3137r117N472p6756
5175A821977n3192N5173K417K8725L3253m7522k8269L6781k6999j6021M1049L7046
5163A884418K6579J2369L145N2302J0035k3273j09560k4361P2829Q5768m890n2558
5151A932803j0912j7509k6256k0855r0432J4818Q9510L8520l0583l7180l7287
5140A804637k5119j389m7635j1285M07K0250j5315N9779J9462K1765J3356m2534
5128A796379r0385Q9886Q8925l2442K9928O6042j4907K2343o0478j5255l9581
5117A840455M4192P5168k2574O7199k754k2172n9714l6325L5292K730J15974j3325
$$ y = [2234829, 2185625, 2155700, 2133893, 2056025, 2001583, 2015752, 1995829, 2086282, 2152165, 2103774, 2029592, 1962089, 1948016, 1865955, 1880179, 1884206, 1920528, 1946059, 1955515, 1902378, 1893261, 1898733, 1821977, 1768785, 1823958, 1826375, 1855100, 1888353, 1840831, 1812562, 1849343, 1822344, 1806323, 1847372, 1884418, 1910997, 1923366, 1926511, 1978813, 1988848, 1965575, 1856015, 1831654, 1904483, 1990251, 1985361, 1932803, 1921891, 1904382, 1878126, 1857271, 1766839, 1781657, 1871167, 1909687, 1879104, 1841924, 1804637, 1779518, 1778129, 1730494, 1719209, 1719616, 1739866, 1724551, 1784330, 1803792, 1825557, 1838913, 1796379, 1705994, 1795880, 1884805, 1852363, 1882291, 1948333, 1933426, 1955769, 1895291, 1880036, 1840455, 1884647, 1959815, 1937241, 2004440, 2001686, 1979514, 1919800, 1883475, 1918767, 1921497, 2037471, 2024146]
5105B024146o9072J1465l66m2791j9568j9368L2043O9867M6915q255L2344N2997
5093B110357n7934j32519k740J13583J9167K3413n56j2432P0184j2279p7300j0291
5081B030653M8125J03340Q6764L3839l6046J6242M3020o0680n2405L4127J15917
5070B362896L1550J1661P5252Q3288p1821j05200p6136q5334J23151J08086N9022
5059B516415J2351L2840L0209Q4409j14497j76681J1024R9792J92J1022L4797
5048B541873o6686j8036m2464q4776J5279P2653O5178j7935J5983K4291r197o9451
5036B426712k1622o9737n104J28909O6664P0621J3992M3255l1251j45005p9824
5025B397610k5992J11354Q5606L1041R4460Q017j0999o1650k5659K9501n380R9295
$$ y = [2024146, 1955074, 1966539, 1966173, 1923382, 1903814, 1884446, 1916489, 1986356, 2033271, 2025016, 2057360, 2110357, 2052423, 1919904, 1917164, 2030747, 2049914, 2073327, 2072771, 2060339, 2130523, 2118244, 2040944, 2030653, 2078778, 2182118, 2268882, 2302721, 2266675, 2282917, 2325937, 2265257, 2212852, 2246979, 2362896, 2394446, 2406107, 2481359, 2564647, 2492826, 2387626, 2311490, 2226156, 2349307, 2457393, 2516415, 2528766, 2561606, 2591815, 2676224, 2561727, 2385046, 2396070, 2495862, 2496054, 2507076, 2541873, 2475187, 2457151, 2414687, 2329911, 2345190, 2417843, 2483021, 2465086, 2481069, 2505360, 2496163, 2426712, 2405090, 2335353, 2330249, 2459158, 2525822, 2596443, 2610435, 2653690, 2622439, 2477434, 2397610, 2371618, 2482972, 2568578, 2599619, 2694079, 2702096, 2691097, 2629447, 2603788, 2633289, 2627909, 2727204]
5013B727204l3569Q3584M2473P9438n2370j41403R802P4230J11541M3995L6621
5002B981546Q8318N1170q7046j59637l9445J60178J58530J40215J5151Q8554K03934
4991C601468O2410L3840J07381J70388J93336M1854L9051n7318k1119j32234j72926
4980C866131j16948j63409M5274L2826J29551R0957l3112l6603p9425o9210j10957
4969C555075Q7442L3824l1104l0423q468K2619m3754j54040N3219M5455K315O1612
4957C593772L7968m0895K464j7609n6072k6533Q8493J35738N9712l6865k4050
4946C716123L9232O7604j3046m4001N4099O9379L4734K6173m3612L0457J08100
4935D045242m3658m2493N178R8196M8511O0201o5782n7543Q1644Q1693O2265p3845
$$ y = [2727204, 2693635, 2777219, 2819692, 2899130, 2846760, 2705357, 2715159, 2789389, 2900930, 2944925, 2981546, 3069864, 3121034, 3033988, 2874351, 2834906, 2995084, 3153614, 3293829, 3308980, 3397534, 3601468, 3663878, 3697718, 3805099, 3975487, 4168823, 4210677, 4249728, 4192410, 4171291, 4039057, 3866131, 3749183, 3585774, 3631048, 3663874, 3793425, 3884382, 3851270, 3814667, 3735242, 3666032, 3555075, 3642517, 3676341, 3645237, 3614814, 3606346, 3628965, 3585211, 3431171, 3484390, 3529845, 3532160, 3593772, 3631740, 3590845, 3593309, 3575700, 3519628, 3493095, 3581588, 3717326, 3777038, 3740173, 3716123, 3755355, 3822959, 3809913, 3765912, 3820011, 3889390, 3924124, 3950297, 3906685, 3937142, 4045242, 4001584, 3959091, 3964269, 4062465, 4110976, 4171177, 4105395, 4047852, 4129496, 4211189, 4273454, 4199609]
4923D199609K3917Q8230O4365J6273J0387j221K3922j0723N3613m7219P4404J48115
4911D643672J8637l392l2400P079L6722R2930L5957P3568P1641o9132n2514Q8267
4899D911035N0074J41716O8570K965R4260J0510m6991J603M1416J12003k150j2334
4887E372677k1385J57518Q9659J1640n5712o726L5564O0098N3979N2762R1289
4876E841363J18844M734l269l3089p5374J12303J49569P1119L3865K7832Q7016
4865F334913M9445O9402J4757O7516J07689n5860P2884J06231J14495k205l6656
4854F842611J12479J58778L1690P9942J72511J95358J36326J65405R647j0015
4844G894732L8211L0770P8912J43874Q4991J8306M3131K0757k8409M7486J05707
$$ y = [4199609, 4223526, 4311756, 4376121, 4392394, 4402781, 4401560, 4425482, 4414759, 4468372, 4421153, 4495557, 4643672, 4662309, 4658917, 4626517, 4633596, 4670318, 4763248, 4799205, 4872773, 4944414, 4875282, 4822768, 4911035, 4961109, 5102825, 5171395, 5174360, 5268620, 5279130, 5232139, 5233742, 5275158, 5387161, 5385011, 5372677, 5351292, 5508810, 5598469, 5610109, 5554397, 5547671, 5583235, 5643333, 5697312, 5750074, 5841363, 5960207, 5964941, 5961672, 5928583, 5853209, 5965512, 6115081, 6186200, 6220065, 6247897, 6334913, 6384358, 6453760, 6468517, 6536033, 6643722, 6587862, 6660746, 6766977, 6881472, 6879267, 6842611, 6955090, 7113868, 7145558, 7225500, 7398011, 7593369, 7729695, 7895100, 7904747, 7894732, 7932943, 7963713, 8042625, 8186499, 8271490, 8289796, 8332927, 8353684, 8325275, 8372761, 8478468]
4833H478468Q7330K04457J62855K19062K38974J71581Q8389K52132L58526M34212
4823A0695986P34225J435240K176088K650750K421339J263719J19065l92188r74799
4814B0129425j574249j510547j338739j063792r68977q13020n93387m35264j99691
4805A1631759j68405n1621K3992l298l018J2720J09893J26879K06131J28851J6926
4794A2030809P1257J86759L7238n9677N3866K06698L91561L69764L01591J77724
4784A3767590P8062n9337j40711j34954j54084P5466K16557J70856K24725K39497
4774A4283667J63403j06021n1503q8315q9536o0177N874J18142J79421J23136
4764A4478091J22039R6222l3609j9437m6277p6369r6242j9600M9453J58359J28560
$$ y = [8478468, 8565798, 8770255, 8933110, 9152172, 9391146, 9562727, 9651116, 9903248, 10261774, 10695986, 11430211, 12865451, 15041539, 17692289, 20113628, 21377347, 21496412, 21104224, 20129425, 18555176, 17044629, 15705890, 14642098, 13673121, 12860101, 12266714, 11831450, 11631759, 11463354, 11411733, 11435725, 11432427, 11429409, 11442129, 11552022, 11678901, 11885032, 12013883, 12030809, 12102066, 12288825, 12326063, 12266386, 12320252, 12526950, 12918511, 13288275, 13589866, 13767590, 13845652, 13786315, 13645604, 13510650, 13356566, 13432032, 13648589, 13819445, 14044170, 14283667, 14447070, 14341049, 14289546, 14201231, 14111695, 14051518, 14057392, 14175534, 14354955, 14478091, 14600130, 14696352, 14662743, 14643306, 14597029, 14520660, 14424418, 14404818, 14454271, 14612630, 14741190]
4753A4741190J5382R92J1837m9527p7831k2852l3469J11337N1449o0339O0411
4742A4748580M9214j940l534M1076N0826J52355k421J03275P8550P9441O7786
4731A5363208N5666N8616O864N5313J53778K05043J66098O5256N9842J6225l8668
4720A6167241k676P7638J00241Q4689O5793J06287k9804L5407R450L4523J00127
4709A6748916M1829J22847P8417J06931J13485J9342k257j3976P0354N6021J64113
4698A7506022J40381M8906J29398J39382K964j2171J04085J60608J13855J04101
4688A8437531J29536j1785J2040N925j33197j14665O8228O892j2387r585j10322
4677A8268211j03518q0796q9222k9578j69857K3104L8931K1601k4609j494m3901
$$ y = [14741190, 14756572, 14757564, 14769401, 14719874, 14642043, 14619191, 14585722, 14697059, 14748508, 14688169, 14748580, 14797794, 14795854, 14792320, 14833396, 14884222, 15036577, 15034156, 15137431, 15215981, 15295422, 15363208, 15418874, 15477490, 15484354, 15539667, 15693445, 15898488, 16064586, 16129842, 16189684, 16205909, 16167241, 16164565, 16242203, 16342444, 16427133, 16492926, 16599213, 16569409, 16604816, 16614266, 16648789, 16748916, 16790745, 16913592, 16992009, 17098940, 17212425, 17231767, 17229510, 17215534, 17285888, 17341909, 17506022, 17646403, 17695309, 17824707, 17964089, 17967053, 17954882, 18058967, 18219575, 18333430, 18437531, 18567067, 18555282, 18567322, 18573247, 18440050, 18325385, 18393613, 18400505, 18388118, 18378533, 18268211, 18164693, 18083897, 17994675, 17965097, 17795240, 17818344, 17857275, 17878876, 17854267, 17852773, 17808872]
4666A7808872p0425r4703j511k3270j7256M3353p0987j3885m2756j24153K8086
4655A7421365p1490r1065n522q116l8932m576j1190n1707k5076j1256q7595j2862
4643A7001978J2645j8853m2338j2837n3822r4690n3677n397L3377M8846j3985
4632A6801247J07838J41841J66000K79256M40215O45296O47950M57074M2198j35507
4622A9593408k98427l36124l77296m91497m43823l65206j78891j76187j82196
4613A6743761R3717J43502J95024K41417L20908K65071K40918K31041J66493R5480
4603A8737332L17528N43620N58041M21188L17552K22023R4912P9132J51183L42232
4593B1784743N05751M16851L05597O9064j60978l79400m55743m03688k78579p525
$$ y = [17808872, 17738447, 17643744, 17642233, 17618963, 17601707, 17645060, 17574073, 17560188, 17517432, 17393279, 17421365, 17349875, 17258810, 17253288, 17245172, 17206240, 17201664, 17190474, 17138767, 17113691, 17102435, 17014840, 17001978, 17014623, 16995770, 16953432, 16940595, 16886773, 16792083, 16738406, 16733009, 16766386, 16815232, 16801247, 16909085, 17050926, 17216926, 17496182, 17936397, 18581693, 19229643, 19686717, 19728915, 19593408, 19294981, 18958857, 18581561, 18090064, 17646241, 17281035, 17102144, 16925957, 16743761, 16837478, 16980980, 17176004, 17417421, 17738329, 18003400, 18244318, 18475359, 18641852, 18737332, 19054860, 19598480, 20156521, 20577709, 20895261, 21117284, 21212196, 21291328, 21442511, 21784743, 22290494, 22707345, 23012942, 23082006, 22921028, 22541628, 22085885, 21682197, 21403618, 21396093]
4583B1396093m1925m10806m45873n86808n91509n44497m98133l30117l23798l04147
4573A7318480m21944m27241l94610l67740k69140k39568j80476Q193M9780K20102
4563A5295836L19618L47864M36094M54591M19318K42610K49492K83562L11468
4554A8360453L43882M52720O72711Q27472O60421L62121O8201j51356m97342o27414
4544B0471869n56620o02128m50739m66267l67522m45646l75128l64791n57393
4535A6285635n67938n89104n73978o12473n17656m60084l85270k40545j06073
4526A2232514j31699r9223n2105J1502l1441M0028J25863N3880K88069L28199
4516A2765587M31802N45837N93208Q19765J071301J889738L235569M143176M105789
$$ y = [21396093, 21354168, 20943362, 20497489, 19910681, 19319172, 18774675, 18276542, 17946425, 17622627, 17318480, 16896536, 16469295, 16074685, 15706945, 15437805, 15198237, 15017761, 15025954, 15075734, 15295836, 15615454, 15963318, 16399412, 16854003, 17273321, 17515931, 17765423, 18048985, 18360453, 18704335, 19157055, 19829766, 20657238, 21317659, 21679780, 21747981, 21596625, 21099283, 20471869, 19915249, 19313121, 18862382, 18396115, 18028593, 17582947, 17207819, 16843028, 16285635, 15717697, 15128593, 14554615, 13942142, 13424486, 12964402, 12579132, 12338587, 12232514, 12100815, 12001592, 11949487, 11960989, 11929548, 11969576, 12095439, 12149319, 12437388, 12765587, 13197389, 13743226, 14336434, 15156199, 16227500, 18117238, 21352807, 25495983, 29601772]
4507B9601772K844684J328148L47592m04514j245815j277445m85770R13901L445922
4498C5068475N811004O617890N324507J995172o31642j983398l973783m786965
4490D3441260m301752l387786j949763m07316P23265Q69504J26971r69886j582844
4481C2561653k349578l000745k864816k643582k373664k103076j736790j240633
4473A4248769q42135o71077m48520l62729l66864l31994k53142l20871k43386
4464A0408051m1437j42670o0949p3122j04251o7448l0505l1102j08763j6948K1492
4453I752348j8254j13957j55166q1375j59061j17911j85481j43173j21584j60626
4443H495760j80893j60634j47533j40062j89605p0576k24269j20050j0600j59760
$$ y = [29601772, 32446456, 33774604, 34122196, 33717682, 32471867, 31194422, 30708652, 31622553, 35068475, 40879479, 47497369, 52821876, 54817048, 54185406, 52202008, 48228225, 43441260, 39139508, 35751722, 33801959, 33394643, 34117908, 34987412, 35114383, 34144497, 32561653, 30212075, 27211330, 24346514, 21702932, 19329268, 17226192, 15489402, 14248769, 13406634, 12735557, 12287037, 11924308, 11557444, 11225450, 10972308, 10651437, 10408051, 10366614, 10223944, 10162995, 10089873, 9985622, 9918174, 9887669, 9856567, 9747804, 9730856, 9752348, 9734094, 9620137, 9464971, 9383596, 9224535, 9106624, 8921143, 8777970, 8656386, 8495760, 8314867, 8154233, 8006700, 7866638, 7677033, 7606457, 7382188, 7262138, 7251538, 7091778]
4433G091778j53662j53925p8689j40178j03004l2073j02495r1242p6958j24182
4423F035370n8971q8876j05387n7384o6286l7825p7285q065n6102j6774p5804
4412E386611j53145L5756m1587m6074L4917O7832o5011j45675n1039k6428o319
4401D989838L99L0169P4227M3810M6227n1207q9324n8620o6663o285n108n9611
4389D847852O543r9246M4118K6609m0378p8173o9911P2579j0026K9571k9550m8723
4377D651265N5450o9664l5217K9907j6997J5001J39419K8164l1010j13374l4937
4366D618007n7347o5137K970J2512P5766L8897j7792o7289N1589J6639o2733J3017
4354D559099q391J15713M3594M2218M0408q7744m0949J3689J1571m3438L4485
$$ y = [7091778, 6938116, 6784191, 6705502, 6565324, 6462320, 6430247, 6327752, 6236510, 6159552, 6035370, 5976399, 5887523, 5782136, 5724752, 5658466, 5620641, 5543356, 5535291, 5479189, 5462415, 5386611, 5233466, 5269222, 5227635, 5181561, 5216478, 5284310, 5219299, 5073624, 5022585, 4996157, 4989838, 4990237, 5020406, 5094633, 5138443, 5184670, 5133463, 5044139, 4985519, 4918856, 4912571, 4907463, 4847852, 4854395, 4755149, 4799267, 4825876, 4785498, 4707325, 4637414, 4709993, 4699967, 4729538, 4699988, 4651265, 4706715, 4637051, 4601834, 4631741, 4614744, 4629745, 4769164, 4797328, 4766318, 4652944, 4618007, 4560660, 4495523, 4498493, 4511005, 4586771, 4625668, 4607876, 4540587, 4592176, 4608815, 4546082, 4559099, 4550708, 4666421, 4710015, 4752233, 4792641, 4704897, 4663948, 4677637, 4689208, 4645770, 4680255]
4343D680255J23822Q0483k8554j7839n8868M6442n1180j3284K7579M3751Q0809
4332D913416o6822n1900K6937P353r2515j6419J59856L959R1073M4278r737N5991
4320E065470n3253p3671m8389L0643O8412L5419n0062m5740O0043O5534M768L02
4308E059476l5626O9684Q7881N0973O1133j7537J4286K4676L7897K5829J4405
4297E393077J06331J07232P1884m4285n9109O7344K9587j121P5436P8781K8928
4286E854085O0683J2634l1857M0997L6555M3927P2160Q8221P1208R1252L4131
4275F373996J6710l8010J5934N7631L8456J12633o527M2750J07066K2375M6115
4264F789129M125M2001K1474L4693Q0015M4941K5510J3349J00460L7325P538q3141
$$ y = [4680255, 4804077, 4884560, 4856006, 4838167, 4779299, 4825741, 4774561, 4761277, 4788856, 4832607, 4913416, 4846594, 4794694, 4821631, 4828984, 4736469, 4720050, 4879906, 4883865, 4974938, 5019216, 5009479, 5065470, 5012217, 4938546, 4890157, 4920800, 4989212, 5024631, 4974569, 4928829, 4988872, 5054406, 5059174, 5059476, 5023850, 5093534, 5181415, 5232388, 5293521, 5275984, 5290270, 5314946, 5352843, 5378672, 5393077, 5499408, 5606640, 5678524, 5634239, 5575130, 5642474, 5672061, 5670940, 5746376, 5825157, 5854085, 5914768, 5927402, 5895545, 5936542, 5973097, 6017024, 6089184, 6177405, 6248613, 6339865, 6373996, 6390706, 6352696, 6368630, 6426261, 6464717, 6577350, 6570823, 6613573, 6720639, 6743014, 6789129, 6793254, 6835255, 6856729, 6891422, 6971437, 7016378, 7041888, 7055237, 7155697, 7193022, 7200560, 7117419]
4252G117419j8998J39867P9706M9450M5899l4144J33943L1507L5252O5141O1175
4241G706217J64836R5738O1637O6741Q9109J86549J69445O1679J13649J29992
4231H845592K33315K09268J84698J83168J99047K70935K18890K28510L40580L97585
4221A1311588L97782M45027L97104L99903M98167N16929N17109O87293O45928
4212A5816830P93892Q12403P78873R08134R31650Q89743J003684J114613J293684
4203B4343506J301439J308025J436389J516820J623215J576628J741150J718963
4195C6566135J911241J999334K049163K016144K061663K164354K286128K188366
4187E3242528K336511K382571K515578K630782K692951K744241K732553K672286
$$ y = [7117419, 7098421, 7238288, 7317994, 7367444, 7413343, 7379199, 7513142, 7544649, 7579901, 7645042, 7706217, 7871053, 7966791, 8028428, 8095169, 8184278, 8370827, 8540272, 8601951, 8715600, 8845592, 9078907, 9288175, 9472873, 9656041, 9855088, 10126023, 10344913, 10573423, 10914003, 11311588, 11709370, 12154397, 12551501, 12951404, 13449571, 13966500, 14483609, 15170902, 15816830, 16610722, 17423125, 18201998, 19110132, 20041782, 20931525, 21935209, 23049822, 24343506, 25644945, 26952970, 28389359, 29906179, 31529394, 33106022, 34847172, 36566135, 38477376, 40476710, 42525873, 44542017, 46603680, 48768034, 51054162, 53242528, 55579039, 57961610, 60477188, 63107970, 65800921, 68545162, 71277715, 73950001]
4179G3950001K437579K407008K268004K201334K103082J941291K051443J930033
4171I1289775J836262J786409J775739J907779J732987J559434J325215R24255
4163A04137855P64847M37132R2172k53409l23454l55812n25672m50130n30384
4154A02993145o39509p71286j024487j160366j361369j597189j734609k024428
4146I2679902k221923k340391k404426k458925k521686k461276k498346k490642
4138G3282287k336526k295576k270255k366623k392950k478685k507836k400375
4130E4233461k491394k488047k395663k356338k188116k115616j970223j966555
4122C6261509j854343j726804j571030j569430j412759j433486j336369j267627
$$ y = [73950001, 76387580, 78794588, 81062592, 83263926, 85367008, 87308299, 89359742, 91289775, 93126037, 94912446, 96688185, 98595964, 100328951, 101888385, 103213600, 104137855, 104902702, 105339834, 105432006, 105178597, 104855143, 104499331, 103973659, 103523529, 102993145, 102353636, 101582350, 100557863, 99397497, 98036128, 96438939, 94704330, 92679902, 90457979, 88117588, 85713162, 83254237, 80732551, 78271275, 75772929, 73282287, 70945761, 68650185, 66379930, 64013307, 61620357, 59141672, 56633836, 54233461, 51742067, 49254020, 46858357, 44502019, 42313903, 40198287, 38228064, 36261509, 34407166, 32680362, 31109332, 29539902, 28127143, 26693657, 25357288, 24089661]
4114B4089661j361484j232695j104078j090049r70679q52769p95290q08184p27834
4105A5146599o21987n71767n13039m69812n10813m60948l90508l01478k57808
4096A1048439k88881k52298k30553j15780r7731j12037m4841m1322J21264J59323
4086A0145583J27052J79123K20054K67165J91980J94831L5838M182P1459q4611
4076A1352656j54971r4451o8865p4226j38521L5853L5872o1691n9409j08337j93980
4065A0469930j69281k41644k57455k62667j83001k72647k83639k01190j85924
4056H412482j50572k08880k3255J5421k6789p7295p7994k090o6709k052J0115
4045G802382r2630K6829J602K9918L0282j23070q3237j40900R452J4032N2492
$$ y = [24089661, 22728177, 21495482, 20391404, 19301355, 18330676, 17477907, 16682617, 15874433, 15146599, 14524612, 13952845, 13439806, 12969994, 12459181, 11998233, 11607725, 11306247, 11048439, 10759558, 10507260, 10276707, 10160927, 10063196, 9951159, 9906318, 9864996, 9986260, 10145583, 10272635, 10451758, 10671812, 10938977, 11130957, 11325788, 11361626, 11365808, 11437267, 11352656, 11197685, 11103234, 11034369, 10960143, 10821622, 10857475, 10893347, 10831656, 10772247, 10663910, 10469930, 10300649, 10059005, 9801550, 9538883, 9355882, 9083235, 8799596, 8598406, 8412482, 8261910, 8053030, 8029775, 8045196, 8018407, 7941112, 7863118, 7861028, 7794319, 7792267, 7802382, 7709752, 7736581, 7738183, 7768101, 7798383, 7675313, 7592076, 7451176, 7460628, 7474660, 7527152]
4034G527152M8766k2892j4494n3947j5368Q7643l5668r5063n069L9538L0994N0113
4022G541705J04304l0082j3391L9525q8574q0953k4745j8411l7627j9396K9598
4011G401953l3390P2744l3019K9608L5254M0195P2910n412O3669P0662K2322P4267
3999G811763N4994l186k7843m693J06926o8036l9996k5168k252K4811k5279J03889
3987G905930P6381M8935M0890k3326J31563k6159M244L5433k8880o034k4534l9592
3975H094851j717L7334K8684k4373J34505R2232O7502J12483R5189J60794J09723
3964H907207R5382J70862Q8655K79685L12378K83887K24446J70651K88421K24187
3954A1045761J63811Q0737K79148K20856K21062K84762L05018L76366L74714M83369
$$ y = [7527152, 7575918, 7553026, 7538532, 7484585, 7469217, 7556860, 7521192, 7426129, 7421060, 7460598, 7491592, 7541705, 7646009, 7615927, 7602536, 7642061, 7553487, 7472534, 7447789, 7429378, 7391751, 7372355, 7401953, 7368563, 7441307, 7408288, 7437896, 7473150, 7513345, 7586255, 7580843, 7644512, 7715174, 7737496, 7811763, 7866757, 7863571, 7835728, 7831035, 7937961, 7869925, 7829929, 7804761, 7802509, 7827320, 7802041, 7905930, 7982311, 8031246, 8072136, 8048810, 8180373, 8154214, 8158458, 8193891, 8165011, 8158977, 8134443, 8094851, 8093134, 8130468, 8159152, 8134779, 8269284, 8361516, 8429018, 8541501, 8636690, 8797484, 8907207, 9002589, 9173451, 9262106, 9541791, 9854169, 10138056, 10362502, 10533153, 10821574, 11045761, 11209572, 11290309, 11569457, 11790313, 12011375, 12296137, 12601155, 12977521, 13352235, 13835604]
3944A3835604Q77794R73747J097100J016911R55574R99418R87490J290946J604352
3935B3638936J962334K164809K240012K370507K015126J694421J194011O29789
3927C7909945L81637O8593k04351k33987k63601j90729p0102J70972K17541K48771
3917C8034689K26638J45988r3919n25766q36914j054328j358571j670776j968729
3908C0898312k075843j929972j817389j660128j464909j246991j086306r73762
3900A8643012q19068o36760m73785l94588k62036j89736k47018r8298j54116k21141
3890A5146466J464J512J93063K6334O270J03989K2278L5792o8806O0441J48315
3879A5677118R6437Q1669J16244K60657J18560J16299N7192J59435L08486K43653
$$ y = [13835604, 14713398, 15687145, 16784245, 17801156, 18756730, 19756148, 20743638, 22034584, 23638936, 25601270, 27766079, 30006091, 32376598, 34391724, 36086145, 37280156, 37909945, 38291582, 38360175, 38155824, 37921837, 37658236, 37467507, 37397405, 37568377, 37785918, 38034689, 38261327, 38407315, 38313396, 37787630, 36950716, 35896388, 34537817, 32867041, 30898312, 28822469, 26892497, 25075108, 23414980, 21950071, 20703080, 19616774, 18643012, 17823944, 17187184, 16713399, 16318811, 16056775, 15867039, 15620021, 15521723, 15367607, 15146466, 15147930, 15149442, 15342505, 15368839, 15375109, 15479098, 15501376, 15537168, 15468362, 15528803, 15677118, 15773555, 15855224, 15971468, 16232125, 16350685, 16466984, 16524176, 16683611, 16992097, 17235750]
3869A7235750L79709L05400L16765M43781M40237M90520N18968N85272Q08501
3860B1524903P62559P94005O51805Q33772Q01840P35895P13982P55712Q36723
3851B8411196P43482O73154Q25558P87579Q62214Q73083R17030Q93020Q19087
3842C5805403Q47122Q17655O45184M71045L44631L46391J38637J17306K14656
3833C9748030J41724K29818J85717K83645K98406K85263K41644R4345J79927J61670
3823D1850189J65132J22140J50528K50758J03110K60495M04798N31257P19907
3814D4558314P96011J080873J237455J559514J850980K033476K517572K899648
3806E8533843L390110L903012M307443M721932N006107N392317N634576N866104
$$ y = [17235750, 17615459, 17920859, 18237624, 18681405, 19121642, 19612162, 20131130, 20716402, 21524903, 22287462, 23081467, 23733272, 24567044, 25368884, 26104779, 26818761, 27574473, 28411196, 29154678, 29827832, 30653390, 31440969, 32303183, 33176266, 34093296, 34986316, 35805403, 36652525, 37470180, 38115364, 38586409, 38931040, 39277431, 39416068, 39533374, 39748030, 39889754, 40119572, 40305289, 40588934, 40887340, 41172603, 41414247, 41508592, 41688519, 41850189, 42015321, 42137461, 42287989, 42538747, 42641857, 42902352, 43307150, 43838407, 44558314, 45354325, 46435198, 47672653, 49232167, 51083147, 53116623, 55634195, 58533843, 61923953, 65826965, 70134408, 74856340, 79862447, 85254764, 90889340, 96755444]
3798I6755444O279913O604385P137093P612243Q263785Q929775R439258R988905
3790A61010801J0187912J0216953J0079773R617567R222246Q485092P801139P208104
3782B33829587O694747O426125O142833O292403O550616O795770P064946P305722
3774B87102749P509895P539473P546148P577553P919432Q766039R899874J1202712
3766C55063875J2470257J3268444J3505541J2389921J0351130P492346M074945
3759D28616459O57280k659555n250531p071725q154835q340467q022853p111577
3751C82662196o201801n506841n299999o206665p949410j0345052j3421361j6276370
3743C11454697j8816330k0709335k1602910k1664000k0932548j9569107j7707052
$$ y = [96755444, 103035357, 109639742, 116776835, 124389078, 132652863, 141582638, 151021896, 161010801, 171198713, 181415666, 191495439, 201113006, 210335252, 218820344, 226621483, 233829587, 240524334, 246950459, 253093292, 259385695, 265936311, 272732081, 279797027, 287102749, 294612644, 302152117, 309698265, 317275818, 325195250, 333961289, 343861163, 355063875, 367534132, 380802576, 394308117, 406698038, 417049168, 424541514, 428616459, 429273739, 426614184, 421363653, 414291928, 406137093, 397796626, 389773773, 382662196, 376460395, 370953554, 365653555, 359446890, 351497480, 341152428, 327731067, 311454697, 292638367, 271929032, 250326122, 228662122, 207729574, 188160467, 170453415]
3736A70453415j5767490j3656581j1751657r836987q204105o640491n275667m151853
3728I5168584l053823k006342j031631p7464Q53409J933044L021210L956644M916695
3719A03680326N657808O031883N921846N447511M438485L228016K055801P34664
3711A37196340l73616j074363j557353j667336j439977j146917j014805o99970
3703A28222003o79001j016095j722233k681646l771327n070275o055947o869584
3695A00355895p423864p529429p282812o802995o203694n669050m942215m288305
3687E0213531l829032l273171k779908k464203k281597j941926j694762j535015
3679C0413917j379230j276110j101828r62965r68273q58445r20290o81576n74672
$$ y = [170453415, 154685925, 141029344, 129277687, 119440700, 111236595, 104596104, 99320437, 95168584, 92114761, 90108419, 89076788, 88999324, 89852733, 91785777, 94806987, 98763631, 103680326, 109338134, 115370017, 121291863, 126739374, 131177859, 134405875, 136461676, 137196340, 136822724, 135748361, 134191008, 132523672, 131083695, 129936778, 128921973, 128222003, 127543002, 126526907, 124804674, 122123028, 118351701, 113281426, 107225479, 100355895, 92932031, 85402602, 78119790, 71316795, 65113101, 59444051, 54501836, 50213531, 46384499, 43111328, 40331420, 37867217, 35585620, 33643694, 31948932, 30413917, 29034687, 27758577, 26656749, 25693784, 24725511, 23867066, 22946776, 22265200, 21690528]
3670B1690528o53816n42857o67013n31940n05606n54255n35383m41804m21565
3661A6836289l97003l94127l26433k81327l30940k37576k87406k91250j97986
3652A4092241j97017k67063k61204k84543j58110j66378k35042j59560k17625
3643A2145699j17617j02643j25928j79641p4255j04408j46239j37463j21358p4784
3633A0961363j5416p5916j14595j78019j93280j70905q7169j15649j29995q2661
3623I797758j10096j50046r2190q6802j16322r5718j82121q1911j24001m7022
3613H711529j36299j59388j65977j53693j67607j25192j31333o5019j13596j15192
3603G378233k648j06838p2199j00443m3175j21416n4214o6815M9825K646p0884
$$ y = [21690528, 21036712, 20493855, 19826842, 19294902, 18789296, 18235041, 17699658, 17257854, 16836289, 16439286, 16045159, 15718726, 15437399, 15106459, 14868883, 14581477, 14290227, 14092241, 13895224, 13628161, 13366957, 13082414, 12924304, 12757926, 12522884, 12363324, 12145699, 12028082, 11925439, 11799511, 11619870, 11545615, 11441207, 11294968, 11157505, 11036147, 10961363, 10945947, 10870031, 10755436, 10577417, 10384137, 10213232, 10126063, 10010414, 9880419, 9797758, 9687662, 9537616, 9445426, 9358624, 9242302, 9146584, 8964463, 8882552, 8758551, 8711529, 8575230, 8415842, 8249865, 8096172, 7928565, 7803373, 7672040, 7607021, 7493425, 7378233, 7375585, 7268747, 7196548, 7096105, 7052930, 6931514, 6877300, 6810485, 6860310, 6862956, 6792072]
3592F792072j9794L2830p9765r1996K582K0256L9068k3580k6166J1991n7865N2908
3580F652541l4988J5671O7754J17406R216J4324J08311N3814J05325L1271P2526
3569G213171L2753J22070P1444P4195P8713N4978j1936N71j33559j6683L9303
3558G525020n6849p9915k0465Q0378L7451n6538L0289J8888K5087N6708P7715
3547G637769K0176N0174O9598J54357J43946J84172J14333K25323J08716q026
3537H700538M7313J0132n3216j62391j31985j12907p2658J1935K4311P29K0475
3526H282276M1995L1233q8495Q1678N5549N9615J10759M8764J22579J54227J24722
3515I024902J02423O6691K04135J67306J72235J66974K80896J90789K23488K77169
$$ y = [6792072, 6772278, 6805108, 6725343, 6633347, 6635929, 6656185, 6695253, 6671673, 6645507, 6657498, 6599633, 6652541, 6617553, 6633224, 6700978, 6818384, 6827600, 6841924, 6950235, 7004049, 7109374, 7140645, 7213171, 7245924, 7367994, 7439438, 7513633, 7592346, 7647324, 7635388, 7635959, 7502400, 7485717, 7525020, 7468171, 7388256, 7367791, 7448169, 7485620, 7429082, 7459371, 7478259, 7503346, 7560054, 7637769, 7657945, 7708119, 7777717, 7932074, 8076020, 8260192, 8374525, 8599848, 8708564, 8700538, 8747851, 8757983, 8704767, 8542376, 8410391, 8297484, 8224826, 8236761, 8261072, 8261801, 8282276, 8324271, 8355504, 8267009, 8348687, 8404236, 8463851, 8574610, 8623374, 8745953, 8900180, 9024902, 9127325, 9194016, 9398151, 9565457, 9737692, 9904666, 10185562, 10376351, 10599839, 10877008]
3505A0877008J33267J68233J68850J37836J99790K67156K45455K56289K33443
3496A2687327J55374K02480K08816J16625O7136J28380J78636K04681K23055J06458
3486A4278968J68615J11464J57197J54128R5079K54316K21965K53993K87257J48315
3476A6131297J87158J87640J10528K52390L78658M25527K30593L10265K40445
3467A8454501K91425L44643L23929M04551N13821N97552N89207O54341O55393
3458B2829363O84196P17947O88388O56403Q39480Q92229Q41518R55088J016834
3449C0121446R12841J015031J040282J041919J146753J189394J198790J152763
3441C8819219R32177O76671L63077j80933n69340r62169j326844j461320j720189
$$ y = [10877008, 11010275, 11178508, 11347358, 11485194, 11684984, 11952140, 12197595, 12453884, 12687327, 12842701, 13045181, 13253997, 13370622, 13437758, 13566138, 13744774, 13949455, 14172510, 14278968, 14447583, 14559047, 14716244, 14870372, 14965451, 15219767, 15441732, 15695725, 15982982, 16131297, 16318455, 16506095, 16616623, 16869013, 17247671, 17673198, 17903791, 18214056, 18454501, 18745926, 19090569, 19414498, 19819049, 20332870, 20930422, 21519629, 22173970, 22829363, 23513559, 24231506, 24919894, 25576297, 26415777, 27308006, 28149524, 29104612, 30121446, 31034287, 32049318, 33089600, 34131519, 35278272, 36467666, 37666456, 38819219, 39751396, 40428067, 40791144, 40610211, 40040871, 39078702, 37751858, 36290538, 34570349]
3432C4570349j787625j891761j770173j682527j578948j441899j234018j036150
3424B2147248r19366q81960o84292o61173o33597o41400o08412m41417l81081
3415A6294550k81356k95175k73683l14120k86034l03039k93835k43002j61057
3406A3843249j05075j57365k13407k22134k74916k13236k72807k91734j55870
3397A1936705j24339o1109j34690j26355j16325j89593k26090k63362j31211p9348
3387A0484283o9025n6722n3923o1488j05538k06010j48879j34168p4464m3844
3377I530222m2646j3639r5622l5741q6375p6262r4898k3127N3912l2027P569m2025
3365I049341r1888j08437j41816j04809o9854j7561J53807N0073n73n3578j09837
$$ y = [34570349, 32782724, 30890963, 29120790, 27438263, 25859315, 24417416, 23183398, 22147248, 21227882, 20345922, 19661630, 19000457, 18366860, 17725460, 17117048, 16675631, 16294550, 16013194, 15718019, 15444336, 15130216, 14844182, 14541143, 14247308, 14004306, 13843249, 13738174, 13580809, 13367402, 13145268, 12870352, 12657116, 12384309, 12092575, 11936705, 11812366, 11751257, 11616567, 11490212, 11373887, 11184294, 10958204, 10694842, 10563631, 10484283, 10415258, 10358536, 10304613, 10243125, 10137587, 9931577, 9782698, 9648530, 9574066, 9530222, 9487576, 9473937, 9378315, 9342574, 9256199, 9179937, 9085039, 9061912, 9115824, 9083797, 9091366, 9049341, 8957453, 8849016, 8707200, 8602391, 8532537, 8514976, 8668783, 8718856, 8718283, 8664705, 8554868]
3354H554868o4200j52092P456n9318L021K0719l8749k4459o7423N622l2673j4462
3342H138310O9419P731j6035K9113J0052R2801j07678J1069J8419R4105J39204
3331H486510P2614L6387K7264O5871J18863J47013R1893O6883J58383L6114q1330
3320I226465l3896r8267j48400p5847r0721M0329l1740O4093L2355J7966O7578
3309H969915J44682J22441J06790L86122M03329L64415N13477L50765L52881N10454
3299A2225271N74388P29069P66653R72585J166957J290568J393415J837090K599337
3290B3555333L601823N970147J1020433J6386060J8250947J4240819N814308j110027
3282I7729843m551343r165109j1468590j0609369r386244p749396o831215n663567
$$ y = [8554868, 8490668, 8338576, 8346032, 8286714, 8289735, 8310454, 8271705, 8247246, 8179823, 8185445, 8152772, 8138310, 8207729, 8215460, 8199425, 8228538, 8238590, 8331391, 8223713, 8234782, 8253201, 8347306, 8486510, 8559124, 8595511, 8622775, 8688646, 8807509, 8954522, 9046415, 9113298, 9271681, 9307795, 9226465, 9192569, 9094302, 8945902, 8870055, 8779334, 8819663, 8787923, 8852016, 8884371, 8902337, 8969915, 9114597, 9237038, 9343828, 9729950, 10133279, 10497694, 11011171, 11361936, 11714817, 12225271, 12799659, 13528728, 14295381, 15267966, 16434923, 17725491, 19118906, 20955996, 23555333, 27157156, 33127303, 44147736, 60533796, 78784743, 93025562, 98839870, 97729843, 93178500, 84013391, 72544801, 61935432, 52549188, 44799792, 37968577, 32305010]
3274C2305010m112351k930932j861525j101883q61571m30114j78043J70700M33048
3265B1432339Q36903J547891K376613L827942O958038J2612349J7148048J6998926
3257H3739049J1284695K649234k613400o073901j0606691j1391900j0474591r039670
3249D7472825p751090o861166n368395m111014k916641k093310j680588j447188
3241A5243433j286127j041405r20349q43930p05469m49705l66054l20777k14327
3232I095290k16022q8888n4917j16093j66553l02366k27292j07401k07327j46992
3222G461439j20232o4957l5603j46119j47804k48111j50107L7785o8394M9462
3212F567359l0271l0217j32885j22174p2227p0209j2201J7354O9001J2438l2724
$$ y = [32305010, 28192659, 25261727, 23400202, 22298319, 21436748, 21006634, 20828591, 20999291, 21432339, 22269242, 23817133, 26193746, 30021688, 36979726, 49592075, 66740123, 83739049, 95023744, 97672978, 95059578, 88985677, 78378986, 66987086, 56512495, 47472825, 39721735, 32860569, 27492174, 23381160, 20464519, 18371209, 16690621, 15243433, 13957306, 12915901, 11995552, 11151622, 10446153, 9996448, 9630394, 9309617, 9095290, 8879268, 8790380, 8735463, 8619370, 8452817, 8150451, 7923159, 7815758, 7608431, 7461439, 7341207, 7276250, 7240647, 7094528, 6946724, 6698613, 6548506, 6586291, 6517897, 6567359, 6537088, 6506871, 6373986, 6251812, 6179585, 6109376, 6097175, 6114529, 6183530, 6195968, 6163244]
3201F163244J1258j20038m0853o9256o6726N873O1556J01922Q5137n3598m9423
3190F029096K5686k0518o5183Q3569N1835J06311J56907Q3176o0048r0887q94
3179F299050J02391q439Q431L1664O4807l350o5113q8920j10285M8244J12619
3168F391099j5733M4388J1024J00583J50640k8608m9276M578O8561K21531J81129
3157G079916J49889J24153J60835J65673N2451J86777J51795K03796J65700K21209
3147H662194J44759J04203J74685J37279J56303J71072K12541L10388J61846J42107
3137A0377377J06645J7909K7932m787M8647J13713P9405R5981M8909J33583O9128
3126A1114442O6873R9047J68075L09120K82929K99134L68714M36591M97093N35167
$$ y = [6163244, 6174502, 6054464, 6013611, 5944355, 5877629, 5883502, 5945058, 6046980, 6132117, 6078519, 6029096, 6054782, 6034264, 5969081, 6052650, 6104485, 6210796, 6367703, 6450879, 6390831, 6299944, 6299050, 6401441, 6393002, 6401433, 6433097, 6497904, 6494554, 6429441, 6340521, 6230236, 6278480, 6391099, 6375366, 6419754, 6430778, 6531361, 6682001, 6653393, 6604117, 6608695, 6677256, 6898787, 7079916, 7229805, 7353958, 7514793, 7680466, 7732917, 7919694, 8071489, 8275285, 8440985, 8662194, 8806953, 8911156, 9085841, 9223120, 9379423, 9550495, 9763036, 10073424, 10235270, 10377377, 10484022, 10501931, 10529863, 10525076, 10573723, 10687436, 10766841, 10862822, 10911731, 11045314, 11114442, 11181315, 11280362, 11448437, 11757557, 12040486, 12339620, 12708334, 13144925, 13642018, 14177185]
3116A4177185O52590Q22210Q68096R41576P53938M48992K49265k4564k11500m96702
3106A8181086n82798n69275n60249n42915n60730n45103l86543l42521k63814
3097A3827138o9276k9128N6367J47959K33643L33862L37835L77830P08426P33680
3087A6658336Q13145Q12626P66967P28460N33521L56131Q9643j20285l90524n03100
3077A9744920n50003p40807q22084q65929p63184p65185p67480o44302o08583
3068A3217363l79381k74356l68989l36770k74776j88475o5074o1545j4732N1751
3058A1305016R7967L4935l1598k272m1841j13354j98843k20515j19566k74746
3048A0435183l23147l37249k16939l10802l76707l54640k74489j92469k91561
$$ y = [14177185, 14829775, 15651985, 16520081, 17461657, 18215595, 18664587, 18913852, 18889288, 18677788, 18181086, 17598288, 17029013, 16468764, 15925849, 15365119, 14820016, 14433473, 14090952, 13827138, 13757862, 13728734, 13785101, 13933060, 14166703, 14500565, 14838400, 15216230, 15924656, 16658336, 17471481, 18284107, 19051074, 19779534, 20313055, 20669186, 20758829, 20638544, 20248020, 19744920, 19194917, 18454110, 17632026, 16766097, 16002913, 15237728, 14470248, 13825946, 13217363, 12837982, 12563626, 12194637, 11857867, 11583091, 11394616, 11329542, 11267997, 11253265, 11305016, 11402983, 11437918, 11406320, 11404048, 11362207, 11248853, 11050010, 10829495, 10709929, 10435183, 10112036, 9774787, 9557848, 9247046, 8870339, 8515699, 8241210, 8048741, 7757180]
3039G757180k81449j81285j67125j97067k29998j34950j46830r2323m0888j01773
3029F183492q3221o3931j45343j23580j55528j61923p0684p4978j5799j10639
3019E177866j58310j18655j13199r9230j50990p0960J1426n0976L9136k3863j12505
3008D329740q0236n3938o6674o1960n5597L6576Q3587l0513p9931l3892j58126
2997C829036j28966j23710j05601q1781j8951q0989j01837n0788J2222n1749j29804
2986B967082q8622M2537Q3857p6281r5300r4098k7162l1748o062p852l1690Q0806
2974B715467P2012L6080k871L75k0029j82762j88725j06420k3298k1824p7466
2963B200539n4063k2599o0406n7021p9493q5908k4957N200j075o0365p383r240
$$ y = [7757180, 7475731, 7294446, 7127321, 6930254, 6700256, 6565306, 6418476, 6326153, 6285265, 6183492, 6100271, 6036340, 5890997, 5767417, 5611889, 5449966, 5379282, 5304304, 5288505, 5177866, 5019556, 4900901, 4787702, 4688472, 4537482, 4466522, 4477948, 4426972, 4466108, 4442245, 4329740, 4249504, 4195566, 4128892, 4066932, 4011335, 4047911, 4131498, 4100985, 4021054, 3987162, 3829036, 3700070, 3576360, 3470759, 3388978, 3370027, 3289038, 3187201, 3136413, 3148635, 3096886, 2967082, 2878460, 2920997, 3004854, 2928573, 2833273, 2739175, 2712013, 2680265, 2674203, 2666351, 2634661, 2715467, 2787479, 2823559, 2820688, 2821063, 2801034, 2618272, 2429547, 2323127, 2299829, 2278005, 2200539, 2146476, 2123877, 2063471, 2006450, 1926957, 1841049, 1816092, 1821292, 1820217, 1759852, 1752469, 1743229]
2951A743229j03830l1148l0773j18183J4736L0436R575J6515r609p8387j31930
2940A310631q2052L0719o572J03760n2050l7712M6953r1905j02333o0287r8870
2929I60282L932P5436R8553K2295L1205n3448m2811j23674j02394R859l0873M1863
2917H90225Q0746J0838p718k0644j57554r2275j6802L2450N3978j0289K4652l8259
2905G49348k8421R468j16083p5780R279J51236N5997k7689K1335k9072j00308
2894F19310j1908j7547n1970q675K0570L0400Q3825k1685p4388p4247k638M0075
2882E31122L3653k1348L6648M3118P064r2952o5089q6670l6490l5790R4070O0861
2870D68197k0145J01222M9287j54983n0323q2025L8479P3089k4881K3238K8534
$$ y = [1743229, 1639399, 1608251, 1577478, 1459295, 1474031, 1504467, 1514042, 1530557, 1520948, 1442561, 1310631, 1228579, 1259298, 1252726, 1356486, 1304436, 1266724, 1313677, 1221772, 1119439, 1059152, 960282, 964214, 1039650, 1138203, 1160498, 1191703, 1138255, 1095444, 971770, 869376, 879235, 848362, 890225, 970971, 981809, 974091, 953447, 795893, 703618, 686816, 719266, 773244, 762955, 787607, 749348, 720927, 730395, 614312, 538532, 547811, 699047, 755044, 727355, 748690, 719618, 619310, 607402, 589855, 537885, 529210, 549780, 580180, 664005, 642320, 567932, 493685, 491047, 531122, 564775, 543427, 580075, 623193, 630257, 537305, 472216, 385546, 349056, 313266, 407336, 468197, 448052, 549274, 598561, 443578, 393255, 311230, 349709, 422798, 397917, 421155, 449689]
2859D49689K5511l0692q7758q8387j5778R0700P3980N7725j4672j5942l5295j33963
2847B75118j098j8958J3820N2066J6339O6398K8451o2953j40024l6997L7423j9370
2835B10215N5143J8212M2084k659j940p6420q4985Q3564N1138L0219O764j1422
2823C19913P7865l5920o2652m935j5066m4477n9099L3880m8604L3620L5704j601
2811B28628l2911n6766Q6175O8079K8787o92N4507m5067k5293o5347K2751k4828
2799B38023o7269K9183K3619j8065L2452O8421k3934n7780j0587n0735K5984j1434
2787A77878k0915P1887M7192n2152l0583m4952K9032L527k3219N1297N0066J5586
2775B74644j1214j01203m0106L2890j7533o431K2484J6720O9560N8807m6065k1203
$$ y = [449689, 475200, 444508, 356750, 268363, 252585, 343285, 417265, 474990, 460318, 444376, 409081, 275118, 274020, 255062, 268882, 320948, 337287, 403685, 432136, 369183, 229159, 192162, 229585, 210215, 265358, 283570, 325654, 322995, 321055, 244635, 159650, 243214, 294352, 324571, 331335, 319913, 397778, 361858, 299206, 294271, 279205, 234728, 175629, 209509, 160905, 194525, 230229, 228628, 195717, 138951, 225126, 293205, 321992, 321300, 375807, 330740, 305447, 240100, 262851, 238023, 170754, 199937, 223556, 205491, 237943, 306364, 282430, 224650, 214063, 163328, 189312, 177878, 156963, 228850, 276042, 223890, 193307, 148355, 177387, 180914, 157695, 208992, 259058, 274644, 263430, 162227, 122121, 155011, 137478, 131047, 153531, 170251, 239811, 298618, 252553, 231350]
2763B31350r8345j3243j008j07385L4538R7408Q6803p8794r5442L7304N181p050
2751I1317K1999j1356J8741L3179q324L2719k501o4184k7421m4586n2171Q0463
2739F7875J7795L3403N9315k3708p0889r1448n1286J414J6761R7376k9504K0532
2727D7636J3427J7989n4461k1854l3874n555R0609j7025n4125Q1312M8941l8684
2715G4336q6123m1834L8041J1271Q0894k9589J8589l4662j1117R3896m1821n7894
2703A3987k2086q288Q8559o310n469l314m674o6218o2328M2113J536K5120M7904
2690D0532K8101l4202j00701M3002N2607k6839J1344q5065N8583Q2126m7497L8631
2678F0622n766p6340l1665k3963N5027l7578j5887p274N0229K6430m1085k665
$$ y = [231350, 133005, 119762, 118754, 11369, 45907, 143315, 230118, 151324, 55882, 93186, 98367, 91317, 113316, 101960, 120701, 153880, 145556, 178275, 175774, 111590, 84169, 39583, -12588, 67875, 85670, 119073, 178388, 154680, 83791, -7657, -58943, -57529, -40768, 56608, 27104, 47636, 61063, 79052, 24591, 2737, -31137, -36692, 53917, 36892, -17233, 64079, 113020, 74336, -11787, -53621, -15580, -4309, 76585, 46996, 65585, 30923, 19806, 113702, 71881, 13987, -8099, -16387, 72172, 65862, 60393, 57079, 52405, -13813, -76141, -34028, -32492, -7372, 40532, 68633, 34431, -66270, -23268, 29339, 2500, 13844, -71221, -12638, 69488, 21991, 60622, 54856, -21484, -53149, -77112, -22085, -59663, -75550, -82824, -32595, -6165, -47250, -49915]
2666d9915k8664o8092J8770L2770R6528P3599p441o7092m427r498j04347j6029
2654a33838K2557k540k6536M6589K5841r404N0015l7465M2141K4791k3425K7939
2642F665q594L0240k2594J3574l2684K9523N1457k0927q7872K6083O9102o3935
2630i962o4389J8164l5199M916N2707N7921k1092M5685J6428j6309k6413l6449
2618a3992n4081o258K7058m4454n492Q1179j7992j05757m8023N8994k3630L2053
2606a20395J20223M788N9844J2292p7005j63074p981m957M8003M6650j443J59994
2594G6939J2744l1020l3112p0541j1241J7729O7892j5958K8129L2114k1230N5928
2582A08373k6952M9051P1634r079Q9867R7296p5636N384l4722p7248j23659o4998
$$ y = [-49915, -78579, -146671, -127901, -95131, 1397, 74996, 67555, 463, -3964, -13462, -117809, -133838, -111281, -113821, -140357, -93768, -67927, -77331, -27316, -64781, -22640, 2151, -21274, 6665, -1929, 28311, 5717, 19291, -13393, 16130, 67587, 46660, -41212, -15129, 53973, -9962, -74351, -56187, -91386, -86470, -33763, 24158, 3066, 48751, 65179, 48870, 22457, -13992, -68073, -74331, -47273, -91727, -97219, -16040, -34032, -139789, -187812, -128818, -152448, -120395, -172, 4616, 64460, 76752, -253, -163327, -171308, -176265, -128262, -81612, -83055, 76939, 89683, 58663, 25551, -44990, -56231, -38502, 29390, 13432, 41561, 73675, 52445, 108373, 81421, 130472, 202106, 193027, 282894, 380190, 304554, 309938, 275216, 197968, 74309, 9311]
2570I311N9340j3190j0265p37M7347q4871k7489K3557k6037j4962L3737L1187
2558B6928P6306n4998n8401m7598m6914L5857J3413M4118M3034L38J3728l0524
2546A5287j15252n948N5857J1358K53K1668l7429J7070N7680q4066p615n8174
2534a29311J15613M6303m5125O3880K2728l1456j29403j3413k472l1002O1857
2523g1801K6118j6622k4797j214j2186o8433N2587L8361j9744N8282L9629r763
2511i583j8967j8281m9939k0846M2124K7716O3658K8046L8453J4488j04801n1685
2499e9617L0738L5269O0403l871N4775K7943j7573q1319o8945R6825j7217n2166
2487E245K9324R2035j1937m8072M5541m8031l3834j0001l5129K1278N0571P4178
$$ y = [9311, 68651, 55461, 45196, 44459, 91806, 6935, -20554, 3003, -23034, -37996, -4259, 26928, 103234, 48236, -10165, -57763, -104677, -68820, -55407, -11289, 31745, 32083, 45811, 15287, -99965, -105913, -50056, -38698, -38445, -16777, -54206, -37136, 20544, -63522, -71137, -129311, -13698, 32605, -12520, 51360, 74088, 42632, -86771, -100184, -102656, -133658, -71801, -45683, -62305, -87102, -88316, -100502, -168935, -116348, -77987, -97731, -39449, 180, -9583, -28550, -46831, -96770, -117616, -75492, -47776, 15882, 43928, 82381, 96869, -7932, -59617, -28879, 6390, 66793, 62922, 117697, 145640, 128067, 46748, -22197, 74628, 57411, 5245, 34569, 126604, 114667, 66595, 112136, 64105, 30271, 20270, -14859, 6419, 56990, 131168]
2475A31168O785o8698l1744k6365R2585m7962J1530N9344l4432l5875k3796K9385
2463F1925j3649J2527J1856N7632j0110O543J2717o8805j12999n719n383N3182
2451b83P8924N451P6054l1328k5940J3302p3050J807p256P8930o758p005M3072
2438A45920j32811N7313N5452L0054L4819P5468O8514p4721m3329m1003k5993
2427A49683O3785l1789L2689L9047Q1695n0763o8596j418L9189n9387n033J7607
2415B06709L9379R6431l4141K400n938Q0119q4454j3583l89k2142P7636j4281
2403C27746p317L292l3852M7274j9219M1623j0946j4835k6966J6906J04542q316
2391D19932l8149r7434n7402l4014Q0040J19696P352r6843K5092O1588M5938m0115
$$ y = [131168, 137953, 69255, 37511, 11146, 103731, 55769, 67299, 126643, 92211, 56336, 32540, 61925, 48276, 60803, 72659, 130291, 120181, 126724, 139441, 70636, -42363, -48082, -53465, -283, 78641, 84092, 160146, 128818, 102878, 116180, 43130, 44937, 37681, 116611, 109853, 102848, 145920, 13109, 70422, 125874, 155928, 190747, 266215, 334729, 260008, 216679, 175676, 149683, 213468, 181679, 214368, 253415, 335110, 284347, 215751, 214333, 253522, 194135, 189102, 206709, 246088, 342519, 308378, 310778, 304840, 384959, 300505, 286922, 286533, 264391, 342027, 327746, 320429, 323721, 289869, 337143, 317924, 359547, 348601, 333766, 306800, 323706, 428248, 419932, 381783, 284349, 226947, 192933, 272973, 392669, 400021, 303178, 328270, 389858, 435796, 395681]
2379C95681K4922L5562O1211N9192M9136L4002o6160k7041Q321j122M3647J31842
2367G49193N3453N9310j2358m320K7215j3694Q7500j998P797K5672J65996Q7369
2355A231135n8101O1775p5164R1453q476R3535J00225p5858Q8412J34697L3685
2344A617318o7153n987J31000P4683L3490Q8094M7558J08690J95631K57155K45929
2333B726408L15409L82380M16916N98933O61443P33422N10096L69975M17297L86837
2323G519116M96961P22664R26382J521708J909457K612149L982008P816543J2985692
2314D0492680J5842652J3873709O798103k87808k944890o810667r913539r391599
2306D7658641q488556p202444o469888n378990m122877k791463j821087j076602
$$ y = [395681, 420603, 456165, 517376, 576568, 625704, 659706, 593546, 566505, 574826, 573704, 617351, 749193, 802646, 861956, 849598, 845278, 872493, 858799, 946299, 944301, 952098, 977770, 1143766, 1231135, 1173034, 1234809, 1159645, 1251098, 1242622, 1336157, 1436382, 1360524, 1448936, 1583633, 1617318, 1550165, 1544178, 1675178, 1749861, 1783351, 1871445, 1919003, 2027693, 2223324, 2480479, 2726408, 3041817, 3424197, 3841113, 4440046, 5101489, 5834911, 6345007, 6714982, 7132279, 7519116, 8016077, 8738741, 9665123, 11186831, 13096288, 15708437, 19690445, 27506988, 40492680, 56335332, 70209041, 77007144, 76719336, 73774446, 66963779, 57050240, 47658641, 39170085, 31967641, 25497753, 20118763, 15995886, 13204423, 11383336, 10306734]
2298A0306734p78683p77139r07650r11117p96653o97607n79136n07590l77964
2289C973195l06626l64064k26460o6337j12227j60352j28782j63633o0013j43543
2279B241158q5522j93663n0884k6364m7420j32427p6156o0750o4705o7475n5323
2268A380469j21075k6840n2984k5026l2140r8319q2572j9772P8101n7644q0620
2257H61578k4444m3783N7569m2241l2936L4691o7152L6672m7025r9050l5479P3276
2245F71676m8668l1797K6550L984j0596k9720j8761N1320n5669n0115L4401k8625
2233E13980P3695m5458n6331K0336r7240L9956n9117l9412j9385k7705N7778j5901
2221C45196m1843K4447P329L0977p6266m6257j4021L8483K1888n5641k2339n0967
$$ y = [10306734, 9528051, 8750912, 7843262, 6932145, 6135492, 5437885, 4858749, 4351159, 3973195, 3666569, 3302505, 3076045, 3009708, 2897481, 2737129, 2608347, 2444714, 2384701, 2241158, 2155636, 1961973, 1911089, 1884725, 1837305, 1704878, 1628722, 1567972, 1503267, 1435792, 1380469, 1259394, 1232554, 1179570, 1154544, 1122404, 1024085, 941513, 921741, 999842, 942198, 861578, 837134, 793351, 850920, 808679, 775743, 810434, 743282, 779954, 732929, 633879, 598400, 671676, 623008, 591211, 617761, 621745, 611149, 581429, 562668, 613988, 558319, 508204, 542605, 513980, 587675, 542217, 485886, 506222, 408982, 448938, 389821, 350409, 331024, 303319, 361097, 345196, 303353, 327800, 335129, 366106, 289840, 243583, 229562, 268045, 289933, 234292, 211953, 160986]
2209A60986N5569l4701N596N9258m5590l3665n4476J5666l3141o2174N5374L2119
2197A20821R9l298k3920k8332p5455Q3514K4499n776j8459K1422M9849n3915q9949
2184A100l3369J4199N2647j8028N7970L3879k7362K2650m8202M9195K158M549
2172A11386Q3792n3433o531K2198n5656K0141o3985M8827l7922q6680J9286K8294
2160B9717M6349m3899J854r6581n0052N5913p107j8786O3442j4310L6k8452l5902
2147i7778m341m4924K2741O3461J15130Q044o0840j23156K895j7734m0406O8572
2135a08336K4016P9635K6851q5924J7777O74j4278o4201l1528M4053N8089J08931
2123E5759M7926j3037p6588j69384l5833j4580N9198R9002Q9964Q1408p8845j13420
$$ y = [160986, 216555, 181854, 187450, 246708, 201118, 167453, 112977, 128643, 95502, 33328, 88702, 120821, 120920, 117622, 93702, 65370, -10085, 73429, 97928, 92152, 73693, 95115, 144964, 91049, 1100, -32269, -18070, 34577, 16549, 74519, 108398, 81036, 103686, 55484, 104679, 106837, 111386, 195178, 141745, 135214, 157412, 101756, 121897, 57912, 106739, 68817, -17863, 1423, 29717, 76066, 32167, 34021, -62560, -112612, -56699, -63806, -82592, -19150, -33460, -33424, -61876, -97778, -102119, -147043, -124302, -60841, 54289, 62333, 1493, -121663, -118768, -136502, -176908, -108336, -84320, -4685, 22166, -63758, -45981, -45307, -59585, -123786, -155314, -111261, -53172, 55759, 103685, 90648, 14060, -155324, -191157, -205737, -146539, -47537, 42427, 123835, 44990, -68430]
2111f8430k3446n4048q568M5443L7119K5356N0399P9203o5877n0064n3478j9618
2099a06009n2433k630J04759R3786M068j1337r7018n8012k3630O4440M3854K7265
2087a2897P9109o8139N0954o2552q3362K7196r9867M7056Q3125J9039l4421L6878
2075a7881j163j31013l5228j0543K8138R9326K5710O2421K2138j3518M937p5794
2063d2470k1872j06919J14054P6567N999K6782n3040j61468q2762J5682N7688
2052a71759J59244Q7341L574K8485M8076n2892j3600k915J21446R2456K6023M9153
2040C74632n1677M4715p6365j79401o7743m6626N6341J5657J2076K75n4634n1215
2028b3965j8633k0339k0899K6609J00784J77k0833R255l1469n9774j09003J16989
$$ y = [-68430, -91876, -145924, -154492, -109049, -71930, -46574, 3825, 83028, 17151, -32913, -86391, -106009, -158442, -161072, -56313, 37473, 41541, 30204, -66814, -124826, -148456, -84016, -40162, -12897, 66212, -1927, 49027, -13525, -96887, -69691, -169558, -122502, -39377, -20338, -54759, -17881, -19044, -150057, -185285, -195828, -167690, -68364, -42654, 19767, 41905, 28387, 33324, -42470, -64342, -171261, -57207, 19360, 25359, 52141, -899, -162367, -245129, -229447, -171759, -12515, 74826, 78400, 106885, 154961, 102069, 88469, 85554, 207000, 299456, 325479, 374632, 322955, 367670, 291305, 111904, 44161, -2465, 53876, 69533, 81609, 81884, 27250, -23965, -42598, -62937, -83836, -57227, 43557, 43734, 22901, 32156, 687, -59087, -168090, -51101]
2016e1101J2236M8026N2281m9220j5695n0126J294n1941m5236P1798O8453L382
2004e849q6078r0970K5302L9201k4023R537M5322N1326r317m8248k8906l7037
1992a59740N0400k9487J4865M6821N9777n3136o0786P7161p8262k1132l4402M2673
1980a45248Q7034r920J30344J6086j05276j17563k9285O4971k630K9026P8582
1969c879Q5702n3733p8908j6233l4187n1063J4809L02Q0439M7266J2033l0005
1957b7457j8934l2986j38047O5521K1966R1917R3926J1445j2845j28088p1331
1946a44913m3031k4009J00899q3R6500Q4966l95r613j34563o5208k7241R9264
1934f7427L9231K5777O0042m4316l2703j25148n4391J1773j6868Q2877R2094J00103
$$ y = [-51101, -38865, 9161, 61442, 12222, -3473, -53599, -52305, -104246, -149482, -77684, -9231, -5849, -91927, -182897, -157595, -118394, -142417, -132880, -87558, -36232, -45549, -93797, -122703, -159740, -109340, -138827, -123962, -77141, -17364, -70500, -131286, -54125, -132387, -153519, -187921, -145248, -58214, -68134, 62210, 78296, -26980, -144543, -173828, -108857, -111487, -82461, -3879, 81823, 28090, -50818, -67051, -101238, -152301, -137492, -137190, -56751, -9485, 2548, -27457, -46391, -79377, -217424, -151903, -129937, -38020, 55906, 67351, 54506, -73582, -144913, -187944, -211953, -111054, -111137, -14637, 70329, 69934, 60321, -74242, -139450, -166691, -67427, -28196, -2419, 57623, 13307, -19396, -144544, -198935, -187162, -204030, -121153, -29059, 71044]
1922G1044P768r1031n3344p8402K0658N1404k2621J20424Q2088K787o9555j53431
1910a12211n5677o2530J9958M0853P4037R3710l1291J6095j23010r2281O7013
1899a65334L3251O1034l8378J76960L8441q1052j7062j03376n9446K527J853N0679
1887i9903M2104Q4908J345l9617n9065p5422m10j2012M9438M2393N3991K4654
1875A2404p0929p0750K2608l5462j3000N7723M4795k4644J13669k9802p6137m3354
1863a12879j7714N4236j8389l35Q2277O5101m7151m4725Q019k8434l1397j6319
1851a07710k6944N0595Q7019M5395m7772m6758m5578N2359N294N6569K8257o0699
1839i973j6974K6627L1944j20793p6221L6788K5161j4315K8950L6316J8170k1498
$$ y = [71044, 78812, -12219, -65563, -143965, -123307, -71903, -94524, 25900, 107988, 110775, 41220, -112211, -167888, -230418, -210460, -169607, -95570, -1860, -33151, -17056, -140066, -232347, -165334, -132083, -71049, -109427, 67533, 105974, 24922, 7860, -95516, -154962, -152435, -150582, -99903, -57799, 27109, 28454, -11163, -70228, -145650, -146060, -158072, -108634, -66241, -12250, 12404, -58525, -129275, -106667, -142129, -155129, -97406, -52611, -77255, 36414, 6612, -69525, -112879, -130593, -76357, -94746, -95081, -12804, 52297, 5146, -39579, -31560, -59994, -91391, -107710, -134654, -84059, 2960, 48355, 583, -46175, -91753, -39394, -34100, 22469, 50726, -9973, -26947, -320, 31624, -89169, -165390, -128602, -103441, -117756, -88806, -52490, -34320, -55818]
1827e5818R639p382k4349k8762M7352Q9563k3919L8471p084m7544j8032k3618
1815e1483J8337l3558K9035L0021J0833j2599o9538K8376K5758L011p5482l176
1803a00465P4285K6178N5875p9590j07058k1045R6424J2106o1427j3566O1574
1792e6709p1992O190M3488j4482l5909j4631N654J2420R1589R4552m1817j19492
1780a01139J144M6608o337l4673K5263M6157j3915k6996o4270k1029N4937m0802
1768a35052M0518P9438L839M1236q6917m0788J5456j3279J5908m4819Q421O8717
1756d7322J5933k3007P4627R403m3011M8040j29635o3462J35422N7589p2650j02138
1744a40211R1087L3272J9559k3633k5700K4750K0604j3767K0759j7044n4576r3054
$$ y = [-55818, -46179, -53561, -77910, -106672, -59320, 30243, 6324, 44795, 37711, -9833, -27865, -51483, -33146, -66704, -37669, -7648, 3185, -9414, -78952, -50576, -24818, -21807, -97289, -100465, -26180, -2, 55873, -23717, -130775, -151820, -55396, -43290, -104717, -118283, -56709, -128701, -122511, -79023, -93505, -129414, -144045, -138391, -125971, -34382, 60170, 18353, -101139, -99995, -53387, -59724, -94397, -69134, -22977, -36892, -63888, -128158, -149187, -94250, -135052, -94534, -15096, -11257, 29979, -56938, -97726, -82270, -95549, -79641, -124460, -116039, -47322, -31389, -54396, 20231, 29634, -13377, 34663, -94972, -158434, -23012, 34577, -38073, -140211, -49124, -15852, 3707, -19926, -45626, -20876, -272, -14039, 6720, -10324, -64900, -157954]
1732a57954J15979L3465J0621m7743M5391N0472j30191q286K1241N616N1551J8839
1720I001k6407m4683n4948Q810o1358K26P1824N13L6018L6152k1473J3858l6752
1707f9219Q0652P378n5666K4117r498j2778p23J1382n9529N130K6872n1988K6113
1694g7757k582r369J39154k0673q4554n6668K7857M9935o0540J2905q708O3676
1682b7324j6576K8810j7342K8190L0732o6314o5026P9431o6908q54M3089M097
1670d5995J6820n4850K985j6435P5705Q608n0202J4488m2812L9369K5115j6919
1658d4123o9861L279N9102l7136Q61J4584j049Q727m193J5214o786r0513N1722
1645a00172m178L8228o5893M6093O6750r643N2379q5536K7586N1294q2230j0509
$$ y = [-157954, -41975, -8510, 2111, -45632, -241, 50231, -79960, -88246, -67005, -61389, -9838, 9001, -17406, -62089, -117037, -108227, -169585, -169359, -97535, -97022, -61004, -24852, -46325, -32467, -69219, 11433, 18811, -36855, -12738, -22236, -35014, -35737, -24355, -83884, -78754, -51882, -103870, -77757, -80339, -89708, 49446, 28773, -55781, -112449, -84592, -34657, -95197, -82292, -91000, -27324, -43900, -15090, -32432, -4242, 26490, -39824, -104850, -25419, -92327, -93181, -50092, -45995, -29175, -84025, -81040, -97475, -21770, -13162, -63364, -48876, -91688, -52319, -27204, -44123, -113984, -110705, -51603, -88739, -87878, -73294, -74343, -65616, -69809, -54595, -61381, -151894, -100172, -104350, -66122, -132015, -85922, -19172, -28815, 23564, -61972, -34386, 16908, -65322, -75831]
1633g5831l5462N9639L1452j4867M670r204j5157J1213J0072L0225r4977L0012
1621f8215N2533N5052q2406n194O4631j5032J7587l4721P099N5087n9068p3712
1609h6359J9305J5966L94l1028R4966k4004J632l0642j3390L6441n1118P106L589
1596e7142n2489M1369J9422N6108q3632l5163J9880k1141N2627P790n338J5033
1584d2676N4742M572q7653N860R989Q996J2798J2271L5541k1040j4097J8078j57362
1571a59981K8221N4565J19873L6845p1154K0395o5676r929o7937j7075J03307
1560b8546J7816J15988o0060n2364N4778j34982P2260J5953n766l3901o4961J00238
1548c547l8626j5964l1549J7017P2258n5297k028J4363l612M8937n7944K3810
$$ y = [-75831, -111293, -51654, -20202, -35069, -30399, -39603, -54760, -43547, -33475, -3250, -98227, -68215, -15682, 39370, -43036, -48230, 16401, 1369, 18956, -15765, -8666, 46421, -12647, -86359, -67054, -51088, -50694, -81722, 13244, -10760, -9128, -39770, -53160, -16719, -67837, -60731, -57142, -109631, -68262, -48840, 7268, -76364, -111527, -91647, -112788, -60161, -52371, -57709, -42676, 12066, 16638, -71015, -65155, -55166, -46170, -33372, -21101, 14440, -6600, -20697, -2619, -159981, -131760, -77195, 42678, 79523, 8369, 28764, -36912, -46841, -114778, -131853, -28546, -10730, 105258, 45198, -7166, 47612, -87370, -15110, 843, -4923, -38824, -103785, -3547, -42173, -58137, -89686, -72669, -411, -55708, -57736, -43373, -46985, 1952, -55992, -32182]
1536c2182k8762k0119M7050n2248N8658K0336K8793m1082o4941M0175m3693j8634
1524a06649P2050l1441m8498N1115O6217p1590N8881O2139n2331K3594l0226J0887
1512D148m0120n1119M6164n3921N6295j5408M8026J9591j00803J14201k5601p7683
1500g6230k4030L6069P8538p7060j9435P0690J3688N6299o2194q8980K7039N642
1488e9964K4652q0731Q5705k7416p630J8396n6310L2332l6600O17O5013j7178
1476e9114J5806o5422O1410Q7494J6809J1322n4844P1675k2235o2758N807l0729
1464b4779J3400j4721M0671p199p7042Q5768l724O216r2341o0008N9873J5277
1452e8609K4224N813M24P31o2512N8756j4305l3339P7952l3990R5082p6763l8949
$$ y = [-32182, -60944, -81063, -34013, -86261, -27603, -7267, 21526, -19556, -84497, -44322, -88015, -106649, -34599, -66040, -114538, -63423, 2794, -68796, -9915, 52224, -107, 23487, -6739, 4148, -35972, -87091, -40927, -94848, -38553, -53961, -5935, 13656, -87147, 27054, 1453, -76230, -100260, -64191, 14347, -62713, -82148, -11458, 2230, 58529, -3665, -92645, -65606, -59964, -35312, -116043, -30338, -57754, -65384, -46988, -103298, -70966, -107566, -106949, -41936, -59114, -43308, -108730, -47320, 40174, 56983, 68305, 13461, 85136, 62901, 143, 5950, -24779, -11379, -26100, 14571, 7372, -69670, 16098, 12374, 18590, -73751, -133759, -73886, -58609, -34385, -28572, -28148, -27417, -89929, -31173, -45478, -78817, -865, -34855, 60227, -16536, -55485]
1439e5485p1025L8151J20804p5591m462l0219m1404J11796k2755L717l7369j4284
1427g8126P2007l1646L8415J0508M1262k2905j3027M395j07850M2453M5731p2939
1415g1722J7179J194Q4848k0239m85k9927m9969M2227q7686L7185L8797K351Q3005
1402D6758q0223M7907K5928o5251j5275k892p715o8679J5830J23629j1977L9105
1390D7145q0539p0353q3579j2396J16013M5401N6981k8515M7811M1074j22817
1379d3774l680M5453l2500P9938j278m098m1985L5598l6973j06873M3015o2516
1367a29673P4394M346R2951L8561o4485M289n2180q7468j6564K3127Q1809j8577
1355d9470L1646K9024l0509k7046j07126N1670N994O9226Q3479j0081K1605n3184
$$ y = [-55485, -126510, -88359, 32445, -43146, -47608, -77827, -119231, -7435, -30190, -26473, -63842, -78126, -6119, -37765, 650, 11158, 52420, 29515, 16488, 20883, -86967, -44514, 1217, -71722, -54543, -53349, 31499, 11260, 10775, -19152, -69121, -26894, -114580, -77395, -38598, -36247, 46758, -33465, 14442, 40370, -24881, -40156, -43048, -50763, -119442, -103612, 20017, 8040, 47145, -33394, -103747, -187326, -199722, -83709, -38308, 18673, -9842, 37969, 79043, -43774, -47454, -2001, -34501, 45437, 44159, 40061, -1924, 33674, -3299, -110172, -67157, -129673, -55279, -50933, 42018, 80579, 16094, 20383, -31797, -119265, -135829, -112702, -30893, -49470, -17824, 11200, -19309, -46355, -153481, -101811, -95817, -26591, 56888, 46807, 68412, 15228]
1343A5228j6735n6669r4083J01525J8021J5277K6172M233L3717j59930K3395q555
1331i8404R073P8218l6966L3680K2795J7915j4704j36357l1048N7451P9375k5571
1319d4543o5141M3801o2906M3440p289j8504M4233l9243O3497P1457M1418J5893
1307H6113j54067o588K8956M4450m020n4695m480l9474R1209O3654p1200L0380
1295A0238q4059N3223L8361M7519l7564p5447M5567L7315j14341o0539K4877O9009
1283d5841O8409n7936j9671M3415m2267j7480K8243L7217J0404R865k8555J267
1271a2930N4235O793o4136o2945O3559o995L3690j7040j7233L193q2957J675P485
1258i3606O2489Q9159l3215J5253L232l4965j563l1579K7304n2548Q4379k2939
$$ y = [15228, -1507, -58176, -152259, -50734, -32713, -17436, 8736, 12969, 46686, -113244, -89849, -98404, -89331, -11113, -48079, -14399, 8396, 26311, 11607, -124750, -155798, -98347, -18972, -44543, -109684, -65883, -128789, -85349, -92638, -111142, -66909, -106152, -42655, 28802, 70220, 86113, -67954, -74542, -45586, -1136, -5156, -59851, -64331, -103805, -12596, 51058, -20142, 10238, -73821, -20598, 17763, 65282, 27718, -47729, -2162, 35153, -79188, -139727, -114850, -45841, 22568, -35368, -55039, -11624, -53891, -71371, -43128, -5911, 4493, 14358, -14197, -12930, 41305, 48098, -16038, -78983, -15424, -22419, 11271, -5769, -23002, -19809, -102766, -101091, -93606, -31117, 58042, 24827, 40080, 43312, 8347, 6784, -24795, 2509, -50039, 34340, 11401]
1246A1401l5834K0947j06323M5419P3758j267l140o997k6490M1439j3677K2636
1234B1872o3677n556K1938J206k2670J0917N9439l3059r016k1767J8613P570N3221
1221C9031O7123j9767j4886j38010m2758N3188J4088k7605J9778M9569j7376M582
1209a3043P8607p6141l5805L3775M2714K1479p0162m7962M8403M0259k8341r3207
1197i9424Q362P8599O596M1463k769l4234K1531n1053K9440k2611r694J7584O3767
1184D7557m455R633l9369o9077N2001L294L7102K2958n5991m2n8252J0159j0751
1171e5233J2139J148J6523J19312j1001n9487n716K196l8952J778m9998L4226
1159c3065q356M5421J8202R559l1191q9860o640K6185N3493j3593k2273o60O229
$$ y = [11401, -24433, -3486, -109809, -64390, 9368, 8101, 4961, -2036, -28526, 12913, -764, 21872, -41805, -47361, -25423, -24217, -46887, -35970, 23469, -9590, -18606, -40373, -21760, -14190, 39031, 106154, 86387, 71501, -66509, -109267, -56079, -41991, -69596, -49818, -249, -17625, -13043, 65564, -10577, -46382, -12607, 30107, 51586, -18576, -66538, -18135, 22124, -6217, -99424, -91062, -12463, -5867, 35596, 32827, -1407, 20124, -30929, -1489, -24100, -33794, -16210, 47557, 43102, 52735, 13366, -55711, -3710, -416, 36686, 59644, 3653, 3611, -54641, -44482, -55233, -43094, -41946, -25423, 93889, 82888, 23401, 17685, 19881, -19071, -17293, -67291, -33065, -41421, 4000, 22202, 31761, 570, -89290, -95930, -69745, -16252, -29845, -52118, -52778, -46549]
1146d6549K2891q417o749o0217l0999P4127K3812K6097m540j3030J4824j5996
1134b4746r852n897R050l2146Q8067P4731O333n6081j9685J6109J7167n5158L9844
1121D7736n446n5518n1075J7188O6263k6162K377m909k3867l0798O423L8608L3542
1108A4362k4136j4898j9731K808O6185r101K8884p2137l2938K4366J23279J790
1096H8733j14051J8528N6339K7041n4605m7855O289J6871k6035J5360j2811J4237
1084a1959R8151n5888n7520J6927j7574K8152Q7913n63k7726l5834p2776l3179
1072h1876J6926Q4293J6055Q0710m7841r4614k8051n744m801L7571N9577K7171
1060E9376m8648j6788k5772j0490L4107M1701J5388P425M0940m772j22537q2462
$$ y = [-46549, -23658, -32075, -38824, -99041, -130040, -55913, -32101, -6004, -10544, -23574, -8750, -24746, -34598, -40495, -31445, -63591, 24476, 99207, 105540, 49459, 29774, 45883, 63050, 7892, 47736, 42290, -13228, -64303, -47115, 19148, -7014, -4637, -9546, -33413, -64211, -57788, -19180, 14362, -9774, -24672, -44403, -41595, 24590, 15489, 44373, -27764, -60702, -36336, 86943, 88733, -25318, -6790, 49549, 76590, 21985, -25870, -19581, -2710, -28745, -13385, -26196, -11959, 86192, 30304, -27216, -10289, -27863, 289, 88202, 87639, 59913, 24079, -48697, -81876, -64950, 19343, 35398, 116108, 68267, -26347, -54398, -60142, -64943, -27372, 32205, 59376, 10728, -6060, -31832, -42322, -8215, 33486, 48874, 56299, 97239, 92467, -30070, -112532]
1048a12532j9667J13387R4842l8044J522O987P602m5843j2099N0744m5757K4845
1036B5987Q633k155O2024q952J90o6330l1836J0547o5715Q7122k5271M3246M4484
1023H1974q605k7814j06635O0376p571j2637K6467l695N2689m9715K636l6677
1011b9207K424P4281j17450O5330M0358M1182O6417j10525R33Q475n0882K2095
999A3431k1563j0530k6962Q0984j5985K5315p3999p76Q0532l2517n7819P8183
987C8294L379j7802k5055M9266o695m9927J9040o0769Q3479k9687p404K0015k9032
974a2898L1903L0500o732k2374o0896J5152K760M9384l4824j5710J27962n5904
962D8323P187L0533n7771M1968j0469j6030k2491L9685K7034q0449j6070M9980
$$ y = [-112532, -132199, -18812, 76030, 37986, 39508, 46495, 54097, 8254, -3845, 46899, 1142, 25987, 34620, 32465, 94489, 85537, 85727, 19397, -12439, -1892, -67607, 19515, -5756, 37490, 81974, 73369, 45555, -61080, -704, -8275, -20912, 5555, 1860, 54549, 4834, 7470, -29207, -26783, 47498, -69952, -4622, 35736, 76918, 143335, 32810, 33743, 42218, -8664, 13431, -8132, -18662, -45624, 35360, 19375, 44690, -29309, -30085, 50447, 17930, -39889, 38294, 41673, 23871, -1184, 48082, 41387, -8540, 10500, -50269, 33210, 3523, -3881, 16134, -12898, 19005, 49505, 42773, 20399, -40497, -25345, -22585, 26799, -8025, -23735, 104227, 48323, 55510, 86043, 28272, 70240, 59771, 43741, 21250, 60935, 87969, 7520, -8550, 41430]
950D1430j9909J8291Q126R2710l7665l8894k1343q5275K3372n5689m5286M7751
938g2381M8839K9684L4279R2101p7929m9338K870k3444k9053q864J18101L3564
926I8429K9657k0348n5250l7538p0464J5435O3064k1904O3838J0025N8078n5665
914G7357j50419Q2536j7994n8667P467R6214P9650q9749l0824m2831J7311J4249
902a5700l7563O5973J6429O3303L1872m0634q6691l5317M1829m3982K3984J22173
890A05676o2512O9042j6291j29189r955j9951J15107L393L011N6046M8448k014
878A60811j63735K2339P054p881O3727r5647J16454L7019n9157n1551j10995L99
866h1163k6680O0401O9550L1624J11612j58091J1622L7911l5390k5878m8532N3435
$$ y = [41430, 21521, 39812, 47938, 140648, 102983, 64089, 42746, -42529, -19157, -74846, -120132, -72381, -23542, 6142, 40421, 132522, 54593, 5255, 8125, -15319, -44372, -53236, 64865, 98429, 128086, 107738, 52488, 14950, -55514, -40079, 22985, 1081, 64919, 74944, 133022, 77357, -73062, 9474, -8520, -67187, -59720, 36494, 116144, 26395, -4429, -47260, -29949, -15700, -53263, 12710, 29139, 92442, 124314, 83680, -3011, -38328, 3501, -40481, -16497, 105676, 43164, 112206, 95915, -33274, -43229, -63180, 51927, 55320, 58331, 114377, 162825, 160811, -2924, 19415, 26469, 18588, 82315, -13332, 103122, 140141, 80984, 29433, -81562, -81163, -107843, -47442, 22108, 53732, 165344, 7253, 18875, 56786, 21396, -4482, -53014, 421]
854D21J3435l3782L2150n2989l6770J0679J1969Q4145l0965L1474m697j881Q4502
841A07691p5287J8090l9205r580J2019R1490M7579j21961m4198q2494K6965L7034
829c1857K1844Q9134q8425J3907J30976r7072k1400n2759j8988l643L7635Q1475
817F0827L956k9457j834j524R939k3793N731m3670J12759K241j21051N6394n3784
804b3266M2456r618p5960Q6746p181K5721J43j8973j094j31109P4690P6934l9397
791I2O9427M03m3278n5349L2673k4263n0942Q7330Q767k089N045j2091K9391m9976
777d860P9931r834k3253m64p956O6234q1517k7957Q3226l4653k0743k285J30046
764A45915m7019p8770M5190l6199K2413n7948J2339l380k1379R1622j314l3998
$$ y = [421, 13856, -19926, 12224, -40765, -77535, -66856, -54887, 29258, -1707, 29767, 25070, 23189, 107691, 32404, 50494, 11289, 1709, 13728, 105218, 152797, 30836, -13362, -95856, -68891, -31857, -10013, 79121, -9304, 4603, 135579, 38507, 17107, -35652, -54640, -58283, -20648, 60827, 64783, 35326, 33492, 31968, 41907, 18114, 23845, -19825, 92934, 95175, -25876, 30518, -23266, 19190, 9572, -66388, 20358, 13177, 38898, 39041, 20068, 18974, -112135, -37445, 39489, 92, 69519, 69922, 26644, -28705, 3968, -20295, -71237, 16093, 24860, 22771, 27816, 15725, 45116, -4860, 75071, 65237, 41984, 41520, 33564, 99798, 18281, -9676, 73550, 38897, 18154, 15869, 145915, 98896, 20126, 65316, 29117, 51530, -6418, 5921, 2541, -18838, 72784, 71470, 37472]
752C7472J1542n3320J13612m1207j7950p22M3458L0193j09648L6063K5736m3281
740C1948L3861p2512O8796L1466K0186J7620n5706M1275m1604j1666q2001j1878
728c0215J00214r0013K1031L5525p8265l246l8319J11696l5414k7238P0391l3805
716B342J3474J3890N2537j2662k4117j2500k3612O7161m9094l1225l436l2102
704c9344J15251J2310l2413K2872l0319J9251m5624L8862N2717k7970O1570q1631
692F5532M2324n0166k3051M6885j37131M3562N0395L1937k447k4852K1373k1921
680D2440p889j9673j7864m2489j2824J33914k8287m126O037l896O912m2432p6441
667f6618J02603R8691K9852l3048J4401p066l8571j7401n1724P8132n5645l4568
$$ y = [37472, 49014, -4306, 109306, 68099, 50149, 49427, 92885, 123078, 13430, 49493, 75229, 31948, 65809, -6703, 62093, 93559, 113745, 131365, 75659, 116934, 75330, 63664, -18337, -30215, 69999, -20014, 1017, 36542, -41723, -44969, -83288, 28408, -7006, -34244, 36147, 2342, 15816, 29706, 82243, 69581, 45464, 32964, 9352, 76513, 27419, -3806, -7242, -39344, 75907, 88217, 55804, 78676, 48357, 67608, 21984, 60846, 113563, 85593, 147163, 65532, 107856, 57690, 34639, 81524, -55607, -12045, 38350, 70287, 67840, 42988, 64361, 42440, 34551, 14878, -2986, -45475, -58299, 75615, 47328, 43202, 49239, 45343, 52255, 9823, -66618, 35985, 134676, 164528, 131480, 145881, 138815, 100244, 82843, 31119, 109251, 53606, 19038]
655A9038N5850l723K3728o2125p0521J06021o7570l0398k2839R3104O4203l4591
643G0177n683o71j0042o3779n7821R1939o2182J7820O8988L4409n5947o6048Q9736
630E0896l6809M8472M720K9262O2645o2130k4069N837n5194j9308j065N4240m5367
617A2130M1636Q1853n5001k1485r3262M7012N2702J793P9037o792l9609Q27n9651
604D1190K3167l1086j294l2088o0398J46435k0200k5345l4420N6972j5231l6008
592A1694P5600P8999j2925m8410J0413L538j16157M405L3096K019k1571m8008
580b7307M8811L851K6166m0073j7230J4938l720L7639n0838m4720J09420J01117
568A58054m1917j13735J5250P3361l9293O0688J457n02m127Q305q1249q2485M0449
$$ y = [19038, 74888, 71165, 94893, 32768, -37753, 68268, 698, -29700, -52539, 40565, 104768, 70177, 64494, 63823, 53781, -9998, -67819, 24120, -38062, -20242, 48746, 83155, 27208, -38840, 50896, 14087, 62559, 67279, 96541, 159186, 97056, 72987, 78824, 23630, 4322, 3257, 57497, 12130, 53766, 135619, 80618, 59133, -34129, 12883, 65585, 67378, 146415, 139623, 100014, 100841, 41190, 64357, 33271, 31977, -111, -60509, 85926, 65726, 40381, 5961, 62933, 47702, 11694, 87294, 166293, 153368, 104958, 115371, 118909, 2752, 7157, 40253, 42272, 20701, -27307, 21504, 25355, 51521, 11448, -5782, 9156, 5436, 43075, -7763, -52483, 56937, 158054, 116137, 2402, 17652, 91013, 51720, 112408, 113865, 113363, 109236, 117541, 36292, -46193, -5744]
555e744O5591k8871J3799m8723M3094l853o3148R2445j1476P1479m5126o198Q3911
542A57180n4965k6379n3314n6571O5134l5247j5871J3536Q1086L9676n4194m5778
530A4293n9529K1359J10086R237m8962n1344P9923P5751l8069p6044k5261r299
$$ y = [-5744, 59847, 30976, 44775, -3948, 39146, 35293, -27855, 64590, 53114, 124593, 79467, 73269, 157180, 102215, 75836, 22522, -34049, 31085, -4162, -20033, -6497, 74589, 114265, 60071, 14293, -45236, -23877, 86209, 95446, 46484, -4860, 75063, 150814, 112745, 36701, 11440, 2141]
$$ [...]
##END NTUPLES=NMR SPECTRUM
##END=
