##TITLE=1H_DE-80H_X3
 200.13MHz, d2o
 8 sc
 
 19ns.26.2.2025
##JCAMPDX= 6.0         $$ Bruker NMR JCAMP-DX V2.0
##DATA TYPE= NMR SPECTRUM
##DATA CLASS= NTUPLES
##ORIGIN= UXNMR, Bruker Analytische Messtechnik GmbH
##OWNER= pz
$$ XWIN-NMR		Version 3.5
$$ Tue Jul 14 10:43:35 2026 Russian Standard Time (UT+4h)  Yarkov@DPX200
##.OBSERVE FREQUENCY= 200.1313
##.OBSERVE NUCLEUS= ^1H
##.ACQUISITION MODE= SIMULTANEOUS
##.ACQUISITION SCHEME= undefined
##.AVERAGES= 8
##.DIGITISER RES= 18
##SPECTROMETER/DATA SYSTEM= spect
##.PULSE SEQUENCE= zg30
##.SOLVENT NAME= DMSO
##.SHIFT REFERENCE= (INTERNAL, DMSO, 0, 15.4979)
##AUDIT TRAIL= $$ (NUMBER, WHEN, WHO, WHERE, WHAT)
$$ ##TITLE= Audit trail, XWIN-NMR		Version 3.5
$$ ##JCAMPDX= 5.01
$$ ##ORIGIN= Bruker BioSpin GmbH
$$ ##OWNER= Yarkov
$$ C:/Bruker/XWIN-NMR/data/yarkov2/nmr/H-C/1/pdata/1/auditp.txt
$$ ##AUDIT TRAIL=  $$ (NUMBER, WHEN, WHO, WHERE, WHAT)
(   1,<2026-07-14 10:42:04.06 +0400>,<Yarkov>,<DPX200>,
      <created by zg, POWCHK disabled, PULCHK disabled
       configuration hash MD5:
       00 E9 B6 7A A2 85 ED C7 34 08 36 98 17 FE 4E 26
       data hash MD5: 16K
       ED C4 7D 23 80 5E D0 3E 23 8D 38 51 8B BE 05 81>)
(   2,<2026-07-14 10:42:20.70 +0400>,<Yarkov>,<DPX200>,
      <Start of raw data processing
       efp BC_mod = 2 LB = 0.25 FT_mod = 6 PKNL = 1 PHC0 = -7252.948 PHC1 = 6.42196 SI = 16K 
       data hash MD5: 16K
       8A 9A FA DC CA 80 C6 DA C4 75 21 C5 66 0F 44 5B>)
(   3,<2026-07-14 10:42:44.10 +0400>,<Yarkov>,<DPX200>,
      <pk PHC0 = -2.974289 PHC1 = 1.000004 
       data hash MD5: 16K
       F9 05 64 F4 35 43 DF FC 09 3E 7B 5B AD 88 68 72>)
(   4,<2026-07-14 10:42:47.29 +0400>,<Yarkov>,<DPX200>,
      <abs ABSG = 5 
       data hash MD5: 16K
       AE EF 36 E2 E8 31 35 6E F3 18 DC 46 07 58 22 51>)
$$ ##END=
$$ 
$$ hash MD5
$$ CD 56 AC E9 7B E6 62 9D 66 9A 72 9D 73 E4 D0 16
##$RELAX= 
##$RELAX= 
##$RELAX= 
##$RELAX= 
##$RELAX= 
##$RELAX= 
$$ Bruker specific parameters
$$ --------------------------
##$DU= <C:/Bruker/XWIN-NMR>
##$EXPNO= 1
##$NAME= <H-C>
##$PROCNO= 1
##$TYPE= <nmr>
##$USER= <yarkov2>
##$AMP= (0..31)
100 100 100 100 100 100 100 100 100 100 100 100 100 100 100 100 100 100 
100 100 100 100 100 100 100 100 100 100 100 100 100 100 
##$AQSEQ= 0
##$AQ_mod= 1
##$AUNM= <au_zg>
##$AUTOPOS= <>
##$BF1= 200.13
##$BF2= 200.13
##$BF3= 200.13
##$BF4= 200.13
##$BF5= 200.13
##$BF6= 200.13
##$BF7= 200.13
##$BF8= 200.13
##$BYTORDA= 1
##$CFDGTYP= 0
##$CFRGTYP= 5
##$CHEMSTR= <none>
##$CNST= (0..31)
1 1 145 1 1 1 1 1 1 1 1 1 1 1 1 1 1 1 1 1 1 1 1 1 1 1 1 1 1 1 1 1 
##$CPDPRG= <>
##$CPDPRG1= <>
##$CPDPRG2= <>
##$CPDPRG3= <>
##$CPDPRG4= <mlev>
##$CPDPRG5= <mlev>
##$CPDPRG6= <mlev>
##$CPDPRG7= <mlev>
##$CPDPRG8= <mlev>
##$CPDPRGB= <>
##$CPDPRGT= <>
##$D= (0..31)
0 0.7 0 0 0 0 0 0 0 0 0 0.03 0 0 0 0 0 0 0 0 0 0 0 0 0 0 0 0 0 0 0 0 
##$DATE= 1784011323
##$DBL= (0..7)
120 120 120 120 120 120 120 120 
##$DBP= (0..7)
150 150 150 150 150 150 150 150 
##$DBP07= 0
##$DBPNAM0= <>
##$DBPNAM1= <>
$$ [...]
##$SUBNAM3= <"">
##$SUBNAM4= <"">
##$SUBNAM5= <"">
##$SUBNAM6= <"">
##$SUBNAM7= <"">
##$SUBNAM8= <"">
##$SUBNAM9= <"">
##$SW= 18.0517328524113
##$SWIBOX= (0..15)
0 0 2 0 0 0 0 0 0 0 0 0 0 0 0 0 
##$SW_h= 3612.71676300578
##$TD= 16384
##$TD0= 1
##$TE= 0
##$TE2= 300
##$TE3= 300
##$TEG= 300
##$TL= (0..7)
0 120 120 120 120 120 120 120 
##$TP= (0..7)
150 150 150 150 150 150 150 150 
##$TP07= 0
##$TPNAME0= <>
##$TPNAME1= <>
##$TPNAME2= <>
##$TPNAME3= <>
##$TPNAME4= <>
##$TPNAME5= <>
##$TPNAME6= <>
##$TPNAME7= <>
##$TPOAL= (0..7)
0.5 0.5 0.5 0.5 0.5 0.5 0.5 0.5 
##$TPOFFS= (0..7)
0 0 0 0 0 0 0 0 
##$TUNHIN= 0
##$TUNHOUT= 0
##$TUNXOUT= 0
##$USERA1= <user>
##$USERA2= <user>
##$USERA3= <user>
##$USERA4= <user>
##$USERA5= <user>
##$V9= 5
##$VALIST= <valist>
##$VCLIST= <CCCCCCCCCCCCCCC>
##$VD= 0
##$VDLIST= <DDDDDDDDDDDDDDD>
##$VPLIST= <PPPPPPPPPPPPPPP>
##$VTLIST= <TTTTTTTTTTTTTTT>
##$WBST= 1024
##$WBSW= 4
##$XGAIN= (0..3)
0 0 0 0 
##$XL= 0
##$YL= 0
##$YMAX_a= 430587
##$YMIN_a= -542458
##$ZGOPTNS= <>
##$ZL1= 120
##$ZL2= 120
##$ZL3= 120
##$ZL4= 120
##$ABSF1= 15.56069
##$ABSF2= -2.491161
##$ABSG= 5
##$ABSL= 3
##$ALPHA= 0
##$AQORDER= 0
##$ASSFAC= 0
##$ASSFACI= 0
##$ASSFACX= 0
##$ASSWID= 0
##$AUNMP= <proc_1d>
##$AZFE= 0.1
##$AZFW= 0.1
##$BCFW= 0
##$BC_mod= 2
##$BYTORDP= 0
##$COROFFS= 0
##$CY= -3
##$DATMOD= 1
##$DC= 0
##$DFILT= <>
##$DTYPP= 0
##$F1P= 0
##$F2P= 0
##$FCOR= 1
##$FTSIZE= 16384
##$FT_mod= 6
##$GAMMA= 0
##$GB= 0
##$INTBC= 1
##$INTSCL= 3.241238e-09
##$ISEN= 128
##$LB= 0.25
##$LEV0= 0
##$LPBIN= 0
##$MAXI= 10000
##$MC2= 0
##$MEAN= 0
##$ME_mod= 0
##$MI= 1.114404
##$NCOEF= 0
##$NC_proc= -5
##$NLEV= 6
##$NOISF1= 3.799351
##$NOISF2= 2.8
##$NSP= 0
##$NTH_PI= 0
##$NZP= 0
##$OFFSET= 15.4979
##$PC= 1
##$PHC0= -7255.922
##$PHC1= 7.421964
##$PH_mod= 1
##$PKNL= yes
##$PPARMOD= 0
##$PSCAL= 0
##$PSIGN= 0
##$REVERSE= no
##$SF= 200.130004762852
##$SI= 16384
##$SIGF1= 3
##$SIGF2= 2
##$SINO= 0.751879
##$SIOLD= 32768
##$SREGLST= <19F.Aceton>
##$SSB= 0
##$STSI= 16384
##$STSR= 0
##$SW_p= 3612.71676300578
##$SYMM= 0
##$S_DEV= 0
##$TDeff= 16384
##$TDoff= 0
##$TI= <>
##$TILT= no
##$TM1= 0
##$TM2= 0
##$TOPLEV= 0
##$USERP1= <user>
##$USERP2= <user>
##$USERP3= <user>
##$USERP4= <user>
##$USERP5= <user>
##$WDW= 1
##$XDIM= 16384
##$YMAX_p= 299478073
##$YMIN_p= -149248
$$ End of Bruker specific parameters
$$ ---------------------------------
##NTUPLES= NMR SPECTRUM
##VAR_NAME=  FREQUENCY,     SPECTRUM/REAL,   SPECTRUM/IMAG
##SYMBOL=    X,             R,               I
##VAR_TYPE=  INDEPENDENT,   DEPENDENT,       DEPENDENT
##VAR_FORM=  AFFN,          ASDF,            ASDF
##VAR_DIM=   16384,         16384,           16384
##UNITS=     HZ,            ARBITRARY UNITS, ARBITRARY UNITS
##FACTOR=    0.220516191357247, 1,           1
##FIRST=     3101.59480264645, 0,            0
##LAST=      -511.121960359331, 0,           0
##MIN=       -511.121960359331, -149248,     0
##MAX=       3101.59480264645, 299478073,    0
$$ Real data points
##PAGE= N=1
##DATA TABLE= (X++(R..R)), XYDATA
$$ [...]
9387 92936 89948 94668 95145 98948 89522 113276 148189 137848 141943 93734 117089 111006 62328
9374 62328 70088 104853 148547 136234 92980 88975 89554 85285 92074 106336 128882 73514 80864
9361 80864 84115 97525 108832 121060 77559 50876 112793 161819 118963 124904 127952 105746
9349 105746 86974 102522 110411 119847 96242 102454 107382 86293 69321 92226 75612 75876 64978
9336 64978 58781 86635 135069 123225 129127 111045 100323 111694 102545 112752 77835 92174
9324 92174 96012 90578 104964 125560 108008 133710 120231 72167 99198 116719 102992 106153
9312 106153 61894 92300 114717 97667 105337 108013 85709 80122 106396 96032 84997 37431
9300 37431 42913 63477 99323 113858 120994 127636 109195 97969 111159 110794 109644 115543 81191
9287 81191 83650 64595 80878 98102 125426 111288 102816 76767 57406 60625 47620 43992 63000
9274 63000 67625 52876 35501 23080 29093 61118 71247 80255 73903 60078 47835 28205 19134
9261 19134 31572 90650 63278 42183 56033 67585 64627 70082 46603 30736 23214 44235
9249 44235 69161 64775 72977 58325 76084 58210 66786 78646 113944 84192 34780 40110 62328
9236 62328 64717 40656 67510 104493 95153 59983 47446 73678 74086 50988 71319 40726 40645
9223 40645 45199 20487 31696 33576 42071 50760 81689 91147 78035 83110 89112 63106 58521
9210 58521 38162 51587 63009 56021 34757 5637 23192 22801 19637 38694 10816 39995 70999
9197 70999 49453 39069 94054 71599 47302 54457 54119 42375 36221 66106 60777 63609 36501
9184 36501 11045 65020 82109 44663 30094 41035 36670 55595 78968 59735 37985 54964
9172 54964 52463 46000 59282 52657 44562 26672 22610 13160 31118 34002 33821 33466 60476 75184
9158 75184 68634 46410 78673 74745 61594 28766 32112 36012 53310 36585 20727 43293 68296
9145 68296 89799 87630 43917 73953 60905 59613 48184 45363 49368 49018 61923 66933 55675
9132 55675 45095 30846 39819 46209 57641 37765 29150 68893 31769 12153 39347 41429 49285
9119 49285 89036 90172 81362 79754 63866 55344 74720 64070 63898 59012 78655 112592 87148
9106 87148 100217 74302 42270 74137 75628 47478 86197 67736 22503 25907 29591 46928
9094 46928 69470 64947 44726 60020 89262 116368 113670 81856 99525 135916 138035 126290
9082 126290 115930 146715 139382 135622 100000 94844 110627 119782 90869 97133 128052 123177 93615
9069 93615 84738 90953 107542 115045 118978 108271 109215 92156 110591 118278 133996 137058 130360 106406
9055 106406 119141 138845 122768 94582 93367 114117 137117 129902 168756 142674 135607 132381
9043 132381 160606 143916 103000 121857 123974 130054 145693 146129 103145 113387 115314 94111 92804
9030 92804 92327 105844 105340 111231 109510 67919 63857 78432 99628 77834 50878 64910 90865
9017 90865 78261 65305 59033 67227 64941 51745 45084 42549 47904 71596 56188 53215 76800
9004 76800 67572 37777 65655 115234 86395 103527 100533 67949 94785 131371 151832 147247
8992 147247 206271 208212 186429 204363 211202 204014 227090 197929 131863 117542 130541 101146
8980 101146 89416 73827 70018 84796 82809 51729 75710 103931 70694 40887 42114 35068
8968 35068 2236 24893 79777 87657 82493 75738 80909 77116 51748 22558 37316 49195 67951
8955 67951 42790 57448 51307 32601 38509 18249 54835 59273 87774 77542 25666 29884 23610
8942 23610 34753 79698 80911 79195 75736 64375 27863 15236 39464 28031 21381 44432 35985
8929 35985 48103 48537 40536 57010 68925 59533 73237 72458 73151 64219 47687 44586 58478 62501
8915 62501 57872 44689 48533 48386 24387 14847 42223 71148 51483 44462 25784 25734 17878 43639
8901 43639 45153 17759 28955 46107 62471 50149 52961 96000 79416 39251 39448 63033 47322
8888 47322 60772 54343 64270 55012 47775 77412 73032 91020 95250 73094 70143 76621 99612
8875 99612 93652 52075 51008 79368 49694 27972 55701 63466 116243 104710 53923 22432
8863 22432 46764 42041 65512 51883 48759 62749 39720 78514 86962 88520 119762 127359 101164
8850 101164 66029 95514 70567 28056 44761 54103 37397 6995 58275 71906 42668 49676
8838 49676 53709 40051 39241 6314 36119 34337 59379 91099 60356 65915 101161 96723 82131
8825 82131 80676 85444 90140 59356 64817 68544 62764 22610 16468 38141 56340 46146 76568
8812 76568 63329 49904 45143 48004 60737 71447 38569 24761 22046 33004 29385 37177 94266
8799 94266 66690 67366 91946 89962 39010 42257 35230 69529 88746 32676 50077 51504 50529
8786 50529 23946 40929 51186 74322 78154 41146 14301 25221 40055 25497 40087 35189
8774 35189 35749 53416 46056 48653 67971 71360 21354 41361 48735 28452 37446 29491 50772
8761 50772 56850 55624 53530 79665 49310 40893 31699 -3458 12804 25759 3946 27834 46281
8748 46281 31142 42912 88752 76211 43040 29021 24724 60890 82944 70975 45811 10777
8736 10777 -7828 18592 7807 -2844 20182 31259 37383 18570 -117 4682 9157 12881 17702
8723 17702 10901 3957 18746 25836 27510 30771 22385 11688 15694 20676 29973 64873 65345 53702
8709 53702 23667 26496 50711 42116 6404 13612 50111 62923 -6033 1576 23538 23785 5716
8696 5716 -11379 41372 47581 26072 21833 21999 29396 14332 16807 7271 -8704 -1462 5916 5192
8682 5192 36448 28399 8354 23705 6212 -3339 17246 5320 5610 34522 34983 10760 19035
8669 19035 18711 11575 -9143 -12513 -9120 -20107 11414 -12178 -21402 -28468 -24411 7266 5953 -1418
8655 -1418 41136 68043 61365 45635 41609 7556 24766 73861 48726 25136 34282 9263 -16985
8642 -16985 2565 -996 -40810 -8445 19134 25704 6424 9300 8813 -1265 -2141 -24289 4426
8629 4426 20179 35549 20720 19585 25546 26692 6351 13386 31841 35555 31137 25937 52156
8616 52156 34660 1312 -22729 18815 -11008 -15233 1898 -23659 -18546 12911 31384 19726
8604 19726 23729 3116 16330 23565 29000 -2804 -43149 -16694 -14305 27140 52526 93296 46310
8591 46310 26594 18331 9924 -35282 -13836 -9278 -24998 23059 26143 36204 29737 9460 30968
8578 30968 29626 42126 30020 4595 3480 10139 30710 32213 40123 43784 43971 44260 61517 53089
8564 53089 26558 37328 39901 -1167 -5831 -8099 38041 60629 32163 19590 45162 23107
8552 23107 44557 35501 51588 30850 17121 24421 8808 5920 13447 21169 30004 26091 16714
8539 16714 10251 8706 23821 17262 31276 64739 25995 40310 61717 50135 13963 -23693
8527 -23693 2090 44424 48649 -5935 -3524 7043 29592 13347 3204 35773 23699 27755
8515 27755 36571 31696 7805 -16271 36409 37146 35917 22668 13051 13903 23762 20589 -14318 -12340
8501 -12340 -41481 -35653 -27151 -7327 -360 30989 33713 10435 7032 19549 26824 26581 5727
8488 5727 13442 21599 -33139 24720 46323 42917 62092 34644 23492 16934 12832 5553 -3570
8475 -3570 -10838 -9111 15601 -345 227 25537 28649 7712 15891 7957 -18134 -12360 37634 31869
8461 31869 43923 70199 36545 41006 10655 25260 11095 -12699 -42344 -27445 -17551 -11607
8449 -11607 -3836 20865 38846 4414 -19347 -27023 20507 6330 -36851 -17522 23932 6601
8437 6601 1318 8427 7391 -1437 -24768 8141 574 -7663 -27381 -13052 -8564 5035 9404 -9342
8423 -9342 -2179 -25765 -16143 -27428 -17390 -44345 -19523 -15489 -15470 -14390 -10967 -10827 -9726 -30
8409 -30 -13629 -17231 -13988 15374 11264 -3990 -30193 -3276 21145 26462 63518 44648 30872
8396 30872 12037 -3872 7638 18835 -1427 -832 -14701 -29893 -47891 -14107 20037 6311
8384 6311 -18612 -38245 -41242 -26418 -3620 -17085 8313 -16011 4878 -1626 2533 10823 19613
8371 19613 16818 5298 -16816 -7979 22230 -9882 10384 27335 -11913 6091 -11619 -51441
8359 -51441 -47628 -29196 -2185 -21176 5280 -549 22252 -10654 -40839 -22107 -5799 25516
8347 25516 4886 -5197 12376 9818 375 4340 -12074 -62694 -61990 -77800 -56986 -30851 11805
8334 11805 13373 -10683 -5746 24474 36825 38216 31519 3292 -2286 2565 -15979 -37993 -10176
8321 -10176 -25105 -4333 47332 38648 41142 42404 28130 31679 13112 5818 16 8030 -5092
8308 -5092 13335 23252 26679 14 -6114 4477 -8967 -12532 -11017 -18544 -15807 -20283 -31154 -12954
8294 -12954 -12024 -6668 20999 -29964 -35020 -2169 -1457 4269 -9218 -4617 -16959 15151 32032
8281 32032 14937 12348 -4858 -17166 9442 9720 19871 51871 20370 11058 3208 1374 20908
8268 20908 -7229 -16170 7679 -2143 -7128 13752 -5289 -38346 -7533 -14595 -22323 -2189 -8019
8255 -8019 -18074 14245 21013 19376 80 6925 7697 -9398 11837 10942 468 -9320 14149 9221
8241 9221 -18228 -43323 -31432 -5262 -29085 -36018 69 8534 -20957 -4542 -36339 -22625
8229 -22625 -1998 -14227 -35891 -34019 -28135 -12557 11900 -37028 -12452 -917 -19435 -9078
8217 -9078 -1027 -854 33939 28948 20081 -4762 1115 9695 41556 20993 -13447 -8349 12473 22380
8203 22380 17076 -1087 14824 2405 8684 43562 46852 41584 61494 61575 183171 173387 -72578
8190 -72578 -78016 -53544 1003 -1577 7905 13438 11046 614 -19435 -6901 30023 4529 -40815
8177 -40815 -32430 9077 -10387 -27567 -24349 -19851 -1300 4148 11838 20942 11841 -40272 -56122
8164 -56122 -25644 33022 3307 -27993 -10990 -30286 -33031 -26069 -39652 -27915 -24206 4434
8152 4434 -7603 -53274 -50131 -14494 -7317 -28406 -39182 -1981 -3899 -22265 -21905 -19418 -21272
8139 -21272 -20265 -27726 -29949 -37535 824 8248 11574 -21083 -42883 14968 -1287 -29771 22682
8126 22682 13615 -12996 -6352 -12237 -27856 -20776 2938 -11534 -24603 -44499 -50360 -42304 -17611
8113 -17611 -24488 -9877 -667 1148 2120 -3265 -1059 -6484 -37058 -49147 -77345 -77514 -15281 -34384
8099 -34384 -12546 -10385 3953 7133 -12741 -6623 -9240 6920 6119 7988 12069 -11785 -13050 -9796
8085 -9796 -30573 -13747 -19283 -48142 -11571 -4106 -31737 -36716 -43548 -41806 -24829 -5776 -14873
8072 -14873 -10236 -13978 -1062 12388 -289 -15743 -18308 -27118 -34356 -10397 4555 -14104 -21680
8059 -21680 -33361 -42235 -44184 -46677 -32814 -2895 -26110 -22610 -1721 111 -8696 -28229 9500
8046 9500 12028 -4583 -6725 -772 -15636 -48297 -49989 -30642 -15192 -14877 -26661 -17050 13087
8033 13087 -13106 -28567 -2657 29043 -20992 -39656 -55312 -12773 11510 9248 22536 7629
8021 7629 9837 4881 -13494 -26593 -35726 -18946 -9388 -9203 -8982 -15574 -1430 -18942 -5106 -21728
8007 -21728 -7487 -21088 -12035 16852 5902 -8271 -34507 -11800 -13652 -5372 -29688 -46203
7995 -46203 -54285 -23402 -19120 -15507 -57224 -49120 -8512 -10660 -14332 -54942 -46013 -19672 -46158
7982 -46158 -29486 -1644 -18179 6964 15410 25386 -18996 -20231 -12871 579 -12608 -19988 10592
7969 10592 -21262 -33343 14370 -18017 20107 28841 19900 1584 -20020 -36558 -34070 -39925 -13740
7956 -13740 -10427 -27650 -9954 -9718 -36841 -36145 -32784 -52450 -39771 -31575 -21060 -28537 -7401
7943 -7401 14562 -1253 -50688 -53824 -51669 -31805 -45339 -51197 -25641 22411 -1513 -22910 -18473
7930 -18473 -22299 -20947 -18576 -19634 -7493 -15749 -35485 -23566 -27889 -67550 -17194 19045 -26322
7917 -26322 -30588 -21394 -1097 -4225 -7978 -19266 -20802 -16990 -28531 -9760 18466 -14409 -25268
7904 -25268 -52506 -61022 -43656 -26196 -11128 -5843 10574 19394 13347 7868 -7404 -6842 -13611
7891 -13611 4397 -4540 -9254 684 -14380 -6848 -26306 -51757 -67768 -53273 -58313 -10466 23006
7878 23006 -7959 -17219 -28052 -10248 -12251 -50405 -44655 -26826 -3726 -30286 -38340 -7689 21905
7865 21905 304 -13036 19956 -3079 -35964 -11767 6773 -4467 -29661 -36457 -14111 -3345
7853 -3345 -7618 -14132 105 -28615 -32336 -14300 18011 3265 -12124 -2419 -36145 -14359 29854
7840 29854 3266 -23968 -31685 -42667 -40949 -45295 -44715 -49107 -60249 -54151 -67941 -26816 -1311
7827 -1311 -4342 -34099 -50528 -36887 17583 46339 -17053 -40567 -10450 -1755 -15669 -35878
7815 -35878 -17102 -12327 -20381 -15467 -47886 -4688 -18199 -5487 10046 15487 -2280 10665 -9062
7802 -9062 -840 -48199 -34897 -120704 -106159 -42069 -60276 -18662 -18104 29435 26677 -31705 -64695
7789 -64695 -43834 -35351 -12260 -28622 -13227 -18656 8872 -13402 12694 2224 -25265 -36113
7777 -36113 -7235 412 -10932 19258 22254 32395 20530 4268 844 -4760 -19707 -38030 -18587
7764 -18587 -35776 -27407 -18278 -15443 -36045 -40573 -29938 -22263 5470 -126 -8432 4470 14652
7751 14652 -1750 5002 5658 -11559 -44881 -35399 -41067 -57657 -40656 -6687 -8003 -15961 -28511
7738 -28511 -34625 -28656 -20985 -28942 -40442 -65214 -50479 -19562 3308 10089 -27830 -14138 -4464
7725 -4464 -11797 -6335 6258 9943 -35405 -25939 -25231 -1974 -16371 -35925 -33903 -35457 -50584 -16119
7711 -16119 -13183 -9896 -12436 -23779 -7455 -29462 -37447 -47445 -24609 -17514 14918 -14274 -40245
7698 -40245 -38123 -21034 -40964 -26036 2267 -17228 -13295 -42285 -50494 -8774 -17787 -30613 -18569
7685 -18569 -11116 -45848 -25442 -11944 -30176 -54137 -40703 -27956 -51430 -28511 -35633 -45899
7673 -45899 -27904 -30463 -68577 -65526 -36565 -18183 -30518 -54823 -66976 -9408 -3050 -34599
7661 -34599 -17842 -11337 -30562 -46261 -16843 -19131 -28682 -48474 -45524 -22549 -11333 -5503 -14004
7648 -14004 1467 -7330 -33063 -33944 -22398 -17877 -5824 -12819 -15246 -12943 584 -3504 -14904
7635 -14904 -15286 -21649 -39678 -72454 -12472 12799 26590 6834 -21462 -7150 7433 24639
7623 24639 26456 5281 -27215 -30235 -23807 -1405 -28838 -18938 -27864 -23085 -7154 20270 32589
7610 32589 -3581 -34560 -14571 1481 11122 23831 2703 21099 8045 -6387 -42307 -33660
7598 -33660 -19861 -1667 5556 -2832 14431 21452 27258 39884 28519 15374 9698 -19504 -19847
7585 -19847 -32313 -40684 -26463 -5233 13915 35806 20768 -9993 -2113 -24867 -22625 -16170 1648
7572 1648 9157 17836 440 7153 22585 13761 -11196 -22781 -14844 -191 10064 -13 15557
7559 15557 13210 -25854 -11387 24231 14376 -5696 2696 10695 20569 30295 55069 55953 51013 68037
7545 68037 66950 100727 82013 85310 107801 143916 180995 194447 212504 264090 306455 375274
7533 375274 473214 578372 685447 830186 869545 843986 791980 775109 723234 573038 483100
7522 483100 423331 307864 233178 189178 136719 127671 132755 84526 80061 51721 28970 44118
7510 44118 37007 59771 44251 25969 25310 39515 42935 38076 37373 26854 32034 50293 42015 32028
7496 32028 37881 32349 40676 43075 23024 9701 10817 1215 -713 15201 4921 -2840 -10481 13782
7482 13782 24225 34183 33391 24356 9988 10450 24856 -13787 -45333 -19965 12717 -8604 12073
7469 12073 4882 -23381 -4556 -7489 -8097 -46089 -31816 6615 34717 45973 18309 -20371 -30538
7456 -30538 -6598 -23322 -58972 -17306 -30046 -4667 60561 27736 -12111 -21240 -59421 -66941
7444 -66941 -16708 16761 6233 18226 5427 -1523 8548 -31503 -31647 -19296 -12441 -21447 -30481
7431 -30481 -636 10681 -13530 -1518 -1004 -35054 -18494 -19506 -38706 -56184 -35340 1346
7419 1346 -9936 -41997 -32601 -48854 -68125 -34630 -32769 -25492 5336 1080 -487 -494 5598 5296
7405 5296 -27537 -50281 -38102 3773 -15575 -16504 23068 23011 28178 1401 -21262 2813 15843
7392 15843 -7271 -25725 1260 25323 -5032 -12760 -22658 -27806 -8801 -33852 -21061 -34710
7380 -34710 -17574 2209 -20237 -37539 -27238 -13385 3346 23054 26078 18516 10428 -19847
7368 -19847 -13865 -26515 -28239 -17193 11282 -7760 -40457 1333 30360 29782 20691 4623 -19455
7355 -19455 -8501 -7154 -15145 -13832 -20064 -38868 -13509 -10628 34063 45540 18160 -203 -31377
7342 -31377 -30396 -16502 -22631 -38392 -35392 -4784 -36686 -44121 -31198 -4337 -15286 -63439 -69810
7329 -69810 -37124 -22370 -37055 -42913 -21319 -18934 -26209 -1019 -29386 -11926 -12166 -41761 -29818
7316 -29818 -31285 -3224 -21069 -17117 -31242 -23797 -39090 -63642 -53265 -66913 -4574 -13394 -1257
7303 -1257 2392 -12339 -41182 -21224 -31964 -13595 -32786 -76046 -58315 -48898 -61973 -77172
7291 -77172 -42592 -15009 -27923 -26561 -15444 -10904 -19480 -18667 -33752 -14989 -22322 -15278 -25308
7278 -25308 -18365 -25423 -4484 -41909 -48325 -28952 -25260 -29203 -70459 -42560 -22074 -24720 -23514
7265 -23514 19701 1316 -12069 20803 -1806 -12720 -18277 -47907 -12844 -56319 -83445 -53525
7253 -53525 -2273 -31588 -20743 -3099 -25528 -31201 -1923 40145 34992 -89 -41941 -12994
7241 -12994 5190 1547 21894 -16584 -27542 -30319 5369 4517 -66870 -66334 -45916 -3999 -25871
7228 -25871 -14913 -13453 -5029 -15249 -13203 7856 -15139 -1243 -16092 1049 -20605 -51688
7216 -51688 -61922 -35906 -71235 -53420 -64293 -39924 -13628 -12047 -8214 -36981 -53272 -40760
7204 -40760 -62034 -60887 -38066 -32657 -17826 -56216 -57700 -69350 -62654 -56887 -31134 -26596 -33428
7191 -33428 -28997 -11721 -48969 -59432 -56934 -57875 -8407 -11798 -10599 -16026 -24558 -21167 -24120 -25567
7177 -25567 -5353 11146 1441 -15461 -1388 -34037 -12467 13240 5779 -22476 24610 10922
7165 10922 -22934 -20696 -44654 -24451 -21736 -12758 -617 32221 -18876 -47395 -53007 -12912 -31315
7152 -31315 -56821 -21943 -21789 -23071 -25421 15446 16586 -1787 -7305 -24274 -15515 -7378 -12150 -34287
7138 -34287 -31716 -58242 -88349 -56290 -7761 -1651 -1470 -20062 -25201 -23123 -49042 -62159 -29442
7125 -29442 -19995 -30190 -6079 -50100 -43727 -38357 -21177 -24719 -9699 -10563 2543 -2678 -15382
7112 -15382 8985 6062 7221 -17179 -16589 -35363 -61924 -83306 -53987 -61666 -42604 -19982 -30072
7099 -30072 -37511 5551 -34714 -51669 -54152 -16353 -22941 -43241 -21318 -10700 -24356 -18470 -22939
7086 -22939 -57580 -65827 -40832 -41501 -58289 -43182 -28525 -34302 -39059 118 1538 -5254 -26835
7073 -26835 -29245 -7469 -25915 -25793 -1871 -8070 -5564 -27880 -26478 -6198 -15533 -30100 8455
7060 8455 18959 -7044 -35095 -62781 -50136 -59886 -35240 -39720 -53124 -16993 -27269 -58209
7048 -58209 -38882 -39489 -31445 -23568 -1270 6855 -850 -141 5324 -8615 -23929 -17661 -25802 -52142
7034 -52142 -24949 14866 -13483 -41753 -43400 -38133 -37150 -58654 -44644 -47436 -88749 -23699 -17099
7021 -17099 -37387 -37491 -18437 6713 -18620 -17027 -6228 -16592 -7680 -28450 -38010 -32502 -26189
7008 -26189 -66824 -37245 -37784 -46471 -27044 -48540 -56443 -31436 -27041 -18729 -20320 -12249 -27358
6995 -27358 -30333 -9418 -20341 -40278 -35273 -25061 -16193 -16208 -1789 36973 21535 -19251 -41820
6982 -41820 -11730 11654 -51553 -55047 -6907 -20233 -30088 -22135 -51528 -30238 -13538 11599
6970 11599 -27947 -23069 -11945 -28676 -72184 -68006 -13503 -1432 -28697 -44360 -32826 -23027
6958 -23027 -20403 -17667 -35945 -1134 2167 -17821 -25683 -53019 -40907 -45875 -26433 -44437 -32918
6945 -32918 -25758 -5009 -13466 -13442 -3245 5096 -616 -9145 -1373 18066 -3929 -29500 -33741 -33142
6931 -33142 -30296 15367 27296 20739 20704 -10465 -8079 -19454 -4098 -22211 -56917 -52908 -54818
6918 -54818 -23103 -5830 -13387 -60320 -58255 -47796 -42115 -38602 -38925 -24638 -31777 -37412 -53584
6905 -53584 -44640 -34863 -24751 10557 -7966 -10196 -31395 -18344 -14485 20979 -1691 -2786 -37546
6892 -37546 -51809 -64392 -45578 -50946 -24643 -22652 -31196 -14488 -64628 -99839 -79944 -53225
6880 -53225 -50542 -62618 -40483 -40597 -46929 -34602 -66409 -40845 -23870 -20077 -10353 -51782 -68859
6867 -68859 -62836 -45439 -23454 -45546 -33922 -52346 -52590 -64247 -54043 -19468 5829 -19159
6855 -19159 -37711 -4717 4425 32604 17801 -19881 -21712 -37529 -29719 -28724 -44749 -58625 -48372
6842 -48372 -40793 -37803 -54945 -3277 -7683 4248 1416 -13268 -15710 -24554 -41855 -52451 -66445
6829 -66445 -79522 -47649 -30454 -67747 -67481 -54650 -32900 -33649 -50177 -52578 -53463 -5675 -22508
6816 -22508 -39710 -4039 11472 -29012 -64031 -23404 -31131 -49426 -70268 -75847 -91698 -50049
6804 -50049 -20825 -7788 -36422 -44629 -18495 -48615 -65247 -52618 -18677 -2748 1667 -11843
6792 -11843 -27250 -21422 -37977 -52414 -61054 -93182 -70475 -46456 -34051 -31340 -43412 -13464
6780 -13464 -19462 -41191 -31345 -5146 -45592 -36532 -39049 -33853 -20109 -62270 -76501 -47064 -39792
6767 -39792 -52570 -40012 -19865 -33553 -46252 -25904 -53169 -28050 -21345 -38031 -20153 -29713
6755 -29713 -49350 -27221 -30188 -10759 -49892 -53367 -41370 -30720 -35666 -52126 -25922 -45184
6743 -45184 -69902 -68683 -89518 -52008 -54823 -56410 -31933 -23188 -67703 -69443 -64657 -74869 -55440
6730 -55440 -25331 -30613 -3232 -22096 -46182 -18240 -14171 -35497 -47264 -22962 -49342 -42426
6718 -42426 -51191 -51670 -22412 -50977 -59603 -58368 -47220 -34285 15308 12986 -22155 -28447 -65631
6705 -65631 -52307 -28311 -5395 3188 -48929 -64854 -66825 -55192 -50979 -53290 -52651 -23206 -9643
6692 -9643 -34673 -46411 -43100 -40065 -57617 -39555 -49598 -55867 -29606 -20347 -31421 -11723 -39418
6679 -39418 -58217 -53639 -47353 -58302 -46427 -41156 -32643 -38565 -40788 -46027 -32537 -56191 -38580
6666 -38580 -14815 -2523 -11071 -56901 -39753 -17187 -34678 -42637 -52410 -29636 -26349 -19375 -18099
6653 -18099 -46109 -66164 -101029 -75512 -75073 -54100 -17340 -48238 -44410 -40886 -62432 -34050 -10852
6640 -10852 -21800 -62282 -12707 3301 -46253 -38478 -36872 -10144 -18470 -50141 -47160 -61755 -90469
6627 -90469 -79816 -59199 -41528 -20239 -24150 4848 -20365 -40599 -14816 -46995 -21470 7584
6615 7584 -12174 -18044 -31433 -54251 -38164 4555 3382 6320 -26608 -51283 -74281 -76582 -54105
6602 -54105 -72766 -78833 -44061 -18061 -16072 -22810 -32966 -55130 -48853 -58597 -40303 -69798 -96666
6589 -96666 -73194 -27537 -12112 -36061 -49089 -54778 -48445 -68180 -90235 -64277 -71504 -77323 -56383
6576 -56383 -48430 -19792 -21826 -23249 -39442 -61119 -89196 -63665 -43187 -32092 -42464 -49758 -64108
6563 -64108 -23550 -24108 -21934 -13014 -25007 -11078 -10458 -12910 -11575 -27389 -40428 -27130 -26981 -35703
6549 -35703 -37767 -20053 -24494 -27640 -38598 -55168 -56249 -29984 -14786 -5629 -10878 -18719 -22942
6536 -22942 -32737 -50922 -66249 -32649 -11073 -17710 -8205 5120 11568 -35589 -39556 -10555 -7509
6523 -7509 -15294 35812 4743 -38624 -34287 -44899 -31501 -33465 -38800 -38021 -48563 -56099 -42742
6510 -42742 -34212 -34495 -40349 -38459 -42346 -46576 -52224 -43218 -31974 -18998 -63503 -65948 -68163 -31711
6496 -31711 -16389 -22830 -41457 -53324 -44946 -47702 -54178 -63815 -46230 -43162 -54027 -62640 -37684
6483 -37684 -46942 -73554 -48021 -26476 -38856 -53880 -35845 -36329 -32953 -40947 -21396 -10527 -20133
6470 -20133 -6329 -24949 -22181 -18844 -28236 -31785 -12474 27920 33644 169 -48063 -69746 -48605
6457 -48605 -60375 -65248 -62182 -60272 -57053 -53942 -51206 -35152 -29824 -39401 -70866 -34528 -53779
6444 -53779 -75238 -77110 -58444 -52500 -28110 -6145 -7784 -62842 -48090 -29373 -55131 -54028 -42418
6431 -42418 -18824 -29571 -46199 -34029 -20808 -19237 2771 -1786 -4256 -12381 -25970 -55967 -49832
6418 -49832 -23888 -31993 -29159 -206 -3711 -48473 -36160 -31953 -46236 -31370 -22625 -26444 -15298
6405 -15298 -3225 -28532 -17610 -822 4777 -7093 11299 -14053 -22436 -25181 -27229 -17334 -9106
6392 -9106 5634 20862 -31290 -35860 1496 14082 -6405 22186 50999 74621 61810 102528
6380 102528 136925 95126 118841 108808 84446 70605 96152 119280 102781 84355 76238 74905
6368 74905 44495 64097 53679 32681 50079 82690 57060 52169 19020 12581 6912 -5320
6356 -5320 4034 -28873 -3916 -18167 -44320 -21566 -14007 -11235 -19502 -22039 -3595 -42402 -30288
6343 -30288 -15273 -560 15739 -4087 -1599 13271 -12826 -44892 -65617 -72305 -49262 -51337
6331 -51337 -59192 -32362 -39859 -19695 -40812 -50725 -49538 -10130 -2509 -14185 -27412 -12598 -20303
6318 -20303 -26914 -21554 -36418 -47624 -43631 -15772 15547 -22783 -45267 -34188 -12229 -26554
6306 -26554 -36234 -68631 -62931 -59473 -51516 -25875 -13601 -63939 -84932 -40669 -51193 -47593 -46111
6293 -46111 -19418 -24060 -33419 -34499 -49726 -81413 -101614 -93522 -57088 -48207 -93099 -100655 -80858
6280 -80858 -55172 -55524 -52071 -38497 -62416 -46821 -22386 -24160 -58464 -37113 -38988 -37243 -27310
6267 -27310 -49859 -107731 -74998 -41378 2571 -11561 -45298 -41932 -18472 -12842 -43152 -30220
6255 -30220 -22273 -27367 -21894 -40920 -42447 -26262 -4444 -25988 -43058 -56297 -31286 -39467 -19321
6242 -19321 -16441 -52014 -45885 -52591 -26686 -33074 -37672 -88172 -67761 -46369 -33748 -25928 -43707
6229 -43707 -51829 -41116 -19023 -25741 -50660 -57405 -46303 -42201 -51178 -28586 -16148 -39724 -27910
6216 -27910 -7649 -18017 -40453 -32286 12789 24131 -31738 -19954 -9260 -452 21587 33746
6204 33746 17966 -17421 -26371 -17725 -12354 -18669 -25547 -39056 -19682 -38463 -29146 27510 24200
6191 24200 25173 -79 -35403 -26186 2579 -13850 -32638 -25832 -36790 -27007 -49333 -45419 -47957
6178 -47957 -59059 -41979 -30754 21662 9134 16798 27105 8892 -829 -7255 -26705 -34039 11345
6165 11345 8396 -32912 -7945 13170 -21136 -2690 -9216 -5700 -40169 -61873 -20388 9127
6153 9127 1277 19572 8211 -15640 -21817 -23584 8032 5315 -3722 10505 -1318 -23222 -21988
6140 -21988 -20255 -37015 -37241 -25037 4835 20233 5081 -32615 -25694 -37253 -45733 -32281 -46825
6127 -46825 -28801 -25935 -27525 -29239 -8620 -14574 -24427 -1729 354 41693 -152 -16969 16642
6114 16642 41741 330 -8089 10981 3826 -17420 -14389 -2251 -19646 -20984 -15873 -20078 -31520
6101 -31520 -13135 -27938 -27743 -15151 -43538 -37638 -62863 -68198 -46474 -27108 9528 -21481 33270
6088 33270 16621 -28144 -12257 -15415 -34216 21598 25111 -18206 -12349 10049 -32857 -16857
6076 -16857 -8370 -18967 -17919 -5350 28739 28448 16481 26147 36215 36532 37141 8688 40605 39629
6062 39629 44463 37239 33380 58644 50124 17662 39963 67430 59863 42287 11019 5827 16664
6049 16664 -12190 8751 26033 26680 6370 -3309 -24378 -11148 13882 10787 21041 38747 10839
6036 10839 -50069 -17566 529 -8407 -22703 -12157 -16321 -6503 -12378 698 -32931 -16955 -10226
6023 -10226 -5641 10203 -2006 5279 24771 11225 27297 13673 -20128 4512 41281 60471
6011 60471 8702 -19012 25127 46091 4752 729 -6090 -11794 3275 4489 11733 72704 47528
5998 47528 14235 20971 -1429 16356 40273 45932 29954 24941 17388 34071 42102 25906 12004
5985 12004 -10925 -31100 -15573 9154 62130 48356 16129 22883 50941 61784 59375 19278
5973 19278 27202 58643 55854 80459 60538 82992 54065 74737 112552 108641 74235 33777
5961 33777 29861 32874 51947 64732 53619 68544 27166 6463 11876 28994 42164 16875
5949 16875 9518 -13645 27434 72296 52534 48659 63400 79622 39615 20100 26355 1764
5937 1764 -1347 2495 21578 5255 8063 31063 18396 -1379 36535 100637 54769 41252 61141
5924 61141 50998 5377 867 -33042 12381 64475 48713 47279 73477 73024 39841 41653 52015
5911 52015 58612 29531 14789 18287 43826 29668 11365 44522 77887 75950 62600 44658
5899 44658 57465 73724 58130 53674 46461 18573 51102 47221 42894 38853 16793 28688 32861
5886 32861 9297 15502 41713 51941 59871 41249 43664 49447 67562 57041 38371 50489 60797
5873 60797 59413 49769 70749 97882 51734 48873 47716 37636 52422 44121 52690 46725 25001
5860 25001 36470 45806 50445 90618 107887 56570 54805 58026 39899 95054 77701 76936 105913
5847 105913 117920 121216 113694 105303 100676 102194 128104 129891 108593 123964 123452 103642 78198
5834 78198 98675 121369 109937 108998 155988 168823 158317 149930 136401 156401 135382 147854
5822 147854 127713 131353 146479 121269 130411 146731 130558 117439 102541 131605 125642 160343
5810 160343 200536 122957 101628 133701 154508 152001 123372 108576 135085 123530 96246 100003
5798 100003 140446 146718 123526 131576 146550 125840 138474 145627 152489 156179 109368 127828 151117
5785 151117 162401 149597 174792 171594 150894 156298 171619 146409 136355 163953 161705 157504
5773 157504 170375 166745 153345 138896 135066 119012 178075 190103 166284 154328 114856 142691
5761 142691 160831 180998 151676 128592 143062 171654 157064 140957 215550 226564 199065 183445
5749 183445 182173 200993 210204 194061 172458 185835 202049 223660 217442 223473 191395 198458 183053
5736 183053 228918 251032 229080 257448 274760 266825 255798 272564 273894 250497 255182 253017
5724 253017 267103 299987 296017 267868 241423 278250 268903 270407 276614 259678 265355 266922 261943
5711 261943 271551 304514 298385 292401 322874 328723 337336 345119 311620 291532 302033 310080 305415
5698 305415 298836 303326 320537 335522 340935 329597 343976 334543 343501 340610 358502 364459 365830
5685 365830 337277 344017 346675 352134 385376 403315 381338 356265 359969 379075 427170 412456
5673 412456 399722 402369 429125 438601 447141 439842 440201 492354 449705 454466 438905 413959 417932
5660 417932 430710 448554 449613 436712 452285 481211 452189 448341 480483 532459 510940 541821
5648 541821 579625 571983 553316 544157 597085 599999 585212 590539 598293 597150 564602 583309 589908
5635 589908 630410 637168 631569 656643 644590 642513 658010 676905 655524 638054 653766 665528
5623 665528 684657 693062 697898 677820 682510 717477 726733 717025 742457 787485 773752 757074 747067
5610 747067 712726 762491 790419 766679 793539 820752 791971 779158 798731 833656 841192 893688
5598 893688 878224 875649 908880 942223 960333 966333 962993 1003214 1025898 1070732 1081814 1069177
5586 1069177 1109781 1136994 1144907 1116616 1132983 1179853 1190011 1220731 1227412 1249715 1285701 1274528
5574 1274528 1268228 1292175 1338723 1361476 1385693 1417363 1438139 1465204 1491307 1506896 1499432 1489609
5562 1489609 1521370 1568576 1614335 1609319 1646715 1655494 1724518 1756197 1820586 1868320 1918279 1977019
5550 1977019 2006478 2083012 2148405 2239521 2310798 2363862 2448384 2548570 2697456 2807142 2899893
5539 2899893 3042062 3207496 3413142 3629580 3878896 4149325 4434231 4770275 5196636 5676043
5529 5676043 6210288 6848745 7548943 8334970 9201795 10067481 10927030 11684588 12301540 12796241
5519 12796241 13163935 13410386 13524636 13588098 13631944 13695401 13746482 13735010 13682527 13457847
5509 13457847 13105270 12603973 11918111 11158384 10299040 9472998 8660937 7940398 7285062
5500 7285062 6672041 6219220 5840054 5457134 5164708 4943237 4778165 4607278 4443102 4338099
5490 4338099 4260593 4147739 4065145 3991295 3955940 3958368 3913785 3903339 3891410 3890817 3811718 3828697
5478 3828697 3836271 3813168 3850433 3860668 3844161 3842013 3878557 3919207 3914184 3887996 3943984 3967949
5466 3967949 3983192 4003599 4064695 4096822 4130755 4187726 4238309 4270928 4299479 4333214 4389529
5455 4389529 4456452 4516492 4538800 4543460 4603189 4646886 4714983 4790378 4828555 4920933 5005719 5062606
5443 5062606 5150510 5191366 5235101 5315359 5403590 5461989 5547183 5634759 5724903 5800192 5872561
5432 5872561 5950499 6038531 6121647 6233351 6335137 6413167 6520682 6617587 6718306 6833902
5422 6833902 6930302 7034069 7145136 7266053 7400027 7505543 7627267 7783825 7897373 8050130
5412 8050130 8234285 8383531 8534371 8700542 8839650 9016528 9217308 9392001 9589267 9805552
5402 9805552 10019652 10220943 10426617 10646883 10865160 11117281 11360748 11586746 11826019 12090404
5392 12090404 12335735 12586240 12884743 13200717 13504605 13806589 14129394 14496494 14846246
5383 14846246 15213762 15584667 15972227 16367607 16792856 17248820 17674353 18157316 18656845
5374 18656845 19151469 19645695 20188020 20744118 21369638 21998200 22602530 23265170 24000064
5365 24000064 24747340 25558619 26369697 27244025 28170314 29111180 30137012 31200246 32340623
5356 32340623 33531114 34790649 36144961 37574431 39079555 40678206 42391188 44200875
5348 44200875 46153044 48277683 50502208 52970355 55596197 58371723 61405656 64677679
5340 64677679 68192154 72025609 76202644 80745710 85665847 90996393 96821863 103139265
5332 103139265 109986688 117398902 125421660 134126669 143439520 153335055 163903297 174996095
5324 174996095 186563003 198455724 210429581 222275968 233689441 244309793 253779540
5317 253779540 261689384 267706225 271545107 273083679 272202744 268914410 263378086 255874200
5309 255874200 246812875 236472436 225291458 213599977 201745574 189978940 178522440
5302 178522440 167574906 157130561 147343082 138167716 129679546 121881631 114707442 108080229
5294 108080229 101994695 96447348 91374359 86762016 82520320 78670596 75179644 72046555
5286 72046555 69212956 66651016 64406242 62510293 60936721 59723501 58810115 58138235
5278 58138235 57611623 57069024 56389097 55468214 54264140 52831393 51221517 49681156 48326690
5269 48326690 47246076 46466468 45910237 45401450 44763044 43943874 42774271 41248994 39386214
5260 39386214 37288719 35162249 33192405 31326356 29655964 28175028 26825818 25618216
5252 25618216 24604201 23690986 22839054 22079510 21409929 20746418 20156480 19643381 19121691
5243 19121691 18600211 18080656 17609826 17127642 16683203 16253046 15827107 15382061 14971317
5234 14971317 14604284 14318374 14026678 13673201 13375642 13089385 12802528 12520105 12256050
5225 12256050 12006702 11772044 11561684 11318235 11086984 10885811 10690342 10500441 10313897
5216 10313897 10141473 9939660 9733144 9565720 9393825 9247572 9055190 8919181 8800601
5207 8800601 8676638 8527773 8380403 8243918 8152810 8023887 7883450 7824411 7692547 7594188
5197 7594188 7523543 7442928 7358971 7312713 7179392 7062831 6994984 6874699 6743643 6648266 6542557
5186 6542557 6432703 6327442 6206299 6103957 5987043 5882368 5791794 5701649 5620774 5518473
5176 5518473 5422864 5357424 5299074 5236464 5150654 5055463 5007257 4943812 4850569 4775690 4699783
5165 4699783 4625239 4576346 4497989 4437799 4402542 4331620 4271840 4215750 4153628 4078590 4002599
5154 4002599 3971775 3910167 3830501 3779240 3778150 3732586 3697272 3687636 3636486 3612842 3597980 3606186
5142 3606186 3521033 3462754 3436578 3410017 3365597 3345776 3323895 3259872 3247045 3221869 3177482
5131 3177482 3169568 3148083 3067241 3032975 3038997 3030833 3025861 3010205 2964922 2965351 2955418 2942279 2887987
5118 2887987 2868746 2871130 2833733 2839713 2856098 2837766 2821215 2838816 2871978 2859031 2873599 2907011
5106 2907011 2950627 3002351 3049293 3131627 3227001 3332510 3461866 3593624 3767846 3951753
5096 3951753 4144472 4431800 4678625 4961609 5193790 5495389 5765073 6013601 6217517 6460605
5086 6460605 6649372 6842040 7130728 7419405 7679500 7911517 8016508 7984149 7896002 7745721
5076 7745721 7493205 7208255 6929695 6590446 6274501 6012836 5751660 5466498 5201443 4922539
5066 4922539 4626802 4335114 4052937 3760104 3526495 3314972 3131723 2951199 2798886 2679236
5056 2679236 2616480 2538782 2451901 2377836 2345356 2300132 2265880 2207186 2184731 2170427 2094052
5045 2094052 2065580 2084300 2055679 2007948 2007044 2020559 1990897 1945553 1926239 1899028 1902814 1901043
5033 1901043 1923966 1922930 1936299 1935362 1897931 1905458 1908508 1905507 1930147 1941667 1938434 1929705 1935790
5020 1935790 1945978 1948654 1964777 1927066 1951741 1972379 1994378 2000644 2033500 2083332 2113578 2179404
5008 2179404 2230333 2289926 2375129 2462032 2542172 2651669 2842663 2999208 3187245 3408022
4998 3408022 3705535 4052381 4493614 4962276 5347735 5700977 5926297 6109821 6222305 6301236
4988 6301236 6418038 6613456 6920765 7298948 7755688 8219109 8539897 8690748 8666366 8432907
4978 8432907 8036919 7567533 7142390 6815113 6601827 6462589 6370442 6279322 6199985 6061774
4968 6061774 5885474 5644801 5367695 5057203 4789117 4582225 4426860 4321743 4258576 4225570
4958 4225570 4272745 4373555 4468462 4572141 4709742 4925270 5173553 5533431 5964273 6474396
4948 6474396 7104221 7855889 8783737 9857059 11088397 12684720 14721450 17274983 20448687
4939 20448687 24423090 29067508 34071646 38890717 42834686 45408511 46306625 45206388
4931 45206388 42367167 38243556 33485121 28686207 24249995 20383694 17115490 14408802
4923 14408802 12285838 10667124 9385853 8337500 7495387 6780470 6260865 5793393 5369639
4914 5369639 5034489 4723373 4477838 4240066 4054003 3893178 3785390 3654523 3523956 3412969
4904 3412969 3295567 3178334 3063345 2992926 2925520 2810185 2717970 2653705 2598190 2558399 2475913
4893 2475913 2475440 2441022 2390494 2360038 2317828 2265984 2223674 2207563 2160852 2120723 2049708 2019331
4881 2019331 1983055 1956623 1917248 1884912 1858742 1860372 1831456 1819024 1773591 1726743 1707466 1688018
4869 1688018 1704297 1712317 1676400 1649780 1644852 1613157 1597629 1579589 1532740 1510119 1538273 1566248
4857 1566248 1556030 1556407 1526954 1541580 1529874 1513493 1512210 1500293 1534403 1525464 1507507 1503739
4845 1503739 1492827 1525283 1535350 1531992 1564541 1565103 1572160 1599017 1605580 1611995 1637964 1653943 1696011
4832 1696011 1711498 1767272 1777610 1793667 1814184 1846190 1861948 1862475 1901080 1992357 2038017 2065137
4820 2065137 2095995 2142828 2222543 2321516 2370067 2404764 2522542 2594749 2722976 2888803 3033253
4809 3033253 3162495 3372050 3544511 3794500 4137724 4481657 4881757 5383570 5996327 6748331
4799 6748331 7628210 8730752 10028108 11604095 13588761 16150055 19335147 23180627
4791 23180627 27568699 32185909 36640642 40282405 42816664 43808394 42869015 40402636
4783 40402636 36908966 32667716 28057215 23654739 19817057 16637305 13948392 11743088
4775 11743088 10011055 8672044 7662275 6806731 6130364 5603061 5159564 4783654 4446058
4766 4446058 4173079 3961896 3717437 3552945 3373824 3216192 3076639 2983579 2907395 2799658
4756 2799658 2732473 2669199 2595027 2529552 2469043 2345243 2264919 2200011 2139068 2076787 2024827
4745 2024827 1979122 1921185 1876519 1824125 1816576 1810015 1785233 1726656 1677827 1630871 1617509 1586138
4733 1586138 1521235 1483894 1464938 1428152 1392698 1372175 1345513 1318179 1278036 1289348 1258187
4722 1258187 1189916 1181365 1178584 1156260 1140210 1111247 1069933 1072275 1060926 1044540 1012827 1035773
4710 1035773 1036363 997589 997738 953439 967419 970729 970767 970580 943266 921381 912528 912269 880064 888114
4696 888114 882917 875379 903274 883325 891268 916630 920706 913788 889202 898179 891694 892451 875076
4683 875076 896063 889962 875588 891960 881216 918435 925212 908022 925058 905871 897162 880732
4671 880732 907073 910870 913654 935073 910369 917517 929459 944797 984883 992199 988440 974518 974394
4658 974394 979052 990610 1014510 1029039 1065801 1093319 1099199 1137081 1171857 1173391 1218320 1254485
4646 1254485 1302932 1346386 1329890 1318462 1351938 1403336 1467735 1511275 1586014 1666667 1769633
4635 1769633 1862084 2004419 2152113 2312269 2514863 2761402 3084783 3464605 3943595 4552383
4625 4552383 5230878 5923112 6582263 7021587 7222548 7223371 7037851 6645330 6116021 5620903
4615 5620903 5230166 4914392 4713109 4616510 4653934 4817756 5073014 5427084 5836985 6341688
4605 6341688 6832919 7356076 7954366 8550169 9131665 9759027 10414041 11144722 11847947 12580957
4595 12580957 13249891 13839380 14389644 14840018 15263973 15694478 16187227 16552130 16809686
4586 16809686 16919553 16888870 16683244 16342216 15922183 15495838 15096253 14653416 14135803 13557216
4576 13557216 12901073 12211926 11459807 10722113 10015006 9318922 8630846 8019170 7390979
4567 7390979 6760734 6147650 5551692 5031352 4507197 4053034 3675719 3330180 3042524 2836124
4557 2836124 2648457 2494404 2328238 2201423 2134243 2023625 1916722 1855782 1783969 1726180
4547 1726180 1676308 1639050 1580003 1514401 1478932 1449166 1395351 1337799 1282012 1264156 1214666
4536 1214666 1221552 1204819 1149537 1133774 1091875 1068608 1064681 1021076 982444 989111 969872 967179
4524 967179 964219 937791 919220 894089 880733 880099 880872 876399 848595 810977 766648 798186 775845
4511 775845 710498 745155 749131 721205 656944 636297 642535 672793 617644 636428 628392 587863
4499 587863 554204 582182 617884 613210 593939 591327 633530 623694 596498 596027 580021 584740 568898
4486 568898 517409 504286 532990 559993 564207 586935 562738 555701 555729 607340 653260 644306 666748
4473 666748 701449 696956 689731 671187 665261 626327 615054 592722 567034 510260 493500 502809
4461 502809 496969 494453 479326 487871 481844 446037 466556 480931 496218 508900 524062 495614
4449 495614 479313 502793 519606 505226 486131 489389 504423 495182 481732 501650 525063 517742
4437 517742 543893 516919 499539 470502 475216 496891 503255 508972 528169 564956 592155 585770
4425 585770 599908 597085 601830 603495 626126 663423 649815 670573 677918 690373 718393 720577 701072
4412 701072 733619 761629 737344 722504 722756 752324 770027 787193 822581 814613 795345 820777
4400 820777 818542 792080 781998 794303 840195 866398 829918 806199 781971 781546 826515 827896
4388 827896 807972 788889 787511 786662 775337 722605 699676 676513 681906 697481 681966 693881
4376 693881 674069 638124 627721 595335 584052 582181 591231 543155 561031 556244 535813 523802
4364 523802 513674 523359 525980 503551 536703 549781 540393 504959 495950 445285 432800 441144 454890
4351 454890 460147 426533 436144 441726 423979 394214 402836 419611 417260 429597 434795 443769 455720
4338 455720 414235 435839 481695 444261 461393 453410 475613 497675 500806 471651 452911 463389
4326 463389 482253 468164 483382 494630 481331 478476 501505 519755 509486 544330 550339 536239
4314 536239 560305 540597 523149 562529 550262 576030 589116 606444 584906 603027 599819 577748
4302 577748 589850 612310 636224 633158 637707 647766 669606 666347 690649 674525 694473 745798
4290 745798 746545 763379 749608 745965 761939 793962 783957 831331 808932 806404 850542 851279 850822
4277 850822 863053 855011 898102 915008 953080 938571 931779 951407 987422 1020043 1033150 1065409
4265 1065409 1079970 1066324 1091083 1081007 1064562 1037420 1106570 1157183 1113356 1123451 1126955 1130594
4253 1130594 1153413 1192223 1207900 1205543 1214754 1218338 1228163 1252977 1280836 1310402 1369588 1348218
4241 1348218 1317840 1361182 1387844 1406442 1416950 1483446 1516420 1559896 1580825 1586211 1594650 1607168
4229 1607168 1613055 1661224 1710841 1707195 1769474 1838039 1814061 1843875 1850010 1886279 1906036 1944474
4217 1944474 1995940 2007350 2020539 2035656 2100729 2126931 2153049 2213471 2236472 2222067 2305746
4206 2305746 2344976 2354806 2383582 2398633 2439836 2508626 2579325 2633418 2686471 2740004 2770462 2816724
4194 2816724 2889533 2967935 3018867 3055950 3134033 3190065 3261723 3324937 3418969 3473571 3547706
4183 3547706 3676841 3745445 3878612 3979915 4081617 4212157 4335046 4479610 4605743 4759597
4173 4759597 4902106 5042985 5209588 5441291 5645265 5854982 6058088 6310848 6579158 6843600
4163 6843600 7092995 7389736 7709117 8036880 8401608 8794149 9196763 9604129 10027443 10506192
4153 10506192 11000916 11584082 12153522 12785536 13429076 14044377 14773471 15548596 16358179
4144 16358179 17235494 18183034 19153820 20165105 21281850 22444888 23694564 24992139 26329471
4135 26329471 27757717 29266475 30863753 32463223 34162398 35878309 37638216 39440447
4127 39440447 41306066 43205963 45159804 47140278 49166698 51177618 53244315 55340351
4119 55340351 57401277 59467544 61480186 63440568 65302284 67075958 68773494 70338122
4111 70338122 71799020 73189707 74524379 75695759 76794736 77818648 78719688 79469920
4103 79469920 80038584 80420805 80605009 80646672 80424352 79986452 79367506 78599799 77730540 76710432
4093 76710432 75595676 74377632 73072305 71670781 70132677 68534572 66833871 64963909
4085 64963909 63021897 60973234 58853251 56667096 54410391 52184428 50028084 47870282
4077 47870282 45768705 43699868 41666428 39707276 37773226 35867671 34007679 32165565
4069 32165565 30412328 28701298 27044564 25458334 23926673 22556633 21218200 19964172
4061 19964172 18810105 17765093 16789856 15883067 15004624 14183670 13455418 12765247 12110777
4052 12110777 11506295 10966465 10450910 9959114 9555510 9188340 8834417 8492095 8200207
4043 8200207 7931528 7691849 7467648 7268402 7091402 6889345 6755507 6585283 6438296 6314472
4033 6314472 6143461 6048538 5954774 5867505 5765100 5679809 5625649 5499989 5402336 5338618 5258800
4022 5258800 5195031 5096440 5021752 5019392 4982255 4934641 4893689 4848354 4795231 4765642 4682608 4609449
4010 4609449 4589062 4541888 4503207 4477876 4438094 4413670 4383233 4320005 4307421 4291728 4262460
3999 4262460 4265683 4238539 4200835 4219277 4202912 4205166 4258437 4285737 4322150 4341590 4346300 4365134
3987 4365134 4344745 4327401 4358701 4319659 4254450 4200120 4164870 4115055 4049713 4002620 3936730
3976 3936730 3889298 3836012 3806087 3780158 3777139 3708411 3628445 3565674 3479347 3411041 3366342 3329141
3964 3329141 3249943 3186647 3117774 3059168 2994232 2933282 2930987 2917056 2875877 2847736 2833775 2833842
3952 2833842 2803223 2804372 2769958 2765400 2772984 2759635 2789423 2789589 2790469 2798159 2795790 2789353 2837647
3939 2837647 2852246 2870893 2893720 2904109 2922243 2925545 2937725 2967104 3022904 3028634 3007273 3044817
3927 3044817 3086819 3098508 3136591 3192884 3197883 3251082 3317514 3359375 3410104 3450167 3510699 3557385
3915 3557385 3604857 3668243 3766571 3827674 3913058 4025224 4123141 4174446 4255369 4406468 4536635
3904 4536635 4648027 4798085 4942766 5146981 5386016 5646008 5920234 6231846 6574271 6933206
3894 6933206 7360285 7858134 8419120 9011421 9714847 10470312 11284824 12165988 13104257 14041614
3884 14041614 15024290 15956749 16771150 17501745 18065076 18503618 18830461 19012370 19093046 19120035
3874 19120035 19101170 19087714 19071710 19007585 18952425 18865468 18754739 18548652 18200293 17761624
3864 17761624 17226302 16587347 15882597 15120592 14339417 13544521 12787593 12150141 11530680
3855 11530680 10987687 10536086 10143634 9800837 9534116 9306020 9121758 8987925 8841428
3846 8841428 8761684 8748086 8735788 8680413 8698620 8688818 8700625 8682088 8759414 8873488 8921386
3835 8921386 9012155 9115338 9216718 9319206 9431987 9553503 9687746 9816365 10013543 10179248
3825 10179248 10328361 10498166 10698218 10900149 11122318 11350142 11618190 11920666 12262064
3816 12262064 12596148 12981910 13421890 13879338 14397585 14927461 15535533 16176120 16837605
3807 16837605 17601781 18363838 19113683 19900452 20711599 21484025 22225379 22929359 23623997
3798 23623997 24392310 25057254 25669470 26299033 26931258 27537247 28082189 28635834 29162811
3789 29162811 29636805 29985772 30329216 30561953 30682139 30714559 30676716 30613948 30545655 30422974
3779 30422974 30285782 30156323 30073320 30031624 30005563 30050659 30119669 30185060 30284747 30503034 30763830
3768 30763830 31104074 31549601 32062155 32755520 33637592 34635058 35849117 37261930 38924033
3759 38924033 40814826 42944464 45322977 48006953 50936288 54132062 57640962 61388465
3751 61388465 65386867 69585495 74003894 78570954 83285126 88078376 92939541 97930495
3743 97930495 102927105 108034008 113258493 118598522 123996641 129531400 135182229 140903625
3735 140903625 146697968 152501578 158332386 164123558 169820020 175414769 180895124 186189431
3727 186189431 191300730 196080712 200508271 204563681 208141571 211246438 213917899 216308245
3719 216308245 218431063 220427887 222556135 224914863 227604731 230770848 234483304 238823342
3711 238823342 243698428 249161945 255153270 261559986 268174399 274845691 281328845 287245284
3703 287245284 292288254 296121435 298561444 299478073 298859557 296877251 293731746 289753757
3695 289753757 285348672 280735659 276137837 271557923 266960925 262049671 256576622 250220164
3687 250220164 242687664 233768807 223389793 211633143 198763756 185150741 171246694
3680 171246694 157492703 144255972 131813836 120484843 110322653 101385471 93621915
3673 93621915 86873804 81126196 76182739 71971331 68370593 65175404 62412049 59981278
3665 59981278 57826117 55891050 54149779 52606706 51220278 50015117 48957223 48003039
3657 48003039 47126298 46282325 45493817 44651802 43801294 42869814 41908414 40891105 39821046
3648 39821046 38740759 37650893 36537477 35395767 34301575 33200532 32183132 31204456
3640 31204456 30214607 29197773 28247028 27297996 26318838 25332500 24364948 23403574 22490400
3631 22490400 21581353 20674964 19816467 19076403 18305117 17583226 16952449 16368628 15783986
3622 15783986 15238481 14762714 14334363 13905246 13510447 13124988 12800332 12484901 12204311
3613 12204311 11933067 11657177 11431438 11188493 10941943 10732277 10532137 10337325 10149125
3604 10149125 9959598 9786311 9588870 9409458 9238571 9078197 8899247 8749037 8631500
3595 8631500 8476099 8331734 8205887 8068756 7967972 7838713 7688489 7555576 7421750 7314268
3585 7314268 7207677 7079277 6979124 6873372 6742727 6608796 6492340 6398815 6289615 6181868
3575 6181868 6110939 6007584 5920274 5832493 5764321 5668937 5554786 5494457 5405290 5320119 5238697
3564 5238697 5168827 5081632 4987038 4908760 4875598 4781494 4696492 4646840 4585295 4514166 4464330
3553 4464330 4421413 4360072 4275188 4200479 4178570 4136928 4040510 3985006 3961548 3903027 3861508
3542 3861508 3784098 3702625 3630381 3574952 3540759 3554760 3482660 3464860 3436970 3352724 3280378
3531 3280378 3230062 3227362 3225997 3145835 3145765 3120262 3036168 2997796 2959746 2963904 2952938 2931696 2919253
3518 2919253 2878528 2883052 2848876 2807710 2778666 2714333 2738422 2750553 2717059 2708402 2688382 2640862
3506 2640862 2640778 2626380 2591466 2561059 2544470 2513733 2503540 2461939 2437423 2425375 2384755 2393016
3494 2393016 2391461 2365292 2327371 2294001 2282965 2277511 2284282 2267031 2232079 2214954 2210940 2201992
3482 2201992 2198680 2198753 2169566 2164473 2169194 2160459 2172228 2177862 2168476 2157094 2153387 2166668 2161951 2189095
3468 2189095 2193310 2196537 2224689 2264350 2252805 2268350 2278880 2293431 2314220 2351776 2403358 2419093
3456 2419093 2454158 2482102 2479947 2506615 2566261 2602371 2622964 2631470 2661039 2723360 2778080 2793565
3444 2793565 2819547 2850696 2901808 2964919 3046475 3092080 3127815 3154903 3230836 3305125 3376511
3433 3376511 3454208 3528785 3643358 3743103 3844566 3951959 4086270 4199544 4283326 4434673
3423 4434673 4560491 4676770 4745796 4801745 4799572 4781664 4801366 4711989 4625896 4583683 4505329
3412 4505329 4422039 4278048 4151250 4005815 3878018 3754061 3662491 3567129 3469984 3395394
3402 3395394 3316765 3224938 3144056 3032513 2933859 2848363 2772870 2717461 2582608 2439168 2344694
3391 2344694 2271609 2156492 2077240 1996734 1937215 1858391 1770486 1733135 1706611 1680114 1650762
3380 1650762 1570823 1541342 1512707 1467280 1453425 1437666 1386669 1368615 1367470 1358651 1350251 1332712
3368 1332712 1326801 1294132 1244206 1276017 1289613 1260901 1272193 1251701 1235277 1191947 1166073 1188917
3356 1188917 1191219 1183011 1170997 1153554 1117057 1128410 1142649 1119215 1106384 1092049 1119037 1130297
3344 1130297 1079203 1013657 983437 961908 974349 961797 939846 926885 887326 889766 884889 884361
3332 884361 872679 870508 866380 888996 839270 828747 832800 839642 856762 826813 801973 773929
3320 773929 768559 742986 770403 780312 812813 825001 781999 809990 824236 799988 764896 753339
3308 753339 717450 711783 729903 721176 718814 708660 705480 647636 645836 665653 671479 679629 692034
3295 692034 676292 645209 645739 639055 657799 650877 634802 609541 612031 611351 607913 605449 604964 611922
3281 611922 616593 619311 602703 608209 575924 605568 577792 569450 574250 556141 572652 533207 578010
3268 578010 604706 569641 560953 549778 547625 560306 574774 590983 557219 517978 521742 507210
3256 507210 494252 510140 508972 501288 505809 507116 496009 497886 481611 478553 482404 492686 460035
3243 460035 464577 491277 475962 471079 475704 498352 478475 418085 435629 446036 418510 454437
3231 454437 484457 487002 463456 439567 423023 427305 418476 422520 428474 426823 458147 475467 449521
3218 449521 452866 420587 399637 397611 387938 415231 443031 408391 394197 416956 411730 451045
3206 451045 442003 438683 408527 417578 442493 431067 435280 418862 392443 403743 371881 363606 358922
3193 358922 387763 398646 418823 430920 423359 426787 441412 458179 439428 415525 412495 450707
3181 450707 416348 434767 460213 464157 418265 411969 407896 422273 434718 443978 439671 429085 408153
3168 408153 433954 453022 454971 443969 439515 451156 461615 461554 484014 451280 436344 443725 446599
3155 446599 450709 417531 421158 449866 475688 485653 470718 464671 469065 455891 445538 456038 464408
3142 464408 461217 446676 443435 485714 489705 461806 458186 456602 461030 460531 462964 480589 496771
3129 496771 482468 490751 519598 476961 482017 495992 498976 495264 503665 515535 516877 519075 531140
3116 531140 535422 559142 559381 559755 540848 562526 544689 574369 577764 595273 606989 579808 600850
3103 600850 646651 677206 634757 620153 626408 623908 647548 657827 680709 704861 745913 736090
3091 736090 707489 714473 741947 773093 748706 768456 785665 797063 825314 852215 858069 868857
3079 868857 856307 859667 903817 926518 899700 864832 824104 799045 767657 776932 783423 735808
3067 735808 702459 718551 716338 730777 739605 723669 716083 770740 776033 758400 754093 773094 780316
3054 780316 754256 791020 780763 772810 746878 717923 751665 733912 722245 734864 741298 717061
3042 717061 692246 652682 617463 606535 575986 567215 584519 589757 601856 589215 557686 548105
3030 548105 561925 590631 568461 546670 558064 539216 521475 538406 535399 507139 488958 490548
3018 490548 460580 431974 425623 433244 435174 457981 422731 398468 388171 402138 391498 386996
3006 386996 381440 404553 409717 411372 401022 379348 356877 346109 364330 334613 299724 330761
2994 330761 354459 331561 342274 354519 333878 309241 318678 333423 342415 319650 283743 264912
2982 264912 265388 272296 272164 297874 306580 287387 270502 240635 253387 247389 229562 258896 267210
2969 267210 254632 245215 267739 265772 240029 266260 246559 250404 228227 211124 234538 237997
2957 237997 203136 231858 261312 272390 282028 246580 221167 237291 234232 228320 242195 228508
2945 228508 265265 237569 244857 247257 220681 231931 231665 188457 179552 198900 204676 215482 217672
2932 217672 212500 202791 243691 266951 229646 217566 252726 268757 219567 182166 203705 211450
2920 211450 224508 226852 216831 186384 165063 181695 197323 190661 179423 163137 183908 191848
2908 191848 183813 138577 149754 194398 195364 173237 162326 169872 200852 173547 166822 158021 155963
2895 155963 157687 170670 177600 198400 187299 160832 134638 133535 166763 175587 158091 107573
2883 107573 119951 174672 163385 161394 132460 143213 161037 151833 177784 152447 144571 132337
2871 132337 142240 135256 142027 125389 102578 153242 148970 150154 146085 146431 164099 141544 158906
2858 158906 167356 117566 85557 101939 109759 139407 144443 141028 149023 155821 136264 153495 121180
2845 121180 94869 121115 161209 140548 132658 99209 101924 127724 121023 83646 95719 88392
2833 88392 90579 116769 106713 86891 67130 85955 125054 130718 137661 124756 85884 85680 89810
2820 89810 68778 99053 116745 103299 117857 115158 132505 128336 115733 125352 142126 108803
2808 108803 118625 158483 136856 140765 133760 143557 139360 139615 138204 126120 125247 132173 107489 112221
2794 112221 144250 149379 123205 83233 78487 71156 86197 99279 105043 106595 122925 119629 94592
2781 94592 92877 113697 112720 100555 99268 87054 61950 82391 128570 116137 121239 146244 139009
2768 139009 93428 95180 106819 71788 40736 74280 83917 67158 134180 126186 111254 89284
2756 89284 93073 94337 127764 129989 124634 135020 103019 91192 113516 98097 95275 67421 59238
2743 59238 81266 108558 129370 91791 91298 76818 93414 97941 120335 142336 116396 106995 116571
2730 116571 107814 100493 104158 89736 94496 89309 110344 100027 60226 36046 63111 55199 59179
2717 59179 83630 67724 38315 62902 58807 85654 89726 86744 86905 97648 72592 68937 112793
2704 112793 93648 86508 50995 66970 78608 62902 71580 83204 59081 73733 74591 65587 57653
2691 57653 61209 77607 70763 98355 69553 49183 56739 58760 42535 44450 92402 91908 93430
2678 93430 100966 90965 88624 76469 86924 59892 53254 84956 74939 72628 29982 35798 92063
2665 92063 107006 69030 42047 41704 48469 26436 24842 48227 80184 50564 54641 73721 102039
2652 102039 97372 94826 142195 117814 82667 51948 51912 50591 34315 42515 36884 49686 94066
2639 94066 123156 114170 73143 55390 41765 64860 53458 78225 90039 55379 53155 44636
2627 44636 51310 51106 31276 39033 46909 50546 42355 9405 12562 10727 20662 16715 16831 17812 8760
2612 8760 41403 61978 67149 46581 45390 64625 42755 31034 40006 53826 35543 37138 48065
2599 48065 42664 30503 44840 54019 72621 52999 47455 44301 56982 71279 50890 88517 93162
2586 93162 64549 68567 71659 61747 63459 65045 46967 48587 60262 87390 63086 45269 44433
2573 44433 37702 33753 65411 31953 18840 70408 71973 35434 21438 57014 83578 67533
2561 67533 75351 70430 62698 67156 66341 39912 63866 56350 69806 76062 38200 55213 29708
2548 29708 22625 -6514 8652 -4297 -2761 27435 26179 57839 61963 56782 51680 28747 35643
2535 35643 45975 46995 22604 9818 36845 37763 9094 19190 15014 53899 80257 78271 29136
2522 29136 67211 53921 15091 23895 58138 59288 57349 71368 65236 30485 73213 73264 31200
2509 31200 41269 33534 13304 49323 70492 26153 18181 23745 55773 25025 29070 36745 25701
2496 25701 32292 32321 20598 22846 28296 27499 25292 21794 20017 24105 23365 34973 25276 8940 27258
2481 27258 55572 75004 83506 56099 54536 42456 53647 60227 13146 41892 83793 75236 76200
2468 76200 68757 54881 79130 36004 26405 28193 20748 18333 43785 58185 42564 34178 29497
2455 29497 42518 12366 -10425 7002 20896 -1208 -37395 -39259 -4195 34952 38148 37961 49471
2442 49471 31332 38533 50154 63236 50994 17536 23916 16263 25409 28481 28696 33370 45313
2429 45313 12638 26725 39100 43407 48841 45655 33793 45918 40443 63714 63448 23674 27740
2416 27740 41847 38493 40541 44755 26102 20130 12210 17206 15972 14044 13496 23370 41214 62306
2402 62306 51779 43223 38045 49408 12827 30083 27912 45673 29558 59545 70401 28583
2390 28583 20103 62312 69463 53347 24464 48841 39650 14063 -27043 10857 17559 -9216 -6441
2377 -6441 9419 38178 15541 20948 31255 16714 21340 7362 15025 23404 24197 12783 -2154
2364 -2154 -21880 -34592 -1540 18879 38131 8490 35975 23867 36251 44477 39723 58185
2352 58185 42932 57524 64025 60720 30341 23030 54042 63390 15794 -1120 18374 7987 6806
2339 6806 24283 23087 -25862 -22407 -35639 757 14062 23889 13045 34932 80448 46953 22568
2326 22568 12690 54909 38318 31888 30772 -19005 -10152 11461 19249 -42272 -59487 -14701 2403
2313 2403 -10027 -27171 13440 40925 25062 5029 20910 29805 16761 38149 9860 5193
2301 5193 20250 26490 34762 36964 15266 -12761 -42984 -55224 -30934 -15535 11953 13725 -2064
2288 -2064 15416 24088 28364 31307 49091 35164 10066 22842 19113 19203 30719 8788 8552 -18080
2274 -18080 -10955 19002 27395 14595 30603 -26610 -33498 -1947 -5382 -17374 -1511 34338 16917
2261 16917 10417 10348 -858 -489 1566 23532 25194 33831 20717 26413 10347 30517 8661 3393
2247 3393 13869 -18809 13214 -989 16575 54957 55319 3807 3875 -4884 25334 36697 37522 27043
2233 27043 5790 -15705 -10108 -8970 -11961 5227 16116 -5120 -26190 -13447 -1520 -1527 12690
2220 12690 16586 22407 47979 35810 16333 -13211 -12532 -19325 15321 51743 56527 61943 20887
2207 20887 -4576 -23302 -11500 22863 29392 -4755 15924 28776 32756 7029 -18335 -19354
2195 -19354 -23986 -25885 -10913 -3291 11075 11958 22475 27491 15517 6798 10761 3242 25657 27360
2181 27360 34364 23040 40320 29712 -11190 9717 -3933 9080 19440 3899 -19079 20075
2169 20075 24841 -20596 1725 -6456 -22118 21294 68246 29521 1227 -8747 -6034 -7367 -42642
2156 -42642 -49834 13742 36929 24822 16952 13895 10957 22490 23975 26339 -16180 -7504 23764
2143 23764 -5175 -4035 -13157 221 -1351 980 15891 42057 10767 -13274 -20278 20022 6693
2130 6693 -2134 2444 -6698 -9172 -53547 -33800 21607 22748 8536 6826 16190 5345 27484
2117 27484 -285 144 38962 51656 64486 20049 11307 17620 23104 46909 30706 19329 15088
2104 15088 5775 -18969 -20071 -40728 -7041 8158 1169 21567 7705 -24022 -31955 -6381 -2338
2091 -2338 14837 21952 -14230 -22723 32774 23390 29016 27553 17018 -5520 -15781 -22975 543
2078 543 -31556 -39194 20737 17046 33886 27153 31608 28201 8370 7172 13638 -28068 -27239 -7127
2064 -7127 10588 9243 -3739 6028 -6498 -37270 -49495 -39417 -20414 -19194 21686 2824 -2187
2051 -2187 -6449 25685 43203 21162 -5183 -34933 -32606 -25440 -9241 -22608 -17524 2782 21811
2038 21811 12963 -6510 8186 5150 3799 22333 1802 4148 19460 7144 -23137 -9680 -20105
2025 -20105 -20873 -33001 -41270 -5375 -9922 -2779 7523 26400 16655 19388 30194 14888 -26457
2012 -26457 -37708 -5789 2955 -15193 -24029 -1815 -1124 15171 20816 4265 -23085 3397 6788
1999 6788 7349 10739 4350 16232 144 3179 19948 -21686 -31612 -49016 -31351 -21412 4284
1986 4284 32226 -4949 -15586 30172 33610 19551 17980 41434 23337 -31605 -22178 -12370 11739
1973 11739 21994 10820 15877 -2491 -1650 -29079 -16544 13402 2652 -21449 -36457 -42757 -28573
1960 -28573 -16700 -33117 -15589 -18326 5420 4568 7023 -9284 128 959 -11477 13618 20778
1947 20778 2372 5999 17810 16184 25388 31165 18879 1589 -27995 -73148 -36365 7853 -7524
1934 -7524 -3418 16240 15754 -20404 -19892 -15138 -23489 -11353 -12426 -6584 -863 -21581 3923 44978
1920 44978 8139 2967 -162 8432 6938 -12469 -29845 -3756 8260 -30831 -45166 -37820 -24451
1907 -24451 -26741 -11926 -23852 -36122 -12278 -12329 -51561 -59857 -45384 -28548 -24302 -20193 -10251
1894 -10251 49 -30769 -47070 -32048 -46169 -35722 -6471 -12589 -23346 -46733 -2280 -14164
1882 -14164 -16374 -2462 -23084 -4094 -30304 -18209 -23635 -32363 -11985 31663 4579 20953
1870 20953 5943 -15620 -14917 -35969 -38510 -18303 -9070 -24457 -25922 -23410 -33625 -20136 34399
1857 34399 20778 7420 -23342 -8928 -23456 -26924 -29898 -39660 649 -5502 -29904 1242 -13480
1844 -13480 -39723 -35926 -20441 3445 -19395 -25095 7283 -3511 -32796 -46132 -26977 -42844
1832 -42844 -34745 -19207 12635 2509 -11844 -23419 -13684 -26138 -52897 -57064 -52521 -23271 -18274
1819 -18274 -15715 -5121 19317 25456 9776 -19697 -11798 -22583 -27967 -9838 -10351 -4369 -11839
1806 -11839 -10794 -27817 -67362 -38251 -26578 -32186 -31145 -16751 -36896 -40519 -24217 -7553 -27292
1793 -27292 -20150 -23541 -20912 -44765 -19694 11293 -6695 2712 12717 19155 1887 3164 -2117
1780 -2117 -15386 -15233 9535 34387 5301 14267 3432 -12972 -13223 723 -15514 -51645 -44760
1767 -44760 -44760 -25136 -23781 -42605 -23067 -13715 -62799 -48340 -1932 -9978 -6053 -16381 -9656 5879
1753 5879 -8629 -20440 -30025 -20519 -16723 14164 12536 -3927 -24851 3484 511 -30150 6876
1740 6876 11288 -6760 -28675 -23290 -9169 -5673 10637 10102 2028 10733 4378 703 10106 -775
1726 -775 -15915 -15462 -10475 -1968 4808 27209 18621 14992 28266 23379 18618 4391 23422 -4245
1712 -4245 -44248 -43736 -30276 1395 32983 16003 -17395 -26204 -34557 -18553 -12156 -44998 -40782
1699 -40782 -44480 -20723 -8177 7827 6155 -11924 -5862 -39252 -31646 -14056 -41490 -63767 -76918
1686 -76918 -34741 -46055 -8002 -13092 -10800 -34161 -44473 -15187 -130 -2153 -37739 -54118
1674 -54118 -47244 2302 -1198 -10952 -11624 9571 -12390 -20816 -25325 -13017 -16471 9871 24034
1661 24034 1455 -12528 -7027 -19835 -21176 -23357 -16146 -6626 3687 -1226 10930 -547 -3898
1648 -3898 -27581 -30634 -1790 1911 -41371 -55619 -10053 -6367 -30892 -25225 -7865 -30637 -8750
1635 -8750 30771 6722 -783 -2182 -18353 -35494 -20154 4458 -5016 4413 186 1396 -8017
1622 -8017 -14329 -5080 -18545 -5236 -22969 -36281 -37570 -56765 -36447 -2267 2198 -18204 -11490
1609 -11490 -33483 -32371 -16573 -15967 -1383 3593 -19284 -20667 -17686 -21873 -23957 -13709 -29383
1596 -29383 -17374 -8596 -39733 -32577 -30681 -28370 -53117 -22738 28834 -223 -21149 -2356 -42048
1583 -42048 -26595 16135 12970 -8778 -44652 -67522 -62232 -50638 -27920 -44916 -48899 18222
1571 18222 -17460 -3094 -19675 -33938 -25938 1363 21898 8140 31397 24490 5160 -4004
1559 -4004 -15443 -10074 -38501 -21905 40848 37557 21935 -7431 -20865 -21851 -10287 -26560 -40213
1546 -40213 -18718 -21070 -11155 -18109 -20205 33 -11232 -21631 -27875 -41400 -22454 -41803 -29724
1533 -29724 -54160 -55101 -20952 2502 -53968 -56662 -22778 5411 38306 27223 -6250 -21710
1521 -21710 -11063 14527 -31769 -57970 -26986 -62416 -67375 -75081 -60297 -30264 -17430 2899
1509 2899 2856 -2559 -536 781 23784 -814 -4371 7900 -2385 -9374 11964 30699 4503 -17262
1495 -17262 11328 -5266 -18373 -8132 6049 -5483 -24443 -12869 -15979 -53606 -28846 -30274
1483 -30274 -35008 -34842 -23131 -982 -20942 3178 324 -50327 -38306 -20716 -30632 -26660 -55992
1470 -55992 -58731 14960 15881 23526 -5858 4886 -14321 -24928 -29770 -19653 -7641 1965 -12463
1457 -12463 -26190 -8484 -17930 -39181 -18536 -26020 -51981 -44575 -49149 -58236 -32966 -6590 -35095
1444 -35095 -43020 -30667 -37194 -32286 -14384 -39740 -60768 -46548 -18478 -29441 -3647 -1768 -26763
1431 -26763 -66444 -74391 -41328 -18407 -11041 -37 -39407 -10018 -3474 11107 -34507 -50755
1419 -50755 -44288 -27174 9883 -27078 -25341 -34927 -33812 -29166 -4676 31724 -10326 -19349 -30229
1406 -30229 -17684 -11745 -24881 -39560 -33771 -18791 -28768 -19160 -31758 18691 11977 -10229 -8745
1393 -8745 -5041 -28722 -26560 -32812 -54267 -31964 1622 7727 -26674 -24843 -29551 -62020 -42965
1380 -42965 -9846 -49061 -42549 -40955 -56715 -44666 -19651 9436 13045 -17037 -33369 -46180
1368 -46180 -37932 -29482 5797 -4202 -14432 8220 1532 5062 -29351 -41293 -66280 -34681 -35472
1355 -35472 -31633 -21481 -40388 -4511 -9745 -11837 18929 -7962 1112 18867 -27418 -49797 -73104
1342 -73104 -50472 -36294 -42469 -40235 -6160 -18524 -52026 -7187 33305 155 -9929 11864
1330 11864 -11128 -16203 3052 -12981 -14516 6731 2961 14888 25801 28968 -11537 -14514 -14205
1317 -14205 -26969 1359 -19742 -35219 -13629 -14311 -11531 -1700 -2744 33888 -10308 -39349 -24173
1304 -24173 -7283 -1578 -21124 -40574 -44249 -42284 -38297 -37362 -34757 -5200 -20072 -8749 12641
1291 12641 13575 -18241 -26208 -9275 -664 -15398 -23420 -37279 -12298 -6732 -12066 -7331 -26265
1278 -26265 2531 18794 -73 -1886 -22452 -28101 -9588 -60098 -56902 -44018 -28276 1681
1266 1681 -30157 -4315 9366 19888 -16797 -24325 -24395 -19386 -4261 -24385 -27106 -27247 -35843 -40566
1252 -40566 -18642 -26834 -25987 -24113 -35715 -14703 12073 -6790 438 1627 -19621 -48803 -32063
1239 -32063 -11374 -2087 -34825 -40411 13400 -13064 -37322 -45971 -60278 -54236 -20339 8517 4876
1226 4876 -29879 -13959 -33087 -18937 -8546 -4893 12264 -4456 -15127 -12184 -48389 -45760 -47335
1213 -47335 -33706 -7419 -77501 -41885 -10576 -29171 -48481 -53914 -34651 -47985 -67255 -57022
1201 -57022 -30466 -19613 -53217 -54704 -40349 -44501 -22788 -19798 -28748 -41648 -57394 -60623 -56674
1188 -56674 11475 21978 -29906 -46402 -18341 -11184 -2539 -22881 -23623 -26039 -27739 -10164 -3353
1175 -3353 -54 8695 -25232 -29093 -20486 -14197 -21345 -25664 -37195 -47914 -29839 -33860 -46367 -19680
1161 -19680 1591 -24140 -2760 9678 -16350 -54397 -5964 4219 -11372 -18617 -25622 -8632
1149 -8632 -7382 13697 -5652 -11073 1814 -36345 -53228 -47133 -43146 -31331 -12397 -13625 6236
1136 6236 1898 16714 -24776 -23572 -11383 -41753 -8095 9587 -22039 -26287 -23718 37 682
1123 682 -22078 -6630 -23137 5013 16860 11688 -14905 -42639 -31725 -6166 -15628 -26313 -30450
1110 -30450 -48543 -35890 -4185 -6518 -37542 -28066 -28473 -8268 -35269 -12093 -1829 6137 -20151
1097 -20151 -25994 -28143 -49636 1201 -26421 -21786 -19057 -30373 -14727 -29015 -5496 -17230 -23485
1084 -23485 -39146 -65378 -14237 -3747 19062 2923 46306 21803 -17392 -11815 -33747 -27230
1072 -27230 -9162 -36041 -15891 -8178 1686 17213 6774 15558 3567 16706 25018 -47813 -54754
1059 -54754 -61465 -42640 -25941 -1756 7083 20548 16235 -19009 -9445 19214 18305 -5632 -15618
1046 -15618 -27785 -9717 -18886 -29950 -23533 -27251 -17724 -26413 -26013 -16295 -21626 -3425 -11279 -9306
1032 -9306 -17386 -6198 -3750 -21885 -2569 14512 -97 -23629 -34036 27190 32217 3969 12103
1019 12103 15224 -15976 -6732 14069 7097 -33213 -31956 -23642 -29279 -5924 44043 -3933 -15674
1006 -15674 -5408 -33675 -40577 -4894 -2434 -39493 -45199 -14357 -32604 -13356 -9514 -3591 478
993 478 4310 7010 -21237 -41165 -60795 -61993 -44766 -11774 -13776 -38336 -20001 -17775 -35023
980 -35023 -52766 -34312 -34412 -29412 -9487 -39466 -26074 8899 12730 18410 -38546 -50000 -16266
967 -16266 -29807 -12179 -29634 -11338 -19841 -51834 -29672 -25552 -21370 -14490 -62899 -68257 -46644
954 -46644 -3990 -14263 -4345 -1200 -3199 4220 -3062 -34289 -29185 -22868 -27592 -33346 -35655 -49834
940 -49834 -47137 -19974 -1281 -22311 -14019 -242 24739 28417 7020 -8244 -4587 7925 -25361
927 -25361 -14297 10599 -19611 9195 14555 41161 35302 -44689 -32393 14692 -9780 -16092 -45840
914 -45840 -54371 -44129 -16311 -6331 -8040 -19757 10297 14220 -2791 -14079 -23122 3149 2817
901 2817 -11650 -8464 15231 -32275 -11056 1649 -229 -18302 12876 -3077 8283 40209 29157
888 29157 14371 -4208 -5762 16763 8908 8870 23396 39512 31023 4509 -24124 -7909 -40883
875 -40883 -40715 -32368 -1466 3034 -64153 -61272 -38785 -5405 -4783 18498 -15432 -25328 -13151 -27412
861 -27412 -31544 5820 10192 -46995 -35835 1641 -6314 -53202 -31630 -4641 -1482 10422 6580
848 6580 6761 -1000 25082 634 -6407 -33314 -30305 -10618 -37595 -5729 10147 -477 -961 -24521
834 -24521 -22481 -9207 -24825 -12979 2720 3647 14058 19680 10647 20663 10925 15933 7314 33027
820 33027 17277 -12690 -10763 3014 12601 -12385 -1108 -13116 -44116 -33507 -27844 -1915 8289
807 8289 -17302 -41171 -60387 -67425 -37624 -29074 -19171 -20904 -16167 -10284 -15907 8123 -481 -34163
793 -34163 -32532 -35634 -23431 -37686 -52034 -34928 -39738 -46116 2275 1212 -26586 -30403 -11838
780 -11838 -5754 -7611 25140 -24614 3162 9759 13069 -15996 -6470 23370 -23568 -6515 11595
767 11595 29951 54503 46186 2634 -29086 -20133 -11448 8680 -1202 -1460 4560 -17463 -23168 13945
753 13945 13504 7636 -12917 1826 18721 1346 -27084 -26755 -15374 13857 42327 15723 936
740 936 19400 21779 31255 48416 42364 14727 19224 4676 15883 20005 -6375 -24591 -17385 2285
726 2285 -5455 4130 2477 5933 13815 3521 -21084 -23234 -6805 3700 12808 31000 10489 -8117
712 -8117 -14579 -36700 -41728 -22819 -13892 -13046 -31775 -9992 3274 -14989 -9601 -9361 -8138 4895
698 4895 -25241 -19345 -13410 -24879 -20085 11471 20451 28505 13896 -9929 21479 29577 17391
685 17391 21227 -19132 -39073 -21517 19575 708 -26486 -28804 -34831 -7668 -1468 -11162 14790
672 14790 32697 19863 -16982 -6806 1359 -8671 -17800 -18461 16929 1485 -5770 12372 -1728
659 -1728 6232 230 -21297 5229 8280 10374 -5733 -11686 -13229 9902 19060 17616 -2474 -31566
645 -31566 12543 33274 16674 1058 25596 21870 -39 33725 33556 2102 14892 17137 18734
632 18734 510 24385 51512 36764 22250 18570 -9352 -13842 40936 14300 15780 16653 10006
619 10006 37535 21679 15733 14406 29001 65585 26871 7476 17072 23303 18433 -1016 -3979
606 -3979 -8642 -29303 -43373 11659 54976 27867 13722 -7877 -23047 19931 5520 -35978
594 -35978 -18513 -42596 -15281 -22114 -25670 -27291 -12059 13507 12023 -22123 -19345 -42686 19406
581 19406 62021 31958 10176 51717 33460 15064 26526 34425 27910 7195 21119 2822
569 2822 30173 -12783 -26203 -17258 -15427 -10889 15797 -1441 -3833 9481 15136 27773 6478
556 6478 -10692 2492 4887 7782 -7556 -7448 -3905 33842 -5770 2863 -1039 4079 -3128 -4505
542 -4505 41722 45688 -3247 -24480 -11810 -6087 26636 34864 34065 -297 2067 -11305 -12579 -2173
528 -2173 -12714 1518 13688 8152 15378 16 2944 17713 -19718 -33218 -37404 -38163 -22982
515 -22982 -23940 -13061 -17148 -39843 -23328 -5077 20105 36333 29465 10985 -6035 -3074 16603
502 16603 8407 42594 73039 49207 29602 9705 19741 -13793 -19041 -48331 -31616 -40245 -37178
489 -37178 18217 -1111 -8465 422 -24945 -13775 43618 61269 74960 46520 20214 38024
477 38024 44160 30596 48980 45751 30759 533 14608 14364 26667 28850 7964 13514 3910
464 3910 13477 11544 39950 62815 25255 33449 12811 19370 -7586 -14790 7179 5810 24507
451 24507 39020 37480 48745 30533 25017 43696 49737 39017 8495 11216 -6607 6428 13312
438 13312 19922 31313 10742 24110 51358 46137 55682 51217 40826 28935 4362 6055 53679
425 53679 135 25265 7866 -4827 35991 43281 30076 29488 -3935 2120 -6523 -22270 -26750
412 -26750 -10170 12412 36150 3176 3548 257 4473 19495 14807 36629 -3980 -7932 -19060
399 -19060 835 -10983 -5260 23914 23668 17854 14792 -16966 21841 42299 12933 30556 26754
386 26754 30000 20133 9530 34927 33630 16837 38367 33985 34259 64823 51937 53783 69275
373 69275 65056 76997 55357 14097 12624 22015 39352 22852 20945 24996 29083 -1007 -1185 13703
359 13703 48419 30935 -9956 -20859 -2680 32632 39405 11119 -1349 26183 22693 10604
347 10604 10520 24541 38315 20738 49647 65869 27042 144 -7627 30570 39874 46242 46862 53154
333 53154 38844 6729 12099 6034 28224 35651 10652 21536 31884 23612 20438 42208 44352
320 44352 24111 15231 3110 34208 52772 61966 36318 34434 72483 59745 27293 -14844 -25300
307 -25300 -21711 -25544 -11284 -3667 14881 36595 27667 28929 44089 56560 45448 20801 28104
294 28104 30911 28192 32481 44363 25863 37188 33385 30867 58075 46419 46037 16995 11075 2609
280 2609 5356 15766 32094 30378 43110 82768 62580 38247 49181 21966 24485 18951 37480
267 37480 32995 31316 34126 14751 14039 179 997 6904 47740 26630 15521 46142 39137 58883
253 58883 59755 45393 41268 36874 41953 63453 71402 39979 34110 51046 49993 44258 60895 33935
239 33935 39201 47179 29980 55763 47555 25948 49727 21709 -3417 -22829 15288 45464 32923
226 32923 23703 7251 -5306 10162 28668 12870 16321 1806 -14174 3149 -3644 -3328 21771
213 21771 33677 37885 32881 15861 6066 8821 48697 47563 13575 21376 -3853 20724 27661
200 27661 28478 32407 23651 9611 19837 50929 41442 38210 19731 23400 2332 -372 46532 63347
186 63347 45274 8366 -876 35948 51031 55153 15073 29286 28256 6031 18381 15621 15333
173 15333 16412 61764 40490 17561 -8334 19131 9280 21076 6752 3384 19582 26380 -8903
160 -8903 18367 32908 16354 14275 -2509 2039 -3466 -6306 -515 6062 11505 700 -26321 -9132
146 -9132 5589 12597 9356 17788 11262 14219 3853 13460 45015 57675 25464 -5981 -23879
133 -23879 -4879 -12049 -18312 -12248 -4125 -12391 -5761 -7445 -26293 -9237 -20691 -43939 -57544
120 -57544 -33668 -12395 6184 6091 10503 4427 -30513 -18812 -13506 -14652 -30673 -38745 -17242 -21392
106 -21392 -25427 -17556 -15470 -39372 -31343 1486 -15801 -18530 -25088 -18001 -10695 -29337 -53742 -19458
92 -19458 -7241 -10610 -13378 -34889 -43779 -27838 -39781 -44018 -46716 -58736 -46364 -47810 -53395 -45775
78 -45775 -35275 -52321 -57192 -65197 -37576 -13806 -39338 -43962 -31413 -38230 -55735 -50629 -41636
65 -41636 -37028 -35491 -55462 -55120 -57122 -62309 -50627 -59964 -53583 -75615 -69300 -71702 -64814 -67504 -99294
50 -99294 -80037 -81165 -65644 -60921 -64497 -60012 -49411 -83179 -89367 -96080 -86239 -69162 -65842 -59275
36 -59275 -82641 -74520 -79745 -70761 -69794 -98280 -92143 -78408 -93017 -101301 -97218 -88739 -82099 -78482
22 -78482 -87185 -93742 -92180 -69874 -67559 -85053 -85976 -91362 -75288 -82181 -112994 -103109 -107434 -116387
8 -116387 -123450 -102589 -103588 -109222 -125155 -149248 -111927 -121850
0 -121850
$$ Imaginary data points
##PAGE= N=2
##DATA TABLE= (X++(I..I)), XYDATA
16383 -1014337 -1013230 -995905 -970188 -957621 -952828 -956050 -916565 -898879 -875882 -853067 -863533 -843916
16371 -843916 -858588 -812224 -779726 -787568 -778587 -765778 -758169 -757198 -734151 -710399 -712071 -676575 -657563
16358 -657563 -646726 -639841 -619429 -600639 -584057 -582421 -597590 -587483 -549322 -534251 -523173 -522693
16346 -522693 -484471 -458716 -454441 -448061 -449590 -428216 -389496 -406846 -382199 -357405 -359435 -343985
16334 -343985 -319541 -325818 -319156 -295877 -283870 -243949 -224302 -199998 -227047 -199081 -171544 -180247
16322 -180247 -166992 -152913 -127789 -119248 -118180 -105305 -94133 -72900 -41566 -21947 3182 -5664
16310 -5664 3561 21387 23414 20966 40756 60231 51375 80727 83774 131014 144072 161378 158538
16297 158538 162936 179836 186394 184481 185440 205672 220895 237079 242624 268377 275588 280551 311604
16284 311604 323504 331985 332144 345395 336991 330568 339914 354452 369291 372735 352346 374934 416036
16271 416036 427711 409116 436285 467973 477930 494271 506718 501447 495451 485815 521917 556048
16259 556048 545697 551489 542789 565584 573255 582875 583365 590453 590004 612722 646354 650612 654561 653957
16245 653957 689217 677813 701320 700712 683752 691215 708146 728172 704089 706629 709341 771643
16233 771643 766232 787621 781540 762674 757722 785110 775302 793956 821628 818343 841754 849053 843698
16220 843698 845355 836340 860000 834568 848616 868270 878193 881338 905695 924227 905898 910795
16208 910795 903643 909694 916619 904757 909416 925017 938172 958665 968066 997754 953205 938138
16196 938138 984463 984247 983153 1017890 1002630 998515 977488 976550 998935 998797 1026728 1051294 1030334
16183 1030334 1028901 1066477 1044552 1033191 1052627 1031854 1047918 1027947 991869 1022459 1066905
16172 1066905 1068909 1086572 1058343 1076084 1119194 1086055 1108623 1113848 1124872 1084205 1094980 1122969
16160 1122969 1142233 1144623 1140319 1111947 1116298 1143574 1145000 1172631 1170335 1156927 1159919 1169536 1156474
16147 1156474 1124245 1100144 1119719 1132556 1134363 1135377 1162701 1185064 1192344 1156322 1179230 1172170
16135 1172170 1162474 1149885 1173238 1196412 1192028 1213746 1218715 1214393 1220774 1219385 1235029 1220116
16123 1220116 1213905 1201016 1190042 1230273 1236982 1225120 1223375 1209613 1213923 1194841 1239628 1220232
16111 1220232 1224469 1217365 1215398 1225867 1218245 1208808 1226790 1239042 1254249 1269364 1233859 1229399
16099 1229399 1223985 1225167 1257758 1229155 1228681 1238431 1253141 1267432 1246158 1259517 1241441 1228283
16087 1228283 1224712 1236955 1231494 1248749 1262104 1251876 1223706 1263915 1317839 1328771 1293152 1298339
16075 1298339 1269229 1248979 1276856 1273437 1264251 1267636 1279349 1272892 1247920 1246430 1254401 1238001
16063 1238001 1235435 1232929 1211166 1248668 1250494 1245130 1271093 1306073 1269371 1261129 1270400 1290389
16051 1290389 1287310 1274161 1288636 1311615 1304803 1282788 1283316 1275031 1264485 1272826 1251871 1265368
16039 1265368 1274125 1277922 1297695 1275326 1255942 1230022 1289317 1307030 1273081 1291475 1256527 1257564
16027 1257564 1280565 1279354 1303017 1308464 1279045 1296515 1282399 1298651 1282603 1270320 1274615 1266355
16015 1266355 1241707 1261934 1279514 1287402 1294791 1297778 1291909 1294451 1291130 1264543 1268383 1274976 1291252
16002 1291252 1295182 1309735 1339890 1306774 1274375 1313393 1302985 1284747 1277364 1318430 1309650 1301903
15990 1301903 1285830 1281694 1317204 1347795 1339123 1316620 1261612 1265873 1271516 1304528 1300997 1259684
15978 1259684 1274581 1276005 1300376 1278643 1261550 1284945 1262916 1294102 1307246 1306482 1335563 1321149
15966 1321149 1314797 1331506 1327701 1328081 1322334 1297185 1251962 1271114 1302152 1290609 1261554 1277219
15954 1277219 1312950 1281848 1294961 1302114 1299887 1333760 1315107 1300420 1283169 1303650 1303406 1278143
15942 1278143 1282990 1280478 1303951 1301328 1288499 1283217 1288983 1294966 1285700 1282743 1260766 1251587 1243293
15929 1243293 1264484 1266540 1292305 1322022 1295589 1267256 1264293 1272647 1282489 1269116 1303700 1330687
15917 1330687 1312149 1359810 1330856 1301191 1296297 1287549 1254654 1254185 1279132 1319041 1336257 1335761
15905 1335761 1348977 1327127 1308358 1328739 1335122 1327301 1331120 1310864 1302011 1277328 1267237 1263170
15893 1263170 1294855 1298692 1295958 1286594 1292414 1291556 1310175 1327363 1298035 1307728 1327433 1307631 1297838
15880 1297838 1292584 1286576 1308073 1267707 1268871 1318893 1325202 1302202 1289110 1326182 1327681 1296324
15868 1296324 1287168 1269039 1295451 1258440 1267125 1313277 1316950 1312298 1305828 1288473 1297468 1312764
15856 1312764 1286711 1294140 1296704 1309452 1330189 1317438 1319919 1334528 1329740 1308381 1290072 1309862
15844 1309862 1309565 1294022 1281168 1278024 1293125 1305488 1304991 1277157 1266491 1261727 1267817 1294829 1303866
15831 1303866 1277190 1278412 1308940 1325354 1318912 1293021 1305070 1305856 1286855 1329559 1332517 1335469
15819 1335469 1304510 1294476 1303885 1284185 1280062 1287722 1344559 1318328 1303686 1321281 1272460 1282010
15807 1282010 1304096 1352312 1322922 1302538 1311242 1281324 1280628 1331298 1306174 1288733 1278117 1263519
15795 1263519 1284215 1291034 1322695 1315617 1323486 1298808 1285937 1315529 1337641 1311912 1292337 1330060
15783 1330060 1354259 1321544 1311521 1333773 1355143 1358663 1367860 1333631 1337505 1327474 1325975 1332552
15771 1332552 1338007 1336442 1335032 1338384 1333297 1319093 1315537 1319167 1297038 1324224 1333766 1307095 1287129
15758 1287129 1328804 1327100 1306785 1300250 1364695 1358548 1334656 1338746 1311758 1304056 1339390 1295254
15746 1295254 1274447 1302929 1272687 1290030 1301082 1301665 1294382 1298585 1313534 1317943 1314427 1330838
15734 1330838 1346184 1321874 1304801 1318996 1310816 1302576 1299168 1320645 1320655 1337767 1295693 1286680 1301454
15721 1301454 1292083 1303585 1295731 1305192 1284238 1282019 1322002 1368316 1336701 1341864 1302258 1276245
15709 1276245 1297498 1284857 1272339 1303547 1325084 1319233 1326495 1304783 1307883 1283270 1289325 1282927
15697 1282927 1302877 1294673 1318137 1339636 1363862 1365377 1332122 1306009 1304984 1312232 1326907 1317871
15685 1317871 1347120 1341526 1287230 1286105 1318429 1350051 1327830 1312296 1336351 1316359 1309183 1293715
15673 1293715 1287557 1279704 1284988 1312082 1292361 1308182 1351431 1321294 1293693 1310258 1310603 1283547
15661 1283547 1263543 1277610 1318546 1320497 1293233 1295204 1291852 1314177 1340005 1338095 1339521 1360806
15649 1360806 1328257 1330969 1322354 1303306 1312026 1314530 1329144 1318629 1308529 1354130 1380231 1326190
15637 1326190 1318656 1309577 1327813 1333301 1337133 1340721 1329885 1337666 1346934 1348778 1329856 1340600 1364771
15624 1364771 1309921 1315455 1304846 1265064 1321137 1322848 1331039 1354381 1373243 1333479 1316799 1307366
15612 1307366 1300116 1323619 1353748 1320725 1341689 1358830 1362790 1368022 1380249 1357421 1342166 1324357
15600 1324357 1308202 1345864 1348384 1334399 1341988 1322633 1306901 1301724 1321075 1284273 1286420 1299870
15588 1299870 1333769 1342828 1300652 1287826 1311356 1309267 1300056 1285086 1312646 1312250 1320133 1298233
15576 1298233 1334640 1338445 1341010 1326183 1318523 1335273 1312704 1323233 1337595 1347628 1371722 1366101
15564 1366101 1343394 1342833 1336447 1362856 1337819 1338582 1320800 1329459 1338588 1350013 1306374 1309409 1305161
15551 1305161 1323610 1351050 1339576 1326388 1317368 1302435 1297986 1296966 1304767 1293909 1284708 1308339
15539 1308339 1319569 1309210 1334967 1358123 1344569 1290435 1318560 1310159 1291539 1320761 1320207 1311476
15527 1311476 1338174 1353024 1354703 1360372 1318464 1301351 1311106 1321919 1333027 1342671 1362760 1367662
15515 1367662 1365341 1353695 1359079 1339218 1341358 1354588 1326053 1305600 1331945 1320158 1310666 1316492
15503 1316492 1335257 1365733 1361837 1347557 1319582 1320223 1330273 1336740 1339898 1312139 1313450 1302330
15491 1302330 1274526 1271576 1339512 1348287 1368850 1384962 1363771 1348084 1341364 1351334 1386399 1369109
15479 1369109 1343690 1344449 1351674 1354490 1357869 1374070 1321014 1345611 1350795 1333452 1310724 1307160 1323989
15466 1323989 1341889 1370121 1362712 1364269 1327521 1321040 1352688 1338215 1367914 1401902 1374418 1341133
15454 1341133 1333132 1315907 1341449 1373918 1389850 1369856 1364011 1334845 1349511 1357586 1325932 1324336
15442 1324336 1315737 1316245 1330762 1370091 1364391 1358028 1395040 1414291 1401594 1344818 1362554 1332932
15430 1332932 1346471 1333709 1343136 1380084 1383837 1389595 1384065 1397395 1363370 1353767 1362682 1350789
15418 1350789 1369085 1392716 1361983 1336382 1328092 1327028 1323076 1349379 1373501 1371146 1339970 1334155
15406 1334155 1349875 1346915 1337873 1318044 1314205 1328929 1340092 1334248 1347294 1367927 1384677 1390617
15394 1390617 1400083 1353344 1330809 1341167 1339725 1353333 1340244 1359982 1351285 1321671 1349635 1365907
15382 1365907 1351306 1374456 1363469 1353340 1373677 1357961 1377101 1401383 1350585 1395146 1408757
15371 1408757 1351618 1366173 1336568 1363573 1352622 1350872 1351685 1325764 1323958 1360659 1372400 1360808
15359 1360808 1374854 1363223 1369454 1409628 1424735 1408246 1372441 1355097 1341930 1332946 1390822 1371311
15347 1371311 1376142 1353603 1346950 1356626 1359399 1351620 1363843 1407345 1386119 1375830 1376960 1361742
15335 1361742 1352954 1339382 1352867 1380094 1375547 1384100 1402777 1377060 1352116 1358093 1370990 1395034
15323 1395034 1389499 1386997 1366508 1351514 1344265 1359841 1374794 1389519 1381053 1334811 1364205 1344188
15311 1344188 1351869 1332837 1314054 1329819 1355243 1369338 1377249 1382307 1389124 1390945 1378666 1356154
15299 1356154 1355065 1369146 1372454 1376438 1348304 1356204 1367797 1369556 1383161 1400928 1410097 1354939
15287 1354939 1367778 1377656 1360597 1376169 1378929 1383826 1390973 1404076 1409652 1399273 1375712 1370483
15275 1370483 1343152 1358767 1366914 1332625 1308339 1357884 1367883 1342902 1361070 1381230 1397031 1401093
15263 1401093 1386814 1391816 1387436 1357969 1346899 1400124 1399193 1403907 1424262 1400562 1392539 1378394
15251 1378394 1377255 1365171 1371776 1378308 1375087 1419076 1412792 1382949 1359397 1349690 1336398 1378199
15239 1378199 1375737 1384732 1379295 1353166 1372976 1354788 1347916 1387298 1399540 1402697 1405993 1421033
15227 1421033 1411068 1372229 1341449 1353507 1378645 1393644 1385818 1368830 1382768 1395307 1397847 1383551
15215 1383551 1370276 1339236 1380398 1411152 1406980 1390950 1400269 1352755 1367159 1356747 1360171 1331222
15203 1331222 1334157 1368877 1351635 1330618 1372404 1356374 1364396 1358532 1368296 1371559 1350471 1352215
15191 1352215 1352358 1375695 1383125 1390294 1392155 1410760 1379341 1359154 1348501 1377105 1370723 1397853
15179 1397853 1392629 1378045 1387409 1361149 1363265 1386024 1389589 1387157 1417111 1384965 1345665 1349793
15167 1349793 1362825 1381929 1382685 1395988 1397950 1404040 1399983 1397285 1392556 1391841 1384322 1389467 1386325 1422962
15153 1422962 1390418 1348416 1381884 1372101 1390976 1380293 1362364 1369265 1392476 1405462 1401658 1404289
15141 1404289 1402227 1393761 1375065 1375939 1367357 1364005 1344010 1363406 1382211 1388146 1381984 1370341 1384910
15128 1384910 1423251 1413369 1400788 1399025 1412093 1412928 1388673 1387129 1400410 1435517 1420645 1361447
15116 1361447 1362339 1415167 1414082 1404485 1438123 1427216 1418483 1397687 1359499 1339338 1396759 1415617
15104 1415617 1364968 1331060 1332809 1351990 1354886 1356459 1358843 1421976 1412777 1383974 1406918 1400813
15092 1400813 1427140 1430270 1407487 1396936 1433725 1450159 1398889 1396573 1399419 1395044 1417348 1409404
15080 1409404 1394222 1402961 1405779 1419866 1409432 1405742 1410547 1390730 1390152 1407664 1410197 1401972 1370795
15067 1370795 1351309 1393013 1398736 1350310 1372867 1393887 1359337 1384597 1384670 1393485 1397549 1359396
15055 1359396 1350784 1393811 1400671 1414997 1415200 1408815 1415656 1376460 1390816 1348084 1352983 1380333 1413586
15042 1413586 1413709 1380541 1363631 1388839 1424979 1449769 1443069 1414368 1400016 1403152 1399545 1419912
15030 1419912 1373165 1362189 1370394 1378791 1378512 1391784 1394726 1377032 1364708 1357388 1360599 1370645 1350736
15017 1350736 1367395 1383771 1369591 1404483 1378324 1386579 1416558 1419711 1380859 1403562 1467829 1426201
15005 1426201 1430725 1410112 1397754 1417170 1386938 1386767 1370918 1406334 1398137 1384253 1395060 1417541
14993 1417541 1385828 1385800 1387865 1414949 1415806 1392475 1398387 1374228 1368021 1392592 1415627 1397814 1411561
14980 1411561 1411438 1403530 1372635 1401290 1431246 1450912 1424307 1390525 1412820 1430031 1443142 1435575
14968 1435575 1435970 1398638 1421898 1431605 1393093 1398749 1386841 1372973 1398483 1410434 1394052 1390344
14956 1390344 1400717 1409023 1406350 1411833 1417851 1399179 1418255 1403706 1405640 1443467 1428247 1410925
14944 1410925 1386292 1401497 1429822 1395457 1406278 1437557 1459839 1452999 1433700 1414262 1428494
14933 1428494 1418115 1422361 1414349 1383684 1388183 1396024 1403516 1404166 1422622 1426471 1450847 1453088 1427007
14920 1427007 1395557 1384378 1407262 1404000 1405592 1406248 1362203 1353726 1369371 1394140 1385353 1379661 1398359
14907 1398359 1406406 1419002 1415888 1454667 1456217 1437319 1414683 1428500 1451611 1429454 1425852 1442767
14895 1442767 1445680 1426530 1422893 1402960 1407716 1391187 1372058 1381435 1415516 1427905 1425405 1387269
14883 1387269 1393781 1388634 1383017 1402348 1389270 1431945 1438311 1405236 1374101 1391438 1423174 1390183
14871 1390183 1365688 1379642 1382019 1402803 1399827 1393328 1400465 1412957 1407130 1438192 1435655 1421666
14859 1421666 1404072 1409737 1416891 1380876 1392424 1417894 1448489 1432345 1454190 1437546 1422327 1442817
14847 1442817 1428466 1442530 1447416 1439287 1445502 1454558 1437687 1390840 1381226 1400728 1401533 1452480 1451106
14834 1451106 1462086 1466083 1458926 1409877 1394706 1410749 1401026 1421379 1431831 1453597 1438331 1402578
14822 1402578 1413293 1439196 1444330 1441315 1427183 1449860 1446360 1447247 1430781 1422736 1432172 1435115 1385129
14809 1385129 1360417 1408249 1409326 1449000 1461922 1421743 1403861 1402144 1450974 1445952 1429461 1417136
14797 1417136 1422275 1426743 1456725 1424905 1425480 1403771 1384926 1398077 1416950 1450836 1472749 1461442
14785 1461442 1454663 1485958 1471856 1477009 1479814 1460392 1425829 1410092 1447358 1461356 1468156 1464413
14773 1464413 1435041 1426004 1446698 1430497 1395964 1430980 1443187 1456163 1415114 1412130 1445194 1461533
14761 1461533 1457899 1441105 1453016 1420223 1449487 1452580 1426907 1438838 1446406 1459648 1400658 1420862
14749 1420862 1429854 1431217 1430517 1451046 1436465 1432644 1472643 1469089 1471374 1433178 1490365 1499976 1457592
14736 1457592 1432780 1455075 1427009 1434296 1455594 1454797 1451630 1412045 1438049 1438046 1429537 1433021 1448917
14723 1448917 1465771 1482337 1475105 1475244 1496809 1462304 1424696 1464203 1451141 1458738 1456097 1453233
14711 1453233 1478284 1455662 1411107 1439740 1465978 1472671 1512528 1520477 1515374 1469016 1454998 1446043
14699 1446043 1472479 1459210 1433844 1453442 1463093 1454178 1454903 1485483 1457232 1421652 1420016 1455038
14687 1455038 1447091 1468214 1505088 1483221 1463173 1469499 1461525 1453994 1447480 1451176 1458071 1450728 1473833
14674 1473833 1472444 1442410 1444333 1441820 1461927 1487414 1475925 1478527 1506709 1507211 1464011 1445461
14662 1445461 1445589 1424681 1458184 1457133 1459537 1464672 1467676 1465539 1471272 1455107 1420819 1414437 1401211
14649 1401211 1406369 1420414 1406888 1416735 1432298 1428232 1439141 1467444 1448665 1417409 1432229 1432380
14637 1432380 1437466 1445507 1436375 1424994 1450052 1478950 1485374 1490200 1468660 1426510 1414550 1418086
14625 1418086 1434829 1443714 1457496 1474257 1459486 1461208 1487388 1500855 1503191 1491581 1516202 1496085
14613 1496085 1473045 1464399 1504668 1486323 1469604 1458794 1459704 1480503 1470801 1467298 1426113 1450117
14601 1450117 1466305 1487288 1493423 1471521 1459861 1437538 1443933 1462409 1480271 1465291 1446204 1450632
14589 1450632 1457565 1473235 1453713 1445241 1466970 1484690 1485511 1486202 1482114 1465280 1496172 1471205 1478919
14576 1478919 1486913 1490239 1486909 1465870 1481513 1490066 1488079 1490996 1469361 1485212 1518757 1486014
14564 1486014 1439032 1414458 1429165 1464286 1454660 1464838 1472842 1461609 1475083 1483231 1472297 1489788
14552 1489788 1482398 1459919 1458827 1472957 1493318 1510879 1525341 1480240 1464721 1481972 1476853 1472933
14540 1472933 1451457 1448734 1427563 1449784 1463509 1498773 1486790 1453641 1476149 1474381 1466048 1497426
14528 1497426 1500078 1455215 1453943 1460093 1454010 1485887 1482698 1428628 1467058 1473730 1478874 1508629 1499093
14515 1499093 1443880 1485637 1507083 1525120 1508489 1534331 1509561 1467605 1495974 1490749 1482389 1507502
14503 1507502 1509909 1467006 1474282 1497105 1483933 1469849 1466340 1480638 1480532 1501689 1491382 1495117
14491 1495117 1484656 1466661 1447564 1451013 1493118 1479764 1480553 1508072 1509009 1476938 1507028 1499996
14479 1499996 1513335 1496789 1458026 1474516 1465104 1441523 1460391 1450697 1442803 1513929 1513261 1502082
14467 1502082 1503291 1499474 1475650 1475831 1474885 1492736 1509951 1481217 1471503 1462172 1459773 1454848 1468356
14454 1468356 1495049 1503866 1497727 1512576 1560154 1544231 1516301 1506085 1504983 1503291 1507026 1516017
14442 1516017 1503349 1516257 1493413 1490499 1493830 1483743 1480212 1466318 1449559 1451275 1451511 1414637
14430 1414637 1432039 1498371 1508381 1475397 1474118 1487430 1471028 1489954 1515089 1492768 1471974
14419 1471974 1463708 1480886 1479412 1489704 1519815 1507484 1512074 1500687 1509677 1527651 1519006 1510936
14407 1510936 1500177 1492244 1498259 1491221 1504303 1467090 1465009 1462767 1457561 1445189 1424633 1454445
14395 1454445 1494477 1465552 1511386 1540442 1543439 1521744 1519963 1531422 1513725 1518965 1510701 1532630
14383 1532630 1518961 1523342 1521959 1502296 1488414 1487798 1489544 1488058 1506904 1482881 1476658 1517393 1485049
14370 1485049 1490675 1522935 1485454 1493610 1488990 1475427 1478171 1512068 1526026 1483513 1493130 1508355
14358 1508355 1517833 1518990 1509982 1483402 1510360 1526738 1512214 1461964 1479883 1500975 1507574 1515741
14346 1515741 1505720 1494234 1499837 1488729 1452898 1455299 1484887 1497855 1482431 1465057 1474179 1491089
14334 1491089 1509302 1483784 1468489 1485663 1484721 1467724 1469898 1498300 1521663 1515272 1490305 1511030
14322 1511030 1526974 1524718 1512760 1471999 1493432 1523518 1522745 1522355 1494981 1461126 1493846 1508734
14310 1508734 1507259 1513588 1520346 1485720 1511308 1525801 1512527 1506055 1495375 1497466 1469024 1480292
14298 1480292 1486569 1496774 1499457 1505723 1512058 1532059 1517933 1509727 1505683 1518392 1525754 1522161 1503498
14285 1503498 1507585 1519989 1546293 1532123 1533751 1556317 1555908 1537427 1512929 1514621 1520805 1516954 1506318
14272 1506318 1491581 1499844 1510054 1498527 1499656 1507674 1496563 1523064 1500305 1509831 1502618 1475743
14260 1475743 1496580 1509531 1501958 1512402 1526025 1551293 1554170 1536174 1525919 1507046 1513630 1511649
14248 1511649 1495939 1500999 1500002 1503594 1515393 1532003 1543295 1517448 1505514 1502694 1507669 1512612 1522196
14235 1522196 1491696 1493412 1523070 1546806 1523900 1529773 1533555 1540953 1533792 1508510 1496794 1549957
14223 1549957 1548855 1503459 1534052 1526503 1524940 1524795 1494507 1473512 1488131 1520751 1518384 1546210
14211 1546210 1555646 1557640 1560241 1510438 1521155 1546595 1545270 1544662 1505316 1560004 1583913 1520030
14199 1520030 1500430 1528390 1520024 1542706 1568056 1546368 1559616 1539497 1525969 1566388 1569298 1532200
14187 1532200 1522896 1538588 1520275 1515752 1534608 1510566 1523909 1555964 1524505 1493723 1511792 1528455
14175 1528455 1518663 1531204 1526494 1515662 1517361 1538797 1533104 1531171 1516802 1485908 1524536 1547813
14163 1547813 1509699 1530514 1544783 1505507 1486741 1520413 1535482 1531799 1545495 1565893 1578762
14152 1578762 1560806 1555813 1545959 1564439 1555206 1530417 1522034 1511722 1516318 1530914 1523640 1531890 1510958
14139 1510958 1492748 1500122 1555711 1557682 1558491 1542631 1554679 1560990 1543652 1520126 1525925 1529045 1536279
14126 1536279 1522435 1553968 1550860 1545533 1580337 1568127 1556953 1527179 1512847 1479792 1520938 1516165
$$ [...]
##END NTUPLES=NMR SPECTRUM
##END=
