##TITLE=1H_DE-80H_X3
 200.13MHz, d2o
 8 sc
 
 19ns.26.2.2025
##JCAMPDX= 6.0         $$ Bruker NMR JCAMP-DX V2.0
##DATA TYPE= NMR SPECTRUM
##DATA CLASS= NTUPLES
##ORIGIN= UXNMR, Bruker Analytische Messtechnik GmbH
##OWNER= pz
$$ XWIN-NMR		Version 3.5
$$ Tue Jul 14 10:36:45 2026 Russian Standard Time (UT+4h)  Yarkov@DPX200
##.OBSERVE FREQUENCY= 200.1313
##.OBSERVE NUCLEUS= ^1H
##.ACQUISITION MODE= SIMULTANEOUS
##.ACQUISITION SCHEME= undefined
##.AVERAGES= 8
##.DIGITISER RES= 18
##SPECTROMETER/DATA SYSTEM= spect
##.PULSE SEQUENCE= zg30
##.SOLVENT NAME= CDCl3
##.SHIFT REFERENCE= (INTERNAL, CDCl3, 0, 15.5607)
##AUDIT TRAIL= $$ (NUMBER, WHEN, WHO, WHERE, WHAT)
$$ ##TITLE= Audit trail, XWIN-NMR		Version 3.5
$$ ##JCAMPDX= 5.01
$$ ##ORIGIN= Bruker BioSpin GmbH
$$ ##OWNER= Yarkov
$$ C:/Bruker/XWIN-NMR/data/yarkov2/nmr/H-C/1/pdata/1/auditp.txt
$$ ##AUDIT TRAIL=  $$ (NUMBER, WHEN, WHO, WHERE, WHAT)
(   1,<2026-07-14 10:35:58.06 +0400>,<Yarkov>,<DPX200>,
      <created by zg, POWCHK disabled, PULCHK disabled
       configuration hash MD5:
       00 E9 B6 7A A2 85 ED C7 34 08 36 98 17 FE 4E 26
       data hash MD5: 16K
       C8 9A 92 B0 4A 5E 95 54 66 4B 80 4D E4 DC 74 BB>)
(   2,<2026-07-14 10:36:03.73 +0400>,<Yarkov>,<DPX200>,
      <Start of raw data processing
       efp BC_mod = 2 LB = 0.25 FT_mod = 6 PKNL = 1 PHC0 = -7252.948 PHC1 = 6.42196 SI = 16K 
       data hash MD5: 16K
       42 F8 40 B7 5F E3 8D 03 75 0A 8E 23 91 3C 5B D3>)
(   3,<2026-07-14 10:36:08.70 +0400>,<Yarkov>,<DPX200>,
      <abs ABSG = 5 
       data hash MD5: 16K
       B1 58 27 91 14 E7 FF D6 46 A4 C3 2E A4 52 CF E3>)
$$ ##END=
$$ 
$$ hash MD5
$$ 6D F4 7F E6 29 47 6D 1A CD 1F 79 5E A9 82 31 4A
##$RELAX= 
##$RELAX= 
##$RELAX= 
##$RELAX= 
##$RELAX= 
##$RELAX= 
$$ Bruker specific parameters
$$ --------------------------
##$DU= <C:/Bruker/XWIN-NMR>
##$EXPNO= 1
##$NAME= <H-C>
##$PROCNO= 1
##$TYPE= <nmr>
##$USER= <yarkov2>
##$AMP= (0..31)
100 100 100 100 100 100 100 100 100 100 100 100 100 100 100 100 100 100 
100 100 100 100 100 100 100 100 100 100 100 100 100 100 
##$AQSEQ= 0
##$AQ_mod= 1
##$AUNM= <au_zg>
##$AUTOPOS= <>
##$BF1= 200.13
##$BF2= 200.13
##$BF3= 200.13
##$BF4= 200.13
##$BF5= 200.13
##$BF6= 200.13
##$BF7= 200.13
##$BF8= 200.13
##$BYTORDA= 1
##$CFDGTYP= 0
##$CFRGTYP= 5
##$CHEMSTR= <none>
##$CNST= (0..31)
1 1 145 1 1 1 1 1 1 1 1 1 1 1 1 1 1 1 1 1 1 1 1 1 1 1 1 1 1 1 1 1 
##$CPDPRG= <>
##$CPDPRG1= <>
##$CPDPRG2= <>
##$CPDPRG3= <>
##$CPDPRG4= <mlev>
##$CPDPRG5= <mlev>
##$CPDPRG6= <mlev>
##$CPDPRG7= <mlev>
##$CPDPRG8= <mlev>
##$CPDPRGB= <>
##$CPDPRGT= <>
##$D= (0..31)
0 0.7 0 0 0 0 0 0 0 0 0 0.03 0 0 0 0 0 0 0 0 0 0 0 0 0 0 0 0 0 0 0 0 
##$DATE= 1784010957
##$DBL= (0..7)
120 120 120 120 120 120 120 120 
##$DBP= (0..7)
150 150 150 150 150 150 150 150 
##$DBP07= 0
##$DBPNAM0= <>
##$DBPNAM1= <>
##$DBPNAM2= <>
##$DBPNAM3= <>
##$DBPNAM4= <>
##$DBPNAM5= <>
##$DBPNAM6= <>
##$DBPNAM7= <>
##$DBPOAL= (0..7)
0.5 0.5 0.5 0.5 0.5 0.5 0.5 0.5 
##$DBPOFFS= (0..7)
0 0 0 0 0 0 0 0 
##$DE= 6
$$ [...]
##$SUBNAM3= <"">
##$SUBNAM4= <"">
##$SUBNAM5= <"">
##$SUBNAM6= <"">
##$SUBNAM7= <"">
##$SUBNAM8= <"">
##$SUBNAM9= <"">
##$SW= 18.0517328524113
##$SWIBOX= (0..15)
0 0 2 0 0 0 0 0 0 0 0 0 0 0 0 0 
##$SW_h= 3612.71676300578
##$TD= 16384
##$TD0= 1
##$TE= 0
##$TE2= 300
##$TE3= 300
##$TEG= 300
##$TL= (0..7)
0 120 120 120 120 120 120 120 
##$TP= (0..7)
150 150 150 150 150 150 150 150 
##$TP07= 0
##$TPNAME0= <>
##$TPNAME1= <>
##$TPNAME2= <>
##$TPNAME3= <>
##$TPNAME4= <>
##$TPNAME5= <>
##$TPNAME6= <>
##$TPNAME7= <>
##$TPOAL= (0..7)
0.5 0.5 0.5 0.5 0.5 0.5 0.5 0.5 
##$TPOFFS= (0..7)
0 0 0 0 0 0 0 0 
##$TUNHIN= 0
##$TUNHOUT= 0
##$TUNXOUT= 0
##$USERA1= <user>
##$USERA2= <user>
##$USERA3= <user>
##$USERA4= <user>
##$USERA5= <user>
##$V9= 5
##$VALIST= <valist>
##$VCLIST= <CCCCCCCCCCCCCCC>
##$VD= 0
##$VDLIST= <DDDDDDDDDDDDDDD>
##$VPLIST= <PPPPPPPPPPPPPPP>
##$VTLIST= <TTTTTTTTTTTTTTT>
##$WBST= 1024
##$WBSW= 4
##$XGAIN= (0..3)
0 0 0 0 
##$XL= 0
##$YL= 0
##$YMAX_a= 483127
##$YMIN_a= -609402
##$ZGOPTNS= <>
##$ZL1= 120
##$ZL2= 120
##$ZL3= 120
##$ZL4= 120
##$ABSF1= 15.49237
##$ABSF2= -2.55948
##$ABSG= 5
##$ABSL= 3
##$ALPHA= 0
##$AQORDER= 0
##$ASSFAC= 0
##$ASSFACI= 0
##$ASSFACX= 0
##$ASSWID= 0
##$AUNMP= <proc_1d>
##$AZFE= 0.1
##$AZFW= 0.1
##$BCFW= 0
##$BC_mod= 2
##$BYTORDP= 0
##$COROFFS= 0
##$CY= -3
##$DATMOD= 1
##$DC= 0
##$DFILT= <>
##$DTYPP= 0
##$F1P= 0
##$F2P= 0
##$FCOR= 1
##$FTSIZE= 16384
##$FT_mod= 6
##$GAMMA= 0
##$GB= 0
##$INTBC= 1
##$INTSCL= 3.241238e-09
##$ISEN= 128
##$LB= 0.25
##$LEV0= 0
##$LPBIN= 0
##$MAXI= 10000
##$MC2= 0
##$MEAN= 0
##$ME_mod= 0
##$MI= 1.114404
##$NCOEF= 0
##$NC_proc= -5
##$NLEV= 6
##$NOISF1= 3.799351
##$NOISF2= 2.8
##$NSP= 0
##$NTH_PI= 0
##$NZP= 0
##$OFFSET= 15.56069
##$PC= 1
##$PHC0= -7252.948
##$PHC1= 6.42196
##$PH_mod= 1
##$PKNL= yes
##$PPARMOD= 0
##$PSCAL= 0
##$PSIGN= 0
##$REVERSE= no
##$SF= 200.129992197841
##$SI= 16384
##$SIGF1= 3
##$SIGF2= 2
##$SINO= 0.751879
##$SIOLD= 32768
##$SREGLST= <19F.Aceton>
##$SSB= 0
##$STSI= 16384
##$STSR= 0
##$SW_p= 3612.71676300578
##$SYMM= 0
##$S_DEV= 0
##$TDeff= 16384
##$TDoff= 0
##$TI= <>
##$TILT= no
##$TM1= 0
##$TM2= 0
##$TOPLEV= 0
##$USERP1= <user>
##$USERP2= <user>
##$USERP3= <user>
##$USERP4= <user>
##$USERP5= <user>
##$WDW= 1
##$XDIM= 16384
##$YMAX_p= 362345699
##$YMIN_p= -182882
$$ End of Bruker specific parameters
$$ ---------------------------------
##NTUPLES= NMR SPECTRUM
##VAR_NAME=  FREQUENCY,     SPECTRUM/REAL,   SPECTRUM/IMAG
##SYMBOL=    X,             R,               I
##VAR_TYPE=  INDEPENDENT,   DEPENDENT,       DEPENDENT
##VAR_FORM=  AFFN,          ASDF,            ASDF
##VAR_DIM=   16384,         16384,           16384
##UNITS=     HZ,            ARBITRARY UNITS, ARBITRARY UNITS
##FACTOR=    0.220516191357247, 1,           1
##FIRST=     3114.16075351291, 0,            0
##LAST=      -498.556009492866, 0,           0
##MIN=       -498.556009492866, -182882,     0
##MAX=       3114.16075351291, 362345699,    0
$$ Real data points
##PAGE= N=1
##DATA TABLE= (X++(R..R)), XYDATA
$$ [...]
$$ plain form
6863 -36461 -23581 -4506 -23094 -45262 -33374 -57640 -64604 -26647 -36360 -77843 -70529 -57436
6851 -57436 -53997 -47852 -11571 -13593 -27600 -40817 -42558 -37324 -64023 -77597 -60203 -36541 -45017
6838 -45017 -52449 -78165 -90246 -76079 -64477 -54737 -30614 -22038 -43896 -43038 -63240 -76966 -77303
6825 -77303 -85165 -66032 -57410 -72760 -35224 -42085 -50121 -13843 -47132 -50562 -40459 -32584 -40669
6812 -40669 -62835 -74874 -86432 -81246 -108694 -106369 -73986 -79622 -79388 -76451 -70239 -94140 -71219
6799 -71219 -30597 -60220 -61956 -93383 -76914 -80104 -67858 -67848 -66766 -75218 -88516 -61639 -42661
6786 -42661 -44637 -42485 -71267 -81074 -86354 -56512 -9265 -13213 -32934 -32443 -18573 -36822 -32826
6773 -32826 -42812 -43953 -32589 -57856 -56752 -51281 -60118 -71550 -32337 -51709 -92647 -74827 -54057
$$ packed form
6863c6461J2880J9075j8588k2168J1888k4266o964L7957r713m1483P314J3093
6851e7436L439O145L6281k022j4007j3217j741N234k6699j3574J7394K3662q476
6838d5017p432k5716j2081J4167J1602R740K4123Q576k1858Q58k0202j3726l37
6825g7303p862J9133Q622j5350L7536o861q036L6278l3289l430J0103P875q085
6812d0669k2166j2039j1558N186k7448K325L2383n636K34K937O212k3901K2921
6799g1219M0622k9623j736l1427J6469l190J2246J0J082q452j3298K6877J8978
6786d2661j976K152k8782r807n280K9842M7247l948j9721M91J3870j8249L996
6773c2826r986j141J1364k5267J104N471q837j1432L9213j9372m0938J7820K0770
$$ plain form
6760 -54057 -15765 -30828 -48134 -49498 -68185 -61439 -51019 -74006 -45643 -55803 -65374 -78261
6748 -78261 -81650 -74429 -57550 -47484 -20676 -44624 -82893 -75873 -49637 -46571 -31106 -60418 -67938
6735 -67938 -52552 -84580 -68307 -76472 -87870 -87212 -106484 -123520 -75324 -51495 -66329 -50956
6723 -50956 -72406 -91947 -109450 -107868 -111139 -96169 -87044 -105831 -76583 -85895 -70773 -65958 -60095
6710 -60095 -41656 -49739 -38309 -60810 -67464 -41612 -52004 -97489 -99675 -148778 -144578 -84133 -65180
6697 -65180 -41166 -43825 -58838 -58921 -94895 -61625 -38663 -72654 -82437 -114176 -94908 -11209 3560
6684 3560 10100 2033 -33723 -40178 -39022 -2808 10884 -12932 -44900 -64012 -58404 -35743 -16832
6671 -16832 -45247 -74253 -82927 -73676 -80600 -85724 -70230 -50803 -72957 -68650 -80658 -62172 -49045
$$ packed form
6760e4057L8292j5063j7306j364j8687O746J0420k2987K8363j0160r571j2887
6748g8261l389P221J6879J0066K6808k3948l8269P020K6236L066J5465k9312p520
6735f7938J5386l2028J6273q165j1398O58j9272j7036M8196K3829j4834J5373
6723e0956k1450j9541j7503J582l271J4970R125j8787K9248r312J5122M815N863
6710f0095J8439q083J1430k2501o654K5852j0392m5485k186m9103M200O0445J8953
6697f5180K4014k659j5013q3l5974L3270K2962l3991r783l1739J9268Q3699J4769
6684C560O540q067l5756o455J156L6214J3692k3816l1968j9112N608K2661J8911
6671a6832k8415k9006q674R251o924n124J5494J9427k2154M307j2008J8486J3127
$$ plain form
6658 -49045 -59072 -63557 -97679 -67974 -71339 -63653 -84220 -108259 -109933 -99906 -103732 -99325 -74243
6645 -74243 -86092 -108657 -100955 -125893 -77782 -79719 -98040 -54705 -44100 -62589 -58782 -86384
6633 -86384 -97849 -63642 -20964 -31186 -78355 -100745 -97496 -125089 -119219 -119796 -98081 -75159 -70142
6620 -70142 -63969 -72598 -71495 -88009 -86997 -80685 -94956 -100608 -89001 -94230 -74036 -89041 -99160
6607 -99160 -107311 -98504 -70427 -63240 -95333 -108752 -93240 -89006 -139846 -117622 -129272 -140734 -120396
6594 -120396 -116550 -114270 -98369 -69081 -81039 -88106 -97780 -74684 -97503 -94998 -66920 -98266 -127800
6581 -127800 -89244 -89395 -62624 -57981 -66511 -88449 -97553 -87816 -108121 -64995 -77863 -106571 -109609
6568 -109609 -128082 -77445 -46546 -46764 -40168 -82879 -97934 -91821 -90438 -81144 -56983 -65565 -116491
$$ packed form
6658d9045j0027m485l4122K9705l365P686k0567k4039j674J0027l826M407K5082
6645g4243j1849k2565P702k4938M8111j937j8321M3335J0605j8489L807k7602
6633h6384j1465L4207M2678j0222m7169k2390L249k7593N870n77K1715K2922N017
6620g0142O173q629J103j6514J012O312j4271n652J1607n229K0194j5005j0119
6607i9160q151Q807K8077P187l2093j3419J5512M234n0840K2224j1650j1462K0338
6594a20396L846K280J5901K9288j1958p067r674K3096k2819K505K8078l1346k9534
6581a27800L8556j51K6771M643q530k1938r104R737k0305M3126j2868k8708l038
6568a09609j8473N0637L0899k18O596m2711j5055O113J383R294K4161q582n0926
$$ plain form
6555 -116491 -114188 -114212 -74361 -40612 -60887 -100244 -100646 -68626 -50315 -53952 -76833 -83074 -103226
6542 -103226 -125484 -136170 -119343 -80543 -64464 -68624 -45628 -84679 -98445 -79762 -53773 -81134
6530 -81134 -90323 -110428 -102306 -80383 -65053 -17169 3733 -8213 -39314 -44310 -20037 5351
6518 5351 -8568 -25101 12701 29750 15066 -25138 -16195 -36572 -67059 -46784 -58068 -90888
6506 -90888 -72168 -51621 -62825 -53148 -63224 -78442 -114433 -93392 -42450 -54890 -102733 -84342
6494 -84342 -107709 -131729 -78885 -64373 -98646 -91701 -95357 -122064 -51855 -42716 -86497 -98581
6482 -98581 -100877 -90541 -54514 -67225 -98629 -64964 -93710 -112856 -123049 -93600 -64655 -80527
6470 -80527 -103542 -144820 -131795 -88773 -122168 -131724 -103560 -88129 -83133 -78729 -80510 -92460 -99957
$$ packed form
6555a16491K303k4L9851L3749k0275l9357m02L2020J8311l637k2881o241k0152
6542a03226k2258j0686J6827L8800J6079m160K2996l9051j3766J8683K5989k7361
6530h1134r189k0105Q122K1923J5330M7884K0902j1946l1101m996K4273K5388
6518E351j3919j6533L7802J7049j4684m0204Q943k0377l0487K0275j1284l2820
6506i0888J8720K0547j1204R677j0076j5218l5991K1041N0942j2440m7843J8391
6494h4342k3367k4020N2844J4512l4273O945l656k6707P0209R139m3781j2084
6482i8581k296J0336L6027j2711l1404L3665k8746j9146j0193K9449K8945j5872
6470h0527k3015m1278J3025M3022l3395r556K8164J5431M996M404j781j1950p497
$$ plain form
6457 -99957 -118364 -102909 -114558 -82021 -81840 -93748 -112019 -105259 -119186 -141170 -83566 -119704
6445 -119704 -105597 -88547 -121484 -103683 -62819 -103232 -138744 -115768 -100014 -131638 -125421 -86648
6433 -86648 -86770 -73534 -112799 -131307 -123098 -136355 -149639 -130560 -102279 -103086 -101841 -94406 -81269
6420 -81269 -96333 -94503 -89729 -95320 -95326 -124223 -143295 -143386 -94966 -92612 -105744 -100452 -107795 -108871 -92486
6405 -92486 -110001 -129516 -104592 -157360 -159567 -162343 -162011 -117808 -139977 -125449 -113647 -106683 -105797
6392 -105797 -144850 -139594 -135140 -153588 -138250 -136670 -145340 -140975 -125741 -110699 -97203 -92741 -124264
6379 -124264 -112248 -105741 -94669 -114015 -133646 -152835 -148851 -101571 -128555 -131781 -111572 -103218
6367 -103218 -104769 -95167 -82686 -89797 -121294 -141605 -136027 -153890 -134701 -131703 -167106 -171307 -111181
$$ packed form
6457i9957j8407J5455j1649L2537J81j1908j8271O760j3927k1984N7604l6138
6445a19704J4107J7050l2937J7801M0864m0413l5512K2976J5754l1624O217L8773
6433h6648j22J3236l9265j8508Q209j3257j3284J9079K8281q07J245P435J3137
6420h1269j5064J830M774n591ok8897j9072r1M8420K354j3132N292p343j076J6385
6405i2486j7515j9515K4924n2768k207k776L32M4203k2169J4528J1802O964Q86
6392a05797l9053N256M454j8448J5338J580q670M365J5234J5042J3496M462l1523
6379a24264J2016O507J1072j9346j9631j9189L984M7280k6984l226K0209Q354
6367a03218j551R602J2481p111l1497k0311N578j7863J9189K998l5403m201O0126
$$ plain form
6354 -111181 -120211 -109631 -63998 -92315 -113071 -137026 -132735 -135516 -125491 -133794 -141316 -128507 -169836
6341 -169836 -151406 -142328 -132919 -112314 -120308 -128313 -138946 -137516 -137255 -135267 -117405 -138542 -163801
6328 -163801 -175356 -174549 -165814 -143980 -133020 -127090 -114994 -128513 -117672 -133928 -139891 -137693 -143386
6315 -143386 -148527 -160746 -168838 -157988 -156264 -128578 -116104 -110603 -122747 -140227 -133516 -144259 -156204
6302 -156204 -146995 -120096 -103505 -108073 -119242 -160096 -164753 -135167 -145734 -129099 -140227 -137216
6290 -137216 -142159 -148376 -153032 -114254 -98245 -140920 -127438 -154685 -162310 -149018 -85278 -112303
6278 -112303 -146468 -128359 -154265 -165058 -180389 -142157 -145557 -173155 -124166 -104823 -77687 -69115
6266 -69115 -95140 -113587 -110186 -110382 -128506 -124073 -102453 -90567 -124873 -173775 -176616 -166707 -127846
$$ packed form
6354a11181r030J0580M5633k8317k0756k3955M291k781J0025q303p522J2809m1329
6341a69836J8430R078R409K0605p994q005j0633J430K61J988J7862k1137k5259
6328a63801j1555Q07Q735K1834J0960N930J2096j3519J0841j6256n963K198n693
6315a43386n141j2219q092J0850J724K7686J2474N501j2144j7480O711j0743j1945
6302a56204R209K6899J6591m568j1169m0854m657K9586j0567J6635j1128L011
6290a37216m943o217m656L8778J6009m2675J3482k7247p625J3292O3740k7025
6278a12303l4165J8109k5906j0793j5331L8232l400k7598M8989J9343K7136Q572
6266f9115k6025j8447L401j96j8124M433K1620J1886l4306m8902k841R909L8861
$$ plain form
6253 -127846 -99432 -119968 -119419 -157071 -141061 -122589 -137372 -117513 -116266 -132976 -145993 -139401
6241 -139401 -124119 -100918 -98987 -100166 -91985 -117326 -125807 -122946 -89998 -94318 -141788 -146989 -134207
6228 -134207 -102846 -122952 -104896 -121017 -136644 -137304 -154018 -173222 -137144 -97842 -131330 -173601
6216 -173601 -174494 -135641 -112994 -92725 -95814 -104843 -102372 -141567 -152318 -143052 -133326 -103625 -95911
6203 -95911 -112456 -135536 -107229 -98466 -86585 -61033 -68679 -75847 -81886 -74305 -62374 -66947 -66662
6190 -66662 -95629 -139327 -171851 -148237 -127456 -118402 -109111 -108968 -123181 -118913 -136573 -124565 -113601
6177 -113601 -91647 -98773 -106054 -87128 -80239 -66599 -59318 -70347 -79072 -72122 -59806 -14882 18561
6164 18561 7869 -19936 -34960 -35293 -57686 -62110 -69337 -66425 -115841 -149306 -155594 -100784 -78483
$$ packed form
6253a27846K8414k0536N49l7652J6010J8472j4783J9859J247j6710j3017O592
6241a39401J5282K3201J931j179Q181k5341q481K861L2948m320m7470n201J2782
6228a34207L1361k0106J8056j6121j5627o60j6714j9204L6078L9302l3488m2271
6216a73601q93L8853K2647K0269l089r029K471l9195j0751R266R726K9701P714
6203i5911j6545k3080K8307Q763J1881K5552p646p168o039P581J1931m573K85
6190f6662k8967m3698l2524K3614K0781R054R291J43j4213M268j7660J2008J0964
6177a13601K1954p126p281J8926O889J3640P281j1029q725O950J2316M4924L3443
6164A8561j0692k7805j5024l33k2393m424p227K912m9416l3465o288N4810K2301
$$ plain form
6151 -78483 -88251 -113442 -113343 -117974 -111307 -54078 -74657 -110873 -127340 -98714 -98156 -79134 -74414 -53815
6137 -53815 -39219 -73954 -93003 -72540 -71532 -42145 -53471 -116656 -111545 -105820 -94280 -83793
6125 -83793 -86298 -48906 -103791 -103834 -90861 -97886 -69319 -68994 -110299 -146117 -133526 -111517 -114967
6112 -114967 -118254 -92562 -85688 -95865 -60701 -71481 -69908 -66014 -88671 -109146 -99427 -98058 -142135
6099 -142135 -145202 -127056 -114028 -114431 -125211 -110817 -75523 -111851 -125977 -147411 -162513 -174717
6087 -174717 -144464 -112121 -123095 -110944 -122912 -136087 -159188 -132567 -118160 -75036 -52539 -85784
6075 -85784 -139019 -122469 -121441 -115563 -81905 -117073 -141317 -118530 -94327 -134754 -88752 -85725
6063 -85725 -78305 -88725 -112267 -131304 -123880 -125116 -158107 -138437 -148211 -155978 -127609 -105418 -105230
$$ packed form
6151g8483r768k5191R9m631O667N7229k0579l6216j6467K8626N58J9022M720K0599
6137e3815J4596l4735j9049K0463J008K9387j1326o3185N111N725J1540J0487
6125h3793k505L7392n4885m3J2973p025K8567L25m1305l5818J2591K2009l450
6112a14967l287K5692O874j0177L5164j0780J573L894k2657k0475R719J369m4077
6099a42135l067J8146J3028m03j0780J4394L5294l6328j4126k1434j5102j2204
6087a74717L0253L2343j0974J2151j1968j3175k3101K6621J4407M3124K2497l3245
6075h5784n3235J6550J028N878L3658l5168k4244K2787K4203m0427M6002L027
6063h5725P420j0420k3542j9037P424j236l2991J9670r774p767K8369K2191J88
$$ plain form
6050 -105230 -95135 -78976 -96810 -135996 -98135 -91621 -55506 -30785 -45251 -41036 -33219 -6386
6038 -6386 4638 -6941 3929 42889 -33593 -28454 2182 -21357 -7256 11005 20007 -50808
6026 -50808 -18012 11016 -12784 5938 -8016 -37227 -41669 -54242 -15111 -6228 -52954 -99929
6014 -99929 -119992 -101051 -88585 -90379 -64388 -66762 -96043 -134619 -123026 -115552 -123628 -103856 -137286
6001 -137286 -120033 -114212 -87218 -88922 -81789 -68553 -97225 -112358 -102120 -101328 -99722 -128363 -154252
5988 -154252 -106218 -114066 -139564 -106460 -90721 -84124 -82139 -104640 -103025 -86217 -85057 -108554 -145074
5975 -145074 -150497 -182882 -140467 -111828 -116101 -109087 -122510 -130183 -132547 -130820 -114775 -113538 -115463
5962 -115463 -121180 -132778 -138782 -114904 -79708 -102735 -104428 -127797 -131141 -125231 -165870 -136331 -120777
$$ packed form
6050a05230J0095J6159j7834l9186L7861O514L6115K4721j4466M215P817K6833
6038f386J1024j1579J0870L8960p6482N139L0636k3539J4101J8261R002p0815
6026e0808L2796K9028k3800J8722j3954k9211m442j2573L9131Q883m6726m6975
6014i9929k0063J8941J2466j794K5991k374k9281l8576J1593P474q076J9772l3430
6001a37286J7253N821K6994j704P133J3236k8672j5133J0238P92J606k8641k5889
5988a54252M8034p848k5498L3104J5739O597J985k2501J615J6808J160k3497l6520
5975a45074n423l2385M2415K8639m273P014j3423p673k364J727J6045J237j925
5962a15463n717j1598o004K3878L5196k3027j693k3369l344N910m0639K9539J5554
$$ plain form
5949 -120777 -113136 -96155 -116700 -135817 -118058 -84486 -76556 -114005 -118380 -101351 -95324 -119931
5937 -119931 -122818 -99253 -81153 -107426 -116306 -72171 -106175 -98432 -76406 -71863 -57455 -48420 -46145
5924 -46145 -52661 -50676 -26731 2669 9522 41511 92489 108245 129256 150996 199707 236110
5912 236110 270750 278780 294761 276370 240618 232231 275342 294378 264554 247765 272867 279560
5900 279560 280144 293560 226244 165527 161338 88674 50045 25861 10687 4974 -21616 -52737
5888 -52737 -65154 -66649 -72150 -40915 -37243 -47401 -80220 -82207 -81532 -94602 -60262 -55437 -90834
5875 -90834 -103784 -128094 -86233 -44686 -22794 -43233 -71311 -93735 -88094 -66478 -59401 -54622
5863 -54622 -68773 -94507 -87368 -64333 -66235 -63883 -65806 -50851 -80236 -113521 -109911 -85610 -59288
$$ packed form
5949a20777P641J6981k0545j9117J7759L3572P930l7449m375J7029O027k4607
5937a19931k887K3565J8100k6273q880M4135l4004P743K2026M543J4408R035K275
5924d6145o516J985K3945K9400O853L1989N0978J5756K1011K1740M8711L6403
5912B36110L4640Q030J5981j8391l5752q387M3111J9036k9824j6789K5102O693
5900B79560N84J3416o7316o0717m189p2664l8629k4184j5174n713k6590l1121
5888e2737j2417j495n501L1235L672j0158l2819j987O75j3070L4340M825l5397
5875i0834j2950k4310M1861M1547K1892k0439k8078k2424N641K1616P077M779
5863e4622j4151k5734P139K3035j902K352j923J4955k9385l3285L610K4301K6322
$$ plain form
5850 -59288 -55810 -49460 -55045 -93504 -96251 -75410 -45608 -54141 -106317 -128352 -114612 -101924 -100609
5837 -100609 -82273 -95762 -115379 -104033 -73825 -73358 -74098 -43209 -59521 -86196 -66074 -54566
5825 -54566 -66189 -35295 -16907 -37251 -56361 -67356 -76476 -38041 1467 -11183 -43231 -33133
5813 -33133 -30830 -12116 -3522 -2943 -36042 -75201 -48166 -29586 -19970 -11786 7935 4655 6877
5800 6877 6482 69652 105875 144043 129215 79977 67954 82072 129260 114968 92630 89561 60424
5787 60424 71228 101179 119451 102057 104222 99085 35611 14723 25509 5544 -28668 9724
5775 9724 33937 23538 50816 77087 69774 50449 29883 1490 -16516 -4635 17417 16926 34212
5762 34212 -25429 -19747 2351 13178 50124 86595 66999 76362 74785 61561 73194 117024
$$ packed form
5850e9288L478O350n585l8459k747K0841K9802q533n2176k2035J3740J2688J315
5837a00609J8336j3489j9617J1346L0208M67p40L0889j6312k6675K0122J1508
5825e4566j1623L0894J8388k0344j9110j0995r120L8435L9508j2650l2048J0098
5813c3133K303J8714Q594N79l3099l9159K7035J8580R616Q184J9721l280K222
5800F877l95O3170L6223L8168j4828m9238j2023J4118M7188j4292k2338l069k9137
5787F0424J0804K9951J8272j7394K165n137o3474k0888J0786j9965l4212L8392
5775I724K4213j0399K7278K6271p313j9325k0566k8393j8006J1881K2052m91J7286
5762C4212n9641N682K2098J0827L6946L6471j9596R363j577j3224J1633M3830
$$ plain form
5750 117024 111684 88076 99671 102066 94696 103998 162829 121637 104763 104083 152324 172597 166597
5737 166597 166549 172350 192227 193180 194805 211286 191386 181172 183963 203915 204733 218938 194293 218255
5723 218255 221522 229114 238596 236912 240263 262158 255919 279723 292298 282383 277032 262161 266249
5710 266249 319426 339002 309794 333935 376756 356243 333838 357063 335838 356739 398268 401217
5698 401217 447503 487549 434848 431135 461542 467380 491115 512501 564189 602702 616245 651938
5686 651938 639395 671043 714365 732135 730159 757138 796846 838706 874004 955250 1030607 1098161
5674 1098161 1157830 1246167 1322120 1345127 1329709 1368006 1396502 1445806 1506108 1574946 1595351
5663 1595351 1601640 1658797 1697337 1706613 1716012 1783645 1792443 1810465 1789718 1746553 1734206 1766713
$$ packed form
5750A17024n340k3608J1595K395p370R302N8831m1192j6874o80M8241K0273o000
5737A66597m8N801J9877R53J625J6481j9900j0214K791J9952Q18J4205k4645K3962
5723B18255L267P592R482j684L351K1895o239K3804J2575r915n351j4871M088
5710B66249N3177J9576k9208K4141M2821k0513k2405K3225k1225K0901M1529K949
5698D01217M6286M0046n2701l713L0407N838K3735K1386N1688L8513J3543L5693
5686F51938j2543L1648M3322J7770j976K6979L9708M1860L5298Q1246P5357O7554
5674A098161N9669Q8337P5953K3007j5418L8297K8496M9304O0302O8838K0405
5663A595351O289N7157L8540R276R399O7633Q798J8022k0747m3165j2347L2507
$$ plain form
5651 1766713 1802842 1816435 1883059 1919892 1954122 1996164 2087260 2150786 2200048 2293634 2332575
5640 2332575 2418944 2527439 2591454 2709078 2837625 2919471 3016009 3152940 3276836 3396296
5630 3396296 3514955 3592857 3754706 3964968 4135789 4359051 4647385 4947475 5279359 5675243
5620 5675243 6156683 6696212 7271523 7862972 8534596 9257710 10163563 11127917 12242374
5611 12242374 13596217 15244773 17313270 19880419 23124277 27279083 32755718 39534180
5603 39534180 47235626 55716522 64687897 73173154 79533723 83215401 85124581 86096762
5595 86096762 86684534 87249221 88234896 89549291 91027162 92452740 93173700 92030344 88707184
5586 88707184 84122235 78935486 72918056 65993785 58413746 50654162 43324937 36667207
$$ packed form
5651A766713L6129J3593O6624L6833L4230M2042R1096O3526M9262R3586L8941
5640B332575Q6369J08495O4015J17624J28547Q1846R6538J36931J23896J19460
5630C396296J18659P7902J61849K10262J70821K23262K88334L00090L31884L95884
5620E675243M81440N39529N75311N91449O71624P23114R05853R64354J114457
5611A2242374J353843J648556K068497K567149L243858M154806N476635O778462
5603C9534180P701446Q480896Q971375Q485257O360569L681678J909180R72181
5595H6096762N87772N64687R85675J314395J477871J425578P20960j143356l323160
5586H8707184m584949n186749o017430o924271p580039p759584p329225o657730
$$ plain form
5578 36667207 30903712 26174086 22424563 19451390 17117456 15239634 13696959 12467102
5570 12467102 11368807 10446151 9622638 8925242 8361984 7843607 7397602 6948963 6558441
5561 6558441 6200718 5870054 5569846 5327733 5124328 4881891 4643063 4411467 4227703 4079137
5551 4079137 3930419 3769991 3577249 3421985 3306906 3209724 3114331 2993917 2897247 2800984
5541 2800984 2692004 2592492 2513175 2485847 2400002 2352201 2253001 2167672 2132279 2092928 2025435
5530 2025435 1974329 1907466 1855383 1789671 1770098 1741760 1677864 1655000 1601509 1517215 1493064
5519 1493064 1505050 1498332 1464503 1440373 1371291 1315231 1323918 1335964 1339875 1332515 1298660 1265018
5507 1265018 1244992 1225809 1221945 1219450 1254844 1175859 1137010 1130289 1147989 1160258 1183086 1181699
$$ packed form
5578C6667207n763495m729626l749523k973173k333934j877822j542675j229857
5570A2467102j098295r22656q23513o97396n63258n18377m46005m48639l90522
5561F558441l57723l30664l00208k42113k03405k42437k38828k31596j83764j48566
5551D079137j48718j60428j92742j55264j15079r7182r5393j20414r6670r6263
5541B800984j08980r9512p9317k7328q5845m7801r9200q5329l5393l9351o7493
5530B025435n1106o6863n2083o5712j9573k8338o3896k2864n3491q4294k4151
5519A493064J1986o718l3829k4130o9082n6060Q687J2046L911p360l3855l3642
5507A265018k0026j9183l864k495L5394p8985l8849o721J7700J2269K2828j387
$$ plain form
5495 1181699 1158090 1101862 1107438 1145387 1158966 1152714 1086433 1096916 1084603 1070030 1100953 1087457
5483 1087457 1073245 1035758 1005803 1028032 1018252 1028574 1002946 986994 952176 930187 924143 905866
5471 905866 912964 911646 942861 908535 884925 908422 879644 871615 869604 857834 853741 820424 830082
5458 830082 844331 855290 852672 868526 854119 880631 900099 879699 904236 923043 946683 956409
5446 956409 967229 974123 962869 964491 1003172 1019313 1032457 1047386 1076998 1112119 1117041 1150410
5434 1150410 1154526 1186927 1202466 1261400 1300362 1293873 1306420 1306352 1314504 1341059 1418088 1458119 1440820
5421 1440820 1486980 1512258 1573703 1636530 1609538 1598297 1580184 1605925 1643126 1684570 1710590
5410 1710590 1753620 1826649 1847111 1869687 1926875 1999904 2026073 2083946 2168779 2218296 2304945
$$ packed form
5495A181699k3609n6228N576L7949J3579o252o6281J0483j2313j4573L0923j3496
5483A087457j4212l7487k9955K2229r780J0322k5628j5952l4818k1989o044j8277
5471I05866P098j318L1215l4326k3610K3497k8778q029k011j1770m093l3317R658
5458H30082J4249J0959k618J5854j4407K6512J9468k0400K4537J8807K3640R726
5446I56409J0820O894j1254J622L8681J6141J3144J4929K9612L5121M922L3369
5434A150410M116L2401J5539N8934L8962o489J2547o8Q152K6555P7029M0031j7299
5421A440820M6160K5278O1445O2827k6992j1241j8113K5741L7201M1444K6020
5410A710590M3030P3029K0462K2576N7188P3029K6169N7873Q4833M9517Q6649
$$ plain form
5399 2304945 2391993 2460353 2521856 2557915 2609504 2669189 2740537 2841091 2916338 3062720 3242771
5388 3242771 3407902 3627527 3872196 4132415 4432797 4786827 5182150 5581343 6004699 6428808
5378 6428808 6907724 7448309 8042839 8700895 9585628 10621586 11888799 13388803 15209102
5369 15209102 17534367 20721655 25398507 31745873 39074551 47516080 57376792 67322432
5361 67322432 73715940 74736519 73418960 72316384 71424960 70437036 69863803 69847817 70780773
5352 70780773 73657734 78190263 81755378 80890933 76631415 71954473 67432811 62163735
5344 62163735 55570631 48104263 40537972 33612408 27555047 22637587 18969968 16347658
5336 16347658 14352198 12767676 11439455 10303876 9302446 8549610 7927700 7405727 6952604
$$ packed form
5399B304945Q7048O8360O1503L6059N1589N9685P1348J00554P5247J46382J80051
5388C242771J65131K19625K44669K60219L00382L54030L95323L99193M23356M24109
5378F428808M78916N40585N94530O58056Q84733J035958J267213J500004J820299
5369A5209102K325265L187288M676852O347366P328678Q441529R860712R945640
5361F7322432O393508J020579j317559j102576q91424r87924n73233j5986R32956
5352G0780773K876961M532529L565115q64445m259518m676942m521662n269076
5344F2163735o593104p466368p566291o925564o057361m917460l667619k622310
5336A6347658j995460j584522j328221j135579j001430p52836o21910n21973m53123
$$ plain form
5327 6952604 6514752 6163144 5870587 5574676 5309395 5032752 4790294 4560322 4367640 4185761
5317 4185761 4019762 3822513 3628516 3494791 3291942 3177704 3044860 2907512 2841307 2746829
5307 2746829 2670815 2573179 2452386 2367059 2293337 2218301 2158931 2079462 2022726 1989222 1957485
5296 1957485 1888118 1835474 1765665 1729151 1708095 1678222 1689154 1679528 1648972 1617424 1648357 1662851
5284 1662851 1632967 1680088 1668477 1642736 1631831 1630511 1663851 1616951 1592547 1630759 1624064 1595964
5272 1595964 1627313 1670273 1667109 1692218 1704774 1745754 1863660 1989518 2103201 2220993 2339741
5261 2339741 2300915 2228158 2146755 2057425 1947406 1812244 1648511 1512778 1376810 1242480
5251 1242480 1163594 1095444 1023228 949145 877229 853644 834561 793237 773166 716767 701448
$$ packed form
5327F952604m37852l51608k92557k95911k65281k76643k42458k29972j92682j81879
5317D185761j65999j97249j93997j33725k02849j14238j32844j37348o6205r4478
5307B746829p6014r7636j20793q5327p3722p5036n9370p9469n6736l3504l1737
5296A957485o9367n2644o9809l6514k1056k9873J0932r626l0556l1548L0933J4494
5284A662851k9884M7121j1611k5741j0905j320L3340m6900k4404L8212o695k8100
5272A595964L1349M2960l164K5109J2556M0980J17906J25858J13683J17792J18748
5261B339741l8826p2757q1403q9330j10019j35162j63733j35733j35968j34330
5251A242480p8886o8150p2216p4083p1916k3585j9083m1324k0071n6399j5319
$$ plain form
5240 701448 679535 643917 671120 708184 678903 638884 596205 582469 598667 621804 615378 547459
5228 547459 547609 523039 514739 521002 544311 519693 508683 511093 471545 441929 442607 468633 432261
5215 432261 418519 429812 369799 381289 371934 399099 443177 430016 412705 414314 406083 380535
5203 380535 403737 412483 410476 443896 487463 535353 615104 697581 775530 871729 1039660 1191664
5191 1191664 1323077 1462384 1516378 1498627 1456651 1381002 1248807 1180003 1089220 965493 812588
5180 812588 683614 620281 609388 589599 562780 514822 465936 442398 407243 452223 439434
5169 439434 409316 395460 353652 342419 382952 398735 375497 371789 370181 364809 375644 399474
5157 399474 411866 419535 429546 408074 458600 506699 516675 522233 538579 490071 443807 392271
$$ packed form
5240G01448k1913l5618K7203L7064k9281m0019m2679j3736J6198K3137o426o7919
5228E47459J50k4570q300O263K3309k4618j1010K410l9548k9616O78K6026l6372
5215D32261j3742J1293o0013J1490r355K7165M4078j3161j7311J609q231k5548
5203C80535K3202Q746k007L3420M3567M7890P9751Q2477P7949R6199J67931J52004
5191A191664J31413J39307N3994j7751m1976p5649j32195o8804r0783j23727j52905
5180H12588j28974o3333j0893j9789k6819m7958m8886k3538l5155M4980j2789
5169D39434l0118j3856m1808j1233M0533J5783k3238l708j608n372J0835K3830
5157C99474J2392P669J0011k1472N0526M8099R976N558J6346m8508m6264n1536
$$ plain form
5145 392271 400128 404054 391314 361812 359263 326874 358989 361813 366147 358948 306638 275568 312587
5132 312587 340564 352177 346874 333230 288794 289175 325315 321815 346459 359306 396890 387999 361070
5119 361070 354260 366143 406595 423274 395627 388732 383482 471506 515596 529033 545691 559324
5107 559324 557182 525667 513479 572723 591679 559762 576623 578469 588714 647967 665645 693409
5095 693409 704092 665150 699522 713620 702972 730418 701853 706191 700152 685014 690779 707383
5083 707383 711333 759953 738259 739377 750823 751908 735654 735165 698140 710595 743084 721836 735261
5070 735261 769416 827426 826055 898268 914404 889666 887436 904315 935493 948177 943921 962847
5058 962847 985517 981480 981502 997074 1019879 1114001 1139381 1179253 1280539 1390778 1453020 1530294
$$ packed form
5145C92271P857L926j2740k9502k549l2389L2115K824M334p199n2310l1070L7019
5132C12587K7977J1613n303j3644m4436L81L6140l500K4644J2847L7584q891k6929
5119C61070o810J1883M0452J6679k7647o895n250Q8024M4090J3437J6658J3633
5107E59324k142l1515j2188N9244J8956l1917J6861J846J0245N9253J7678K7764
5095F93409J0683l8942L4372J4098j0648K7446k8565M338o039j5138N765J6604
5083G07383L950M8620k1694J118J1446J085j6254m89l7025J2455L2489k1248J3425
5070G35261L4155N8010j371P2213J6136k4738k230J6879L1178J2684m256J8926
5058I62847K2670m037K2J5572K2805R4122K5380L9872J01286J10239O2242P7274
$$ plain form
5046 1530294 1606204 1632209 1700124 1718791 1742393 1789135 1863542 1909156 1935285 1996041 2058423
5035 2058423 2095125 2125276 2142234 2150038 2131900 2126246 2177869 2217518 2229953 2255491 2308956 2361150
5023 2361150 2385652 2464960 2549939 2631373 2645657 2674327 2683188 2707059 2776065 2814231 2836992 2912358
5011 2912358 2999896 3098993 3158495 3232051 3306249 3383364 3463533 3546987 3633245 3692492 3773835
5000 3773835 3892091 3988163 4080000 4213303 4322848 4417021 4569358 4746740 4855292 4978721
4990 4978721 5104981 5227545 5344191 5450929 5585392 5688586 5790953 5907021 6118285 6473186
4980 6473186 6871167 7296149 7801880 8374215 9077226 9871116 10757015 11737670 12821435
4971 12821435 14005445 15188486 16478681 17855539 19405051 21206755 23371287 25937535
$$ packed form
5046A530294P5910K6005O7915J8667K3602M6742P4407M5614K6129O0756O2382
5035B058423L6702L0151J6958P804j8138n654N1623L9649J2435K5538N3465N2194
5023B361150K4502P9308Q4979Q1434J4284K8670Q861K3871O9006L8166K2761P5366
5011B912358Q7538R9097N9502P3556P4198P7115Q0169Q3454Q6258N9247Q1343
5000C773835J18256R6072R1837J33303J09545R4173J52337J77382J08552J23429
4990D978721J26260J22564J16646J06738J34463J03194J02367J16068K11264L54901
4980F473186L97981M24982N05731N72335P03011P93890Q85899R80655J083765
4971A2821435J184010J183041J290195J376858J549512J801704K164532K566248
$$ plain form
4963 25937535 29079814 32898745 37723376 44031292 53040445 66437852 84567714 107600492
4955 107600492 136608024 169249203 200227791 222280439 232971948 232186404 221883587
4948 221883587 207636698 191138550 171211044 148388062 124694537 102048895 82322928
4941 82322928 66321157 54032017 45005477 38500832 33459282 29367622 25950378 23193324
4933 23193324 20918727 19104650 17662971 16571081 15657146 14984002 14430999 13979574 13627632
4924 13627632 13297666 12999952 12723577 12493397 12292140 12073288 11874932 11640244 11365317
4915 11365317 11138877 10936306 10724519 10568928 10446250 10419355 10401371 10456621 10518879 10665141
4905 10665141 10962928 11366276 11776046 12323684 12971938 13708573 14541662 15459479 16464530
$$ packed form
4963B5937535L142279L818931M824631O307916R009153J3397407J8129862K3032778
4955A07600492K9007532L2641179L0978588K2052648J0691509p85544j0302817
4948B21883587j4246889j6498148j9927506k2822982k3693525k2645642j9725967
4941H2322928j6001771j2289140r026540o504645n041550m091660l417244k757054
4933B3193324k274597j814077j441679j091890r13935o73144n53003m51425l51942
4924A3627632l29966k97714k76375k30180k01257k18852j98356k34688k74927
4915A1365317k26440k02571k11787j55591j22678k6895j7984N5250O2258J46262
4905A0665141K97787M03348M09770N47638O48254P36635Q33089R17817J005051
$$ plain form
4896 16464530 17511845 18656365 19897615 21317437 23113344 25269239 27832332 31056617
4888 31056617 35228204 40675960 48526584 60281382 75865796 94916194 119699519 149516354
4880 149516354 178017398 198641748 212475107 221285965 219889528 208637708 193402689
4873 193402689 176440470 157072583 135639064 113467804 92605736 74855713 60425122
4866 60425122 49114150 40776415 34700923 30003264 26177642 23036793 20466654 18391402
4858 18391402 16695310 15388234 14350641 13503577 12829997 12277720 11774512 11351818 10928612
4849 10928612 10553244 10196730 9819543 9466831 9146707 8809171 8489035 8143450 7818806
4840 7818806 7509508 7232729 6978141 6753855 6559348 6412628 6193832 6003991 5840587 5653842
$$ packed form
4896A6464530J047315J144520J241250J419822J795907K155895K563093L224285
4888C1056617M171587N447756P850624J1754798J5584414J9050398K4783325K9816835
4880A49516354K8501044K0624350J3833359Q810858j396437j1251820j5235019
4873A93402689j6962219j9367887k1433519k2171260k0862068j7750023j4430591
4866F0425122j1310972q337735o075492m697659l825622l140849k570139k075252
4858A8391402j696092j307076j037593q47064o73580n52277n03208m22694m23206
4849A0928612l75368l56514l77187l52712l20124l37536l20136l45585l24644
4840G818806l09298k76779k54588k24286j94507j46720k18796j89841j63404j86745
$$ plain form
4830 5653842 5548412 5450140 5327342 5181041 4990956 4800370 4654875 4512695 4440287 4355768
4820 4355768 4230443 4091327 4008711 3928669 3823825 3699844 3544497 3425624 3309581 3186701
4810 3186701 3119495 3073341 2999005 2920463 2803303 2720922 2690386 2693019 2681529 2655520 2597358
4799 2597358 2511795 2421607 2405824 2382213 2306609 2254523 2183325 2081545 2055872 2038663 2030978
4788 2030978 2044681 1970108 1940890 1934625 1931208 1900653 1889309 1895871 1870731 1800208 1806622 1838117
4776 1838117 1823314 1818908 1792704 1715766 1697654 1701740 1692122 1666062 1612456 1562440 1499148 1499565
4764 1499565 1504124 1446435 1456481 1424031 1386791 1327351 1319321 1327816 1309761 1345407 1312960 1267352
4752 1267352 1220106 1178887 1161881 1143014 1132190 1118183 1034688 984151 982038 998137 1020654 1022448
$$ packed form
4830E653842j05430r8272j22798j46301j90085j90586j45495j42180p2408q4519
4820D355768j25325j39116q2616q0042j04844j23981j55347j18873j16043j22880
4810C186701o7206m6154p4336p8542j17160q2381l0536K633j1490k6009n8162
4799B597358q5563r0188j5783k3611p5604n2086p1198j01780k5673j7209p685
4788B030978J3703p4573k9218o265l417l0555j1344O562k5140p0523O414L1495
4776A838117j4803m406k6204p6938j8112M086r618k6060n3606n0016o3292M17
4764A499565M559n7689J0046l2450l7240n9440q030Q495j8055L5646l2447m5608
4752A267352m7246m1219j7006j8867j0824j4007q3495n0537k113J6099K2517J794
$$ plain form
4740 1022448 963846 940052 890400 879249 905197 859866 828038 814679 775846 736295 797599
4729 797599 783306 782354 757842 749287 735606 723436 711327 713024 695115 644410 612662 644254
4717 644254 672983 672092 709862 712140 707836 690202 658892 670155 689752 691109 650227 577412 576059
4704 576059 595690 626242 637672 664618 640526 616197 639257 669519 691720 661762 636196 617139
4692 617139 611490 588385 578214 606802 600730 558870 548863 564350 567217 564985 567681 607304 629628
4679 629628 607506 575971 570853 578373 547431 546095 527144 515130 515962 513705 513803 512237 522821 513942
4665 513942 492625 513321 527556 503120 500755 490654 487571 498214 524390 516827 551365 548822
4653 548822 521674 543020 550709 562260 589868 628362 629791 611807 708409 765860 902541 1040876
$$ packed form
4740A022448n8602k3794m9652j1151K5948m5331l1828j3359l8833l9551O1304
4729G97599j4293r52k4512q555j3681j2170j2109J697j7909n0705l1748L1592
4717F44254K8729q91L7770K278m304j7634l1310J1263J9597J357m0882p2815j353
4704E76059J9631L0552J1430K6946k4092k4329K3060L0262K2201k9958k5566j9057
4692F17139n649k3105j0171K8588o072m1860j0007J5487K867k232K696L9623K2324
4679F29628k2122l1535n118P520l0942j336j8951j2014Q32k257R8j566J0584q879
4665E13942k1317K0696J4235k4436k365j0101l083J0643K6176p563L4538k543
4653E48822k7148K1346P689J1551K7608L8494J429j7984R6602N7451J36681J38335
$$ plain form
4641 1040876 1146372 1295532 1510642 1632265 1690809 1711601 1624061 1520249 1412663 1310396
4631 1310396 1193898 1068053 976377 867480 720739 652343 676895 663384 605340 574893 525395
4620 525395 507051 475542 467723 515289 499518 470501 491610 502057 468685 472078 502448 483608
4608 483608 456531 449185 471677 470165 477902 479510 465171 459665 434848 430814 426362 436983 434201
4595 434201 414447 398828 376347 386982 420849 447607 464534 479630 446312 430341 443790 482309
4583 482309 487279 507853 521332 502255 480828 501229 502510 498434 535738 544816 548694 580038 625968
4570 625968 675346 733947 835086 899965 1014169 1169333 1352497 1469714 1535622 1533664 1482743
4559 1482743 1427906 1313383 1232464 1158514 1043250 916061 846621 730205 682656 634573 548014
$$ packed form
4641A040876J05496J49160K15110J21623N8544K0792q7540j03812j07586j02267
4631A310396j16498j25845r1676j08897j46741o8396K4552j3511n8044l0447m9498
4620E25395j8344l1509p819M7566j5771k9017K1109J0447l3372L393L0370j8840
4608D83608k7077p346K2492j512P737J608j4339n506k4817m034m452J0621k782
4595D34201j9754j5619k2481J0635L3867K6758J6927J5096l3318j5971J3449L8519
4583D82309M970K0574J3479j9077k1427K0401J281m076L7304R078L878L1344M5930
4570F25968M9378N8601J01139O4879J14204J55164J83164J17217O5908j958n0921
4559A482743n4837j14523q0919p3950j15264j27189o9440j16416m7549m8083q6559
$$ plain form
4548 548014 530277 514566 504334 462450 451977 451571 459545 426598 405400 417344 417950 453380 447482
4535 447482 445984 470443 411278 420085 428891 428368 413473 428569 434647 452943 506981 500791 476791
4522 476791 505089 520390 499702 509268 514911 482092 463285 482934 468566 449201 494186 481275
4510 481275 443768 486490 468025 473271 485448 489400 497234 478494 444728 489439 465047 491879
4498 491879 496337 439891 462916 480469 474261 471723 482600 502715 522794 517741 467535 493497
4486 493497 520925 532780 566625 551655 530729 573557 588316 611748 640316 660169 629839 646682
4474 646682 699720 701928 707578 720301 721037 725360 770715 772484 783391 810005 835965 819437 808430
4461 808430 818207 865325 926076 943529 975328 985533 1008717 1041633 1026477 1062848 1120757 1105797
$$ packed form
4548E48014j7737j5711j0232m1884j0473m06P974l2947k1198J1944O06L5430n898
4535D47482j498K4459n9165Q807Q806n23j4895J5096O078J8296N4038o190k4000
4522D76791K8298J5301k0688R566N643l2819j8807J9649j4368j9365M4985j2911
4510D81275l7507M2722j8465N246J2177L952P834j8740l3766M4711k4392K6832
4498D91879M458n6446K3025J7553o208k538J0877K0115K0079n053n0206K5962
4486D93497K7428J1855L3845j4970k0926M2828J4759K3432K8568J9853l0330J6843
4474F46682N3038K208N650J2723P36M323M5355J769J0907K6614K5960j6528j1007
4461H08430R777M7118O0751J7453L1799J0205K3184L2916j5156L6371N7909j4960
$$ plain form
4449 1105797 1098325 1139223 1137134 1159126 1183686 1179466 1116599 1110610 1112172 1128527 1159005 1123600
4437 1123600 1122053 1113350 1114359 1085624 1105893 1092650 1125136 1166467 1147921 1120286 1127795 1174682
4425 1174682 1194685 1217327 1231049 1247291 1291584 1302909 1378962 1456781 1509402 1586268 1647036
4414 1647036 1713019 1831448 1944171 2061202 2177477 2288825 2488290 2802034 3221990 3779794
4404 3779794 4543459 5460381 6524780 7676158 8809114 9810410 10572279 11036434 11173297
4395 11173297 10947457 10486891 9829519 8977972 8002507 6995583 6047290 5204012 4449134
4386 4449134 3809496 3366717 2978602 2679519 2510174 2309598 2226943 2184131 2098054 2007303
4376 2007303 1947431 1884197 1797821 1811213 1835010 1815399 1820731 1824976 1852386 1806595 1789620 1783054
$$ packed form
4449A105797p472M0898k089K1992K4560m220o2867n989J562J6355L0478l5405
4437A123600j547q703J009k8735K0269j3243L2486M1331j8546k7635P509M6887
4425A174682K0003K2642J3722J6242M4293J1325P6053P7819N2621P6866O0768
4414A647036O5983J18429J12723J17031J16275J11348J99465L13744M19956N57804
4404C779794P63665R16922J064399J151378J132956J001296P61869M64155J36863
4395A1173297k25840m60566o57372q51547r75465j006924r48293q43278p54878
4386D449134o39638m42779l88115k99083j69345k00576q2655m2812q6077r0751
4376B007303n9872o3234q6376J3392K3797j9611N332M245K7410m5791j6975o566
$$ plain form
4364 1783054 1754854 1752015 1739617 1739191 1764613 1743422 1705995 1714455 1735032 1735434 1737302 1721080 1761706
4351 1761706 1786142 1776195 1781076 1813247 1804695 1861180 1911054 1932340 1929833 1966091 2011016 2014011
4339 2014011 2047777 2090515 2130225 2151307 2192707 2249438 2288829 2295064 2333239 2366118 2382537 2429582
4327 2429582 2474137 2538171 2579892 2628772 2656542 2695605 2773506 2784205 2859801 2980567 3080887
4316 3080887 3163234 3242745 3313727 3420926 3485506 3590405 3631133 3707323 3805309 3901916 3993952
4305 3993952 4065447 4128468 4195711 4278651 4390042 4526541 4671520 4819750 4994067 5172035
4295 5172035 5399739 5667710 5995024 6373780 6775341 7268452 7832328 8519832 9441668 10518244
4285 10518244 11808381 13461745 15400694 17561161 20035196 22753878 25448013 27956187
$$ packed form
4364A783054k8200k839j2398m26K5422k1191l7427Q460K0577M02J868j6222M0626
4351A761706K4436r947M881L2171q552N6485M9874K1286k507L6258M4925K995
4339B014011L3766M2738L9710K1082M1400N6731L9391O235L8175L2879J6419M7045
4327B429582M4555O4034M1721M8880K7770L9063P7901J0699P5596J20766J00320
4316C080887Q2347P9511P0982J07199O4580J04899M0728P6190R7986R6607R2036
4305C993952P1495O3021O7243Q2940J11391J36499J44979J48230J74317J77968
4295E172035K27704K67971L27314L78756M01561M93111N63876O87504R21836J076576
4285A0518244J290137J653364J938949K160467K474035K718682K694135K508174
$$ plain form
4277 27956187 30162634 32193457 34340798 37129275 40772501 45050762 50028591 55474600
4269 55474600 60375289 63252829 63793151 63338772 62650999 61595019 60596223 60333145 60812013
4260 60812013 62301612 65025976 67713837 67892166 64785270 60943460 57580316 53849497
4252 53849497 49630271 45442117 41700633 38746432 36825008 35738417 34751443 32909946
4244 32909946 30597571 28762241 27219379 25756647 24712586 24323908 24198349 24719584 26088361
4235 26088361 27788664 28061401 26614277 25180001 24004050 22704936 20931266 18866600
4227 18866600 16764711 14882350 13228692 11856106 10836433 10187640 9723722 9404327 9095694
4218 9095694 8860773 8692226 8560812 8471999 8419738 8441377 8444229 8498184 8536669 8545361 8663357
$$ packed form
4277B7956187K206447K030823K147341K788477L643226M278261M977829N446009
4269E5474600M900689K877540N40322m54379o87773j055980r98796k63078M78868
4260F0812013J489599K724364K687861J78329l106896l841810l363144l730819
4252E3849497m219226m188154l741484k954201j921424j086591r86974j841497
4244C2909946k312375j835330j542862j462732j044061l88678j25559N21235J368777
4235B6088361J700303K72737j447124j434276j175951j299114j773670k064666
4227A8866600k101889j882361j653658j372586j019673o48793m63918l19395l08633
4218I095694k34921j68547j31414q8813n2261K1639K852N3955L8485Q692J17996
$$ plain form
4207 8663357 8769851 8932125 9135569 9380079 9594449 9844909 10119437 10417541 10770586 11181303
4197 11181303 11640951 12110071 12620500 13218706 13844421 14540302 15301075 16114156 17025530
4188 17025530 17997613 19043093 20117528 21354281 22644485 24049299 25550804 27074301
4180 27074301 28731322 30489757 32294858 34281766 36377917 38531104 40753194 43052557
4172 43052557 45412437 47804448 50239293 52743419 55247540 57728694 60211245 62681411
4164 62681411 65167791 67679061 70150051 72619385 75046914 77407687 79711490 81922569
4156 81922569 83961054 85752609 87417684 88848658 90130502 91262631 92230617 93038320
4148 93038320 93729223 94295111 94689675 94863795 94752101 94495066 94001086 93296832 92347683
$$ packed form
4207H663357J06494J62274K03444K44510K14370K50460K74528K98104L53045M10717
4197A1181303M59648M69120N10429N98206O25715O95881P60773Q13081R11374
4188A7025530R72083J045480J074435J236753J290204J404814J501505J523497
4180B7074301J657021J758435J805101J986908K096151K153187K222090K299363
4172D3052557K359880K392011K434845K504126K504121K481154K482551K470166
4164F2681411K486380K511270K470990K469334K427529K360773K303803K211079
4156H1922569K038485J791555J665075J430974J281844J132129R67986Q07703
4148I3038320O90903N65888L94564J74120j11694k57035m93980p04254r49149
$$ plain form
4139 92347683 91146636 89792817 88260502 86604136 84820882 82943491 80951784 78846404
4131 78846404 76677786 74418333 72071197 69678408 67143577 64543745 61967221 59302358
4123 59302358 56680783 54066319 51500886 48993113 46542988 44119236 41777628 39543666
4115 39543666 37412473 35329238 33317134 31352533 29431877 27623855 25949273 24324135
4107 24324135 22779134 21359619 19967019 18611697 17429025 16344067 15356428 14478072
4099 14478072 13640880 12797753 12040644 11373677 10763702 10269474 9764300 9250798 8793778
4090 8793778 8399857 7966038 7655636 7401934 7155123 6909502 6677213 6437805 6249598 6126040
4080 6126040 5992029 5862303 5746135 5582406 5429559 5354941 5296853 5207171 5149210 5123897
$$ packed form
4139I2347683j201047j353819j532315j656366j783254j877391j991707k105380
4131G8846404k168618k259453k347136k392789k534831k599832k576524k664863
4123E9302358k621575k614464k565433k507773k450125k423752k341608k233962
4115C9543666k131193k083235k012104j964601j920656j808022j674582j625138
4107B4324135j545001j419515j392600j355322j182672j084958r87639q78356
4099A4478072q37192q43127p57109o66967o09975m94228n05174n13502m57020
4090H793778l93921m33819l10402k53702k46811k45621k32289k39408j88207j23558
4080F126040j34011j29726j16168j63729j52847p4618n8088q9682n7961k5313
$$ plain form
4070 5123897 5037726 4942860 4960755 4961853 4966959 4976414 4962470 4902873 4883865 4894433 4920374 4960186
4058 4960186 4994710 4995017 4983215 5037291 5102046 5167320 5221760 5306280 5349874 5382034 5422524 5504057
4046 5504057 5556497 5595259 5593841 5562221 5576007 5554205 5562824 5600834 5576575 5567571 5535520 5507775
4034 5507775 5494901 5454468 5414633 5406221 5357617 5265823 5201765 5153167 5115535 5089252 5036896 4976014
4022 4976014 4891045 4800298 4769268 4714852 4668233 4610398 4547160 4441190 4360852 4327711 4263685
4011 4263685 4220513 4160466 4126576 4118559 4086617 4089733 4148921 4099848 4049547 4042524 3999421 4008217
3999 4008217 4052617 4039273 4025869 4008978 4028757 4056653 4115105 4200078 4217210 4226510 4257274 4253435
3987 4253435 4262720 4389758 4472343 4499079 4580132 4639694 4663902 4742702 4878442 4970243 5067827
$$ packed form
4070E123897q6171r4866J7895J098N106R455j3944n9597j9008J0568K5941L9812
4058D960186L4524L07j1802N4076O4755O5274N4440Q4520M3594L2160M0490Q1533
4046E504057N2440L8762j418l1620J3786k1802Q619L8010k4259r004l2051k7745
4034E507775j2874m0433l9835q412m8604r1794o4058m8598l7632k6283n2356o0882
4022D976014q4969r0747l1030n4416m6619n7835o3238j05970q0338l3141o4026
4011D263685m3172o0047l3890q017l1942L116N9188m9073n0301p023m3103Q796
3999D008217M4400j3344j3404j6891J9779K7896N8452Q4973J7132R300L0764l839
3987D253435R285J27038Q2585K6736Q1053N9562K4208P8800J35740R1801R7584
$$ plain form
3976 5067827 5109443 5187892 5273468 5397394 5500972 5583093 5741938 5847757 5933998 6055622
3966 6055622 6185268 6370789 6532645 6668571 6746841 6841163 7056762 7240567 7415132 7576781
3956 7576781 7749308 7894655 8124553 8416526 8716379 9061986 9438465 9826784 10292129 10874386
3946 10874386 11483141 12161054 12960444 13811451 14801593 15908724 17134998 18614016 20335852
3937 20335852 22317240 24687083 27554293 30932720 34965728 39943768 45799905 52634194
3929 52634194 60373087 68820905 77545002 86116753 94014258 100769733 106215225 110157938
3921 110157938 112708158 114063834 114428072 114107147 113332520 112540550 111873183 111487541 111403648
3912 111403648 111529581 111590874 111161944 109937246 107567766 104000432 99240705 93407413 86779209
$$ packed form
3976E067827M1616P8449Q5576J23926J03578Q2121J58845J05819Q6241J21624
3966F055622J29646J85521J61856J35926P8270R4322K15599J83805J74565J61649
3956G576781J72527J45347K29898K91973K99853L45607L76479L88319M65345N82257
3946A0874386O08755O77913P99390Q51007R90142J107131J226274J479018J721836
3937B0335852J981388K369843K867210L378427M033008M978040N856137O834289
3929E2634194P738893Q447818Q724097Q571751P897505O755475N445492L942713
3921A10157938K550220J355676L64238l20925p74627p91970o67367l85642q3893
3912A11403648J25933O1293m28930j224698k369480l567334m759727n833292o628204
$$ plain form
3903 86779209 79611755 72219410 64909797 57934754 51425036 45561948 40403565 35919217
3895 35919217 32124535 28955527 26279833 24018365 22108005 20459345 19064462 17881395
3887 17881395 16904724 16019304 15312021 14714592 14195702 13710159 13318841 12940224 12636738
3878 12636738 12398352 12151121 11929848 11724241 11508288 11324855 11180700 11061125 10925519
3869 10925519 10819575 10776674 10698382 10657646 10669166 10632449 10585453 10576132 10562843 10577519 10598310
3858 10598310 10615574 10659628 10709617 10768420 10816362 10912649 11029863 11092008 11163708 11277329 11398395
3847 11398395 11557714 11733011 11927184 12124670 12347164 12571803 12884565 13250083 13579800
3838 13579800 13968668 14442583 14952877 15526702 16150776 16826952 17531726 18266030 19023085
$$ packed form
3903H6779209p167454p392345p309613o975043o509718n863088n158383m484348
3895C5919217l794682l169008k675694k261468j910360j648660j394883j183067
3887A7881395r76671q85420p07283n97429n18890m85543l91318l78617l03486
3878A2636738k38386k47231k21273k05607k15953j83433j44155j19575j35606
3869A0925519j05944m2901p8292m0736J1520l6717m6996r321j3289J4676K0791
3858A0598310J7264M4054M9989N8803M7942R6287J17214O2145P1700J13621J21066
3847A1398395J59319J75297J94173J97486K22494K24639L12762L65518L29717
3838A3579800L88868M73915N10294N73825O24074O76176P04774P34304P57055
$$ plain form
3829 19023085 19759529 20540326 21296166 22056280 22795095 23485221 24198546 24968924 25771974
3820 25771974 26582244 27404274 28259196 29122554 29966631 30769260 31497106 32128094 32643517
3811 32643517 33014375 33330867 33602777 33811600 33952724 34116214 34267338 34347642 34441525 34612433
3801 34612433 34816710 34954868 35068040 35157049 35211244 35303298 35423619 35617608 35885493 36234083
3791 36234083 36671287 37264098 38041287 38986333 40216131 41678435 43319408 45240590 47537189
3782 47537189 50130411 53195032 56764872 60779868 65423884 70722401 76883411 84016063
3774 84016063 92302700 101901150 113092465 126168466 141181094 158144212 176953469
3767 176953469 197147202 217724144 237627956 256126311 272796768 287433158 299850657
$$ packed form
3829A9023085P36444P80797P55840P60114P38815O90126P13325P70378Q03050
3820B5771974Q10270Q22030Q54922Q63358Q44077Q02629P27846O30988N15423
3811C2643517L70858L16492K71910K08823J41124J63490J51124Q0304R3883J70908
3801C4612433K04277J38158J13172Q9009N4195R2054J20321J93989K67885L48590
3791C6234083M37204N92811P77189R45046J229798J462304J640973J921182K296599
3782D7537189K593222L064621L569840M014996M644016N298517O161010P132652
3774H4016063Q286637R598450J1191315J3076001J5012628J6963118J8809257
3767A76953469K0193733K0576942J9903812J8498355J6670457J4636390J2417499
$$ plain form
3760 299850657 309896727 317735804 323785160 328600347 332709584 336529077 340444477 344669573
3752 344669573 349159477 353646477 357639197 360715384 362345699 361761449 358079413 351053319
3744 351053319 341273681 329769843 317348154 304421775 291347024 278602313 266537311
3737 266537311 255443978 245555541 236805815 228976702 221862971 215155907 208553280 201889379
3729 201889379 195013860 187944705 180712729 173333229 165892422 158563520 151384750 144508146
3721 144508146 137961024 131779565 125868049 120106661 114540195 109124574 103786001 98511152
3713 98511152 93316109 88180789 83196094 78429750 73935580 69831761 66227849 63038859
3705 63038859 60290186 58022775 56137100 54712021 53675686 53038075 52701605 52590573 52697713
$$ packed form
3760B99850657J0046070P839077O049356M815187M109237L819493L915400M225096
3752C44669573M489904M487000L992720L076187J630315n84250l682036p026094
3744C51053319r779638j1503838j2421689j2926379j3074751j2744711j2065002
3737B66537311j1093333r888437q749726p829113p113731o707064o602627o663901
3729B01889379o875519p069155p231976p379500p440807p328902p178770o876604
3721A44508146o547122o181459n911516n761388n566466n415621n338573n274849
3713I8511152n195043n135320m984695m766344m494170m103819l603912l188990
3705F3038859k748673k267411j885675j425079j036335o37611l36470j11032J07140
$$ plain form
3696 52697713 52956954 53373494 53885635 54414539 54921583 55315652 55550236 55646059 55634901 55526300
3686 55526300 55329274 55102577 54752138 54326531 53908532 53449217 52952500 52409002 51757334
3677 51757334 50899355 49928881 48875685 47686193 46464687 45115607 43693591 42197658
3669 42197658 40720767 39286405 37927189 36676036 35459703 34240596 33035566 31904831
3661 31904831 30742569 29642961 28529540 27377355 26292061 25179405 24047242 22958303
3653 22958303 21968157 21073463 20204329 19372067 18557105 17848223 17258412 16691071 16185583
3644 16185583 15712235 15277428 14840720 14461022 14119416 13814030 13538139 13222790 12941156
3635 12941156 12659326 12433097 12216973 11958599 11738418 11509175 11276977 11050201 10818560
$$ packed form
3696E2697713K59241M16540N12141N28904N07044L94069K34584R5823j1158j08601
3686E5526300j97026k26697l50439m25607m17999m59315m96717n43498o51668
3677E1757334q57979r70474j053196j189492j221506j349080j422016j495933
3669D2197658j476891j434362j359216j251153j216333j219107j205030j130735
3661C1904831j162262j099608j113421j152185j085294j112656j132163j088939
3653B2958303r90146q94694q69134q32262q14962p08882n89811n67341n05488
3644A6185583m73348m34807m36708l79698l41606l05386k75891l15349k81634
3635A2941156k81830k26229k16124k58374k20181k29243k32198k26776k31641
$$ plain form
3626 10818560 10614949 10386792 10208409 10014930 9789382 9639484 9429274 9300997 9162537
3617 9162537 8940865 8721016 8568187 8397396 8215233 8087640 7935851 7776892 7603210 7444310
3607 7444310 7315001 7214126 7114733 7007323 6837552 6709817 6604138 6520192 6436529 6370508
3597 6370508 6312246 6212890 6134028 6016832 5940467 5899078 5827727 5767370 5705725 5612487 5529369
3586 5529369 5491892 5481072 5452764 5362308 5263439 5182575 5166083 5146676 5089206 5021527 4965578
3575 4965578 4869989 4821049 4824818 4803679 4753746 4655489 4611420 4552785 4528665 4535499 4522282 4460209
3563 4460209 4416238 4390651 4342003 4327640 4321094 4304691 4277046 4219833 4179601 4143775 4103283 4115787
3551 4115787 4089494 4064485 4013755 3976233 3981046 3985841 3965703 3929253 3873240 3831314 3817861 3813450
$$ packed form
3626A0818560k03611k28157j78383j93479k25548j49898k10210j28277j38460
3617I162537k21672k19849j52829j70791j82163j27593j51789j58959j73682j58900
3607G444310j29309j00875r9393j07410j69771j27735j05679q3946q3663o6021
3597F370508n8262r9356p8862j17196p6365m1389p1351o0357o1645r3238q3118
3586E529369l7477j0820k8308r0456r8869q0864j6492j9407n7470o7679n5949
3575D965578r5589m8940L769k1139m9933r8257m4069n8635k4120O834j3217o2073
3563D460209m3971k5587m8648j4363o546j6403k7645n7213m0232l5826m0492J2504
3551D115787k6293k5009n0730l7522M813M795k0138l6450n6013m1926j3453m411
$$ plain form
3539 3813450 3805069 3747201 3725630 3714083 3697472 3638556 3665502 3677647 3658973 3654425 3673832 3654625
3527 3654625 3597502 3625137 3629461 3608723 3601710 3584343 3609989 3604873 3543866 3549869 3547536 3551057 3537959
3514 3537959 3547172 3566944 3563910 3577735 3588827 3574952 3573123 3579941 3563100 3561802 3586001 3586160 3590899
3501 3590899 3622691 3633206 3622134 3656045 3695222 3687480 3712322 3750126 3792343 3850860 3874337 3908618
3489 3908618 3900741 3968952 4026274 4099345 4178580 4212092 4292144 4373534 4481410 4611124 4685605
3478 4685605 4758990 4861696 4959509 5057782 5180203 5234833 5299003 5392915 5469291 5515945 5558801
3467 5558801 5642494 5677192 5699466 5796782 5893587 5910200 5941032 6001645 6037971 6038592 6075550 6092111
3455 6092111 6100758 6096795 6098681 6105399 6119154 6080226 6051945 6062052 6069305 6057709 6029205 6052672
$$ packed form
3539C813450q381n7868k1571j1547j6611n8916K6946J2145j8674m548J9407j9207
3527C654625n7123K7635M324k0738p013j7367K5646n116o1007O003k333L521j3098
3514C537959R213J9772l034J3825J1092j3875j829O818j6841j298K4199J59M739
3501C590899L1792J0515j1072L3911L9177p742K4842L7804M2217N8517K3477L4281
3489C908618p877O8211N7322P3071P9235L3512Q0052Q1390J07876J29714P4481
3478D685605P3385J02706R7813R8273J22421N4630O4170R3912P6376M6654M2856
3467E558801Q3693L4698K2274R7316R6805J6613L0832O0613L6326O21L6958J6561
3455F092111Q647l963J886O718J3755l8928k8281J0107P253j1596k8504K3467
$$ plain form
3443 6052672 6052717 6058897 6093371 6084708 6093296 6121762 6149942 6163539 6199313 6258194 6288480 6308985 6342534
3430 6342534 6421993 6449834 6502797 6610488 6691826 6784246 6902164 7032928 7164466 7303512
3420 7303512 7454005 7701039 7887859 8094498 8329833 8615254 8943662 9337252 9781552 10213081
3410 10213081 10710903 11260915 11856914 12487291 13074149 13660853 14229729 14722800 15152884
3401 15152884 15447526 15630712 15635054 15465762 15198687 14805400 14321015 13756256 13088459 12436234
3391 12436234 11761533 11073616 10467683 9905532 9379993 8902620 8481885 8076929 7729830
3382 7729830 7450850 7219088 7018962 6855710 6746476 6639420 6491615 6363574 6216211 6051175
3372 6051175 5940308 5838219 5661883 5521377 5361279 5219273 5104886 5003431 4896484 4769003
$$ packed form
3443F052672M5O180L4474q663Q588K8466K8180J3597L5774N8881L0286K0505L3549
3430F342534P9459K7841N2963J07691Q1338R2420J17918J30764J31538J39046
3420G303512J50493K47034J86820K06639K35335K85421L28408L93590M44300M31529
3410A0213081M97822N50012N95999O30377N86858N86704N68876M93071M30084
3401A5152884K94642J83186M342j69292k67075l93287m84385n64759o67797o52225
3391A2436234o74701o87917o05933n62151n25539m77373m20735m04956l47099
3382G729830k78980k31762k00126j63252j09234j07056j47805j28041j47363j65036
3372F051175j10867j02089j76336j40506j60098j42006j14387j01455j06947j27481
$$ plain form
3362 4769003 4725603 4615907 4536971 4488230 4394269 4301625 4200391 4145974 4098777 4056734 4045879
3351 4045879 3970913 3915205 3894995 3898317 3905852 3919863 3902195 3865259 3748729 3717612 3707594 3670660
3339 3670660 3627619 3568246 3514110 3495714 3402564 3362314 3345452 3283878 3268307 3252611 3202530
3328 3202530 3167088 3175231 3119048 3118743 3124755 3086146 3050419 3003312 2965515 2940608 2968376 2950318
3316 2950318 2927194 2872860 2823427 2799263 2795897 2806634 2801523 2747775 2734582 2744179 2698574 2710061
3304 2710061 2715996 2700474 2672671 2640320 2625549 2639299 2624075 2629002 2573206 2534119 2516598 2523482
3292 2523482 2497178 2494812 2484759 2478048 2443322 2414092 2419239 2435997 2419365 2367614 2346506 2307020
3280 2307020 2292702 2289705 2314336 2331810 2296104 2248203 2233905 2194718 2194927 2223943 2224124 2216409 2187744
$$ packed form
3362D769003m3400j09696p8936m8741r3961r2644j01234n4417m7197m2043j0855
3351D045879p4966n5708k0210L322P535J4011j7668l6936j16530l1117j0018l6934
3339C670660m3041n9373n4136j8396r3150m0250j6862o1574j5571j5696n0081
3328C202530l5442Q143n6183l05O012l8609l5727m7107l7797k4907K7768j8058
3316B950318k3124n4334m9433k4164l366J0737n111n3748j3193R597m5605J1487
3304B710061N935j5522k7803l2351j4771J3750j5224M927n5796l9087j7521O884
3292B523482k6304k366j0053o711l4726k9230N147J6758j6632n1751k1108l9486
3280B307020j4318k997K4631J7474l5706m7901j4298l9187K09K9016J81p715k8665
$$ plain form
3267 2187744 2153143 2118318 2100143 2104298 2106294 2092190 2103831 2078150 2050463 2098903 2096746 2069883
3255 2069883 2069270 2030673 2013304 1983560 1988255 1983228 1998703 1995133 1981363 1944704 1936380 1994971 1981055
3242 1981055 1947712 1936012 1934290 1931231 1958677 1943558 1970906 1969672 1924686 1888553 1898392 1910242
3230 1910242 1900932 1897612 1862363 1853451 1854576 1880096 1863446 1876390 1863027 1820042 1806455 1809959
3218 1809959 1771175 1735920 1763031 1751980 1767054 1765449 1733432 1735198 1724355 1729527 1740523 1713672
3206 1713672 1717584 1693666 1696860 1701442 1692659 1685132 1682274 1702329 1658039 1631912 1641081 1664516 1678044
3193 1678044 1645719 1570357 1603283 1663922 1638900 1617197 1642723 1653268 1611170 1634641 1626463 1638239
3181 1638239 1634850 1600280 1595178 1604165 1623742 1626841 1663257 1655436 1630996 1651647 1701061 1707192 1718306
$$ packed form
3267B187744l4601l4825j8175M155J996j4104J1641k5681k7687M8440k157k6863
3255B069883o13l8597j7369k9744M695n027J5475l570j3770l6659q324N8591j3916
3242A981055l3343j1700j722l059K7446j5119K7348j234m4986l6133R839J1850
3230A910242r310l320l5249q912J125K5520j6650J2944j3363m2985j3587L504
3218A809959l8784l5255K7111j1051J5074j605l2017J766j0843N172J0996k6851
3206A713672L912k3918L194M582q783p527k858K0055m4290k6127R169K3435J3528
3193A678044l2325p5362L2926O0639k5022k1703K5526J0545m2098K3471q178J1776
3181A638239l389l4570n102Q987J9577L099L6416p821k4440K0651M9414O131J1114
$$ plain form
3168 1718306 1727556 1752412 1787381 1782720 1766387 1760030 1777739 1785805 1774305 1757177 1760750 1763375 1780338
3155 1780338 1761805 1766904 1818681 1858714 1843335 1865268 1904636 1920489 1948670 1985324 1965225 1963079
3143 1963079 1987223 1998436 2030348 2082359 2115636 2122046 2171083 2251543 2296908 2353124 2349276 2311801
3131 2311801 2287210 2289398 2304343 2343447 2363403 2340341 2319302 2283696 2238368 2251918 2285382 2306566
3119 2306566 2330347 2331856 2338128 2378806 2381182 2443940 2463039 2451560 2475163 2502338 2536977 2587984
3107 2587984 2619665 2692120 2757958 2779675 2823926 2852521 2949243 3003218 3042551 3075045 3093463
3096 3093463 3162355 3298562 3331163 3359349 3429170 3460928 3526372 3645337 3691601 3733403 3813838
3085 3813838 3826111 3821116 3867592 3917984 4015464 4044278 4056661 4042602 4093834 4135923 4187004 4263764
$$ packed form
3168A718306R250K4856L4969m661j6333o357J7709Q066j1500j7128L573K625J6963
3155A780338j8533N099N1777M0033j5379K1933L9368J5853K8181L6654k0099k146
3143A963079K4144J1213L1912N2011L3277O410M9037Q0460M5365N6216l848l7475
3131B311801k4591K188J4945L9104J9956k3062k1039l5606m5328J3550L3464K1184
3119B306566K3781J509O272M0678K376O2758J9099j1479K3603K7175L4639N1007
3107B587984L1681P2455O5838K1717M4251K8595R6722N3975L9333L2494J8418
3096C093463O8892J36207L2601K8186O9821L1758O5444J18965M6264M1802Q0435
3085C813838J2273m995M6476N0392R7480K8814J2383j4059N1232M2089N1081P6760
$$ plain form
3073 4263764 4353746 4399588 4517786 4658918 4786316 4962799 5196769 5449260 5672264 5922813
3063 5922813 6157512 6392240 6591389 6703441 6753506 6773808 6694863 6547608 6409958 6240950
3053 6240950 6077493 5916181 5745793 5610055 5479885 5440664 5409606 5403235 5425106 5437763 5513283
3042 5513283 5604441 5723820 5834144 5913849 6024551 6108566 6229831 6368175 6451172 6528895
3032 6528895 6575245 6554548 6487076 6381784 6286335 6140121 5976553 5766843 5588260 5390282
3022 5390282 5150103 4964849 4877877 4787506 4641032 4561321 4499207 4455926 4422749 4407551 4404898
3011 4404898 4350205 4293244 4234997 4184167 4114925 4060440 3929984 3814921 3720896 3620448 3511721
3000 3511721 3392214 3281874 3183891 3065060 2973710 2908649 2819369 2740037 2671517 2618772 2508369
$$ packed form
3073D263764Q9982M5842J18198J41132J27398J76483K33970K52491K23004K50549
3063E922813K34699K34728J99149J12052N0065K0302p8945j47255j37650j69008
3053F240950j63457j61312j70388j35738j30170l9221l1058o371K1871J2657P5520
3042E513283R1158J19379J10324P9705J10702Q4015J21265J38344Q2997P7723
3032F528895M6350k0697o7472j05292r5449j46214j63568k09710j78583j97978
3022E390282k40179j85254q6972r0371j46474p9711o2114m3281l3177j5198k653
3011D404898n4693n6961n8247n0830o9242n4485j30456j15063r4025j00448j08727
3000C511721j19507j10340r7983j18831r1350o5061q9280p9332o8520n2745j10403
$$ plain form
2989 2508369 2439790 2413308 2395402 2389223 2336723 2290672 2257764 2258425 2214500 2126201 2111281 2093779
2977 2093779 2011612 1950142 1941713 1932665 1894307 1850816 1799123 1771949 1735248 1703826 1689773 1658519
2965 1658519 1654987 1637698 1610640 1588581 1570126 1551865 1511891 1466962 1448272 1467098 1455890 1446118
2953 1446118 1394304 1341905 1343456 1288676 1297273 1301440 1261239 1219485 1181972 1162888 1158687 1146511
2941 1146511 1152442 1134817 1142688 1139602 1112078 1104343 1092304 1044653 1035559 998119 995654 1007596 996819
2928 996819 1019983 973663 942158 920048 900799 884409 878533 901203 880413 834729 838314 847610
2916 847610 837404 826375 819708 777373 737684 739387 728763 754717 726390 703040 693384 664366
2904 664366 681651 719870 716443 749726 704409 632867 623611 594571 634802 634558 606251 566655
$$ packed form
2989B508369o8579k6482j7906o179n2500m6051l2908O61m3925q8299j4920j7502
2977B093779q2167o1470q429r048l8358m3491n1693k7174l6701l1422j4053l1254
2965A658519l532j7289k7058k2059j8455j8261l9974m4929j8690J8826j1208r772
2953A446118n1814n2399J551n4780Q597M167m0201m1754l7513j9084m201j2176
2941A146511N931j7625P871l086k7524p735j2039m7651r094l7440k465J1942j0777
2928I96819K3164m6320l1505k2110j9249j6390n876K2670k0790m5684L585R296
2916H47610j0206j1029o667m2335l9689J703j0624K5954k8327k3350r656k9018
2904F64366J7285L8219l427L3283m5317p1542r256k9040M0231k44k8307l9596
$$ plain form
2892 566655 569134 547914 559797 587329 574864 578183 553427 518527 508999 536432 548970 527804
2880 527804 512380 497955 456618 462745 454640 483484 500113 471054 433173 409989 452766 454273
2868 454273 485933 473549 445708 441495 394595 360112 404262 433237 436175 423572 398845 368180
2856 368180 373047 403892 405751 374613 363292 374320 372967 397387 438840 436972 408024 360305
2844 360305 322133 325356 388026 392407 394840 393134 361151 362785 363882 384650 354845 348892 361242
2831 361242 346348 356589 393680 392481 411230 399634 357927 330280 348346 364729 355127 361347
2819 361347 346851 334454 339299 311639 299079 282642 271882 277674 304119 312481 308882 302557 294057
2806 294057 303711 292306 274966 281354 271300 271337 284691 296057 302860 279966 301559 302821 257712
$$ packed form
2892E66655K479k1220J1883K7532j2465L319k4756l4900r528K7433J2538k1166
2880E27804j5424j4425m1337O127q105K8844J6629k9059l7881k3184M2777J507
2868D54273L1660j2384k7841m213m6900l4483M4150K8975K938j2603k4727l0665
2856C68180M867L0845J859l1138j1321J1028j353K4420M1453j868k8948m7719
2844C60305l8172L223O2670M381K433j706l1983J634J097K0768k9805n953J2350
2831C61242j4894J0241L7091j199J8749j1596m1707k7647J8066J6383r602O220
2819C61347j4496j2397M845k7660j2560j6437j0760N792K6445Q362l599o325q500
2806B94057R654j1405j7340O388j0054L7J3354J1366O803k2894K1593J262m5109
$$ plain form
2793 257712 290136 310560 274941 268537 262950 252442 265684 260752 254332 273062 253815 247401 266015
2780 266015 242324 250615 250633 255127 246029 258892 249676 241229 243252 244015 262998 265633 222904 192260
2766 192260 224493 215890 234567 227125 228994 230922 204666 201156 228642 248294 271267 224665 169265
2753 169265 163391 188720 197728 233428 242355 230899 219586 211931 223422 275083 279650 222597 223168
2740 223168 196995 186088 203443 221252 212164 188332 184653 159773 202457 215896 237772 207825
2728 207825 194128 173349 179084 196357 235956 249945 239894 244389 198568 184537 174859 218190
2716 218190 212867 212210 174506 172753 178303 187819 218410 199143 178098 157260 156103 149407 159524
2703 159524 232673 179531 130692 116775 109305 117601 152691 154306 137096 132761 130646 143226 158672
$$ packed form
2793B57712L2424K0424l5619o404n587j0508J3242m932o420J8730j9247o414J8614
2780B66015k3691Q291J8M494r098J2863r216q447K023P63J8983K635m2729l0644
2766A92260L2233q603J8677p442J869J928k6256l510K7486J9652K2973m6602n5400
2753A69265n874K5329R008L5700Q927j1456j1313p655J1491N1661M567n7053N71
2740B23168k6173j0907J7355J7809r088k3832l679k4880M2684J3439K1876k9947
2728B07825j3697k0779N735J7273L9599J3989j0051M495m5821j4031r678M3331
2716B18190n323o57l7704j753N550R516L0591j9267k1045k0838j157o696J0117
2703A59524P3149n3142m8839j3917p470Q296L5090J615j7210m335k115J2580J5446
$$ plain form
2690 158672 168514 164005 128843 135252 136065 119268 130545 124481 142965 156672 121561 87495 110123
2677 110123 142799 125966 125105 130290 116664 116083 113415 141535 140915 111353 93471 109386 151108
2664 151108 166489 163142 142645 139517 161212 129113 120078 123267 162153 168225 146100 110460 139843
2651 139843 144009 131407 126636 116819 108307 95564 106561 101444 140970 154018 85602 78650 115652
2638 115652 118756 117663 114310 131942 101695 91996 75110 47183 60471 122911 124698 117211 129929
2625 129929 108512 120895 135302 115421 128183 89465 56927 83501 99559 99969 119186 94042
2613 94042 84209 78952 67523 97870 98039 94827 103556 81294 58100 89081 91345 71173 61623
2600 61623 65371 66546 74746 33331 46384 61197 52348 53163 56749 88714 109073 132858 137575
$$ packed form
2690A58672R842m509l5162O409Q13j6797J1277o064J8484J3707l5111l4066K2628
2677A10123L2676j6833q61N185j3626n81k668K8120o20k9562j7882J5915M1722
2664A51108J5381l347k0497l128K1695l2099r035L189L8886O072k2125l5640K9383
2651A39843M166j2602m771r817q512j2743J0997n117L9526J3048o8416o952L7002
2638A15652L104j093l353J7632l0247r699j6886k7927J3288O2440J787p487J2718
2625A29929k1417J2383J4407j9881J2762l8718l2538K6574J6058M10J9217k5144
2613I4042r833n257j1429L0347J69l212Q729k2262k3194L0981K264k0172r550
2600F1623L748J175Q200m1415J3053J4813q849Q15L586L1965K0359K3785M717
$$ plain form
2587 137575 112159 52306 25440 72641 111893 96403 53771 45003 70666 47578 19116 43387
2575 43387 60503 85856 84703 52008 61834 97150 90049 65259 62256 63089 58742 61718 77600
2562 77600 98358 88362 75585 62513 76089 118007 84279 63184 76724 59229 100400 129610
2550 129610 115250 117831 83350 60645 39422 29692 60159 54178 49349 50327 38005 61285 84874
2537 84874 73036 60740 73353 102323 133718 122736 122296 127806 125743 151929 181846 165413 148863
2524 148863 126500 102432 128619 99766 81403 91357 82715 83733 97289 72972 58032 45085
2512 45085 56009 55663 55441 58189 24743 21672 29004 41737 75882 106306 55412 40866 78878
2499 78878 68945 39990 41851 34744 23314 47723 50130 28030 42595 61008 63406 57541 62168
$$ packed form
2587A37575k5416n9853k6866M7201L9252j5490m2632q768K5663k3088k8462K4271
2575D3387J7116K5353j153l2695R826L5316p101k4790l003Q33m347K976J5882
2562G7600K0758r996j2777j3072J3576M1918l3728k1095J3540j7495M1171K9210
2550A29610j4360K581l4481k2705k1223r730L0467n981m829R78j2322K3280K3589
2537H4874j1838j2296J2613K8970L1395j0982m40N510k063K6186K9917j6433j6550
2524A48863k2363k4068K6187k8853j8363R954q642J018J3556k4317j4940j2947
2512D5085J0924l46k22K748l3446l071P332J2733L4145L0424n0894j4546L8012
2499G8878r933k8955J861p107j1430K4409K407k2100J4565J8413K398n865M627
$$ plain form
2486 62168 78302 93384 67094 42804 72299 81381 58386 49683 116695 137393 69009 91550
2474 91550 75070 49896 48191 65746 124247 103456 53273 35671 28562 11187 4253 46570
2462 46570 75894 67608 59416 47783 37718 58411 81496 46186 26737 4669 -17560 20925
2450 20925 45740 74450 62332 36865 9143 -185 41531 70405 80131 69736 81088 72458
2438 72458 51474 51743 56690 47910 75418 41201 49640 79653 92740 76282 49947 62752 41430
2425 41430 43664 98766 93691 76124 73982 61503 42881 81437 107193 82169 83210 105378 91503
2412 91503 17792 37491 32390 41542 55213 24018 21150 29124 -12285 24083 64615 80433 57873
2399 57873 60399 75949 55618 81432 92015 60930 50559 39593 15579 62930 72548 56681
$$ packed form
2486F2168J6134J5082k6290k4290K9495R082k2995q703O7012K0698o8384K2541
2474I1550j6480k5174j705J7555N8501k0791n0183j7602p109j7375o934M2317
2462D6570K9324q286q192j1633j0065K0693K3085l5310j9449k2068k2229L8485
2450B0925K4815K8710j2118k5467k7722r328M1716K8874R726j0395J1352q630
2438G2458k0984K69M947q780K7508l4217Q439L0013J3087j6458k6335J2805k1322
2425D1430K234N5102n075j7567k142j2479j8622L8556K5756k5024J041K2168j3875
2412I1503p3711J9699n101R152J3671l1195k868P974m1409L6368M0532J5818k2560
2399E7873K526J5550k0331K5814J0583l1085j0371j0966k4014M7351R618j5867
$$ plain form
2387 56681 52465 60547 60049 56499 68073 86027 70262 61124 29082 27220 35519 49051 69718
2374 69718 88237 52982 52677 71664 56985 94012 82323 72332 60448 60200 73479 87640 95957
2361 95957 141214 118626 96640 88623 107361 135751 104140 125883 122271 133674 123375 127487
2349 127487 121997 112296 143239 137669 129315 121967 122264 140365 145706 122133 122113 115809 120036 156311
2335 156311 196261 188643 171180 168943 143675 132641 160253 193340 215679 220913 200889 173803
2323 173803 215649 226204 223016 222581 250583 248784 200558 221649 226964 239693 269079 242763 242594
2310 242594 235209 259471 287126 289356 292963 310287 309633 303383 344284 364812 365048 355648 359785 393035
2296 393035 400691 398207 399406 430434 487420 467839 498401 510615 525196 569433 651599 668345
$$ packed form
2387E6681m216Q082m98l550J1574J7954j5765r138l2042j862Q299J3532K0667
2374F9718J8519l5255l05J8987j4679L7027j1689r991j1884k48J3279J4161Q317
2361I5957M5257k2588k1986q017J8738K8390l1611K1743l612J1403j0299M112
2349A27487n490r701L0943n570q354p348K97J8101N341k3573k0o304M227L6275
2335A56311L9950p618j7463k237k5268j1034K7612L3087K2339N234k0024k7086
2323A73803M1846J0555l188m35K8002j799m8226K1091N315J2729K9386k6316j69
2310B42594p385K4262K7655K230L607J7324o54o250M0901K0528K36r400M137L3250
2296C93035P656k484J199L1028N6986j9581L0562J2214J4581M4237Q2166J6746
$$ plain form
2284 668345 748241 855838 982814 1127267 1240127 1367432 1512468 1674510 1824606 1938862
2274 1938862 2069864 2259861 2512842 2714540 3068516 3553245 4261158 5367037 7129542
2265 7129542 9059089 11283571 14178136 17150972 18640857 17912369 16761765 15898358 14962284
2256 14962284 13492067 11648652 9693003 7900552 6282251 4958401 3979988 3399911
2248 3399911 3021571 2763718 2486646 2156724 1903488 1717057 1578231 1424869 1346248 1212103
2238 1212103 1104760 1017815 953873 911074 864031 852801 806637 768502 703074 658224 650617
2227 650617 615517 568180 546067 524710 475868 461168 450345 428038 441077 434622 414198 386227
2215 386227 383528 379478 401921 382939 329805 340384 319642 340070 362288 292085 255227 288871
$$ packed form
2284F68345P9896J07597J26976J44453J12860J27305J45036J62042J50096J14256
2274A938862J31002J89997K52981K01698L53976M84729P07913J105879J762505
2265G129542J929547K224482K894565K972836J489885p28488j150604q63407r36074
2256A4962284j470217j843415j955649j792451j618301j323850r78413n80077
2248C399911l78340k57853k77072l29922k53236j86431j38826j53362p8621j34145
2238A212103j07343q6945o3942m2799m7043j1230m6164l8135o5428m4850p607
2227F50617l5100m7337k2113k1357m8842j4700j0823k2307J3039o455k0424k7971
2215C86227k699m050K2443j8982n3134J0579k0742K0428K2218p0203l6858L3644
$$ plain form
2203 288871 249146 232218 242175 279675 270484 230290 215196 228577 229606 215747 204700 223831
2191 223831 204494 193959 167360 183056 190211 172830 142595 125267 152110 160522 192357 182035
2179 182035 127792 125139 133296 121715 104916 115820 145184 126797 115781 111550 87270 102765
2167 102765 145283 119589 136974 141223 116224 111494 118462 119105 120466 73953 45984 58710 97626
2154 97626 107830 116943 124272 83437 47887 66316 69497 64808 84576 92053 47044 42383 99140
2141 99140 86292 79651 75974 48123 56513 66797 68866 78078 43138 50372 51283 35821 10553
2128 10553 62395 74360 69059 50380 45603 47210 25300 51351 74204 48474 -5381 -1092 2675
2115 2675 8634 55343 78080 33563 22655 1660 21594 27299 27987 5399 -766 -12129 -8693
$$ packed form
2203B88871l9725j6928R957L7500r191m0194j5094J3381J029j3859j1047J9131
2191B23831j9337j0535k6599J5696P155j7381l0235j7328K6843Q412L1835j0322
2179A82035n4243k653Q157j1581j6799J0904K9364j8387j1016m231k4280J5495
2167A02765M2518k5694J7385M249k4999m730O968O43J361m6513k7969J2726L8916
2154I7626J0204R113P329m0835l5550J8429L181m689J9768P477m5009m661N6757
2141I9140j2848o641l677k7851Q390J0284K069R212l4940P234R11j5462k5268
2128A0553N1842J1965n301j8679m777J607k1910K6051K2853k5730n3855M289L767
2115B675N959M6709K2737m4517j0908k0995J9934N705O88k2588o165j1363L436
$$ plain form
2102 -8693 11169 16631 25162 11002 -17663 -31737 9082 2619 6254 13055 22909 18953 9494 12400
2088 12400 22656 31002 18316 3147 8468 42817 40636 30879 24495 37777 13830 -13125 13837
2075 13837 44488 34539 25475 44539 39453 38063 14345 16414 10856 -24684 -26910 -25311 -3515
2062 -3515 40278 -2261 -10558 10413 3989 -2680 -17318 139 -559 -7775 -532 -20003 -9967
2049 -9967 -13168 -25378 -7930 15287 2405 -20436 -3367 9104 32559 34093 898 1655 -5872
2036 -5872 -67170 -36609 2279 -9435 -44475 -38175 -42101 -18914 16457 16679 -945 5618 -3605
2023 -3605 -10686 -3033 7955 25030 2218 -18982 -29017 -35979 -37010 -4977 14157 31018 27525
2010 27525 -11410 -40336 -32257 -8808 13722 25770 11756 -20288 -20177 7665 25534 41194
$$ packed form
2102h693J9862N462Q531j4160k8665j4074M0819o463L635O801R854l956r459K906
2088A2400J0256Q346j2686j5169N321L4349k181r757o384J3282k3947k6955K6962
2075A3837L0651r949r064J9064n086j390k3718K069n558l5540k226J599K1796
2062c515M3793m2539q297K0971o424o669j4638J7457o98p216P243j9471J0036
2049i967l201j2210J7448K3217j2882k2841J7069J2471K3455J534l3195P57p527
2036e872o1298L0561L8888j1714l5040O300l926K3187L5371K22j7624O563r223
2023c605p081P653J0988J7075k2812k1200j0035o962j031L2033J9134J6861l493
2010B7525l8935k8926Q079K3449K2530J2048j4014l2044J11K7842J7869J5660
$$ plain form
1998 41194 44787 19634 34834 49283 44418 77670 97034 98754 104459 71602 51377 83399 95835
1985 95835 59553 18838 -22915 -45422 -33045 28118 42554 34667 5394 -22299 -22483 5750
1973 5750 23229 -7943 -21572 -35343 -41560 -50011 -48360 -25891 -15085 -15774 -58401 -51197 -25734
1960 -25734 3802 13842 -28082 -61429 -74465 -53733 -63310 -56833 7816 -23655 -47757 -67589
1948 -67589 -67877 -10373 18702 42119 16598 -10910 -48350 -53189 -26240 -18929 18151 -30701 -65290
1935 -65290 -45023 15991 44035 25386 30682 23982 1394 12925 25462 49206 16355 1581
1923 1581 4774 -17932 10366 18735 14318 -6059 -7587 -23852 -28835 -1607 7779 -15186 -29482
1910 -29482 -81182 -78304 -77335 -49668 -44099 -42814 -69989 -92940 -71243 -14534 -4932 25501 10471
$$ packed form
1998D1194L593k5153J5200J4449m865L3252J9364J720N705l2857k0225L2022J2436
1985I5835l6282m0715m1753k2507J2377O1163J4436p887k9273k7693j84K8233
1973E750J7479l1172j3629j3771o217q451J651K2469J0806o89m2627P204K5463
1960b5734K9536J0040m1924l3347j3036K0732r577O477O4649l1471k4102j9832
1948f7589k88N7504K9075K3417k5521k7508l7440m839K6949P311L7080m8852l4589
1935f5290K0267O1014K8044j8649N296o700k2588J1531J2537K3744l2851j4774
1923A581L193k2706K8298Q369m417k0377j528j6265m983K7228R386k2965j4296
1910b9482n1700K878R69K7667N569J285k7175k2951K1697N6709R602L0433j5030
$$ plain form
1897 10471 -19272 2330 -5530 -7476 6222 -24689 -19130 -19728 -46718 -48822 -42958 -31648 -987
1884 -987 -22493 -29468 -22241 -30535 -20238 -2118 -13474 -9752 -11894 -49408 -55740 -40868 13045
1871 13045 2793 -18434 -34022 -33306 -9719 -33065 -39350 -19765 -20783 -38149 -47527 -10995 20080
1858 20080 6028 -12698 -39224 -52229 -52741 -61241 -75684 -65468 -12253 -2644 -16080 -30372 -11647
1845 -11647 -12268 -30919 -66129 -49837 -32058 -40350 -52910 -42137 -40027 -44491 -27438 -1075 -2607
1832 -2607 -15677 -42626 -25498 -19103 -2146 31292 11491 8297 6422 5705 -3050 -18975 -28434
1819 -28434 -55506 -46061 -71153 -52002 -29523 -30503 -9885 -19143 16858 12091 11529 25839 4458
1806 4458 3688 -17950 -27563 -24940 -31474 -58452 -46749 -32961 -51643 -62003 -36393 -41476 -39961
$$ packed form
1897A0471k9743K1602p860j946J3698l0911N559n98k6990k104N864J1310L0661
1884i87k1506o975P227q294J0297J8120j1356L722k142l7514o332J4872N3913
1871A3045j0252k1227j5588P16K3587k3346o285J9585j018j7366r378L6532L1075
1858B0080j4052j8726k6526j3005n12q500j4443J0216N3215R609j3436j4292J8725
1845a1647o21j8651l5210J6292J7779q292j2560J0773K110m464J7053K6363j532
1832b607j3070k6949J7128O395J6957L3438j9801l194j875p17q755j5925r459
1819b8434k7072R445k5092J9151K2479r80K0618r258L6001m767n62J4310k1381
1806D458p70k1638r613K623o534k6978J1703J3788j8682j0360K5610n083J515
$$ plain form
1793 -39961 -1233 1440 -13293 -11303 -14216 -20273 -14966 -16249 -39273 -48928 -48543 -38191 -9175 -12873
1779 -12873 -2464 -19058 -25798 -2827 -17757 1880 9901 -6947 -21214 -70361 -78000 -50205
1767 -50205 -49572 -18482 15182 -965 -63970 -79051 -49531 -33838 -9575 -4953 7322 -22232
1755 -22232 -43107 -60474 -15474 13223 -14490 -37266 -62413 -27157 -57987 -56802 -58814 -45945
1743 -45945 -6748 -41134 -69878 -44259 -29275 -32850 -24237 -26913 -28066 -62920 -20943 -15136 -26254
1730 -26254 -12481 -3050 -40852 -54815 -42259 -39166 -37937 -18735 -40402 -50476 -15819 -10933 7270
1717 7270 -4152 -13082 -13712 -61042 -68038 -56233 -11086 -9672 41892 30756 -17481 -4524 16446
1704 16446 7874 7608 -7386 -39030 -36272 -35013 -11723 -14352 -51288 -72598 -65437 -54723 -25696
$$ packed form
1793c9961L8728K673j4733J990k913o057N307j283k3024r655L85J0352K9016l698
1779a2873J0409j6594o740K2971j4930J9637Q021j6848j4267m9147p639K7795
1767e0205O33L1090L3664j6147o3005j5081K9520J5693K4263M622J2275k9554
1755b2232k0875j7367M5000K8697k7713k2776k5147L5256l0830J185k012J2869
1743d5945L9197l4386k8744K5619J4984l575Q613k676j153l4854M1977N807j1118
1730b6254J3773R431l7802j3963J2556L093J229J9202k1667j0074L4657M886J8203
1717G270j1422q930o30m7330o996J1805M5147J414N1564j1136m8237J2957K0970
1704A6446q572k66j4994l1644K758J259K3290k629l6936k1310P161J0714K9027
$$ plain form
1691 -25696 -6450 -10436 -12494 -21896 -14129 -1280 -20804 -13707 -9176 -10090 -26620 -36458 -57792 -46094
1677 -46094 -29919 -6324 -2800 -6309 -40500 -46413 -27405 -46387 -13095 3148 1627 -5697 -35666
1664 -35666 -31451 -15394 -15283 -48011 -74644 -66155 -29810 -46540 -32610 -25015 -25999 -45286 -87466
1651 -87466 -39399 7761 -4218 -13146 -18119 -55771 -81658 -60217 -25907 -40516 -55764 -62651
1639 -62651 -52768 -57759 -52578 -22725 -61706 -68092 -47202 -68001 -63122 -34724 17705 -10032 -29310
1626 -29310 -25284 -76411 -126228 -90454 -58523 -51647 -34182 -59612 -50810 -50772 -3651 -6766 -12679
1613 -12679 -36169 -59863 -42083 -45875 -56227 -28073 -36031 -47621 -32712 -36476 -44641 -37836 -17077
1600 -17077 954 12558 -6910 -33719 -51424 -25177 -5109 -25166 -27653 -70633 -54946 -25549
$$ packed form
1691b5696J9246l986k058r402P767J2849j9524P097M531r14j6530r838k1334J1698
1677d6094J6175K3595L524l509l4191n913J9008j8982L3292J6243j521p324k9969
1664c5666M215J6057J11l2728k6633Q489L6345j6730J3930P595r84j9287m2180
1651h7466M8067M7160j1979q928m973l7652k5887K1441L4310j4609j5248o887
1639f2651R883m991N181K9853l8981o386K0890k0799M879K8398N2429k7737j9278
1626b9310M026n1127m9817L5774L1931O876J7465k5430Q802L8M7121l115n913
1613a2679k3490k3694J7780l792j0352K8154p958j1590J4909l764q165O805K0759
1600a7077J8031J1604j9468k6809j7705K6247K0068k0057k487m2980J5687K9397
$$ plain form
1588 -25549 -29400 -56641 -72222 -61719 -67432 -37510 3465 14471 -18484 -68489 -21593 -6125
1576 -6125 -25497 -13466 -26456 -37155 -38997 -16459 -48949 -45251 -40105 -31479 -27993 -22174 -24746
1563 -24746 -14818 -17563 -15237 400 9884 -7425 -533 5569 -36194 -32414 9832 -6481 -37955
1550 -37955 -25160 -35773 -34253 -35829 -41472 -18982 -24004 -53290 -20506 -3687 -14294 -7787 -17204
1537 -17204 -16207 -7922 -23850 -22603 -9801 -39023 -71650 -54067 -52829 -48959 -19525 -23987 -4554
1524 -4554 -13631 -45550 -54482 -50059 -71691 -48893 -36553 -12877 -29748 -46245 -61986 -64178 -56420
1511 -56420 -64777 -52889 -66184 -84623 -66783 -27617 -28355 -95527 -66431 -33046 -64028 -44399
1499 -44399 -31902 -30319 -44215 -36402 -44527 -57864 -42386 -19417 -54281 -94347 -78464 -61440
$$ packed form
1588b5549l851k7241j5581J0503n713K9922M0975J1006l2955n0005M6896J5468
1576f125j9372J2031j2990j0699j842K2538l2490L698N146Q626L486N819k572
1563b4746R928k745K326J5637R484j7309O892O102m1763L780M2246j6313l1474
1550c7955J2795j0613J520j576n643K2490n022k9286L2784J6819j0607O507r417
1537a7204R97Q285j5928J247J2802k9222l2627J7583J238L870K9434m462J9433
1524d554r077l1919q932M423k1632K2798J2340K3676j6871j6497j5741k192P758
1511e6420q357J1888j3295j8439J7840L9166p38o7172K9096L3385l0982J9629
1499d4399J2497J583j3896P813q125j3337J5478K2969l4864m0066J5883J7024
$$ plain form
1487 -61440 -32348 -21623 -73871 -91769 -76202 -79793 -95205 -68974 -50815 -34702 -45643 -82261
1475 -82261 -91928 -46740 -24646 -27567 -38457 -16353 -6199 -31271 -6584 -36103 -22089 -17281
1463 -17281 -25039 -19522 -25406 -13 3979 -13464 -26832 -52628 -54439 -27484 -37624 -25462 -32393
1450 -32393 -15123 -6817 23600 6639 -22615 -14295 -30126 -63119 -18380 23888 -26813 -801
1438 -801 5260 -32992 -38143 -50023 -43498 -24876 -45830 -29986 -22735 -53677 -32960 -30760 -9745
1425 -9745 -34258 -40516 -36563 -49756 -68367 -48906 -29979 -59863 -44449 -65674 -62726 -42603 -29465
1412 -29465 -40401 -55054 -76626 -49101 -36540 -7393 -32055 -26613 -12268 -51031 -44900 -34517
1400 -34517 -56302 -45903 -12089 -24503 -48408 -35053 -32749 -40798 -6944 -21733 -33491 -23231
$$ packed form
1487f1440K9092J0725n2248j7898J5567l591j5412K6231J8159J6113j0941l6618
1475h2261r667M5188K2094k921j0890K2104J0154k5072K4687k9519J4014M808
1463a7281p758N517n884K5393L992j7443j3368k5796j811K6955j0140J2162o931
1450c2393J7270Q306L0417j6961k9254Q320j5831l2993M4739M2268n0701K6012
1438h01O061l8252n151j1880O525J8622k0954J5844P251l0942K0717K200K1015
1425i745k4513o258L953j3193j8611J9461J8927k9884J5414k1225K948K0123J3138
1412b9465j0936j4653k1572K7525J2561K9147k4662N442J4345l8763O131J0383
1400c4517k1785J0399L3814j2414k3905J3355K304q049L3854j4789j1758J0260
$$ plain form
1388 -23231 -41844 -13851 -24497 -35783 -15026 -19389 162 -16587 -14335 -27958 -9534 13030
1376 13030 1517 -1703 -12922 -19736 -18973 -39533 -73355 -84829 -60366 -45101 1324 13065 11042
1363 11042 4670 -30434 -21855 2121 14576 13989 -8242 -37909 -40894 1630 36673 19121 6291
1350 6291 22183 9249 -27494 -49319 -20406 -11612 -31218 -60698 -48093 -15444 -14563 -28521 -25560
1337 -25560 -9915 -26703 -71329 -46593 -37160 -51030 -57901 -64461 -74722 -75223 -33053 -258 15455
1324 15455 -38846 -56308 -36296 -18443 -21482 -32915 21632 35512 -45765 -58524 -46727 -27175
1312 -27175 -8775 13791 -5184 -21062 -49053 -66784 -52263 -57124 -52035 -53600 -39498 -18330
1300 -18330 -36795 -20752 -5136 4873 -11860 -33128 -52374 -34423 -21723 -1920 -7702 -35353
$$ packed form
1388b3231j8613K7993j0646j1286K0757m363J9551j6749K252j3623J8424K2564
1376A3030j1513l220j1219o814P63k0560l3822j1474K4463J5265M6425J1741k023
1363A1042o372l5104Q579K3976J2455n87k2231k9667k985M2524L5043j7552j2830
1350F291J5892j2934l6743k1825K8913Q794j9606k9480J2605L2649Q81j3958K961
1337b5560J5645j6788m4626K4736R433j3870o871o560j0261n01M2170L2795J5713
1324A5455n4301j7462K0012J7853l039j1433N4547J3880q1277j2759J1797J9552
1312b7175J8400K2566j8975j5878k7991j7731J4521m861N089j565J4102K1168
1300a8330j8465J6043J5616J0009j6733k1268j9246J7951J2700J9803n782k7651
$$ plain form
1288 -35353 -46054 -64984 -52974 -57918 -20209 6841 -14339 -44870 -21191 2894 -974 -10679
1276 -10679 -2367 -36489 -37318 -38057 -55878 -27459 -18100 -42965 -59651 -57842 -21189 10050 -6043
1263 -6043 -32349 -33254 -32000 -65003 -29250 -21712 -35057 -33636 -47174 -49259 -1892 6145 16764
1250 16764 -9768 -26023 -28640 -29251 -23226 -12140 -6142 -26465 298 8956 10464 2110 -4252 -8330
1236 -8330 -17691 -33105 -25601 -24213 -21987 -55728 -44254 -46023 -45801 -31135 -35991 -30480 -34989 -54338
1222 -54338 -55477 -46856 -25623 -34870 -34538 4418 -32080 -18211 -41768 -41856 -33055 -18699 2889 -32368
1208 -32368 -20169 -50052 -54376 -42162 -31918 -36257 -52133 -40448 -32338 -1106 -12895 -44798
1196 -44798 -36089 -35566 -6606 5912 15789 -3920 5346 -19847 -24002 -10061 -15388 15687 19323
$$ packed form
1288c5353j0701j8930J2010m944L7709K7050k1180l0531K3679K4085l868r705
1276a0679Q312l4122q29p39j7821K8419R359k4865j6686J809L6653L1239j6093
1263f043k6306r05J254l3003L5753P538j3345J421j3538k085M7367Q037J0619
1250A6764k6532j6255k617o11O025J1086N998k0323K6763Q658J508q354o362m078
1236h330r361j5414P504J388K226l3741J1474j769K22J4666m856N511m509j9349
1222e4338j139Q621K1233r247L32L8956l6498J3869k3557q8Q801J4356K1588l5257
1208c2368J2199k9883m324J2214J0244m339j5876J1685Q110L1232j1789l1903
1196d4798Q709N23K8960J2518R877j9709R266k5193m155J3941n327L1075L636
$$ plain form
1183 19323 -8716 -5082 -29525 -13169 18890 11450 -29856 -66075 -66072 -80699 -53045 -54605 -48262
1170 -48262 -24547 -28292 -10560 -56486 -41698 -4346 -25775 -20998 -54906 -50276 -32301 -44552
1158 -44552 -57556 -21183 20856 6911 -36897 -9983 -11516 -15150 -12729 -11612 -60107 -54294 -56363
1145 -56363 -67941 -27286 -2603 -19637 -37934 -22477 -64551 -36817 2288 -13332 10055 -10661
1133 -10661 -46781 -25929 -13269 -20060 235 25632 -36225 -27780 23961 829 15876 5420
1121 5420 9109 10535 -3047 -23222 -30359 -5456 -55026 -95720 -74845 -58053 -36875 -20122 -22972
1108 -22972 -43633 -13266 22511 -5241 1205 8282 -2553 -17873 -28190 -1744 1049 7335 3744
1095 3744 -36003 -59949 -50048 -13102 -28486 -5313 1001 -33828 36022 12989 -60874 -10505
$$ packed form
1183A9323k8039L634k4443J6356L2059p440m1306l6219Lj4627K7654j560O343
1170d8262K3715l745J7732m5926J4788L7352k1429M777l3908M630J7975j2251
1158d4552j3004L6373M2039j3945m3808K6914j533l634K421J117m8495N813k069
1145e6363j1578M0655K4683j7034j8297J5457m2074K7734L9105j5620K3387k0716
1133a0661l6120K0852J2660o791K0295K5397o1857Q445N1741k3132J5047j0456
1121E420L689J426j3582k0175p137K4903m9570m0694K0875J6792K1178J6753k850
1108b2972k0661L0367L5777k7752O446P077j0835j5320j0317K6446K793O286l591
1095C744l9747k3946R901L6946j5384K3173O314l4829O9850k3033p3863N0369
$$ plain form
1083 -10505 26559 12086 -19547 -26039 -43289 -14098 -5100 -23873 -20918 -8805 -7272 -33785 -28942
1070 -28942 -10874 8211 30868 -6734 -19094 -29220 -4778 16250 -14386 -22208 -25832 -46317
1058 -46317 -11068 -4111 -37432 -8269 -39261 -28798 -908 -4841 -33338 9930 12228 -11609
1046 -11609 3873 -5863 -20174 -4957 -14674 -13335 -12390 -23630 -2444 10964 11176 -32264 -79646
1033 -79646 -60906 -25577 -31806 -52669 -55980 -84487 -39691 -12035 -36216 -35038 3629 32358
1021 32358 17399 3267 -33110 -48938 -18054 -6283 -17059 -12119 -12909 11423 -14887 -4657
1009 -4657 -8172 -41777 -60612 -18397 12431 16865 1283 -15389 -6117 -18090 -16361 1868 13609
996 13609 31931 -17473 -66773 -42361 -42721 -54229 -7847 1859 14631 -12433 -32174 -32474 -22874
$$ packed form
1083a0505L7064j4473l1633o492j7250K9191Q998j8773K955J2113J533k6513M843
1070b8942J8068J9085K2657l7602j2360j0126K4442K1028l0636p822l624k0485
1058d6317L5249O957l3321K9163l0992J0463K7890l933k8497M3268K298k3837
1046a1609J5482r736j4311J5217r717J339R45j1240K1186J3408K12m3440m7382
1033g9646J8740L5329o229k0863l311k8507M4796K7656k4181J178L8667K8729
1021C2358j4959j4132l6377j5828L0884J1771j0776M940p90K4332k6310J0230
1009d657l515l3605j8835M2215L0828M434j5582j6672R272j1973J729J8229J1741
996A3609J8322m9404m9300K4412l60j1508M6382R706J2772k7064j9741l00R600
$$ plain form
983 -22874 -7082 5237 -938 -23078 -28993 -30733 -2410 -7445 10085 -5148 -12747 -29067 -40776
970 -40776 -44722 -425 327 -14072 -17101 -45893 -5185 28735 6665 -16593 -49520 -90309 -49828
957 -49828 -1297 29864 17179 -15295 -45058 -8872 610 -7634 2224 4590 23597 8239 32144
944 32144 50129 22209 2746 -19156 -34699 -46664 -80820 -27864 -228 -12882 -58900 -77414
932 -77414 -49753 -41797 -24719 29407 25984 -3323 -47407 -32656 -9074 28809 43408 15119
920 15119 -25941 -38641 -38135 -38154 3677 -6025 -12636 -23137 -3157 28448 12162 22922 19326 21396
906 21396 4931 -21738 -53 -3188 31001 35457 27557 -22397 -59779 -88346 -37330 43151 79931
893 79931 28479 17509 11488 9690 29423 17488 -28933 -56511 -41506 -19460 -31778 1765
$$ packed form
983b2874J5792J2319o175k2140n915j740K8323n035J7530j5233p599j6320j1709
970d0776l946M4297P52j4399l029k8792M0708L3920k2070k3258l2927m0789M0481
957d9828M8531L1161j2685l2474k9763L6186R482q244R858K366J9007j5358K3905
944C2144J7985k7920j9463k1902j5543j1965l4156N2956K7636j2654m6018j8514
932g7414K7661P956J7078N4126l423k9307m4084J4751K3582L7883J4599k8289
920A5119m1060j2700N06j9M1831r702o611j0501J9980L1605j6286J0760l596K070
906B1396j6465k6669K1685l135L4189M456p900m9954l7382k8567N1016Q0481L6780
893G9931n1452j0970o021j798J9733j1935m6421k7578J5005K2046j2318L3543
$$ plain form
881 1765 6712 -7181 -33121 -64658 -25279 -21293 -16715 -212 6798 -27635 -7293 6355 22236
868 22236 31675 12395 -10616 -30643 -21780 -18867 -1002 28311 22621 -5806 -10738 -240 27265
855 27265 26558 9753 44486 -9003 -33611 -4173 45227 47691 29000 2703 -34342 -42773 -21419
842 -21419 30813 20915 -9055 13397 -24692 -11248 -4407 30110 28157 37699 -7837 -58135 -26354
829 -26354 -30112 -19848 -38467 -44360 -20792 -15349 -8903 14959 12428 11019 -24248 -2323 -17113
816 -17113 4829 15878 -12214 -1228 -14232 -18976 -27471 -14927 -3226 22165 43255 45853 20110
803 20110 6147 -8244 -2648 6962 -23962 -41188 -30847 -6577 11999 14012 18512 3587 -12516
790 -12516 23446 35212 61812 50778 7340 20702 5761 9621 24075 3629 13452 -37195
$$ packed form
881A765M947j3893k5940l1537L9379L986M578J6503P010l4433K0342J3648J5881
868B2236R439j9280k3011k0027Q863K913J7865K9313n690k8427m932J0498K7505
855B7265p07j6805L4733n3489k4608K9438M9400K464j8691k6297l7045q431K1354
842b1419N2232r898k9970K2452l8089J3444O841L4517j953R542m5536n0298L1781
829b6354l758J0264j8619n893K3568N443O446K3862k531j409l5267K1925j4790
816a7113K1942J1049k8092J0986j3004m744q495J2544J1701K5391K1090K598k5743
803B0110j3963j4391N596R610l0924j7226J0341K4270J8576K013M500j4925j6103
790a2516L5962J1766K6600j1034m3438J3362j4941L860J4454k0446R823n0647
$$ plain form
778 -37195 -744 16698 52625 6784 -26504 -22050 -26419 -39121 -24329 697 -2557 1852 -7022
765 -7022 3764 -12569 -34482 -24137 20419 31629 31917 10188 -7709 253 49702 25233 -10470
752 -10470 -7663 -33161 -33072 19118 27064 19443 38114 41476 45806 40542 29692 31990 12922 -2890
738 -2890 -8387 -19955 -24764 -13265 -7998 -21598 -10420 -16687 -9802 13840 19707 4566 43564
725 43564 20002 -16591 967 -1762 9503 -18707 -4926 -16514 7655 47470 27685 30577
713 30577 11200 15609 -2905 -51504 -21103 64244 55164 57036 17026 23507 34713 8915 -3328
700 -3328 15038 9922 -20020 24563 24016 41380 55609 59207 34633 15583 6368 28119 10286
687 10286 5212 2865 15804 -15451 -6514 1027 27516 -46606 -19743 29249 31458 46326 -1939
$$ packed form
778c7195L6451J7442L5927m5841l3288M454m369j2702J4792K5026l254M409q874
765g022J0786j6333k1913J0345M4556J1210K88k1729j7897P962M9449k4469l5703
752a0470K807k5498Q9N2190P946p621J8671L362M330n264j0850K298j9068j5812
738b890n497j1568m809J1499N267j3600J1178o267O885K3642N867j5141L8998
725D3564k3562l6593J7558k729J1265k8210J3781j1588K4169L9815j9785K892
713C0577j9377M409j8514m8599L0401Q5347r080J872m0010O481J1206k5798j2243
700c328J8366n116k9942M4583n47J7364J4229L598k4574j9050r215K1751j7833
687A0286n074k347J2939l1255Q937P541K6489p4122K6863M8992K209J4868m8265
$$ plain form
674 -1939 -19291 11943 4931 25516 70363 58414 40792 49880 21650 -26870 -2472 21208 27308
661 27308 30193 11463 18047 13798 23581 53652 54298 60972 45147 34533 35977 61233 35174 24573
647 24573 6304 7706 23411 10503 36461 37392 50832 20165 -9180 -400 -5886 25252 4427
634 4427 34551 21588 10647 33609 26604 24739 55340 21838 2507 24143 43822 50153 23576
621 23576 25737 44334 46163 46051 44326 52498 28118 26041 -9019 977 17936 39755 87673 71685
607 71685 39535 39022 25715 39273 46589 25483 7325 34068 10602 -2156 30691 49419 39755
594 39755 13838 -12681 8575 28732 28157 28154 17019 30858 15919 41661 76720 51624 7223
581 7223 7856 -1915 -11043 3982 16633 4407 5542 30309 22656 -15171 2413 25058 14610
$$ packed form
674a939j7352L1234p012K0585M4847j1949j7622R088k8230m8520K4398K3680O100
661B7308K885j8730O584m249R783L0071O46O674j5825j0614J444K5256k6059j0601
647B4573j8269J402J5705j2908K5958R31J3440l0667k9345Q780n486L1138k0825
634D427L0124j2963j0941K2962p005j865L0601l3502j9331K1636J9679O331k6577
621B3576K161J8597J829j12j725Q172k4380k077l5060R996J6959K1819M7918j5988
607G1685l2150n13j3307J3558P316k1106j8158K6743k3466j2758L2847J8728r664
594C9755k5917k6519K1256K0157n75lj1135J3839j4939K5742L5059k5096m4401
581G223O33r771r128J5025J2651j2226J135K4767p653l7827J7584K2645j0448
$$ plain form
568 14610 23880 56750 40377 5739 24181 33569 39866 28672 -7301 7991 23981 54991 64792
555 64792 63892 77649 76285 55649 36169 50459 28737 25566 60036 31721 15683 755 -10490
542 -10490 985 12442 -13870 12676 18537 39931 37295 33016 19455 42168 50246 9172 28636
529 28636 36017 46655 24503 10704 28456 23601 6518 40533 27187 11542 4405 17852 64083
516 64083 62914 42908 38116 51235 56893 33414 22106 11516 -7872 19850 23356 40531 72852
503 72852 88871 83969 48878 19008 -11246 29977 49898 43392 79427 57826 -5623 21016
491 21016 50302 4207 41061 64952 36356 31577 6449 -375 13158 25167 20156 20682 19948
478 19948 25349 49717 63922 40722 48425 69687 60405 74159 83959 84040 73732 93322 62290
$$ packed form
568A4610R270L2870j6373l4638J8442R388O297j1194l5973J5292J5990L1010R801
555F4792r00J3757j364k0636j9480J4290k1722l171L4470k8315j6038j4928j1245
542a0490J1475J1457k6312K6546N861K1394k636m279j3561K2713Q078m1074J9464
529B8636P381J0638k2152j3799J7752m855j7083L4015j3346j5645p137J3447M6231
516F4083j169k0006m792J3119N658k3479j1308j0590j9388K7722L506J7175L2321
503G2852J6019m902l5091k9870l0254M1223J9921o506L6035k1601o3449K6639
491B1016K9286m6095L6854K3891k8596m779k5128o824J3533J2009n011N26p34
478A9948N401K4368J4205k3200P703K1262r282J3754R800Q1j0308J9590l1032
$$ plain form
465 62290 54320 82373 62107 34927 -1869 -8464 949 11601 49918 89762 56982 -12889 11442
452 11442 26908 32376 80470 76219 39718 34805 9103 43322 66566 63930 51681 55341 47352
439 47352 3958 21620 71309 108621 92377 42069 16972 25836 76749 100303 84168 34884
427 34884 7658 6890 50401 50967 32824 50843 36041 34444 16034 47748 68307 107411 88914
414 88914 62787 54452 22792 35326 57483 73733 41885 43314 70063 38686 60919 38360
402 38360 56822 38101 42044 13779 43984 82940 84867 80295 60175 71761 55944 58853 65760
389 65760 64477 85037 68381 34105 69039 109506 90874 80144 49011 30024 30824 29890 35078
376 35078 64033 71753 53399 30855 14702 38391 44879 24252 52404 64245 27425 19738 40163
$$ packed form
465F2290p970K8053k0266k7180l6796o595R413J0652L8317L9844l2780o9871K4331
452A1442J5466N468M8094m251l6501m913k5702L4219K3244k636j2249L660p989
439D7352m3394J7662M9689L7312j6244n0308k5097Q864N0913K3554j6135m9284
427C4884k7226p68M3511N66j8143J8019j4802j597j8410L1714K0559L9104j8497
414H8914k6127q335l1660J2534K2157J6250l1848J429K6749l1377K2233k2559
402C8360J8462j8721L943k8265L0205L8956J927m572k0120J1586j5817K909O907
389F5760j283K0560j6656l4276L4934M0467j8632j0730l1133j8987Q00r34N188
376C5078K8955P720j8354k2544j6153K3689O488k0627K8152J1841l6820p687K0425
$$ plain form
363 40163 67991 98542 69444 39020 47598 36822 62492 65496 80473 64043 25350 -3141
351 -3141 11127 64235 73162 99909 71462 32239 62678 37995 97680 99499 87434 79102 62769
338 62769 51836 61653 54866 29235 49300 51085 39666 46898 81426 106738 75555 92735 58994
325 58994 59516 60944 64153 52522 76964 77350 39162 48309 47385 76492 74702 96891 87780 76671
311 76671 69711 84500 96374 56593 51413 77576 68268 51238 54375 79800 83978 64349 39825
298 39825 40391 41441 44497 56803 62801 70950 71450 70927 48374 68569 55411 30995 27815 21181
$$ packed form
363D0163K7828L0551k9098l0424Q578j0776K5670L004J4977j6430l8693k8491
351c141J4268N3108Q927K6747k8447l9223L0439k4683N9685J819j2065q332j6333
338F2769j0933R817o787k5631K0065J785j1419P232L4528K5312l1183J7180l3741
325E8994N22J428L209j1631K4442L86l8188R147r24K9107j790K2189r111j1109
311G6671o960J4789J1874l9781n180K6163r308j7030L137K5425M178j9629k4524
298C9825N66J050L056J2306N998Q149N00n23k2553K0195j3158k4416l180o634
$$ [...]
##END NTUPLES=NMR SPECTRUM
##END=
