##TITLE=1H_DE-80H_X3
 200.13MHz, d2o
 8 sc
 
 19ns.26.2.2025
##JCAMPDX= 6.0         $$ Bruker NMR JCAMP-DX V2.0
##DATA TYPE= NMR SPECTRUM
##DATA CLASS= NTUPLES
##ORIGIN= UXNMR, Bruker Analytische Messtechnik GmbH
##OWNER= pz
$$ XWIN-NMR		Version 3.5
$$ Wed Jun 10 10:38:59 2026 Russian Standard Time (UT+4h)  Yarkov@DPX200
##.OBSERVE FREQUENCY= 200.1313
##.OBSERVE NUCLEUS= ^1H
##.ACQUISITION MODE= SIMULTANEOUS
##.ACQUISITION SCHEME= undefined
##.AVERAGES= 8
##.DIGITISER RES= 18
##SPECTROMETER/DATA SYSTEM= spect
##.PULSE SEQUENCE= zg30
##.SOLVENT NAME= DMSO
##.SHIFT REFERENCE= (INTERNAL, DMSO, 0, 15.4869)
##AUDIT TRAIL= $$ (NUMBER, WHEN, WHO, WHERE, WHAT)
$$ ##TITLE= Audit trail, XWIN-NMR		Version 3.5
$$ ##JCAMPDX= 5.01
$$ ##ORIGIN= Bruker BioSpin GmbH
$$ ##OWNER= Yarkov
$$ C:/Bruker/XWIN-NMR/data/yarkov2/nmr/H-C/1/pdata/1/auditp.txt
$$ ##AUDIT TRAIL=  $$ (NUMBER, WHEN, WHO, WHERE, WHAT)
(   1,<2026-06-10 10:38:12.59 +0400>,<Yarkov>,<DPX200>,
      <created by zg, POWCHK disabled, PULCHK disabled
       configuration hash MD5:
       00 E9 B6 7A A2 85 ED C7 34 08 36 98 17 FE 4E 26
       data hash MD5: 16K
       20 95 AA 39 17 C3 54 1F CA E7 9D 76 FD B4 AB 21>)
(   2,<2026-06-10 10:38:16.73 +0400>,<Yarkov>,<DPX200>,
      <Start of raw data processing
       efp BC_mod = 2 LB = 0.25 FT_mod = 6 PKNL = 1 PHC0 = -6900.219 PHC1 = 13.42196 SI = 16K 
       data hash MD5: 16K
       E0 C1 CE E2 22 67 AE 43 61 BF F0 08 23 69 7F C8>)
$$ ##END=
$$ 
$$ hash MD5
$$ 75 C3 75 6A E7 40 69 A9 3F 6C AD F2 5B 41 33 4F
##$RELAX= 
##$RELAX= 
##$RELAX= 
##$RELAX= 
##$RELAX= 
##$RELAX= 
$$ Bruker specific parameters
$$ --------------------------
##$DU= <C:/Bruker/XWIN-NMR>
##$EXPNO= 1
##$NAME= <H-C>
##$PROCNO= 1
##$TYPE= <nmr>
##$USER= <yarkov2>
##$AMP= (0..31)
100 100 100 100 100 100 100 100 100 100 100 100 100 100 100 100 100 100 
100 100 100 100 100 100 100 100 100 100 100 100 100 100 
##$AQSEQ= 0
##$AQ_mod= 1
##$AUNM= <au_zg>
##$AUTOPOS= <>
##$BF1= 200.13
##$BF2= 200.13
##$BF3= 200.13
##$BF4= 200.13
##$BF5= 200.13
##$BF6= 200.13
##$BF7= 200.13
##$BF8= 200.13
##$BYTORDA= 1
##$CFDGTYP= 0
##$CFRGTYP= 5
##$CHEMSTR= <none>
##$CNST= (0..31)
1 1 145 1 1 1 1 1 1 1 1 1 1 1 1 1 1 1 1 1 1 1 1 1 1 1 1 1 1 1 1 1 
##$CPDPRG= <>
##$CPDPRG1= <>
##$CPDPRG2= <>
##$CPDPRG3= <>
##$CPDPRG4= <mlev>
##$CPDPRG5= <mlev>
##$CPDPRG6= <mlev>
##$CPDPRG7= <mlev>
##$CPDPRG8= <mlev>
##$CPDPRGB= <>
##$CPDPRGT= <>
##$D= (0..31)
0 0.7 0 0 0 0 0 0 0 0 0 0.03 0 0 0 0 0 0 0 0 0 0 0 0 0 0 0 0 0 0 0 0 
##$DATE= 1781073492
##$DBL= (0..7)
120 120 120 120 120 120 120 120 
##$DBP= (0..7)
150 150 150 150 150 150 150 150 
##$DBP07= 0
##$DBPNAM0= <>
##$DBPNAM1= <>
##$DBPNAM2= <>
##$DBPNAM3= <>
##$DBPNAM4= <>
##$DBPNAM5= <>
##$DBPNAM6= <>
##$DBPNAM7= <>
##$DBPOAL= (0..7)
0.5 0.5 0.5 0.5 0.5 0.5 0.5 0.5 
##$DBPOFFS= (0..7)
0 0 0 0 0 0 0 0 
##$DE= 6
##$DECBNUC= <off>
##$DECIM= 32
##$DECNUC= <off>
##$DECSTAT= 4
##$DIGMOD= 1
##$DIGTYP= 9
##$DL= (0..7)
0 120 120 120 120 120 120 120 
##$DP= (0..7)
$$ [...]
##$SUBNAM2= <"">
##$SUBNAM3= <"">
##$SUBNAM4= <"">
##$SUBNAM5= <"">
##$SUBNAM6= <"">
##$SUBNAM7= <"">
##$SUBNAM8= <"">
##$SUBNAM9= <"">
##$SW= 18.0517328524113
##$SWIBOX= (0..15)
0 0 2 0 0 0 0 0 0 0 0 0 0 0 0 0 
##$SW_h= 3612.71676300578
##$TD= 16384
##$TD0= 1
##$TE= 0
##$TE2= 300
##$TE3= 300
##$TEG= 300
##$TL= (0..7)
0 120 120 120 120 120 120 120 
##$TP= (0..7)
150 150 150 150 150 150 150 150 
##$TP07= 0
##$TPNAME0= <>
##$TPNAME1= <>
##$TPNAME2= <>
##$TPNAME3= <>
##$TPNAME4= <>
##$TPNAME5= <>
##$TPNAME6= <>
##$TPNAME7= <>
##$TPOAL= (0..7)
0.5 0.5 0.5 0.5 0.5 0.5 0.5 0.5 
##$TPOFFS= (0..7)
0 0 0 0 0 0 0 0 
##$TUNHIN= 0
##$TUNHOUT= 0
##$TUNXOUT= 0
##$USERA1= <user>
##$USERA2= <user>
##$USERA3= <user>
##$USERA4= <user>
##$USERA5= <user>
##$V9= 5
##$VALIST= <valist>
##$VCLIST= <CCCCCCCCCCCCCCC>
##$VD= 0
##$VDLIST= <DDDDDDDDDDDDDDD>
##$VPLIST= <PPPPPPPPPPPPPPP>
##$VTLIST= <TTTTTTTTTTTTTTT>
##$WBST= 1024
##$WBSW= 4
##$XGAIN= (0..3)
0 0 0 0 
##$XL= 0
##$YL= 0
##$YMAX_a= 35770
##$YMIN_a= -57350
##$ZGOPTNS= <>
##$ZL1= 120
##$ZL2= 120
##$ZL3= 120
##$ZL4= 120
##$ABSF1= 0
##$ABSF2= 0
##$ABSG= 0
##$ABSL= 0
##$ALPHA= 0
##$AQORDER= 0
##$ASSFAC= 0
##$ASSFACI= 0
##$ASSFACX= 0
##$ASSWID= 0
##$AUNMP= <proc_1d>
##$AZFE= 0.1
##$AZFW= 0.1
##$BCFW= 0
##$BC_mod= 2
##$BYTORDP= 0
##$COROFFS= 0
##$CY= -3
##$DATMOD= 1
##$DC= 0
##$DFILT= <>
##$DTYPP= 0
##$F1P= 0
##$F2P= 0
##$FCOR= 1
##$FTSIZE= 16384
##$FT_mod= 6
##$GAMMA= 0
##$GB= 0
##$INTBC= 1
##$INTSCL= 3.241238e-09
##$ISEN= 128
##$LB= 0.25
##$LEV0= 0
##$LPBIN= 0
##$MAXI= 10000
##$MC2= 0
##$MEAN= 0
##$ME_mod= 0
##$MI= 1.114404
##$NCOEF= 0
##$NC_proc= -10
##$NLEV= 6
##$NOISF1= 3.799351
##$NOISF2= 2.8
##$NSP= 0
##$NTH_PI= 0
##$NZP= 0
##$OFFSET= 15.48687
##$PC= 1
##$PHC0= -6900.219
##$PHC1= 13.42196
##$PH_mod= 1
##$PKNL= yes
##$PPARMOD= 0
##$PSCAL= 0
##$PSIGN= 0
##$REVERSE= no
##$SF= 200.130006971941
##$SI= 16384
##$SIGF1= 3
##$SIGF2= 2
##$SINO= 0.751879
##$SIOLD= 32768
##$SREGLST= <19F.Aceton>
##$SSB= 0
##$STSI= 16384
##$STSR= 0
##$SW_p= 3612.71676300578
##$SYMM= 0
##$S_DEV= 0
##$TDeff= 16384
##$TDoff= 0
##$TI= <>
##$TILT= no
##$TM1= 0
##$TM2= 0
##$TOPLEV= 0
##$USERP1= <user>
##$USERP2= <user>
##$USERP3= <user>
##$USERP4= <user>
##$USERP5= <user>
##$WDW= 1
##$XDIM= 16384
##$YMAX_p= 435047119
##$YMIN_p= -1921054
$$ End of Bruker specific parameters
$$ ---------------------------------
##NTUPLES= NMR SPECTRUM
##VAR_NAME=  FREQUENCY,     SPECTRUM/REAL,   SPECTRUM/IMAG
##SYMBOL=    X,             R,               I
##VAR_TYPE=  INDEPENDENT,   DEPENDENT,       DEPENDENT
##VAR_FORM=  AFFN,          ASDF,            ASDF
##VAR_DIM=   16384,         16384,           16384
##UNITS=     HZ,            ARBITRARY UNITS, ARBITRARY UNITS
##FACTOR=    0.220516191357247, 1,           1
##FIRST=     3099.38736345145, 0,            0
##LAST=      -513.329399554333, 0,           0
##MIN=       -513.329399554333, -1921054,    0
##MAX=       3099.38736345145, 435047119,    0
$$ Real data points
##PAGE= N=1
##DATA TABLE= (X++(R..R)), XYDATA
$$ [...]
$$ plain form
5074 40276623 39891249 39731026 38276208 38009067 37774815 36916331 36465711 36199279 36044802
5065 36044802 35770073 34744611 34076256 33896914 33479318 33289395 32802168 32985550 32653642
5056 32653642 32406859 32720314 32629993 32494493 32527107 32018471 31229859 31835713 32567384 32339293
5046 32339293 32297503 32305650 32287171 32218187 32485285 32427812 32942054 33296437 32908262 32661006
5036 32661006 32809572 32918072 33413548 33850753 34029081 33941938 34101083 34039659 33644041 33612209
5026 33612209 33881854 34016637 34023066 33955367 33546406 33952608 34264241 34106711 33435775 33363922
5016 33363922 33189346 33150349 33655771 33772274 33193665 33311772 33809677 33766206 34005648 33561091
5006 33561091 33713046 33681993 33341344 33946606 34090583 34770959 34811230 34558561 34669672 35318793
$$ packed form
5074D0276623l85374j60223j454818k67141k34252q58484m50620k66432j54477
5065C6044802k74729j025462o68355j79342m17596j89923m87227J83382l31908
5056C2653642k46783L13455r0321j35500L2614n08636p88612O05854P31671k28091
5046C2339293m1790Q147j8479o8984K67098n7473N14242L54383l88175k47256
5036C2661006J48566J08500M95476M37205J78328q7143J59145o1424l95618l1832
5026C3612209K69645J34783O429o7699m08961M06202L11633j57530o70936p1853
5016C3363922j74576l8997N05422J16503n78609J18107M97905m3471K39442m44557
5006C3561091J51955l1053l40649O05262J43977O80376M0271k52669J11111O49121
$$ plain form
4996 35318793 36065445 36185511 37356119 38154692 38546722 39032710 39448676 40226230 39896798
4987 39896798 39451093 39641187 40299979 40266987 40154355 39960018 40046567 40017298 40355349 40883542
4977 40883542 40868460 41231199 41651092 42071099 42095441 42628487 42871946 43195462 43514756 43865929
4967 43865929 43846089 45097052 45799112 45958270 46445867 46737186 46555867 47092105 48130493
4958 48130493 48183714 48550499 49026203 49642975 49501388 48630941 48313913 48404645 47648951 47164013
4948 47164013 47212007 46941849 46442542 46381340 46747477 46634067 46117643 46073863 46781939 46697293
4938 46697293 46110021 46409387 46970361 47188915 47212412 47419647 47560336 47376292 48046482 48541079
4928 48541079 48598331 48831524 49599793 49738199 50215247 50139562 50118409 50925944 51585097 51916222
$$ packed form
4996C5318793P46652J20066J170608P98573L92030M85988M15966P77554l29432
4987C9896798m45705J90094O58792l2992j12632j94337Q6549k9269L38051N28193
4977D0883542j5082L62739M19893M20007K4342N33046K43459L23516L19294L51173
4967D3865929j9840J250963P02060J59158M87597K91319j81319N36238J038388
4958D8130493N3221L66785M75704O16772j41587q70447l17028R0732p55694m84938
4948D7164013M7994k70158m99307o1202L66137j13410n16424m3780P08076q4646
4938D6697293n87272K99366N60974K18554K3497K07235J40689j84044O70190M94597
4928D8541079N7252K33193P68269J38406M77048p5685k1153Q07535O59153L31125
$$ plain form
4918 51916222 52180668 53745453 54145726 54117008 55167139 55724536 56111979 56197035 56498261
4909 56498261 57168800 57638883 58390519 58186488 57786723 58339996 58521586 58097539 58365642
4900 58365642 58054860 58377891 58484665 58923927 59451500 60154611 60561916 61672855 62209756
4891 62209756 63170100 64411683 65485643 66729023 67992545 68957604 69680960 69910709 70853245
4882 70853245 71309769 71002994 70711801 69432157 68522825 67582045 67055977 66467713 65211279
4873 65211279 63463451 63058667 63056415 62487214 61894110 61103764 61318349 60981085 60671029 61128595
4863 61128595 60757219 61238458 61913696 62533873 63339843 63741685 64064020 64722239 65824739
4854 65824739 66304213 66373095 67291397 66592752 65646559 65421399 65121793 64109967 63775605
$$ packed form
4918E1916222K64446J564785M00273k8718J050131N57397L87443Q5056L01226
4909E6498261O70539M70083P51636k04031l99765N53273J81590m24047K68103
4900E8365642l10782L23031J06774M39262N27573P03111M07305J110939N36901
4891F2209756R60344J241583J073960J243380J263522R65059P23356K29749R42536
4882G0853245M56524l06775k91193j279644r09332r40780n26068n88264j256434
4873F5211279j747828m04784k252n69201n93104p90346K14585l37264l10056M57566
4863F1128595l71376M81239O75238O20177Q05970M01842L22335O58219J102500
4854F5824739M79474O8882R18302o98645r46193k25160k99606j011826l34362
$$ plain form
4845 63775605 63910089 64132067 64186399 63980663 64472446 65209867 66471125 67557293 69753467
4836 69753467 73117182 75923934 81247080 89125605 100290667 113636292 122286022 123122059
4828 123122059 122024949 118092247 110570355 101026836 91315111 82478887 75032235 70060340
4820 70060340 65673068 62355326 60508656 58135612 56711374 55039516 53249703 52486913
4812 52486913 51143994 49764754 49254942 48559964 47730165 47408000 47110891 46710637 45971329
4803 45971329 45825359 45711052 45344801 44510792 44027552 43853577 44038861 43448872 42921104
4794 42921104 43131818 43412957 43134095 43175065 43059534 42847326 42537794 42987619 43972128 43576540
4784 43576540 43877282 44370628 45412851 46341639 47321993 49236860 50305820 51706751 53652754
$$ packed form
4845F3775605J34484K21978N4332k05736M91783P37421J261258J086168K196174
4836F9753467L363715K806752N323146P878525J1165062J3345625Q649730Q36037
4828A23122059j097110l932702p521892r543519r711725q836224p446652m971895
4820G0060340m387272l317742j846670k373044j424238j671858j789813p62790
4812E2486913j342919j379240n09812o94978q29799l22165k97109m00254p39308
4803D5971329j45970j14307l66251q34009m83240j73975J85284n89989n27768
4794D2921104K10714K81139k78862M0970j15531k12208l09532M49825R84509l95588
4784D3576540L00742M93346J042223R28788R80354J914867J068960J400931J946003
$$ plain form
4775 53652754 55030023 56647897 58913305 61411440 63971365 65565114 67748341 69808139
4767 69808139 71628629 74361590 76244826 77592426 78777521 79946849 80894976 82271876
4759 82271876 83255219 84319908 85982735 86549187 87655833 88938054 90209205 91858865
4751 91858865 93729999 96574105 99299505 101581171 104347393 107762178 111364827 113380136
4743 113380136 116276740 118670741 121104804 122934208 124090715 124964363 124472377 123906019
4735 123906019 122778990 121093940 119235295 116653575 113617854 110910614 107652006 104210311
4727 104210311 101087662 98834805 96482114 93402923 91233746 89460988 87558252 85867910
4719 85867910 84491695 83428932 81853398 79876765 78014377 76207324 74373739 72018183
$$ packed form
4775E3652754J377269J617874K265408K498135K559925J593749K183227K059798
4767F9808139J820490K732961J883236J347600J185095J169328R48127J376900
4759H2271876R83343J064689J662827N66452J106646J282221J271151J649660
4751I1858865J871134K844106K725400K281666K766222L414785L602649K015309
4743A13380136K896604K394001K434063J829404J156507Q73648m91986n66358
4735A23906019j127029j685050j858645k581720l035721k707240l258608l441695
4727A04210311l122649k252857k352691l079191k169177j772758j902736j690342
4719H5867910j376215j062763j575534j976633j862388j807053j833585k355556
$$ plain form
4711 72018183 70028102 67640633 65149020 62635418 59525006 56275639 53491278 50107490
4703 50107490 47238338 45087427 42729496 40404173 37938092 35590853 34233542 32203941
4695 32203941 30085325 28628098 26989282 26255313 25116581 24057382 22443571 21297350
4687 21297350 21202002 20183278 20161978 19411753 18541175 18530070 17166668 16724320 15909000 15217723
4677 15217723 15513198 15175195 14744094 14359938 13863896 13789972 13459169 13209963 12659479 12445033
4667 12445033 12313956 12153436 11614980 11451287 11715987 11259117 10753928 10650425 10808079
4658 10808079 10626460 10405614 10013394 9693731 9868525 10106031 9870447 9615740 10000828
4649 10000828 9918459 9726707 9705610 9459281 9286213 9782565 9975681 9424316 9670037 9837323
$$ packed form
4711G2018183j990081k387469k491613k513602l110412l249367k784361l383788
4703E0107490k869152k150911k357931k325323k466081k347239j357311k029601
4695C2203941k118616j457227j638816p33969j138732j059199j613811j146221
4687B1297350r5348j018724k1300p50225q70578j1105j363402m42348q15320o91277
4677A5217723K95475l38003m31101l84156m96042p3924l30803k49206n50484k14446
4667A2445033j31077j60520n38456j63693K64700m56870n05189j03503J57654
4658A0808079j81619k20846l92220l19663J74794K37506k35584k54707L85088
4649A0000828q2369j91752k1097k46329j73068M96352J93116n51365K45721J67286
$$ plain form
4639 9837323 10273835 10544022 10856327 10778011 10950201 11741494 11998093 12253824 12862829 14103978
4629 14103978 15820000 18278318 21098764 25061443 27552394 28402019 28017295 26958845
4621 26958845 25658895 23376963 20531891 18641055 16931056 16696712 16580007 16174414 16494934
4612 16494934 17606288 19705469 21211974 22937827 24814395 26006775 28306166 30170182
4604 30170182 32012537 33672745 35899717 38747490 42193623 44743160 46401846 47988209
4596 47988209 48509211 49515508 50969007 52408313 54513345 56315580 56699457 56965507 56250976
4587 56250976 54396627 52366148 50134049 48882754 47926331 46301393 44595332 42495522
4579 42495522 39929748 37012770 34736602 32619040 30651888 28803426 26526533 24463867
$$ packed form
4639I837323M36512K70187L12305p8316J72190P91293K56599K55731O09005J241149
4629A4103978J716022K458318K820446L962679K490951Q49625l84724j058450
4621B6958845j299950k281932k845072j890836j709999k34344j16705m05593L20520
4612A6494934J111354K099181J506505J725853J876568J192380K299391J864016
4604C0170182J842355J660208K226972K847773L446133K549537J658686J586363
4596D7988209N21002J006297J453499J439306K105032J802235L83877K66050p14531
4587E6250976j854349k030479k232099j251295r56423j624938j706061k099810
4579D2495522k565774k916978k276168k117562j967152j848462k276893k062666
$$ plain form
4571 24463867 22902691 20884688 18449459 16202382 14630612 13357395 12685069 11604030
4563 11604030 10480035 9079757 8686693 8449403 7714752 7305642 7121394 7101647 7567641
4554 7567641 7774983 6828842 6910381 6869526 6664477 7179039 6437151 5990119 5790812 5768142
4544 5768142 5988604 6280824 5851400 5679054 5401372 5414179 5481003 5024274 4871597 4705938
4534 4705938 4816155 4976609 4685189 4684666 4500606 4227803 3893568 4034433 4386559 4554682
4524 4554682 4251987 3968862 3565861 3930209 4029249 3930444 4104067 3893797 4422821 4547533
4514 4547533 4618750 4320907 3946263 3539848 3386110 3413769 3493335 3079654 3150636 3627098
4504 3627098 3559674 3394095 2756516 3249214 3119568 2771357 2901900 3253563 3520486 3707918
$$ packed form
4571B4463867j561176k018003k435229k247077j571770j273217o72326j081039
4563A1604030j123995j400278l93064k37290p34651m09110j84248j9747M65994
4554G567641K07342r46141Q1539m0855k05049N14562p41888m47032j99307k2670
4544E768142K20462K92220m29424j72346k77682J2807O6824m56729j52677j65659
4534D705938J10217J60454k91420n23j84060k72803l34235J40865L52126J68123
4524D554682l02695k83125m03001L64348R9040r8805J73623k10270N29024J24712
4514D547533P1217k97843l74644m06415j53738K7659P9566m13681P0982M76462
4504C627098o7424j65579o37579M92698j29646l48211J30543L51663K66923J87432
$$ plain form
4494 3707918 3702731 3466915 3019609 3119156 3238265 2985826 2602917 2620579 2778425 3265216
4484 3265216 2771191 2537758 2725001 2810034 3133910 3506723 3435283 3499633 3342041 2916608
4474 2916608 3278048 3237239 3339415 3351623 3274546 2969074 2737340 2697621 3057761 3262863
4464 3262863 3180993 2811455 2775860 3364305 3910973 3110995 3106376 3298108 2679247 2626277
4454 2626277 3125631 3156824 2840738 2666829 3248461 3213349 3229687 3146808 3365157 2710456
4444 2710456 2585002 2846945 2953139 3090780 2900100 2686210 2689842 2319466 3033016 3088849
4434 3088849 3132608 2769712 2802946 3103386 2872273 2686524 2691901 2976288 3273417 3051907
4424 3051907 2667475 2724599 2948326 3340982 3385363 3622103 3226769 3279700 2754332 2711317
$$ packed form
4494C707918n187k35816m47306R9547J19109k52439l82909J7662J57846M86791
4484C265216m94025k33433J87243Q5033L23876L72813p1440O4350j57592m25433
4474B916608L61440m0809J02176J2208p7077l05472k31734l9719L60140K05102
4464C262863q1870l69538l5595N88445N46668p99978m619J91732o18861n2970
4454B626277M99354L1193l16086j73909N81632l5112J6338q2879K18349o54701
4444B710456j25454K61943J06194J37641j90680k13890L632l70376P13550N5833
4434C088849M3759l62896L3234L00440k31113j85749N377K84387K97129k21510
4424C051907l84432N7124K23727L92656M4381K36740l95334N2931n25368m3015
$$ plain form
4414 2711317 2706322 2003345 2092799 2939844 2585267 2540082 3317493 3382333 3490653 3294296
4404 3294296 3466991 3200104 2854869 2842295 3010044 2925315 2628308 2687859 3425532 3173377
4394 3173377 2921871 3331122 3716462 3686002 3742251 3452446 3170964 3306087 3398270 2898333
4384 2898333 2608057 3466398 3407756 2936655 3261589 3122144 3196204 3261419 3624205 3716721
4374 3716721 3673649 3783930 3623669 3440192 3179097 3755390 4252390 3961381 3761327 4215605
4364 4215605 3773694 3881750 3405911 3320472 3765499 3842959 3721796 4369019 4414791 4044249
4354 4044249 4232823 3997477 3943285 4205461 4018728 4587936 4799513 5120678 5497535 4970937
4344 4970937 4998155 5613752 5318528 5899011 5407689 5024613 5486676 6084350 5711745 5485610
$$ packed form
4414B711317m995p02977Q9454Q47045l54577m5185P77411O4840J08320j96357
4404C294296J72695k66887l45235j2574J67749q4729k97007N9551P37673k52155
4394C173377k51506M09251L85340l0460N6249k89805k81482J35123R2183m99937
4384B898333k90276Q58341n8642m71101L24934j39445P4060O5215L62786R2516
4374C716721m3072J10281j60261j83477k61095N76293M97000k91009k00054M54278
4364D215605m41911J08056m75839q5439M45027P7460j21163O47223M5772l70542
4354D044249J88574k35346n4192K62176j86733N69208K11577L21165L76857n26598
4344D970937K7218O15597k95224N80483m91322l83076M62063N97674l72605k26135
$$ plain form
4334 5485610 5293467 5439366 5172277 5143375 5632141 6148848 6561438 6228485 6247264 5985567
4324 5985567 5769388 6534602 7224099 7449940 7596292 7630582 7433720 7301627 7383144 7820948
4314 7820948 8206128 8243103 8551690 9013188 9574968 10550000 11110055 10973103 10990161 11228842
4304 11228842 11595598 11960656 12318609 12033974 12233956 13238424 13542858 13475826 13718792
4295 13718792 14570748 15111534 15097705 15184467 15094184 16350375 17217466 17284696 16878721 17527480
4285 17527480 18570753 18978076 19525797 19313075 19190126 19662631 19448572 19972019 20308299
4276 20308299 19964859 20301457 20837108 20940922 21145818 21303952 21372883 21490068 21431863 21072801
4266 21072801 21611276 21833333 22053480 22358956 22925395 23460060 23405230 23268242 23773745 24445667
$$ packed form
4334E485610j92143J45899k67089k8902M88766N16707M12590l32953J8779k61697
4324E985567k16179P65214O89497K25841J46352L4290j96862j32093Q1517M37804
4314G820948L85180L6975L08587M61498N61780R75032N60055j36952J7058K38681
4304A1228842L66756L65058L57953k84635J99982J004468L04434o7032K42966
4295A3718792Q51956N40786j3829Q6762r0283J256191Q67091O7230m05975O48759
4285A7527480J043273M07323N47721k12722j22949M72505k14059N23447L36280
4276B0308299l43440L36598N35651J03814K04896J58134O8931J17185n8205l59062
4266B1072801N38475K22057K20147L05476N66439N34665n4830j36988N05503O71922
$$ plain form
4256 24445667 24570148 24650586 25213468 25449446 25631711 26104052 26767181 27979620 28552635
4247 28552635 28727963 29917597 30695520 31682220 32065287 32465876 33901723 35199260 36168514
4238 36168514 37627995 39743483 42381607 46504110 52827737 61895857 74557742 84912652
4230 84912652 88252285 88006138 85786551 81289444 74202548 65618343 57755669 52182249
4222 52182249 48009633 43833437 41768589 41286102 40168204 39127052 38276795 37662229 37261353
4213 37261353 37226621 36620381 36064812 35630905 35530852 34943444 35240657 35331910 34210464 34104158
4203 34104158 34158533 33748670 33625004 33455825 33407988 33282733 32727709 31955396 31269033 30957645
4193 30957645 31117853 31419614 31329994 30879213 30422568 30182576 29949154 29329030 29420764 28991343
$$ packed form
4256B4445667J24481Q0438N62882K35978J82265M72341O63129J212439N73015
4247B8552635J75328J189634P77923R86700L83067M00589J435847J297537R69254
4238C6168514J459481K115488K638124M122503O323627R068120J2661885J0354910
4230H4912652L339633k46147k219587m497107p086896q584205p862674n573420
4222E2182249m172616m176196k064848m82487j117898j041152q50257o14566m00876
4213C7261353l4732o06240n55569m33907j00053n87408K97213R1253j121446j06306
4203C4104158N4375m09863j23666j69179m7837j25255n55024p72313o86363l11388
4193C0957645J60208L01761q9620m50781m56645k39992k33422o20124R1734m29421
$$ plain form
4183 28991343 28482220 28186403 28356077 28172217 28258236 27910045 27736524 28460722 28409087 28176015
4173 28176015 27944437 28397953 28386728 28527609 28186899 28449331 27713189 27431321 28117945 28327870
4163 28327870 28161151 27774545 27826726 27988909 28321075 27607803 27521860 28000427 27968560 27746787
4153 27746787 27073016 27184274 27285997 27442703 27192443 26581195 26231297 26776998 27197398
4144 27197398 27022257 26630158 26444966 26675390 26777094 26920971 26780542 26938737 27562072
4135 27562072 28571570 28034505 27665756 28216856 28480516 29004294 30013914 30295956 30765090
4126 30765090 31415393 31881465 31982936 32282965 33384231 34014454 34356871 35212965 35912164
4117 35912164 36727507 37433122 38905718 40228311 40989187 41406138 41801787 43870405 44666333
$$ packed form
4183B8991343n09123k95817J69674j83860Q6019l48191j73521P24198n1635k33072
4173B8176015k31578M53516j1225J40881l40710K62432p36142k81868O86624K09925
4163B8327870j66719l86606N2181J62183L32166p13272q5943M78567l1867k21773
4153B7746787o73771J11258J01723J56706k50260o11248l49898N45701M20400
4144B7197398j75141l92099j85192K30424J01704J43877j40429J58195O23335
4135B7562072J009498n37065l68749N51100K63660N23778J009620K82042M69134
4126C0765090O50303M66072J01471L00029J101266O30223L42417Q56094O99199
4117C5912164Q15343P05615J472596J322593P60876M16951L95649K068618P95928
$$ plain form
4108 44666333 45198161 46562183 47839811 48195660 48896211 50056308 50890410 51766387 53210866
4099 53210866 54163181 55918528 57181338 58195369 59328926 60839792 62723454 63991081
4091 63991081 65865961 67493131 69270049 70675424 71814304 72515925 74076285 75791764
4083 75791764 76381619 76714696 77648269 78317864 78679685 78938952 79499578 80075098 80467603
4074 80467603 80521367 82145880 82977814 83151779 84304486 85730933 87288201 89082066 90527918
4065 90527918 92406498 94207057 96751037 100806304 104835867 108695666 111005148 112954153
4057 112954153 114324523 115680722 115366558 114005789 113623468 113091649 112897879 112819286 113118979
4048 113118979 112601470 112621002 113267170 113100808 112466745 112420824 112705684 113387227 113546906 114231576
$$ packed form
4108D4666333N31828J364022J277628L55849P00551J160097Q34102Q75977J444479
4099E3210866R52315J755347J262810J014031J133557J510866J883662J267627
4091F3991081J874880J627170J776918J405375J138880P01621J560360J715479
4083G5791764N89855L33077R33573O69595L61821K59267N60626N75520L92505
4074H0467603N3764J624513Q31934J73965J152707J426447J557268J793865J445852
4065I0527918J878580J800559K543980M055267M029563L859799K309482J949005
4057A12954153J370370J356199l14164j360769l82321n31819j93770p8593K99693
4048A13118979n17509J9532O46168j66362o34063m5921K84860O81543J59679O84670
$$ plain form
4038 114231576 115553123 116176833 116445966 117114035 117955098 118160477 118111606 118354286 118463175
4029 118463175 118134385 117848039 117181124 117025098 116526290 115766175 115279046 115295823 114258038
4020 114258038 113640377 113556857 112968281 112238226 111833891 112043708 112283320 112019474 111734972
4011 111734972 111681865 111297482 109933329 108993358 108239000 107472553 105912548 104394379 102608896
4002 102608896 101126654 99010471 97028865 95609007 94038342 92534003 91289247 90017375
3994 90017375 88126799 86893453 86265639 85725929 85366702 85244848 84871970 84006886 83051186
3985 83051186 83430155 83610259 83248649 82855615 83247176 82566838 82373633 82339056 81788453 81961769
3975 81961769 81437147 80454443 79903852 79586396 79307361 78988423 78996833 79335056 79826267 79829754
$$ packed form
4038A14231576J321547O23710K69133O68069Q41063K05379m8871K42680J08889
4029A18463175l28790k86346o66915j56026m98808p60115m87129J6777j037785
4020A14258038o17661q3520n88576p30055m04335K09817K39612k63846k84502
4011A11734972n3107l84383j364153r39971p54358p66447j560005j518169j785483
4002A02608896j482242k116183j981606j419858j570665j504339j244756j271872
3994I0017375j890576j233346o27814n39710l59227j21854l72878q65084r55700
3985H3051186L78969J80104l61610l93034L91561o80338j93205l4577n50603J73316
3975H1961769n24622r82704n50591l17456k79035l18938Q410L38223M91211L487
$$ plain form
3965 79829754 79888353 79718531 78934661 79353082 79003780 78996400 79132299 80068659 81738102 84355153
3955 84355153 86952546 89164545 91713180 93402353 94718147 96102315 95906043 94982518
3947 94982518 95417438 95916544 95781545 95101424 94429736 93998984 92600925 90911521 90293310
3938 90293310 89675575 88582441 87504992 87088079 87074461 87392617 87896659 89327710 90394527
3929 90394527 91795249 93568607 94873180 96208942 97309704 98724931 99692036 99652525 98101850
3920 98101850 95560275 93682766 90812522 87255405 84751788 82683688 81950511 80843199
3912 80843199 79857752 79269056 78379234 77327288 76186299 75246303 72840621 71201539 69427762
3903 69427762 67185015 64764744 62690071 60724323 57913796 55988520 55037915 53608277
$$ packed form
3965G9829754N8599j69822p83870M18421l49302p380J35899R36360J669443K617051
3955H4355153K597393K211999K548635J689173J315794J384168j96272r23525
3947I4982518M34920M99106j34999o80121o71688m30752j398059j689404o18211
3938I0293310o17735j093134j077449m16913j3618L18156N04042J431051J066817
3929I0394527J400722J773358J304573J335762J100762J415227R67105l9511j550675
3920I8101850k541575j877509k870244l557117k503617k068100p33177j107312
3912H0843199r85447n88696q89822j051946j140989r39996k405682j639082j773777
3903F9427762k242747k420271k074673j965748k810527j925276r50605j429638
$$ plain form
3895 53608277 52394721 51100912 51124351 51356341 50739103 50801523 51111540 51494948 51782029
3886 51782029 52166027 52819720 53835213 54712612 55821637 56654828 58088224 59782504 61807318
3877 61807318 63859350 65671602 67012673 68681180 70785187 72490922 73316363 74001618
3869 74001618 74219137 73589720 72339328 71061135 69622039 67228401 65088272 63809400
3861 63809400 62100641 60795845 60033134 59553168 59243939 58567276 58681962 58731425 59492219
3852 59492219 58917594 59794720 59922402 59155636 58665706 57872982 57959292 57085001 56599571 56098503
3842 56098503 55608343 54693248 54740514 55494452 55546185 56018078 56962135 58146226 58680179 58852860
3832 58852860 59426797 60231657 60298459 59595581 58990987 58367575 57685858 57475721 57274031 56873616
$$ packed form
3895E3608277j213556j293809K3439K31990o17238O2420L10017L83408K87081
3886E1782029L83998O53693J015493Q77399J109025Q33191J433396J694280K024814
3877F1807318K052032J812252J341071J668507K104007J705735Q25441O85255
3869G4001618K17519o29417j250392j278193j439096k393638k140129j278872
3861F3809400j708759j304796p62711m79966l09229o76663J14686M9463P60794
3852E9492219n74625Q77126J27682p66766m89930p92724Q6310q74291m85430n01068
3842E6098503m90160r15095M7266P53938N1733M71893R44057J184091N33953J72681
3832E8852860N73937Q04860O6802p02878o04594o23412o81717k10137k01690m00415
$$ plain form
3822 56873616 56226071 55081716 54610903 54692644 55775448 56255852 56731954 57453734 57687218
3813 57687218 58645124 59977084 60128187 59540866 59858964 58589234 56382074 54362952 52794920
3804 52794920 51113225 48862195 47126549 45653707 43802857 42352192 40469168 39563201
3796 39563201 38532161 37601033 37243089 36646976 36437691 36074143 36012868 35589863 35539236 36031606
3786 36031606 35317881 35292928 35923530 35712464 35994407 36295163 36254670 36633535 37049432 37309004
3776 37309004 37417494 38175611 38740462 38968268 38717804 39470749 39371092 39167362 39207862 39139809
3766 39139809 39073984 38146014 36937109 36549102 36451625 36050547 35707187 34986873 34548454 33756727
3756 33756727 34215192 33629941 32761200 32416633 33130886 33051777 32819786 32351143 32628397 32301225
$$ packed form
3822E6873616o47545j144355m70813Q1741J082804M80404M76102P21780K33484
3813E7687218R57906J331960J51103n87321L18098j269730k207160k019122j568032
3804E2794920j681695k251030j735646j472842j850850j450665j883024r05967
3796C9563201j031040r31128l57944n96113k09285l63548o1275m23005n0627M92370
3786C6031606p13725k4953O30602k11066K81943L00756m0493L78865M15897K59572
3776C7309004J08490P58117N64851K27806k50464P52945r9657k03730M0500o8053
3766C9139809o5825r27970j208905l88007r7477m01078l43360p20314m38419p91727
3756C3756727M58465n85251q68741l44567P14253p9109k31991m68643K77254l27172
$$ plain form
3746 32301225 32126475 32431923 31911600 32047462 32145828 32313764 32199949 32452257 32586817 32412015
3736 32412015 31931929 31741438 31872079 31666366 32364344 32002654 31571906 31625796 32054935 32474826
3726 32474826 32776688 33557366 33978507 33832487 34384357 34028364 34236508 33833204 33948372
3717 33948372 33519539 33217405 33127374 33317016 33416851 33053007 32682575 32538031 32605362 32010743
3707 32010743 31865045 31483944 31168871 30932025 30631364 30896615 31200839 30559298 30261594
3698 30261594 30199622 29368195 28405754 28215053 27697957 27214949 26515948 25892782 25522432 25536253
3688 25536253 25231150 25219008 24941021 24102725 23567785 23345151 22613918 21767466 21186554 21041277
3678 21041277 20418375 19308533 18698387 18904722 17958149 16924233 16716093 16447963 16112097
$$ packed form
3746C2301225j74750L05448n20323J35862R8366J67936j13815K52308J34560j74802
3736C2412015m80086j90491J30641k05713O97978l61690m30748N3890M29139M19891
3726C2474826L01862P80678M21141j46020N51870l55993K08144m03304J15168
3717C3948372m28833l02134r0031J89642R9835l63844l70432j44544O7331n94619
3707C2010743j45698l81101l15073k36846l00661K65251L04224o41541k97704
3698C0261594o1972q31427r62441j90701n17096m83008o99001o23166l70350J3821
3688B5536253l05103j2142k77987q38296n34940k22634p31233q46452n80912j45277
3678B1041277o22902j109842o10146K06335r46573j033916k08140k68130l35866
$$ plain form
3669 16112097 15618454 15089480 15205259 15420789 15374617 15162197 14877453 14748068 14951865 15374155
3659 15374155 15392775 15313771 14815148 14567737 14807307 14374742 14411802 13815957 13225137 13063491
3649 13063491 12769068 12627678 12396629 11453828 11918619 11780554 11322820 10539611 10631605 10559805
3639 10559805 10357155 10095235 11027969 10517256 9887909 9516995 9578330 9860998 9729594 9418735
3629 9418735 9143791 9016343 8878826 9372110 9990863 10628483 10317083 10271196 10078605 9630447
3619 9630447 8867399 9185772 9480396 9498152 9277622 9143919 8780360 8656142 7718035 7857594
3609 7857594 7830273 7439270 7257875 7219685 7278118 7168590 6987416 7097011 6791061 6155242
3599 6155242 6241125 6830843 7156631 6883547 6781853 7045079 6584834 6851953 6966865 7316954
$$ packed form
3669A6112097m93643n28974J15779K15530m6172k12420k84744j29385K03797M22290
3659A5374155J8620p9004m98623k47411K39570m32565L7060n95845n90820j61646
3649A3063491k94423j41390k31049r42801M64791j38065m57734p83209R1994p1800
3639A0559805k02650k61920R32734n10713o29347l70914O1335K82668j31404l10859
3629I418735k74944j27448j37517M93284O18753O37620l11400m5887j92591m48158
3619I630447p63048L18373K94624J7756k20530j33703l63559j24218r38107J39559
3609G857594k7321l91003j81395l8190N8433j09528j81174J09595l05950o35819
3599F155242Q5883N89718L25788k73084j01694K63226m60245K67119J14912L50089
$$ plain form
3589 7316954 7264953 6911769 7522749 7627935 7634060 7605766 7128710 7271857 6991825 7040019
3579 7040019 7197293 7182704 7199715 7617738 7791250 7494807 7406829 7696923 7921107 7301127
3569 7301127 7569675 7811208 7628284 7781491 8244432 7949183 7329530 7081135 7377677 7324484
3559 7324484 7480594 7468080 7408098 7291380 7845225 7797521 7610605 7336017 6817696 6941003
3549 6941003 7049020 6826985 6303957 6041858 7069445 6743052 6365282 7285280 7444213
3540 7444213 7341840 6643013 6496074 7069137 7319866 7140540 7032466 6594175 6400462 6448336
3530 6448336 7359649 7637634 7482342 6785202 6818336 7389439 7195325 7332285 7298050 7103326
3520 7103326 6921643 6641961 6863404 7038823 7067175 7016934 7826452 7497479 7095382 7303099
$$ packed form
3589G316954n2001l53184O10980J05186O125k8294m77056J43147k80032M8194
3579G040019J57274j4589J7011M18023J73512k96443q7978K90094K24184o19980
3569G301127K68548K41533j82924J53207M62941k95249o19653k48395K96542n3193
3559G324484J56110j2514n9982j16718N53845m7704j86916k74588n18321J23307
3549F941003J08017k22035n23028k62099J027587l26393l77770R19998J58933
3540G444213j02373o98827j46939N73063K50729j79326j08074m38291j93713M7874
3530F448336R11313K77985j55292o97140L3134N71103j94114J36960l4235j94724
3520G103326j81683k79682K21443J75419K8352n0241Q09518l28973m02097K07717
$$ plain form
3510 7303099 7608870 7613445 7846580 8533676 9034609 9203444 9126446 8522867 9279819 9125032
3500 9125032 9379163 9566473 9788949 9671787 10038698 10605933 10553342 10463153 10060686 11290466
3490 11290466 10766544 10508274 10802290 10767567 10520585 10517985 11020773 11476681 11165777 11083095
3480 11083095 11726227 11489584 11278222 11568948 11949866 12786510 12796878 13181109 13761942 14470300
3470 14470300 14567041 14426003 15277489 16239991 16412209 17330600 17806616 18179660 18215234 18256726
3460 18256726 18534677 18423998 18924676 19573350 19376904 19151411 19551583 19148276 18397474
3451 18397474 18381245 18684297 19215037 18913377 18431981 18474858 18733496 18697700 18673734 19152531
3441 19152531 20243050 20320405 20981778 22006544 22473953 23210010 23681057 24843395 26575221
$$ packed form
3510G303099L05771M575K33135O87096N00933J68835p6998o03579P56952j54787
3500I125032K54131J87310K22476j17162L66911N67235n2591r0189m02467J229780
3490A1290466n23922k58270K94016l4723k46982k600N02788M55908l10904q2682
3480A1083095O43132k36643k11362K90726L80918Q36644J0368L84231N80833P08358
3470A4470300R6741j41038Q51486R62502J72218R18391M76016L73044L5574M1492
3460A8256726K77951j10679N00678O48674j96446k25493M00172m03307p50802
3451A8397474j6229L03052N30740l01660m81396M2877K58638l5796k3966M78797
3441A9152531J090519P7355O61373J024766M67409P36057M71047J162338J731826
$$ plain form
3432 26575221 28115368 29056461 29874666 31044399 33050302 34809148 35966640 36650061 37475241
3423 37475241 38632915 39442410 40082324 40143342 40181990 40556148 41300950 41626614 41690325 41898427
3413 41898427 41412916 40889230 41154884 41022283 40380368 39574911 39240015 38552494 37911755
3404 37911755 38079022 38022067 37607015 37959407 38308934 39519216 39538489 39920578 41183284
3395 41183284 42949219 45031099 45899945 47869541 50173608 52818953 55899469 59915855
3387 59915855 64218720 68581014 72211437 75454501 78625841 80869705 83145603 85039072
3379 85039072 85946014 86826252 87266081 87437136 86512922 85560364 84031565 82774007 81093288
3370 81093288 78999816 77069112 75848694 74307539 72322764 71950360 71817965 71731816 72015584
$$ packed form
3432B6575221J540147R41093Q18205J169733K005903J758846J157492O83421Q25180
3423C7475241J157674Q09495O39914O1018L8648L74158P44802L25664O3711K08102
3413D1898427m85511n23686K65654j32601o41915q05457l34896o87521o40739
3404C7911755J67267n6955m15052L52392L49527J210282J9273L82089J262706
3395D1183284J765935K081880Q68846J969596K304067K645345L080516M016386
3387E9915855M302865M362294L630423L243064L171340K243864K275898J893469
3379H5039072R06942Q80238M39829J71055r24214r52558j528799j257558j680719
3370H1093288k093472j930704j220418j541155j984775l72404j32395q6149K83768
$$ plain form
3361 72015584 72617605 73381737 74215355 75707833 78076333 80806295 82443962 83208773 84147453
3352 84147453 83938410 82619461 81486335 80719683 79228628 78271911 77692395 78273513 78362615
3343 78362615 78676077 79715029 79775529 80057252 80147276 81145631 82629493 82920563 83692747
3334 83692747 84196572 84944941 85894401 86462185 86947378 87643154 88775105 90733161 92801629
3325 92801629 95159018 98569168 101974292 105384347 109236355 113904544 118887593 125614289
3317 125614289 133513051 143703855 155901843 169999250 186180441 204688950 223099298
3310 223099298 240430780 254169301 262545607 264177764 259468953 249863991 236341933 220649746
3302 220649746 204282442 188749928 176109767 166079753 157901479 153317807 151242587
$$ packed form
3361G2015584O02021P64132Q33618J492478K368500K729962J637667P64811R38680
3352H4147453k09043j318949j133126p66652j491055r56717n79516N81118Q9102
3343G8362615L13462J038952O0500K81723R0024R98355J483862K91070P72184
3334H3692747N03825P48369R49460N67784M85193O95776J131951J958056K068468
3325I2801629K357389L410150L405124L410055L852008M668189M983049O726696
3317A25614289P898762J0190804J2197988J4097407J6181191J8508509J8410348
3310B23099298J7331482J3738521Q376306J632157m708811r604962j3522058j5692187
3302B20649746j6367304j5532514j2640161j0030014q178274m583672k075220
$$ plain form
3295 151242587 152177000 155617988 162020291 171572124 184752176 200912289 218773919 236392445
3287 236392445 250996216 260545830 262600070 257831261 246085729 229529517 210349489
3280 210349489 190843786 170986261 152385755 135981865 122107971 110520780 100866366
3273 100866366 92650301 85721726 80121024 75696911 71179279 67896728 65197458 62541397
3265 62541397 60610860 59196923 57839025 57649244 57428985 56433263 55772794 56090199 56459372
3256 56459372 56033927 55187958 54829280 54532690 52955934 51974734 51751896 51268336 50982309
3247 50982309 51247435 50927913 51723580 51961346 52507949 53231645 54240062 55006227 56123315
3238 56123315 57452778 59533134 61318993 63184088 65867510 68627913 72579893 76962843
$$ packed form
3295A51242587R34413L440988O402303R551833J3180052J6160113J7861630J7618526
3287B36392445J4603771R549614K054240m768809j1745532j6556212j9180028
3280B10349489j9505703j9857525j8600506j6403890j3873894j1587191r654414
3273A00866366q216065o928575n600702m424113m517632l282551k699270k656061
3265F2541397j930537j413937j357898j89781k20259r95722o60469L17405L69173
3256E6459372m25445q45969l58678k96590j576756r81200k22838m83560k86027
3247E0982309K65126l19522P95667K37766N46603P23696J008417P66165J117088
3238E6123315J329463K080356J785859J865095K683422K760403L951980M382950
$$ plain form
3230 76962843 81800448 87701788 94322023 102122175 111173542 122292041 134943721 150616530
3222 150616530 169093047 190076538 213543644 238463528 262612614 284786995 303636413
3215 303636413 317519722 326860544 333767307 338375745 341775489 343161655 343897638 341485483
3207 341485483 334911165 323745888 307316393 286737494 262708067 237039356 211714387
3200 211714387 187275967 164666009 145208943 127750162 113119072 100712504 89980979
3193 89980979 82247674 75202486 68789859 63792380 59921124 56448439 52911429 50538519
3185 50538519 48467047 46252007 44245201 42597473 41174086 39927003 38628973 37468151
3177 37468151 37008546 36292747 34550659 33656176 32757888 32351800 31510470 31132987 30759092
$$ packed form
3230G6962843M837605N901340O620235P800152R051367J1118499J2651680J5672809
3222A50616530J8476517K0983491K3467106K4919884K4149086K2174381J8849418
3215C03636413J3883309R340822O906763M608438L399744J386166P35983k412155
3207C41485483o574318j1165277j6429495k0578899k4029427k5668711k5324969
3200B11714387k4438420k2609958j9457066j7458781j4631090j2406568j0731525
3193H9980979p733305p045188o412627m997479l871256l472685l537010k372910
3185E0538519k071472k215040k006806j647728j423387j247083j298030j160822
3177C7468151m59605p15799j742088q94483q98288m06088q41330l77483l73895
$$ plain form
3168 30759092 30103503 29275891 28487069 28330869 28131501 28190933 27853667 27157051 27133265 27018466
3158 27018466 26900947 26700445 26551270 25851463 25784439 25857858 25444356 24989183 24237975 24339790
3148 24339790 24931664 25229935 24994641 25420667 24967161 25453167 25956661 25995168 26911668 27336042
3138 27336042 27635566 27665988 28207958 28290219 28645619 29190559 30026921 30725723 31354687 31615639
3128 31615639 32584427 33852807 34206050 35477725 36454403 37100128 38439354 40328797 42203235
3119 42203235 44031265 46034700 48476708 51181090 53691814 56829462 60101067 63705844
3111 63705844 68108236 71840919 76127370 80878519 85924744 91947296 98121008 105051312
3103 105051312 113284810 123044087 133999179 147811712 163230531 181497429 201765289
$$ packed form
3168C0759092o55589q27612p88822j56200j99368N9432l37266o96616k3786j14799
3158B7018466j17519k00502j49175o99807o7024P3419m13502m55173p51208J01815
3148B4339790N91874K98271k35294M26026m53506M86006N03494L8507R16500M24374
3138B7336042K99524L0422N41970Q2261L55400N44940Q36362O98802O28964K60952
3128C1615639R68788J268380L53243J271675R76678O45725J339226J889443J874438
3119D2203235J828030K003435K442008K704382K510724L137648L271605L604777
3111F3705844M402392L732683M286451M751149N046225O022552O173712O930304
3103A05051312Q233498R759277J0955092J3812533J5418819J8266898K0267860
$$ plain form
3096 201765289 222386982 242275944 259871073 272758659 280491916 281943861 279309343
3089 279309343 274079102 268157913 263507937 261378286 262081216 265587260 271588408 277293437
3081 277293437 281355802 280767941 274392327 262910934 246008761 226631412 206231711 185302339
3073 185302339 165600065 147548380 131327157 117464243 105690765 95199227 86693068
3066 86693068 79252549 71822101 65452646 60370667 55765757 52131195 48762977 45515904
3058 45515904 42679921 40270398 38365367 36446297 34010487 32091889 30743468 29692794
3050 29692794 28771014 27940739 27364637 26798741 25996240 25181291 24181061 23529243 22653802
3041 22653802 22283662 21470320 20498127 20023693 19844677 19179351 18128957 17285954 16566849
$$ packed form
3096B01765289K0621693J9888962J7595129J2887586P733257J451945k634518
3089B79309343n230241n921189m649976k129651P02930L506044O001148N705029
3081B77293437M062365n87861o375614j1481393j6902173j9377349k0399701k0929372
3073A85302339j9702274j8051685j6221223j3862914j1773478j0491538q506159
3066H6693068p440519p430448o369455n081979m604910l634562l368218l247073
3058D5515904k835983k409523j905031j919070k435810j918598j348421j050674
3050B9692794r21780q30275n76102n65896q02501q14949j000230o51818q75441
3041B2653802l70140q13342r72193m74434j79016o65326j050394q43003p19105
$$ plain form
3032 16566849 15975820 16037213 15363437 15230915 15100564 14701166 13724537 13414589 13304495 12752910
3022 12752910 12353110 11904123 12128573 12116846 11302414 11055764 10705118 10623103 10262949 9393004
3012 9393004 9775674 10239641 9022125 8506174 8555258 8798843 9146183 8826729 8898220 8401902
3002 8401902 8119446 8384617 8003573 7977075 8128816 7779165 7614742 6943801 6495961 6037636
2992 6037636 6128345 5684462 5121871 5678269 5255353 4923932 5397237 5733096 5122034 4706513
2982 4706513 4768819 4655493 4184393 4302543 4644287 3691290 3787356 4279376 4388007 4262244
2972 4262244 4150288 4187677 4516291 3344783 3304797 3670763 3463768 3209334 3006235 2579146
2962 2579146 2966877 3478093 3367852 3682850 3522907 3458999 3726607 3558379 2882920 2896184
$$ packed form
3032A6566849n91029O1393o73776j32522j30351l99398r76629l09948j10094n51585
3022A2752910l99800m48987K24450j1727q14432k46650l50646q2015l60154q69945
3012I393004L82670M63967j217516n15951M9084K43585L47340l19454P1491m96318
3002H401902k82456K65171l81044k6498J51741l49651j64423o70941m47840m58325
2992F037636R0709m43883n62591N56398m22916l31421M73305L35859o11062m15521
2982D706513O2306j13326m71100J18150L41744r52997R6066M92020J08631j25763
2972D262244j11956L7389L28614j171508l9986L65966k06995k54434k03099m27089
2962B579146L87731N11216j10241L14998j59943o3908K67608j68228o75459J3264
$$ plain form
2952 2896184 3240996 3684748 3440612 3192175 2802612 3103033 3049023 3487706 2997723 2147556
2942 2147556 2506087 2915504 2914112 3130786 3308525 3260648 3614130 3119628 3044356 3108244
2932 3108244 3818874 3664904 3674217 4044132 3430191 3351752 3062557 3141937 3195279 2777770
2922 2777770 2854504 2953102 2770005 2861606 3098847 2694225 2385193 2803099 2790826 2508214
2912 2508214 2572540 2041607 1780694 1876877 1791921 1867880 1850842 1519319 1335209 1675713
2902 1675713 1359930 1797138 1643195 1706439 2349452 1587001 1778307 1355354 1445278 1827151
2892 1827151 1212152 988952 1584716 1772601 1456266 1181994 1142369 668644 177934 758886
2882 758886 1700114 1846988 1434409 1140200 1116069 993652 846826 964399 904601 823174
$$ packed form
2952B896184L44812M43752k44136k48437l89563L00421n4010M38683m89983q50167
2942B147556L58531M09417j392K16674J77739m7877L53482m94502p5272O3888
2932C108244P10630j53970R313L69915o13941p8439k89195P9380N3342m17509
2922B777770P6734R8598j83097R1601K37241m04622l09032M17906j2273k82612
2912B508214O4326n30933k60913R6183q4956P5959j7038l31523j84110L40504
2902A675713l15783M37208j53943O3244O43013p62451J91306m22953Q9924L81873
2892A827151o14999k23200N95764J87885l16335k74272l9625m73725m90710N80952
2882G58886R41228J46874m12579k94209k4131j22417j46826J17573n9798q1427
$$ plain form
2872 823174 1368140 1084054 429786 569528 1361968 1505117 1402111 1424557 1317918 1220383
2862 1220383 1281187 1151781 1508921 1584937 1414569 1405177 1550568 1596193 897376 1066602
2852 1066602 1554674 1309901 1132823 1084809 660717 490002 341529 509671 796173 995880
2842 995880 798607 1279200 1495979 1240084 1233193 1453211 1219425 1161700 1376645 1499039
2832 1499039 1139139 1023897 1426717 1419669 1412748 1631889 2052200 1604232 1195109 1779550
2822 1779550 2477612 1628245 1454278 1795214 2216290 2081089 1441818 1345920 1296283 1745579
2812 1745579 1698692 2206474 1819003 1533462 2111589 2510658 2632555 1908085 2357250 2914953
2802 2914953 2092638 1622445 1994472 1491205 1845653 2404702 2007641 2368621 2359264 2214935
$$ packed form
2872H23174N44966k84086o54268J39742P92440J43149j03006K2446j06639r7535
2862A220383O0804j29406L57140P6016j70368r392J45391M5625o98817J69226
2852A066602M88072k44773j77078m8014m24092j70715j48473J68142K86502J99707
2842I95880j97273M80593K16779k55895o891K20018k33786n7725K14945J22394
2832A499039l59900j15242M02820p048o921K19141M20311m47968m09123N84441
2822A779550O98062q49367j73967L40936M21076j35201o39271r5898m9637M49296
2812A745579m6887N07782l87471k85541N78127L99069J21897p24470M49165N57703
2802B914953q22315m70193L72027n03267L54448N59049l97061L60980r357j44329
$$ plain form
2792 2214935 1841065 1923428 1909048 1648079 1513454 1803825 1444451 1438557 1428211 1079116
2782 1079116 776810 1012595 1396605 1021933 784176 923639 873411 368219 -118229 150951
2772 150951 464672 378920 251255 1054954 1168289 832396 566828 498528 823931 929055
2762 929055 675279 713105 1375688 1343095 474588 399833 410915 345025 514500 614172 1129142
2751 1129142 1112140 677558 583873 259644 515830 878420 550088 113936 -214405 412386
2741 412386 594229 464807 998422 869717 549474 717976 899770 1304678 1146172 1393171
2731 1393171 1111072 1145220 930846 729632 502585 647216 587919 734305 823366 895186
2721 895186 1019994 550480 627783 705566 228795 273451 482968 790208 845170 553735
$$ packed form
2792B214935l73870Q2363j4380k60969j34625K90371l59374n894j0346l49095
2782A079116l02306K35785L84010l74672k37757J39463n0228n05192m86448K69180
2772A50951L13721q5752j27665Q03699J13335l35893k65568o8300L25403J05124
2762I29055k53776L7826O62583l2593q68507p4755J1082o5890J69475R9672N14970
2751A129142j7002m34582r3685l24229K56186L62590l28332m36152l28341O26791
2741D12386J81843j29422N33615j28705l20243J68502J81794M04908j58506K46999
2731A393171k82099L4148k14374k01214k27047J44631n9297J46386Q9061P1820
2721H95186J24808m69514P7303P7783m76771M4656K09517L07240N4962k91435
$$ plain form
2711 553735 758190 837655 269117 244556 680488 702144 440206 -261513 282969 564698
2701 564698 631754 616913 798106 924158 555927 736515 1000937 1125743 978335 1054969
2691 1054969 409651 410016 805728 705608 889760 1135567 921504 1110932 684157 541569
2681 541569 417583 363235 124894 240412 1416988 1627211 1187364 722165 556002 528555
2671 528555 177855 -159471 800132 745862 263513 128602 673004 488657 200611 611830
2661 611830 1075723 1132457 1001314 1489072 1299056 728559 1120867 1018385 961925 811432
2651 811432 783969 886085 897156 797304 1466214 869903 372465 767285 352407 328471
2641 328471 -74572 216662 307439 641025 1015250 1423437 1304317 1291200 1186891 974151
$$ packed form
2711E53735K04455P9465n68538k4561M35932K1656k61938p01719N44482K81729
2701E64698O7056j4841J81193J26052l68231J80588K64422J24806j47408P6634
2691A054969o45318L65L95712j00120J84152K45807k14063J89428m26775j42588
2681E41569j23986n4348k38341J15518J176576K10223m39847m65199j66163k7447
2671E28555l50700l37326R59603n4270m82349j34911N44402j84347k88046M11219
2661F11830M63893N6734j31143M87758j90016n70497L92308j02482n6460j50493
2651H11432k7463J02116J1071r9852O68910n96311m97438L94820m14878k3936
2641C28471m03043K91234R0777L33586L74225M08187j19120j3117j04309k12740
$$ plain form
2631 974151 1051556 1037571 747982 750655 646514 1063134 418256 139240 336875 188399
2621 188399 437439 733403 937968 587583 633062 769099 741349 930962 509917 495907
2611 495907 787498 623387 736595 1254567 1696436 1293339 606095 847985 975458 1132648
2601 1132648 1137811 1233561 1359561 2340109 2581777 2856950 3322490 2878351 2939411 2680549
2591 2680549 2207332 1823743 2049687 1997869 1462689 1171720 1309572 957709 877866 1101986
2581 1101986 1627945 1457491 1458910 965594 829787 511342 1101629 747306 774312 743910
2571 743910 151077 645333 740573 868421 682420 434040 751237 517555 714072 728377
2561 728377 924583 973203 899000 801641 661254 1109797 1115802 1007380 1556508 1428579 1680658
$$ packed form
2631I74151P7405j3985k89589K673j04141M16620o44878k79016J97635j48476
2621A88399K49040K95964K04565l50385M5479J36037k7750J89613m21045j4010
2611D95907K91591j64111J13208N17972M41869m03097o87244K41890J27473J57190
2601A132648N163R5750J26000R80548K41668K75173M65540m44139O1060k58862
2591B680549m73217l83589K25944n1818n35180k90969J37852l51863p9843K24120
2581A101986N25959j70454J419m93316j35807l18445N90287l54323K7006l0402
2571G43910n92833M94256R5240J27848j86001k48380L17197k33682J96517J4305
2561G28377J96206M8620p4203r7359j40387M48543O005j08422N49128j27929K52079
$$ plain form
2550 1680658 1931377 1697323 1172335 1055882 1038529 357559 490992 1305685 1627228 1406030
2540 1406030 1526524 1595354 1029391 364876 589828 540005 290734 415387 850941 1000974
2530 1000974 1252163 1388282 1439031 1162564 1482217 1795386 1554561 970758 1205612 1788731
2520 1788731 1426983 1319756 1323410 566040 964320 1024279 1120069 1212142 1201545 1190267 1070539
2509 1070539 1275550 1150871 833873 1378668 1637411 1337731 1378162 1233256 1565187 1299652
2499 1299652 987897 1015313 1402199 1421145 702655 1217328 1861295 1227951 1128225 1873548
2489 1873548 1801075 1904888 1377091 1644265 1274160 1519722 2159563 2197089 1887861 1480322
2479 1480322 1869055 1714795 2075847 2216859 2342449 2262280 1904020 1908681 1532385 969566
$$ packed form
2550A680658K50719k34054n24988j16453j7353o80970J33433Q14693L21543k21198
2540A406030J20494O8830n65963o64515K24952m9823k49271J24653M35554J50033
2530A000974K51189J36119N0749k76467L19653L13169k40825n83803K34854N83119
2520A788731l61748j07227L654p57370L98280N9959R5790R2073j0597j1278j19728
2509A070539K05011j24679l16998N44795K58743k99680M0431j44906L31931k65535
2499A299652l11755K7416L86886J8946p18490N14673O43967o33344r9726P45323
2489A873548p2473J03813n27797K67174l70105K45562O39841L7526l09228m07539
2479A480322L88733j54260L61052J41012J25590q0169l58260M661l76296n62819
$$ plain form
2469 969566 1299758 1491631 2365848 1750901 1309917 1817871 1443054 1652985 1801705 1847068
2459 1847068 1936791 1761746 1610063 1718432 2041192 1944011 1587040 1874064 2260101 2263385
2449 2263385 2327123 2453167 1936085 2252027 2271328 3058988 3145230 2953826 3127809 3213251
2439 3213251 3653030 3092149 2162964 2226758 2779612 3048960 2886185 2902222 3275479 2912667
2429 2912667 2646139 2565874 2041169 2127361 2714509 2592972 2756198 2639891 2598574 3389758
2419 3389758 3252720 3235183 4009947 3545275 2817849 3351973 3431809 3240940 3550630 3706876
2409 3706876 4028277 3528495 3208113 3368962 3958470 3352536 3162146 3719892 4023832 3973900
2399 3973900 3869737 4679987 4676722 4341827 4308378 4655337 4827253 4956967 5695920 6188184
$$ packed form
2469I69566L30192J91873Q74217o14947m40984N07954l74817K09931J48720M5363
2459A847068Q9723j75045j51683J08369L22760r7181l56971K87024L86037L284
2449B263385O3738J26044n17082L15942J9301P87660Q6242j91404J73983Q5442
2439C213251M39779n60881r29185O3794N52854K69348j62775J6037L73257l62812
2429B912667k66528q0265n24705Q6192N87148j21537J63226j16307m1317P91184
2419C389758j37038j7537P74764m64672p27426N34124P9836j90869L09690J56246
2409C706876L21401m99782l20382J60849N89508o05934j90390N57746L03940m9932
2399C973900j04163Q10250l265l34895l3449L46959J71916J29714P38953M92264
$$ plain form
2389 6188184 6977268 6850063 6964337 7426215 7592882 7038000 6905229 7172611 7378691 7058219
2379 7058219 7727764 8169091 8331882 8746998 9443999 9235000 9302467 9537862 9948026 10954746
2369 10954746 10970591 12014187 12425468 11866977 11808294 12158172 12610355 12664319 12999003 13525896
2359 13525896 13837835 14623458 15222268 16394298 18120539 18780386 19151812 20711732 21962399
2350 21962399 23248940 24052420 25215165 27401760 30147284 33643569 37591077 41162715
2342 41162715 44272070 47703747 51738399 55011935 60747092 67456773 76770097 90236710
2334 90236710 110822269 141704684 188487657 258158404 351312737 420852258 435047119
2327 435047119 428828968 408707629 371389610 313256287 246934482 192005208 147057219
$$ packed form
2389F188184P89084j27205J14274M61878J66667n54882j32771K67382K06080l20472
2379G058219O69545M41327J62791M15116O97001k08999O7467K35395M10164J006720
2369A0954746J5845J043596M11281n58491n8683L49878M52183N3964L34684N26893
2359A3525896L11939P85623N98810J172030J726241O59847L71426J559920J250667
2350B1962399J286541Q03480J162745K186595K745524L496285L947508L571638
2342D1162715L109355L431677M034652L273536N735157O709681R313324J3466613
2334I0236710K0585559L0882415M6782973O9670747R3154333O9539521J4194861
2327D35047119o218151k0121339l7318019n8133323o6321805n4929274m4947989
$$ plain form
2320 147057219 112863870 89845252 74192863 62210791 53879468 49330467 46283991
2313 46283991 43062627 40906206 38883307 36274986 32608106 28774072 26003228 24105899
2305 24105899 22474650 20726885 19423819 19144824 18690920 18047905 17575935 17022066 16945016
2296 16945016 17279987 16597003 15177953 14459070 14583367 14474632 14248696 14003269 13851511
2287 13851511 13467001 13049596 12623846 12096611 11822009 11465539 11416955 11040101 11003639 10708680
2277 10708680 9971345 9798936 9374218 8517773 8129510 8167813 8097726 7783050 7261501 6623343
2267 6623343 6102731 5820627 5475259 5841353 5696575 4986103 4534938 4850104 5305624 5164910
2257 5164910 4879479 4968216 4798240 4331901 4540127 4932762 4823398 4027398 3620012 3377417
$$ packed form
2320A47057219l4193349k3018618j5652389j1982072q331323m549001l046476
2313D6283991l221364k156421k022899k608321l666880l834034k770844j897329
2305B4105899j631249j747765j303066k78995m53904o43015m71970n53869p7050
2296A6945016L34971o82984j419050p18883J24297j08735k25936k45427j51758
2287A3851511l84510m17405m25750n27235k74602l56470m8584l76854l6462k94959
2277A0708680p37335j72409m24718q56445l88263L8303p0087l14676n21549o38158
2267F623343n20612k82104l45368L66094j44778p10472m51165L15166M55520j40714
2257E164910k85431Q8737j69976m66339K08226L92635j09364p96000m07386k42595
$$ plain form
2247 3377417 3581218 3807199 3549292 3448196 3691712 3949405 3946679 3572250 3492056 3870342
2237 3870342 3744687 4061504 3893766 3691830 3434598 3678181 3356381 2407185 2673858 2477244
2227 2477244 2713548 2704605 2875275 2900965 2029333 1598944 1570627 1782237 1880755 1996300
2217 1996300 1521159 1337155 1621776 1324682 1100847 1249440 1422354 1411570 931363 1040092
2207 1040092 1274727 1577214 1527255 1290869 1161935 1054806 775943 865119 967635 660824
2197 660824 820582 1194644 1003549 990596 925759 772504 808981 -108559 441124 1124113
2187 1124113 1351762 1181122 1277098 1050756 783887 1094920 1339876 1386078 1096315 1144940
2177 1144940 1698360 1682612 1433105 1024763 344540 876257 903130 791167 1248605 977115
$$ packed form
2247C377417K03801K25981k57907j01096K43516K57693k726l74429q0194L78286
2237C870342j25655L16817j67738k01936k57232K43583l21800r49196K66673j96614
2227B477244K36304q943J70670K5690q71632m30389k8317K11610R8518J15545
2217A996300m75141j84004K84621k97094k23835J48593J72914j0784m80207J08729
2207A040092K34635L02487m9959k36386j28934j07129k78863Q9176J02516l06811
2197F60824J59758L74062j91095j2953o4837j53255L6477r17540N49683O82989
2187A124113K27649j70640R5976k26342k66869L11033K44956M6202k89763M8625
2177A144940N53420j5748k49507m08342o80223N31717K6873j11963M57438k71490
$$ plain form
2167 977115 1334245 625042 798947 542533 26601 490960 542570 651098 629683 737949
2157 737949 934901 1100994 891827 760229 910106 239754 609512 1286756 1638575 1117185
2147 1117185 1233229 1603457 1325987 1174462 1037911 992950 819598 929361 706696 1227886
2137 1227886 755987 365730 91899 298530 360661 472706 1010739 385856 335313 305754
2127 305754 638648 668618 727625 589021 474425 368126 219204 807111 575882 821611
2117 821611 587744 880360 706409 323024 670996 543131 294385 561820 464726 523973
2107 523973 893324 433864 455123 1072152 1229717 1060711 1316481 1161374 1121883 882515
2097 882515 913243 1102853 789531 743789 1216615 1200865 1237688 1665516 1433395 1435312 692741
$$ packed form
2167I77115L57130p09203J73905k56414n15932M64359N1610J08528k1415J08266
2157G37949J96952J66093k09167j31598J49877o70352L69758O77244L51819n21390
2147A117185J16044L70228k77470j51525j36551m4961j73352J09763k22665N21190
2137A227886m71899l90257k73831K06631O2131J12045N38033o24883n0543k9559
2127C05754L32894K9970N9007j38604j14596j06299j48922N87907k31229K45729
2117H21611k33867K92616j73951l83385L47972j27865k48746K67435r7094N9247
2107E23973L69351m59460K1259O17029J57565j69006K55770j55107l9491k39368
2097H82515L0728J89610l13322m5742M72826j5750L6823M27828k32121J917p42571
$$ plain form
2086 692741 554454 898968 983827 -25748 -174927 259166 806142 511179 654529 725988
2076 725988 546414 380257 533688 923936 735545 570526 847051 1051855 1218798 1121789
2066 1121789 1103600 1103205 1000943 1457837 1725228 2346187 2579880 2550852 3013860 2546225
2056 2546225 2015490 1581656 1452815 1191220 1175044 1294224 1255652 1348423 716761 679265
2046 679265 809817 598328 993726 1166639 724520 243449 -9669 735239 632034 368424
2036 368424 368642 437669 -99343 163415 392974 868947 612590 -78876 300091 809140
2026 809140 748506 454092 752064 796179 791682 869232 760783 522294 205347 159071 448688
2015 448688 305465 47188 415177 516277 616724 676979 851171 729901 331890 -427357
$$ packed form
2086F92741j38287L44514Q4859j009575j49179M34093N46976k94963J43350P1459
2076G25988j79574j66157J53431L90248j88391j65019K76525K04804J66943r7009
2066A121789j8189l95j02262M56894K67391O20959K33693k9028M63008m67635
2056B546225n30735m33834j28841k61595j6176J19180l8572R2771o31662l7496
2046F79265J30552k11489L95398J72913m42119m81071k53118P44908j03205k63610
2036C68424K18O9027n37012K62758K29559M75973k56357o91466L78967N09049
2026H09140o0634k94414K97972M4115m497P7550j08449k38489l16947m6276K89617
2015D48688j43223k58277L67989J01100J00447O0255J74192j21270l98011p59247
$$ plain form
2005 -427357 -200406 -49168 -486403 -788558 195552 760542 539778 113705 599172 185935
1995 185935 -391884 105937 33606 515996 -27430 358091 366163 -421183 112014 712976
1985 712976 1028310 521813 -96570 71660 619902 684553 347867 726124 1092079 282677
1975 282677 593964 549422 412485 268243 75440 740342 498838 16058 201873 307664
1965 307664 284543 861729 886845 476440 540828 727388 263319 672727 117346 -230420
1955 -230420 -24689 10854 78046 637508 369344 -124941 -96367 -166835 -127747 -86614 256305
1944 256305 394648 297988 210116 91708 435877 480550 224016 78749 49368 238690
1934 238690 381963 46344 -130562 290822 224489 -473559 -225789 206698 417304 651567
$$ packed form
2005d27357K26951J51238m37235l02155R84110N64990k20764m26073M85467m13237
1995A85935n77819M97821p2331M82390n43426L85521Q072p87346N33197O00962
1985G12976L15334n06497o18383J68230N48242O4651l36686L78257L65955q09402
1975B82677L11287m4542j36937j44242j92803O64902k41504m82780J85815J05791
1965C07664k3121N77186K5116m10405O4388J86560m64069M09408n55381l47766
1955b30420K05731L5543O7192N59462k68164m94285K8574p0468L9088M1133L42919
1944B56305J38343r6660q7872j18408L44169M4673k56534j45267k9381J89322
1934B38690J43273l35619j76906M21384o6333o98048K47770M32487K10606K34263
$$ plain form
1924 651567 287057 160704 -94672 683674 570658 210026 210369 -273925 341268 1145518
1914 1145518 712814 555709 112521 124804 242718 331569 23150 278840 465909 586117
1904 586117 307849 153494 200115 -168572 224957 47581 319065 660280 738475 590424
1894 590424 977242 276509 153634 274375 128921 345012 572574 82424 117839 562017
1884 562017 172387 549951 741112 623798 778179 598882 262104 288513 510632 169073
1874 169073 603114 467455 224215 409735 573022 297228 442590 491695 790336 214682
1864 214682 511342 135462 23633 549595 581446 141971 -340682 -237231 -266071 390752
1854 390752 1057290 776325 -29517 130331 242293 223172 -3066 93365 -109349 48567
$$ packed form
1924F51567l64510j26353k55376P78346j13016l60632L43m84294O15193Q04250
1914A145518m32704j57105m43188J2283J17914Q8851l08419K55690J87069J20208
1904E86117k78268j54355M6621l68687L93529j77376K71484L41215P8195j48051
1894E90424L86818p00733j22875J20741j45454K16091K27562m90150L5415M44178
1884E62017l89630L77564J91161j17314J54381j79297l36778K6409K22119l41559
1874A69073M34041j35659k43240J85520J63287k75794J45362M9105K98641n75654
1864B14682K96660l75880j11829N25962L1851m39475m82653J03451k8840O56823
1854C90752O66538k80965q05842J59848J11962j9121k26238R6431k02714J57916
$$ plain form
1844 48567 352825 557936 562848 843111 329840 124454 253200 672327 770414 516702
1834 516702 796015 1033662 827754 701991 -133925 -246313 487918 610689 346270 55957
1824 55957 -236823 -27251 -137920 132156 67073 173737 -190116 -30573 253338 -135408
1814 -135408 373967 76947 -41079 -171152 89940 286342 -82638 -22844 265157 -242200
1804 -242200 331764 979504 70900 -82137 146112 400224 -81905 -32178 112255 246179
1794 246179 184927 -62100 187917 -73995 937 89047 208277 684707 198739 -121399
1784 -121399 230238 103631 110420 134556 197017 64501 -281828 -432128 -257531 -268500 -958720
1773 -958720 -349438 74139 334781 242610 436484 726907 478837 -194401 -68116 -23171
$$ packed form
1844D8567L04258K05111M912K80263n13271k05386J28746M19127R8087k53712
1834E16702K79313K37647k05908j25763q35916j12388P34231J22771k64419k90313
1824E5957k92780K09572j10669K70076o5083J06664l63853J59543K83911l88746
1814a35408N09375k97020j18026j30073K61092J96402l68980N9794K88001n07357
1804b42200N73964O47740r08604j53037K28249K54112m82129M9727J44433J33924
1794B46179o1252k47027K50017k61912P4932Q8110J19230M76430m85968l20138
1784a21399L51637j26607O789K4136O2461j32516l46329j50300J74597j0969o90220
1773i58720O09282M23577K60642r2171J93874K90423k48070o73238J26285M4945
$$ plain form
1763 -23171 -677083 -205641 140225 301349 259346 114176 -44069 869732 559413 386137
1753 386137 242223 322713 430047 1184612 979075 316285 482492 383488 41402 40508 456357
1742 456357 628782 527848 139097 484781 916186 632119 155913 435686 423199 332060
1732 332060 529845 739065 544077 124110 8482 292921 1061187 982169 -285785 121172
1722 121172 578862 515206 630758 716675 796535 463171 635598 330806 139472 -437674
1712 -437674 -409932 227763 206285 -174797 -108650 121941 -151809 240786 668666 474997
1702 474997 249962 -159409 244695 31068 82648 -75636 2712 434623 -22538 -119580
1692 -119580 128722 169805 216726 394816 671357 269155 92676 616512 703343 633844
$$ packed form
1763b3171o53912M71442L45866J61124m2003j45170j58245R13801l10319j73276
1753C86137j43914Q0490J07334P54565k05537o62790J66207r9004l42086q94M15849
1742D56357J72425j00934l88751L45684M31405k84067m76206K79773j2487r1139
1732C32060J97785K09220j94988m19967j15628K84439P68266p9018j267954M06957
1722A21172M57690o3656J15552Q5917P9860l33364J72427l04792j91334n77146
1712d37674K7742O37695k1478l81082O6147K30591k73750L92595M27880j93669
1702D74997k25035m09371M04104k13627N1580j58284P8348M31911m57161r7042
1692a19580K48302M1083M6921J78090K76541m02202j76479N23836Q6831o9499
$$ plain form
1682 633844 -80948 107914 271904 102242 -170531 7824 480515 245588 401231 769808
1672 769808 498641 -415692 212476 -172686 150874 810304 719169 982957 635262 593289
1662 593289 1123849 1535829 512492 515937 375373 640668 -32775 -47242 258429 296831
1652 296831 137630 603659 665435 668053 607339 680179 818211 155340 -169658 -33408 405563
1641 405563 415198 -124431 -278924 16212 -22017 4791 158539 175314 239465 354526 511885
1630 511885 251445 -546405 -720996 -3616 213354 -300371 253047 372414 391477 542394
1620 542394 219285 434952 245485 -357253 -118585 645103 788941 673554 700972 178837
1610 178837 -12189 -204620 97319 601629 809861 417592 716283 887122 761397 778160
$$ packed form
1682F33844p14792J88862J63990j69662k72773J78355M72691k34927J55643L68577
1672G69808k71167r14333O28168l85162L23560O59430r1135K63788l47695m1973
1662E93289N30560M11980j023337L445j40564K65295o73443j4467L05671L8402
1652B96831j59201M66029O1776K618o0714P2840J38032o62871l24998J36250M38971
1641D05563R635n39629j54493K95136l8229K6808J53748J6775O4151J15061J57359
1630E11885k60440p97850j74591P17380K16970n13725N53418J19367J9063J50917
1620E42394l23109K15667j89467o02738K38668P63688J43838j15387K7418n22135
1610A78837j91026j92431L01939N04310K08232l92269K98691J70839j25725J6763
$$ plain form
1600 778160 771042 580433 976102 1082512 1055469 774435 373266 461848 675079 142775
1590 142775 44427 625575 725366 325065 85776 -6322 471776 382993 -510834 -45245
1580 -45245 65072 -46794 -184290 -192782 -212047 -242543 -190134 411885 220389 240239 211979
1569 211979 -100941 -42099 -184839 53501 -400249 -336836 -169351 87741 79531 -320392
1559 -320392 -578568 -284451 -766833 -364941 274959 521840 649759 287708 673416 331276
1549 331276 126323 -19136 471636 625304 460067 259427 365687 28183 -439645 -251604
1539 -251604 -110524 -285265 -180220 404100 260646 306826 131374 -177876 -74714 -6421
1529 -6421 12566 159036 225007 400334 413102 -9534 409259 1048736 477893 307161 563461
$$ packed form
1600G78160p118j90609L95669J06410k7043k81034m01169Q8582K13231n32304
1590A42775r8348N81148R9791m00301k39289r2098M78098q8783q93827M65589
1580d5245J10317j11866j37496q492j9265l0496N2409O02019j91496J9850k8260
1569B11979l12920N8842j42740K38340m53750O3413J67485K57092q210l99923
1559c20392k58176K94117m82382M01892O39900K46881J27919l62051L85708l42140
1549C31276k04953j45459M90772J53668j65237k00640J06260l37504m67828J88041
1539b51604J41080j74741J05045N84320j43454M6180j75452l09250J03162O8293
1529f421J8987J46470O5971J75327J2768m22636M18793O39477n70843j70732K56300
$$ plain form
1518 563461 264360 -1408 -202446 300543 66355 -165331 120018 422772 460129 321139
1508 321139 -47076 32925 583477 506810 228565 -37478 -6944 618190 294919 438683
1498 438683 74524 -228703 195110 97820 319239 692112 678805 301104 -224145 324444
1488 324444 20348 234332 280042 -369160 -112073 -92281 -40840 85967 316503 558479
1478 558479 1091058 677461 208263 749723 803137 654608 680179 584409 418217 -35384
1468 -35384 169311 190802 235315 409954 254758 41179 143910 418312 130730 -490529
1458 -490529 -295814 66046 829367 637043 482629 711843 81392 -162566 -218161 -417617
1448 -417617 -136627 -36230 -406628 -540204 -143360 -82276 -82275 -61041 144490 218780 -64861
$$ packed form
1518E63461k99101k65768k01038N02989k34188k31686K85349L02754L7357j38990
1508C21139l68215Q0001N50552p6667k78245k66043L0534O25134l23271J43764
1498D38683l64159l03227M23813r7290K21419L72873j3307l77701n25249N48589
1488C24444l04096K13984M5710o49202K57087J9792N1441J26807K30536K41976
1478E58479N32579m13597m69198N41460N3414j48529K5571r5770j66192m53601
1468c5384K04695K1491M4513J74639j55196k13579J02731K74402k87582o21259
1458d90529J94715L61860P63321j92324j54414K29214o30451k43958n5595j99456
1448d17617K80990J00397l70398j33576L96844O1084JK1234K05531P4290k83641
$$ plain form
1437 -64861 -125263 176377 -14571 -242222 -11515 124600 267334 920133 924755 561185
1427 561185 702349 1091073 951226 507918 352576 437292 693231 933161 590902 316069
1417 316069 56614 350795 517996 453089 866144 1375572 493009 -216115 49058 309256
1407 309256 522917 532679 161424 247230 234247 -359327 -475515 63877 251992 51583
1397 51583 -217473 97246 248171 697575 734892 549186 655434 189940 -176453 244342
1387 244342 490352 398014 506805 -54975 207905 -231435 143326 220537 528933 430856
1377 430856 198590 306167 578532 -331541 -533052 -182901 -376429 30135 29841 291201
1367 291201 688326 724071 256152 455675 773235 504645 881251 943773 1081495 408581
$$ packed form
1437f4861o0402L01640j90948k27651K30707J36115J42734O52799M622l63570
1427E61185J41164L88724j39847m43308j55342Q4716K55939K39930l42259k74833
1417C16069k59455K94181J67201o4907M13055N09428q82563p09124K65173K60198
1407C09256K13661R762l71255Q5806j2983n93574j16188N39392J88115k00409
1397E1583k69056L14719J50925M49404L7317j85706J06248m65494l66393M20795
1387B44342K46010r2338J08791n61780K62880m39340L74761P7211L08396r8077
1377D30856k32266J07577K72365r10073k01511L50151j93528M06564k94K61360
1367B91201L97125L5745m67919J99523L17560k68590L76606O2522J37722o72914
$$ plain form
1357 408581 327620 247378 482826 745647 1047306 300859 195296 598983 398744 322957
1347 322957 531115 852667 669023 639746 84740 7004 -221515 -683512 -578365 403359
1337 403359 819085 174923 551367 577251 464760 248894 117072 503707 318928 111774
1327 111774 227172 127020 386212 330643 136895 782890 377973 -160367 -214445 -259627
1317 -259627 -156918 62927 -20033 -223935 -472956 102049 369883 520027 364301 1017779
1307 1017779 857859 463673 -67924 93447 67335 -7563 -154308 -186304 222695 465261
1297 465261 248299 220858 779018 607815 994937 938536 71370 57454 540200 1074343
1287 1074343 767529 396425 -80494 -53659 42999 167207 194085 670452 664910 790506
$$ packed form
1357D08581q0961q0242K35448K62821L01659p46447j05563M03687k00239p5787
1347C22957K08158L21552j83644k9277n55006p7736k28519m61997J05147R81724
1337D03359M15726o44162L76444K5884j12491k15866j31822L86635j84779k07154
1327A11774J15398j00152K59192n5569j93748O45995m04917n38340n4078m5182
1317b59627J02709K19845q2960k03902k49021N75005K67834J50144j55726O53478
1307A017779j59920l94186n31597J61371k6112p4898j46745l1996M08999K42566
1297D65261k16962k7441N58160j71203L87122n6401q67166j3916M82746N34143
1287A074343l06814l71104m76919K6835R6658J24208K6878M76367n542J25596
$$ plain form
1277 790506 601132 260991 -24811 -53129 28278 -179969 -54344 92357 516339 455806
1267 455806 630461 -126840 -476523 -20197 -288027 162857 297673 190676 244197 414546
1257 414546 328934 -21475 332129 75766 409916 450361 -164537 188984 541746 349127
1247 349127 713622 353381 477835 425226 858819 340424 644649 453908 175939 913201
1237 913201 589452 272068 527863 923490 972068 613590 -147638 177660 500626 411211
1227 411211 -472367 -194221 127749 -91554 481495 344839 458066 285466 342177 307957
1217 307957 471683 769936 235041 317570 708333 248099 155997 278421 706091 648811
1207 648811 -35862 8457 -307078 449096 737956 103354 -25517 -167415 335826 -35075
$$ packed form
1277G90506j89374l40141k85802k8318Q1407k08247J25625J46701M23982o0533
1267D55806J74655p57301l49683M56326k67830M50884J34816j06997N3521J70349
1257D14546q5612l50409L53604k56363L34150M0445o14898L53521L52762j92619
1247C49127L64495l60241J24454n2609M33593n18395L04225j90741k77969P37262
1237I13201l23749l17384K55795L95627M8578l58478p61228L25298L22966q9415
1227D11211q83578K78146L21970k19303N73049j36656J13227j72600N6711l4220
1217C07957J63726K98253n34895Q2529L90763m60234r2102J22424M27670n7280
1207F48811o84673M4319l15535P56174K88860o34602j28871j41898N03241l70901
$$ plain form
1197 -35075 -109614 -267160 62593 109877 159292 181496 -91616 -453206 -654131 -474498 -4503
1186 -4503 -211517 -535986 -430062 -331237 35695 241399 -5039 111347 403525 -464142
1176 -464142 -682059 226784 736020 677400 365575 17693 396566 726223 596526 542440
1166 542440 321200 108017 370073 244324 302569 -24109 263461 460120 4028 463630
1156 463630 988857 510423 207218 134375 597134 807286 778837 318524 -93735 -353375
1146 -353375 -472157 -163572 535864 372654 340996 648566 608650 618831 719283 820809
1136 820809 202764 -18786 302637 296387 39296 283569 663092 987132 744333 53870
1126 53870 -191802 -445634 46894 30978 13833 330995 727556 559203 24529 187620
$$ packed form
1197c5075p4539j57546L29753M7284M9415K2204k73112l61590k00925J79633M69995
1186d503k07014l24469J05924R8825L66932K05704k46438J16386K92178q67667
1176d64142k17917R08843N09236n8620l11825l47882L78873L29657j29697n4086
1166E42440k21240k13183K62056j25749N8245l26678K87570J96659m56092M59602
1156D63630N25227m78434l03205p2843M62759K10152k8449m60313m12259k59640
1146c53375j18782L08585O99436j63210l1658L07570l9916J0181J00452J01526
1136H20809o18045k21550L21423o250k57091K44273L79523L24040k42799o90463
1126E3870k45672k53832M92528j5916j7145L17162L96561j68353n34674J63091
$$ plain form
1116 187620 215547 -232716 519685 632789 595739 557172 427979 289169 213192 294967 369121
1105 369121 423939 257796 393357 417302 131181 310567 123015 -610122 -165018 104139
1095 104139 63247 203690 142126 139847 -109018 88242 287649 66598 -19828 -61451 142613
1084 142613 359550 837247 809547 489265 243722 335589 -220145 -725245 -211540 136728
1074 136728 333176 226203 230576 436650 456172 767199 208377 513961 416473 96551
1064 96551 -113117 -94979 30925 70541 117256 389074 643297 415159 145643 110377 5143
1053 5143 264039 410254 290072 305172 290868 136197 288443 720179 496576 230568
1043 230568 456295 421221 348465 9201 549818 848231 786930 924809 318903 185556
$$ packed form
1116A87620K7927m48263P52401J13104l7050l8567j29193j38810p5977Q1775P4154
1105C69121N4818j66143J35561K3945k86121J79386j87552p33137M45104K69157
1095A04139m0892J40443o1564k279k48865J97260J99407k21051q6426m1623K04064
1084A42613K16937M77697k7700l20282k45543R1867n55734n05100N13705L48268
1074A36728J96448j06973M373K06074J9522L11027n58822L05584r7488l19922
1064I6551k09668J8138J25904L9616M6715K71818K54223k28138k69516l5266j05234
1053E143K58896J46215j20182J5100j4304j54671J52246M31736k23603k66008
1043B30568K25727l5074p2756l39264N40617K98413o1301J37879o05906j33347
$$ plain form
1033 185556 84486 219033 127400 491634 779868 366914 363184 494389 602427 766405
1023 766405 679273 104407 185916 835946 825903 837411 589248 297271 169758 -122139
1013 -122139 -57290 144398 707685 978571 970959 631799 264018 16929 124161 888376
1003 888376 416879 160981 158778 412038 436884 223187 260261 -85806 -61431 -238863 122249
992 122249 109677 455410 327099 540741 732097 242408 251052 155004 445444 192667 21396
981 21396 561915 167000 -39585 72333 87894 -130564 -123827 -99467 -276598 -483321 131084
970 131084 163988 -131228 -120382 140603 353590 -39304 690968 440576 621468 457048
960 457048 283497 148026 169167 256842 259619 36090 -270510 -2906 63891 218996 490674
$$ packed form
1033A85556j01070J34547r1633L64234K88234m12954l730J31205J08038J63978
1023G66405q7132n74866Q1509O50030j0043J1508k48163k91977j27513k91897
1013a22139O4849K01688N63287K70886p612l39160l67781k47089J07232P64215
1003H88376m71497k55898k203K53260K4846k13697L7074l46067K4375j77432L61112
992A22249j2572L45733j28311K13642J91356m89689Q644r6048K90440k52777j71271
981B1396N40519l94915k06585J11918J5561k18458O737K4360j77131k06723O14405
970A31084L2904k95216J0846K60985K12987l92894P30272k50392J80892j64420
960D57048j73551j35471K1141Q7675K777k23529l06600K67604O6797J55105K71678
$$ plain form
949 490674 564859 -246034 -363467 -108855 31979 -188494 -214954 -92354 -166849 71441
939 71441 -117259 -84300 70454 483392 92054 -224568 36844 -503331 -422890 167525
929 167525 131792 334659 345926 552024 296495 218431 358462 869090 1189005 864867
919 864867 160285 -151861 -88253 -140347 -194683 -321826 -226280 -155590 -165271 712859 913701
908 913701 523929 -44969 325317 463179 -26695 -228745 -6297 240988 24917 -178516
898 -178516 -113422 -205459 -98865 -643072 -1119934 -686390 -346773 -130336 -86456 455128
888 455128 127921 5557 365739 272907 282504 365327 883915 495339 163061 432552 62929
877 62929 134533 527026 792120 526832 -353625 -568528 -325971 153497 -595734 -199997
$$ packed form
949D90674P4185q10893j17433K54612J40834k20473k6460J22600p4495K38290
939G1441j88700L2959J54754M12938l91338l16622K61412n40175Q0441N90415
929A67525l5733K02867J1267K06098k55529p8064J40031N10628L19915l24138
919H64867p04582l12146O3608n2094n4336j27143R5546P0690r681Q78130K00842
908I13701l89772n68898L70286J37862m89874k02050K22448K47285k16071k03433
898a78516O5094r2037J06594n44207m76862M33544L39617K16437M3880N41584
888D55128l27207j22364L60182r2832R597Q2823N18588l88576l32278K69491l69623
877F2929P1604L92493K65094k65288q80457k14903K42557M79468p49231L95737
$$ plain form
867 -199997 686971 282303 477517 192999 632298 754790 654158 289549 120095 160744
857 160744 794170 849532 150162 -392262 -269129 28165 544516 740240 734408 231106
847 231106 456725 263869 181914 547531 465545 108765 249412 184122 25013 -259962
837 -259962 -53321 -101726 -661629 -399947 -234014 38088 33320 130394 51711 583589 -30764
826 -30764 -486509 -115378 162683 348520 158482 522461 628367 611096 610448 484598 459445
815 459445 15683 75796 127257 138490 251146 -277281 -160148 -38011 409809 299956
805 299956 571947 721133 264861 205803 359287 205212 83420 462911 287544 -101561
795 -101561 203609 138556 83608 -260292 98085 247340 -272271 -77832 148596 588364
$$ packed form
867a99997Q86968m04668J95214k84518M39299J22492j00632l64609j69454M0649
857A60744O33426N5362o99370n42424J23133K97294N16351J95724n832n03302
847B31106K25619j92856q1955L65617q1986l56780J40647o5290j59109k84975
837b59962K06641m8405n59903K61682J65933K72102m768R7074p8683N31878o14353
826c0764m55745L71131K78061J85837j90038L63979J05906j7271o48j25850k5153
815D59445m43762O0113N1461J1233J12656n28427J17133J22137M47820j09853
805B99956K71991J49186m56272n9058J53484j54075j21792L79491j75367l89105
795a01561L05170o5053n4948l43900L58377J49255n19611J94439K26428M39768
$$ plain form
785 588364 287395 110924 267024 4476 620397 149712 -14995 33182 -347886 214778
775 214778 379610 268561 -200239 190481 486871 577214 35310 -217206 762927 1010929
765 1010929 553488 -5227 122360 389013 -148133 65296 -191898 -173146 -330231 -352695
755 -352695 429789 559779 184603 140922 28666 141678 12890 -158926 837598 978877
745 978877 711208 726588 270681 649462 971285 831902 1026014 949028 637880 332972
735 332972 328419 273791 321516 395139 118417 -69057 134350 630988 649541 734985 327797
724 327797 238777 359729 -93280 391121 1007773 405814 15906 121943 713681 151317
714 151317 337834 376065 123962 242852 -83357 -231168 -29342 181105 99076 824707
$$ packed form
785E88364l00969j76471J56100k62548O15921m70685j64707M8177l81068N62664
775B14778J64832j11049m68800L90720K96390R0343n41904k52516R80133K48002
765A010929m57441n58715J27587K66653n37146K13429k57194J8752j57085k2464
755c52695P82484J29990l75176m3681j12256J13012j28788j71816R96524J41279
745I78877k67669J5380m55907L78781L21823j39383J94112p6986l11148l04908
735C32972m553n4628M7725P3623k76722j87474K03407M96638J8553Q5444m07188
724C27797q9020J20952m53009M84401O16652o01959l89908J06037N91738n62364
714A51317J86517L8231k52103J18890l26209j47811K01826K10447q2029P25631
$$ plain form
704 824707 517788 337760 624112 346709 529102 51595 223720 641250 686409 390476
694 390476 256864 -13857 -396013 -383648 -754127 -613165 710455 958549 152349 -112101
684 -112101 78730 385165 359974 742944 604477 320070 374857 379219 240065 345290 11192
673 11192 153919 -184639 -5211 592477 200402 -25340 -256605 -314204 -222855 -15259
663 -15259 -400474 -417865 235249 219255 511087 1155095 498285 1184157 938015 340333
653 340333 447415 136810 -11730 -480326 -536678 -362691 -136226 81841 91692 139648 301680
642 301680 821715 1146994 477222 355434 430677 232098 58101 244097 106191 292023
632 292023 500608 420380 325513 123151 14087 -87119 168348 671122 967593 1023353
$$ packed form
704H24707l06919j80028K86352k77403J82393m77507J72125M17530M5159k95933
694C90476j33612k70721l82156J2365l70479J40962J323620K48094q06200k64450
684a12101J90831L06435k5191L82970j38467k84407N4787M362j39154J05225l34098
673A1192J42727l38558J79428N97688l92075k25742k31265n7599R1349K07596
663a5259l85215j7391O53114j5994K91832O44008o56810O85872k46142n97682
653C40333J07082l10605j48540m68596n6352J73987K26465K18067R851M7956J62032
642C01680N20035L25279o69772j21788P5243j98579j73997J85996j37906J85832
632B92023K08585q0228r4867k02362j09064j01206K55467N02774K96471N5760
$$ plain form
622 1023353 758046 786479 380542 7059 197700 545423 535671 565749 522328 663161 555903
611 555903 476286 278343 527743 380980 718858 269128 169255 501699 216432 535167
601 535167 280278 323775 441059 312485 304832 -82987 27854 -201476 -335308 224819
591 224819 380405 402990 88597 -401302 -481826 -118330 283637 232321 145223 166256 371949
580 371949 503790 694790 481516 213347 311839 -411 -457504 -251262 39523 558625
570 558625 845057 510083 305354 642932 679091 764783 1029491 404957 603368 332117
560 332117 469485 986351 721213 848168 800523 492087 -105203 -404137 191929 477542
550 477542 772495 1444014 1205128 767808 640510 590444 199003 578513 671930 406709
$$ packed form
622A023353k65307K8433m05937l73483J90641L47723r752L0078m3421J40833j07258
611E55903p9617j97943K49400j46763L37878m49730r9873L32444k85267L18735
601E35167k54889M3497J17284j28574p653l87819J10841k29330j33832N60127
591B24819J55586K2585l14393m89899q0524L63496M01967n1316q7098K1033K05693
580C71949J31841J91000k13274k68169R8492l12250m57093K06242K90785N19102
570E58625K86432l34974k04729L37578L6159Q5692K64708o24534J98411k71251
560C32117J37368N16866k65138J26955m7645l08436n97290k98934N96066K85613
550D77542K94953O71519k38886m37320j27298n0066l91441L79510R3417k65221
$$ plain form
540 406709 437963 431769 672689 356427 382584 -372906 -38013 -35870 76564 27613 67009
529 67009 374407 581218 825736 274201 448547 388767 -28111 136371 600610 565730
519 565730 515576 459192 628934 487339 191942 78400 470068 258301 -132530 545090
509 545090 378162 -57947 -90220 344454 337538 643393 734491 409208 -67235 362490 241993
498 241993 -227795 504827 360357 37217 353207 -11226 184812 28442 -11102 229058
488 229058 35003 72974 73577 309538 590610 -38642 187586 379061 252957 64822 264732
477 264732 287222 546592 561230 972469 167684 -98589 553314 374206 637521 182610
467 182610 646101 1042320 730699 601426 814645 191814 39234 110198 -49763 193503
$$ packed form
540D06709L1254o194K40920l16262K6157p55490L34893K143J12434m8951L9396
529F7009L07398K06811K44518n51535J74346n9780m16878J64482M64239l4880
519E65730n0154n6384J69742j41595k95397j13542L91668k11767l90831O77620
509E45090j66928m36109l2273M34674o916L05855R1098l25283m76443M29725j20497
498B41993m69788P32622j44470l23140L15990l64433J96038j56370l9544K40160
488B29058j94055L7971O03K35961K81072o29252K26228J91475j26104j88135J99910
477B64732K2490K59370J4638M11239q04785k66273O51903j79108K63315m54911
467A82610M63491L96219l11621j29273K13219o22831j52580P0964j59961K43266
$$ plain form
457 193503 250749 -21780 -151680 25345 185071 98750 387641 -60033 -196318 195529
447 195529 41762 62552 512341 336153 129570 282972 750619 577814 151123 -53081
437 -53081 -35037 529055 421248 563120 469705 116516 182526 447555 282525 -102141 170540
426 170540 213805 -242425 454237 565954 398398 909827 563835 261885 6692 346128
416 346128 373753 599742 346325 -46198 424838 1011268 773956 230688 171232 357424
406 357424 281629 209356 535631 527505 -399998 -368960 255997 115974 50680 27499 675965
395 675965 814912 217443 593294 235345 132901 267129 585710 207794 93783 191254
385 191254 121997 9582 -322781 68884 623238 372255 338780 403153 645243 886270
$$ packed form
457A93503N7246k72529j29900J77025J59726q6321K88891m47674j36285L91847
447A95529j53767K0790M49789j76188k06583J53402M67647j72805m26691k04204
437e3081J8044N64092j07807J41872r3415l53189O6010K65029j65030l84666K72681
426A70540M3265m56230O96662J11717j67556N11429l45992l01950k55193L39436
416C46128K7625K25989k53417l92523M71036N86430k37312n43268n9456J86192
406C57424p5795p2273L26275q126r27503L1038O24957j40023o5294k3181O48466
395F75965J38947n97469L75851l57949j02444J34228L18581l77916j14011R7471
385A91254o9257j12415l32363L91665N54354k50983l3475O4373K42090K41027
$$ plain form
375 886270 733438 406606 109041 -157857 -316112 -109314 464856 38136 -251209 -25200
365 -25200 419959 -319172 -247162 271525 531638 629452 226510 173334 -174199 -193683 -522119
354 -522119 -281832 -301921 59523 58767 393530 819123 638760 207214 160231 125675 184250
343 184250 -50794 164210 411759 667802 135933 -453946 -799503 -270690 377118 10977
333 10977 206530 364638 360809 687642 441805 14029 -79984 409618 761470 704754 562975
322 562975 235314 112617 338828 755597 455545 -64405 -201562 289100 473695 401334
312 401334 -167561 -114755 206577 138506 250521 221020 865608 376479 1092948 1130708 734079
301 734079 750808 -182688 -317717 -541346 -181199 185259 446880 222357 197747 62048
$$ packed form
375H86270j52832l26832k97565k66898j58255K06798N74170m26720k89345K26009
365b5200M45159p39131P2010N18687K60113R7814m02942n3176l47533j9484l28436
354e22119K40287k0089L61444p56L34763M25593j80363m31546m6983l4556N8575
343A84250k35044K15004K47549K56043n31869n89879l45557N28813O47808l66141
333A0977J95553J58108l829L26833k45837m27776r4013M89602L51852n6716j41779
322E62975l27661j22697K26211M16769l00052n19950j37157M90662J84595p2361
312D01334n68895N2806L21332o8071J12015k9501O44588m89129P16469L7760l96629
301G34079J6729r33496j35029k23629L60147L66458K61621k24523k4610j35699
$$ plain form
291 62048 -123756 64645 -110065 -105479 -270006 89286 305967 -167253 -8322 -393466
281 -393466 125577 940951 954674 432658 -87832 327533 251735 224069 190923 -475399 -289388
270 -289388 455506 308102 362905 307547 675921 330080 119969 -37470 413159 619962
260 619962 409862 281840 467801 749853 543705 161193 224813 194064 -14305 313996
250 313996 509378 743280 83861 -61715 -24744 307444 577102 359151 216473 15661
240 15661 78412 -48585 325343 278462 40643 196510 -23184 -30821 -381134 -83110 233531
229 233531 123850 112362 113143 139985 127526 69189 200885 21786 -173732 101628 -177529
218 -177529 85872 -100345 241912 701604 312474 147111 250484 539151 481207 -279080
$$ packed form
291F2048j85804J88401j74710M586j64527L59292K16681m73220J58931l85144
281c93466N19043Q15374J3723n22016n20490M15365p5798k7666l3146o66322J86011
270b89388P44894j47404N4803n5358L68374l45841k10111j57439M50629K06803
260F19962k10100j28022J85961K82052k06148l82512O3620l0749k08369L28301
250C13996J95382K33902o59419j45576L6971L32188K69658k17951j42678k00812
240A5661O2751j26997L73928m6881k37819J55867k19694p637l50313K98024L16641
229B33531j09681j1488P81K6842j2459n8337J31696j79099j95518K75360k79157
218a77529K63401j86217L42257M59692l89130j65363J03373K88667n7944p60287
$$ plain form
208 -279080 328208 690746 1045752 991474 587545 332936 -38675 -382800 168453 180116
198 180116 -405720 178174 -70002 -47843 -93009 -300515 -224297 99798 -30770 -216150
188 -216150 -96411 133132 -121857 -47867 137451 571359 309294 243139 323125 402106 90875
177 90875 211229 51556 -70013 -28108 -81186 182952 221241 -25328 -287497 -292527 -68312
166 -68312 -337319 -213604 -274883 -444795 -631462 -250162 -221517 -229797 219120 -45980 -201471
155 -201471 -157104 -233106 517517 930623 76590 -132145 237612 266609 415166 6756
145 6756 -142811 -121140 -292364 -302308 102602 206357 -34600 171992 269500 45885 82714
134 82714 -124491 -335908 54245 89869 -243219 -387485 -273850 -171291 231695 -80548
$$ packed form
208b79080O07288L62538L55006n4278m03929k54609l71611l44125N51253J1663
198A80116n85836N83894k48176K2159m5166k07506P6218L24095j30568j85380
188b16150J19739K29543k54989P3990J85318M33908k62065o6155P9986P8981l11231
177I0875J20354j59673j21569M1905n3078K64138L8289k46569k62169n030K24215
166f8312k69007J23715o1279j69912j86667L81300K8645q280M48917k65100j55491
155b01471M4367p6002P50623M13106q54033k08735L69757K8997J48557m08410
145F756j49567K1671j71224r944M04910J03755k40957K06592R7508k23615L6829
134H2714k07205k11417L90153L5624l33088j44266J13635J02559M02986l12243
$$ plain form
124 -80548 -164643 248150 372997 237174 317115 384724 652538 361104 283539 192318 170796
113 170796 -40968 -260662 510048 236562 -395490 -420758 -15257 231763 -12008 -10841
103 -10841 -154460 -38892 264354 146404 -15476 -234149 -139540 55282 50109 133440 85526
92 85526 -174602 -62714 -6028 -95373 -162230 12683 -21085 -33162 120951 -51944 109200
81 109200 114659 -315900 -624495 -205040 -540803 -331150 -450061 -421965 101630 208130 -138857
70 -138857 -264520 -352142 -379384 -446447 -751759 -869306 146102 -14117 -291339 -429135
60 -429135 -229582 38791 -113001 -681944 -343964 -317618 -261441 -90602 -102107 60507 -643405
49 -643405 -402380 -224808 -435917 -355263 -620565 -351720 -304835 -414887 -221818 -466849
$$ packed form
124h0548q4095M12793J24847j35823P9941O7609K67814k91434p7565r1221k1522
113A70796k11764k19694P70710k73486o32052k5268M05501K47020k43771J167
103a0841j43619J15568L03246j17950j61880k18673R4609J94822n173Q3331m7914
92H5526k60128J11888N6686q9345o6857J74913l3768j2077J54113j72895J61144
81A09200N459m30559l08595M19455l35763K09653j18911K8096N23595J06500l46987
70a38857j25663q7622k7242o7063l05312j17547J015408j60219k77222j37796
60d29135J99553K68373j51792n68943L37980K6346N6177J70839j1505J62614p03912
49f43405K41025J77572k11109Q0654k65302K68845M6885j10052J93069k45031
$$ plain form
39 -466849 -575275 -804442 -576330 -438118 -93595 -527270 -127091 27008 185877 47076
29 47076 111828 137231 164934 -15443 -276983 -342957 -657740 -915081 -1171782 -525078 -395096
18 -395096 -345985 -110943 84794 46858 -272025 -315390 -564105 -834829 -630166 -376327 -804950
7 -804950 -774118 -391175 -376846 -400895 -609501 -583072 -501361
0 -501361
$$ packed form
39d66849j08426k29167K28112J38212L44523m33675M00179J54099J58869j38801
29D7076O4752K5403K7703j80377k61540o5974l14783k57341k56701O46704J29982
18c95096M9111K35042J95737l7936l18883m3365k48715k70724K04663K53839m28623
7h04950L0832L82943J4329k4049k08606K6429Q1711
0e01361
$$ Imaginary data points
##PAGE= N=2
##DATA TABLE= (X++(I..I)), XYDATA
$$ plain form
16383 -3193266 -3095839 -3015246 -2883877 -3055236 -3163099 -2936312 -2951912 -3068409 -2622367 -2221520
16373 -2221520 -2485187 -2811663 -2732123 -2574321 -2692124 -2453286 -2536881 -2447047 -1959772 -2039027
16363 -2039027 -2109283 -1992754 -2029037 -1885289 -1881140 -1716529 -1701278 -1960442 -1829851 -1563332
16353 -1563332 -1222312 -1658890 -1627842 -1343478 -1409755 -1713558 -1911203 -1418017 -1062955 -1165027
16343 -1165027 -1310314 -1163957 -539899 -503838 -430336 -473048 -594648 -525412 -548833 -596345
16333 -596345 -710558 -354473 -348034 -210485 -116928 -444282 -367740 -284396 -45549 14915 -141632
16322 -141632 313802 256200 154652 -79513 136860 230599 -58482 -107971 151983 410426
16312 410426 522446 252484 499885 434052 502768 591165 878301 665199 831459 732249
$$ packed form
16383c193266R7427Q0593J31369j71359j07863K26787j5600j16497M46042M00847
16373b221520k63667l26476P9540J57802j17803K38838q3595Q9834M87275p9255
16363b039027p0256J16529l6283J43748M149J64611J5251k59164J30591K66519
16353a563332L41020m36578L1048K84364o6277l03803j97645M93186L55062j02072
16343a165027j45287J46357O24058L6061P3502m2712j21600O9236k3421m7512
16333e96345j14213L56085O439J37549R3557l27354P6542Q3344K38847O0464j56547
16322a41632M55434n7602j01548k34165K16373R3739k89081m9489K59954K58443
16312D10426J12020k69962K47401o5833O8716Q8397K87136k13102J66260r9210
$$ plain form
16302 732249 501921 345262 542370 802364 968875 965277 1105780 937180 941739 1002614
16292 1002614 1077847 1311907 1170317 1643494 1482084 1233892 1424782 1421157 1112791 1287997
16282 1287997 1856034 1955825 1796649 1946111 1828503 1980796 2017106 2401758 2304159 2109753
16272 2109753 1784330 1928052 2064301 1424569 1610707 2046920 2344657 2906925 2707874
16263 2707874 2640871 2551970 2694144 2851621 2694053 2298946 2641745 2307814 2439032 2826737
16253 2826737 2869759 2952891 2916635 2803784 3062547 3056815 2977917 2875190 2816034 2600630 2924341
16242 2924341 2868023 3316361 3738617 3613634 3452310 3654936 3294271 3473990 3481772 3621137
16232 3621137 3891533 3707889 3464784 3498555 3393421 3447712 3942044 4167197 4072352 3829866
$$ packed form
16302G32249k30328j56659J97108K59994J66511l598J40503j68600M559O0875
16292A002614P5233K34060j41590M73177j61410k48192J90890l625l08366J75206
16282A287997N68037R9791j59176J49462j17608J52293L6310L84652r7599j94406
16272B109753l25423J43722J36249o39732J86138M36213K97737N62268j99051
16263B707874o7003q8901J42174J57477j57568l95107L42799l33931J31218L87705
16253B826737M3022Q3132l6256j12851K58763n732p8898j02727n9156k15404L23711
16242B924341n6318M48338M22256j24983j61324K02626l60665J79719P782J39365
16232C621137K70396j83644k43105L3771j05134N4291M94332K25153r4845k42486
$$ plain form
16222 3829866 3831060 4022461 4299444 4165708 4220925 3651561 3872687 3684629 3996949 4279129
16212 4279129 3711581 3648342 3820925 4266445 4382732 4084012 4120957 4358032 4417964 4917245
16202 4917245 4766130 4170185 4366652 4353181 4624231 4798688 4093434 4083282 3860515 3393110
16192 3393110 3668175 4113651 4203843 4243030 4467254 4609669 4535375 4235683 4951071 5048823
16182 5048823 4933301 4454244 4269202 4207286 4291814 4348678 4663870 4841783 4765520 4612972
16172 4612972 4719890 4479914 4610773 4576909 4518446 4423929 4829765 4711585 3900458 3664937
16162 3664937 4009621 4436596 4806398 5433971 5074392 4801060 4700879 5135112 5023085
16153 5023085 4912496 4871760 4215889 5197971 5417790 4604019 4254269 4912854 5585164 5442846
$$ packed form
16222C829866J194J91401K76983j33736N5217n69364K21126j88058L12320K82180
16212D279129n67548o3239J72583M45520J16287k98720L6945K37075N9932M99281
16202D917245j51115n95945J96467j3471K71050J74457p05254j0152k22767m67405
16192C393110K75065M45476R0192L9187K24224J42415p4294k99692P15388R7752
16182E048823j15522m79057j85042o1916Q4528N6864L15192J77913p6263j52548
16172D612972J06918k39976J30859l3864n8463r4517M05836j18180q11127k35521
16162C664937L44684M26975L69802O27573l59579k73332j00181M34233j12027
16153E023085j10589m0736o55871R82082K19819q13771l49750O58585O72310j42318
$$ plain form
16143 5442846 5568237 5418731 4943561 4727971 4717808 4628189 4807333 4817464 5055212 5179819
16133 5179819 5426346 5565532 4638536 4712775 4432101 3800000 4428257 4850279 5097954 5471382
16123 5471382 5452729 5455788 4979028 4717777 5204165 6062065 5406509 5105790 4955148 5323684
16113 5323684 5509799 5212085 5284797 5550120 5326679 5059481 5499512 5659287 5370233 5206047
16103 5206047 5460730 5503833 5071789 5576825 5525996 5441799 5425288 5374539 6256106 5650730
16093 5650730 5019453 5364577 5525410 5144873 5041915 5360550 5927313 5542546 5216114
16084 5216114 5186962 5545930 4979539 4841558 5474817 5203019 5082952 5123435 5324389 5360906
16074 5360906 5230826 4918719 5113331 4996709 4356123 5381863 5492588 5607342 5060242
$$ packed form
16143E442846J25391j49506m75170k15590j0163q9619J79144J0131K37748J24607
16133E179819K46527J39186r26996P4239k80674o32101O28257M22022K47675L73428
16123E471382j8653L059m76760k61251M86388Q57900o55556l00719j50642L68536
16113E323684J86115k97714P2712K65323k23441k67198M40031J59775k89054j64186
16103E206047K54683M3103m32044N05036n0829q4197j6511n0749Q81567o05376
16093E650730o31277L45124J60833l80537j02958L18635N66763l84767l26432
16084E216114k9152L58968n66391j37981O33259k71798j20067M0483K00954L6517
16074E360906j30080l12107J94612j16622o40586J025740J10725J14754n47100
$$ plain form
16065 5060242 4845041 4831626 5462985 5374976 4941943 5569055 5471004 5324089 5487320 5037296
16055 5037296 5183908 5339794 5021542 4976958 5244858 5413776 5590257 5333629 5153154 6104263
16045 6104263 5828328 5629696 5785308 5697302 6018745 5745547 5552324 5321464 5707659 5923339
16035 5923339 5543536 5046157 4768817 4910165 5007401 4926530 4458857 4980623 4986757 4817078
16025 4817078 5807919 5677456 4987844 4677922 5490512 5589445 5313058 5114962 4873611 4905952
16015 4905952 5047476 5225144 5644850 6398714 6208150 5895133 5420622 4789180 5058889
16006 5058889 5779213 5844235 5051323 5383277 5439662 5498503 5795973 5609190 5465358 5294952
15996 5294952 5300328 5544641 5827612 5664937 5248080 5178314 5513828 5365624 5507636 4942193
$$ packed form
16065E060242k15201j3415O31359q8009m33033O27112r8051j46915J63231m50024
16055E037296J46612J55886l18252m4584K67900J68918J76481k56628j80475R51109
16045F104263k75935j98632J55612q8006L21443k73198j93223k30860L86195K15680
16035E923339l79803m97379k77340J41348R7236q0871m67673N21766O134j69679
16025D817078R90841j30463o89612l09922Q12590R8933k76387j98096k41351L2341
16015D905952J41524J77668M19706P53864j90564l13017m74511o31442K69709
16006E058889P20324O5022p92912L31954N6385N8841K97470j86783j43832j70406
15996E294952N376K44313K82971j62675m16857o9766L35514j48204J42012n65443
$$ plain form
15986 4942193 5132564 4975917 4809013 5039476 5547233 5726812 5445841 5146100 4908833
15977 4908833 5073882 5321320 5600093 5882849 5955312 6068036 5891192 5756933 5893366 5533059
15967 5533059 5493466 5784609 5703299 5473148 5764147 5540996 5608887 5852294 5660107 5643010
15957 5643010 5383856 5346037 5507367 5752716 5963154 6107086 5792882 5355015 5290067 5777512
15947 5777512 5338311 5027400 5314977 5950932 6079904 5545760 5040714 4841316 4544029
15938 4544029 4944876 5306902 5479674 5298541 5552618 5485137 5138959 5299056 4945928 5145653
15928 5145653 5504792 5418864 5362836 5139028 5443879 5144227 5136597 5352638 5429802 5550716
15918 5550716 5596809 5404860 5352762 5490027 6060954 6141699 5279799 5445737 5417286 5605915
$$ packed form
15986D942193J90371j56647j66904K30463N07757J79579k80971k99741k37267
15977D908833J65049K47438K78773K82756P2463J12724j76844j34259J36433l60307
15967E533059l9593K91143q1310k30151K90999k23151O7891K43407j92187j7097
15957E643010k59154l7819J61330K45349K10438J43932l14204m37867o4948M87445
15947E777512m39201l10911K87577O35955J28972n34144n05046j99398k97287
15938D544029M00847L62026J72772j81133K54077o7481l46178J60097l53128J99725
15928E145653L59139q5928n6028k23808L04851k99652p630K16041P7164J20914
15918E550716M6093j91949n2098J37265N70927Q0745q61900J65938k8451J88629
$$ plain form
15908 5605915 5634938 5781281 5608053 5885272 5758448 5861853 5881518 5771709 5494983 5759861
15898 5759861 5784851 5873854 5540711 5458189 5334230 5256696 4957767 4781700 5565358 5302122
15888 5302122 5362632 5044614 5296646 5576314 5242907 5086051 5067806 4820615 5431128 6082991
15878 6082991 6366334 6440533 6342355 5741075 5561815 5500704 5773136 5595550 5722192 5877456
15868 5877456 5798011 6104842 5750850 5783478 5667687 5257936 5358959 5408497 5393338 5707040
15858 5707040 5396812 5210211 5369054 5905547 6099435 5557994 5349676 5274092 5826708 5533435
15848 5533435 5421574 5207940 5789389 6238516 5733960 5539531 5616492 5515570 5436063 5778263
15838 5778263 5361882 4946237 5521740 5623654 5090182 5767470 5606491 5441067 5309349
$$ packed form
15908E605915K9023J46343j73228K77219j26824J03405J9665j09809k76726K64878
15898E759861K4990Q9003l33143q2522j23959p7534k98929j76067P83658k63236
15888E302122O0510l18018K52032K79668l33407j56856j8245k47191O10513O51863
15878F082991K83343P4199r8178o01280j79260o1111K72432j77586J26642J55264
15868E877456p9445L06831l53992L2628j15791m09751J01023M9538j5159L13702
15858E707040l10228j86601J58843N36493J93888n41441k08318p5584N52616k93273
15848E533435j11861k13634N81449M49127n04556j94429P6961j00922p9507L42200
15838E778263m16381m15645N75503J01914n33472O77288j60979j65424j31718
$$ plain form
15829 5309349 5386346 5631892 6128748 5988018 5817425 5255016 5620023 5977185 6087037 5762982
15819 5762982 5928738 6149542 5564161 5600471 5374486 5012851 5534522 5241480 5274735 5173991
15809 5173991 5487020 5405224 5111203 5376050 5182606 5621898 6369622 5880013 5237855 5297752
15799 5297752 5425021 5479354 5547796 6037287 6081615 5918222 5897037 5491255 5247258 5648505
15789 5648505 5171416 5211764 5443257 5712940 6061980 6224992 5680108 6112332 6034552 5520725
15779 5520725 6021120 6034688 5569168 5571489 5951728 5763439 5034567 5073356 5614770 5846720
15769 5846720 6066258 6057364 5918131 5434569 5689098 5315600 5948319 6296008 5737713 5631810
15759 5631810 5788941 5666552 5098014 5684492 6185890 6031814 6214949 5896748 6310961
$$ packed form
15829E309349P6997K45546M96856j40730j70593n62409L65007L57162J09852l24055
15819E762982J65756K20804n85381L6310k25985l61635N21671k93042L3255j00744
15809E173991L13029q1796k94021K64847j93444M39292P47724m89609o42158N9897
15799E297752J27269N4333O8442M89491M4328j63393k1185m05782k43997M01247
15789E648505m77089M0348K31493K69683L49040J63012n44884M32224p7780n13827
15779E520725N00395J3568m65520K321L80239j88289p28872L8789N41414K31950
15769E846720K19538q894j39233m83562K54529l73498O32719L47689n58295j05903
15759E631810J57131j22389n68538N86478N01398j54076J83135l18201M14213
$$ [...]
##END NTUPLES=NMR SPECTRUM
##END=
