##TITLE=1H_DE-80H_X3
 200.13MHz, d2o
 8 sc
 
 19ns.26.2.2025
##JCAMPDX= 6.0         $$ Bruker NMR JCAMP-DX V2.0
##DATA TYPE= NMR SPECTRUM
##DATA CLASS= NTUPLES
##ORIGIN= UXNMR, Bruker Analytische Messtechnik GmbH
##OWNER= pz
$$ XWIN-NMR		Version 3.5
$$ Tue Jun  9 10:38:14 2026 Russian Standard Time (UT+4h)  Yarkov@DPX200
##.OBSERVE FREQUENCY= 200.1313
##.OBSERVE NUCLEUS= ^1H
##.ACQUISITION MODE= SIMULTANEOUS
##.ACQUISITION SCHEME= undefined
##.AVERAGES= 8
##.DIGITISER RES= 18
##SPECTROMETER/DATA SYSTEM= spect
##.PULSE SEQUENCE= zg30
##.SOLVENT NAME= CDCl3
##.SHIFT REFERENCE= (INTERNAL, CDCl3, 0, 15.3635)
##AUDIT TRAIL= $$ (NUMBER, WHEN, WHO, WHERE, WHAT)
$$ ##TITLE= Audit trail, XWIN-NMR		Version 3.5
$$ ##JCAMPDX= 5.01
$$ ##ORIGIN= Bruker BioSpin GmbH
$$ ##OWNER= Yarkov
$$ C:/Bruker/XWIN-NMR/data/yarkov2/nmr/H-C/1/pdata/1/auditp.txt
$$ ##AUDIT TRAIL=  $$ (NUMBER, WHEN, WHO, WHERE, WHAT)
(   1,<2026-06-09 10:37:18.48 +0400>,<Yarkov>,<DPX200>,
      <created by zg, POWCHK disabled, PULCHK disabled
       configuration hash MD5:
       00 E9 B6 7A A2 85 ED C7 34 08 36 98 17 FE 4E 26
       data hash MD5: 16K
       86 27 57 38 EE E8 5F 9C 5F 0C 15 B4 B2 A1 F7 E7>)
(   2,<2026-06-09 10:37:25.89 +0400>,<Yarkov>,<DPX200>,
      <Start of raw data processing
       efp BC_mod = 2 LB = 0.25 FT_mod = 6 PKNL = 1 PHC0 = -6376.443 PHC1 = 8.221958 SI = 16K 
       data hash MD5: 16K
       39 A7 44 0C D2 E3 BF 18 44 6D 92 DE B6 E1 11 C5>)
(   3,<2026-06-09 10:37:30.78 +0400>,<Yarkov>,<DPX200>,
      <abs ABSG = 5 
       data hash MD5: 16K
       39 70 A1 B1 BA 07 77 0B 40 71 B6 47 8F CF 9A F2>)
$$ ##END=
$$ 
$$ hash MD5
$$ 7F CC 2B 49 6D 3D 63 94 93 38 EE 36 D9 6D 3C A4
##$RELAX= 
##$RELAX= 
##$RELAX= 
##$RELAX= 
##$RELAX= 
##$RELAX= 
$$ Bruker specific parameters
$$ --------------------------
##$DU= <C:/Bruker/XWIN-NMR>
##$EXPNO= 1
##$NAME= <H-C>
##$PROCNO= 1
##$TYPE= <nmr>
##$USER= <yarkov2>
##$AMP= (0..31)
100 100 100 100 100 100 100 100 100 100 100 100 100 100 100 100 100 100 
100 100 100 100 100 100 100 100 100 100 100 100 100 100 
##$AQSEQ= 0
##$AQ_mod= 1
##$AUNM= <au_zg>
##$AUTOPOS= <>
##$BF1= 200.13
##$BF2= 200.13
##$BF3= 200.13
##$BF4= 200.13
##$BF5= 200.13
##$BF6= 200.13
##$BF7= 200.13
##$BF8= 200.13
##$BYTORDA= 1
##$CFDGTYP= 0
##$CFRGTYP= 5
##$CHEMSTR= <none>
##$CNST= (0..31)
1 1 145 1 1 1 1 1 1 1 1 1 1 1 1 1 1 1 1 1 1 1 1 1 1 1 1 1 1 1 1 1 
##$CPDPRG= <>
##$CPDPRG1= <>
##$CPDPRG2= <>
##$CPDPRG3= <>
##$CPDPRG4= <mlev>
##$CPDPRG5= <mlev>
##$CPDPRG6= <mlev>
##$CPDPRG7= <mlev>
##$CPDPRG8= <mlev>
##$CPDPRGB= <>
##$CPDPRGT= <>
##$D= (0..31)
0 0.7 0 0 0 0 0 0 0 0 0 0.03 0 0 0 0 0 0 0 0 0 0 0 0 0 0 0 0 0 0 0 0 
##$DATE= 1780987037
##$DBL= (0..7)
120 120 120 120 120 120 120 120 
##$DBP= (0..7)
150 150 150 150 150 150 150 150 
##$DBP07= 0
##$DBPNAM0= <>
##$DBPNAM1= <>
##$DBPNAM2= <>
##$DBPNAM3= <>
##$DBPNAM4= <>
##$DBPNAM5= <>
##$DBPNAM6= <>
##$DBPNAM7= <>
##$DBPOAL= (0..7)
0.5 0.5 0.5 0.5 0.5 0.5 0.5 0.5 
##$DBPOFFS= (0..7)
0 0 0 0 0 0 0 0 
##$DE= 6
$$ [...]
##$SUBNAM3= <"">
##$SUBNAM4= <"">
##$SUBNAM5= <"">
##$SUBNAM6= <"">
##$SUBNAM7= <"">
##$SUBNAM8= <"">
##$SUBNAM9= <"">
##$SW= 18.0517328524113
##$SWIBOX= (0..15)
0 0 2 0 0 0 0 0 0 0 0 0 0 0 0 0 
##$SW_h= 3612.71676300578
##$TD= 16384
##$TD0= 1
##$TE= 0
##$TE2= 300
##$TE3= 300
##$TEG= 300
##$TL= (0..7)
0 120 120 120 120 120 120 120 
##$TP= (0..7)
150 150 150 150 150 150 150 150 
##$TP07= 0
##$TPNAME0= <>
##$TPNAME1= <>
##$TPNAME2= <>
##$TPNAME3= <>
##$TPNAME4= <>
##$TPNAME5= <>
##$TPNAME6= <>
##$TPNAME7= <>
##$TPOAL= (0..7)
0.5 0.5 0.5 0.5 0.5 0.5 0.5 0.5 
##$TPOFFS= (0..7)
0 0 0 0 0 0 0 0 
##$TUNHIN= 0
##$TUNHOUT= 0
##$TUNXOUT= 0
##$USERA1= <user>
##$USERA2= <user>
##$USERA3= <user>
##$USERA4= <user>
##$USERA5= <user>
##$V9= 5
##$VALIST= <valist>
##$VCLIST= <CCCCCCCCCCCCCCC>
##$VD= 0
##$VDLIST= <DDDDDDDDDDDDDDD>
##$VPLIST= <PPPPPPPPPPPPPPP>
##$VTLIST= <TTTTTTTTTTTTTTT>
##$WBST= 1024
##$WBSW= 4
##$XGAIN= (0..3)
0 0 0 0 
##$XL= 0
##$YL= 0
##$YMAX_a= 1014351
##$YMIN_a= -1149580
##$ZGOPTNS= <>
##$ZL1= 120
##$ZL2= 120
##$ZL3= 120
##$ZL4= 120
##$ABSF1= 15.47694
##$ABSF2= -2.574909
##$ABSG= 5
##$ABSL= 3
##$ALPHA= 0
##$AQORDER= 0
##$ASSFAC= 0
##$ASSFACI= 0
##$ASSFACX= 0
##$ASSWID= 0
##$AUNMP= <proc_1d>
##$AZFE= 0.1
##$AZFW= 0.1
##$BCFW= 0
##$BC_mod= 2
##$BYTORDP= 0
##$COROFFS= 0
##$CY= -3
##$DATMOD= 1
##$DC= 0
##$DFILT= <>
##$DTYPP= 0
##$F1P= 0
##$F2P= 0
##$FCOR= 1
##$FTSIZE= 16384
##$FT_mod= 6
##$GAMMA= 0
##$GB= 0
##$INTBC= 1
##$INTSCL= 3.241238e-09
##$ISEN= 128
##$LB= 0.25
##$LEV0= 0
##$LPBIN= 0
##$MAXI= 10000
##$MC2= 0
##$MEAN= 0
##$ME_mod= 0
##$MI= 1.114404
##$NCOEF= 0
##$NC_proc= -5
##$NLEV= 6
##$NOISF1= 3.799351
##$NOISF2= 2.8
##$NSP= 0
##$NTH_PI= 0
##$NZP= 0
##$OFFSET= 15.36346
##$PC= 1
##$PHC0= -6376.443
##$PHC1= 8.221958
##$PH_mod= 1
##$PKNL= yes
##$PPARMOD= 0
##$PSCAL= 0
##$PSIGN= 0
##$REVERSE= no
##$SF= 200.130031667642
##$SI= 16384
##$SIGF1= 3
##$SIGF2= 2
##$SINO= 0.751879
##$SIOLD= 32768
##$SREGLST= <19F.Aceton>
##$SSB= 0
##$STSI= 16384
##$STSR= 0
##$SW_p= 3612.71676300578
##$SYMM= 0
##$S_DEV= 0
##$TDeff= 16384
##$TDoff= 0
##$TI= <>
##$TILT= no
##$TM1= 0
##$TM2= 0
##$TOPLEV= 0
##$USERP1= <user>
##$USERP2= <user>
##$USERP3= <user>
##$USERP4= <user>
##$USERP5= <user>
##$WDW= 1
##$XDIM= 16384
##$YMAX_p= 435261207
##$YMIN_p= -733279
$$ End of Bruker specific parameters
$$ ---------------------------------
##NTUPLES= NMR SPECTRUM
##VAR_NAME=  FREQUENCY,     SPECTRUM/REAL,   SPECTRUM/IMAG
##SYMBOL=    X,             R,               I
##VAR_TYPE=  INDEPENDENT,   DEPENDENT,       DEPENDENT
##VAR_FORM=  AFFN,          ASDF,            ASDF
##VAR_DIM=   16384,         16384,           16384
##UNITS=     HZ,            ARBITRARY UNITS, ARBITRARY UNITS
##FACTOR=    0.220516191357247, 1,           1
##FIRST=     3074.68965369029, 0,            0
##LAST=      -538.027109315486, 0,           0
##MIN=       -538.027109315486, -733279,     0
##MAX=       3074.68965369029, 435261207,    0
$$ Real data points
##PAGE= N=1
##DATA TABLE= (X++(R..R)), XYDATA
$$ [...]
8233 -203029 -214310 -207493 -199278 -222051 -168052 -170999 -200585 -172457 -208075 -191343 -149247 -168516
8221 -168516 -170420 -163748 -171734 -141631 -173353 -211025 -163633 -149904 -172422 -210790 -219605 -195340
8209 -195340 -184191 -230618 -270325 -269746 -240145 -235524 -252670 -259749 -262935 -201732 -278963 -315598 -361333
8196 -361333 -323736 -346800 -366729 -511654 -226158 5733 -132434 -145912 -111853 -138869 -255108
8185 -255108 -264123 -209770 -149683 -138301 -133025 -174365 -140455 -153494 -118615 -61263 -68273 -135896
8173 -135896 -131918 -151699 -176560 -230096 -192166 -143151 -162508 -206951 -211387 -198885 -139984 -204979
8161 -204979 -238732 -272714 -291953 -281331 -312990 -261988 -212120 -238816 -227165 -221151 -264643 -208962
8149 -208962 -218861 -239326 -241723 -221132 -196949 -190307 -142822 -155635 -193102 -173307 -155577 -166403
8137 -166403 -162087 -204316 -189264 -185784 -216820 -169309 -135065 -109136 -131811 -194137 -250006 -219923
8125 -219923 -230296 -244247 -261889 -213243 -240541 -303147 -306224 -282042 -238026 -226546 -214433 -207524
8113 -207524 -216504 -177481 -164609 -202260 -277206 -217548 -198639 -216652 -218387 -197688 -157544 -183587
8101 -183587 -178175 -217042 -240469 -220971 -199785 -221515 -211070 -191745 -224679 -230737 -247846 -230179
8089 -230179 -260660 -208331 -191141 -188427 -156133 -114725 -174483 -164300 -132147 -100019 -130529 -173088
8077 -173088 -175561 -184972 -173584 -201173 -187431 -162159 -158855 -158130 -152965 -150883 -160165 -203250 -206745
8064 -206745 -169491 -126470 -123754 -116404 -135371 -104948 -128110 -166132 -245996 -231506 -168480 -146397
8052 -146397 -180368 -213447 -185990 -203614 -202667 -214060 -183027 -194152 -184766 -153858 -107928 -91530
8040 -91530 -158636 -136144 -106544 -141145 -121923 -164343 -126364 -133784 -132123 -78249 -117341 -134995
8028 -134995 -135361 -181451 -174343 -129319 -129805 -20889 -77782 -135130 -115755 -135420 -219922 -150934
8016 -150934 -149013 -136113 -136308 -143528 -94170 -61485 -79384 -133693 -180335 -131480 -172783 -182752 -206166
8003 -206166 -181086 -104696 -130749 -122603 -152220 -161135 -163823 -138025 -96955 -76958 -93375 -67350
7991 -67350 -73510 -90483 -92248 -164839 -179703 -110140 -105240 -118215 -99852 -95619 -99892 -111666 -99508
7978 -99508 -76003 -95496 -80050 -26000 -25897 -104194 -136391 -108967 -116818 -89561 -91748 -111119 -134824
7965 -134824 -116134 -129220 -108719 -175092 -141330 -105317 -119224 -100275 -120761 -71589 -99078 -144122
7953 -144122 -103326 -95585 -90121 -118614 -116968 -99264 -98316 -108235 -139904 -101884 -116318 -117816 -74365
7940 -74365 -102554 -130387 -136575 -142593 -120339 -147166 -137381 -72759 -65356 -138348 -206419 -181355 -131439
7927 -131439 -147579 -120041 -130735 -126919 -140833 -80661 -82166 -73761 -152017 -140856 -71772 -131805
7915 -131805 -161025 -131366 -111338 -90656 -86306 -125108 -44252 -23271 -68870 -32564 -52610 -58994
7903 -58994 -112482 -112801 -115093 -85351 -109464 -106322 -104375 -83525 -80420 -95789 -79690 -80905 -89478
7890 -89478 -136465 -159506 -154209 -126526 -122815 -110797 -76540 -69001 -91043 -61431 -28271 -72519
7878 -72519 -90996 -94320 -90691 -123360 -94749 -58575 -46256 -73448 -87167 -99731 -66987 -58091
7866 -58091 -102702 -68277 -66672 -76405 -110406 -71877 -85376 -90133 -78259 -51818 -64150 -87664
7854 -87664 -66526 -90178 -91852 -106941 -110631 -146084 -103682 -77688 -106533 -92589 -109221 -99651
7842 -99651 -99073 -154114 -110496 -66230 -84473 -122912 -126563 -112702 -142881 -152307 -166464 -171060 -149932
7829 -149932 -122882 -109620 -101342 -62995 -35461 -108169 -147751 -149961 -150197 -132003 -136110 -162835 -151662
7816 -151662 -158922 -155107 -162904 -189752 -229995 -225224 -216970 -232541 -345503 -171968 -100973 -113915
7804 -113915 -128580 -129405 -92127 -127439 -131282 -134437 -172356 -169404 -177877 -154283 -127701 -109486 -122588
7791 -122588 -156802 -174290 -139433 -159746 -151378 -138102 -128687 -108209 -174729 -162423 -144496 -141362
7779 -141362 -177760 -202637 -191048 -190178 -165841 -180843 -151673 -189301 -169399 -187239 -151349 -106622
7767 -106622 -133895 -127885 -123314 -171460 -203328 -197487 -205062 -143087 -138174 -147171 -151755 -166344 -192056
7754 -192056 -231248 -244225 -212876 -203075 -190957 -154399 -162767 -159199 -125133 -105148 -113508 -152287
7742 -152287 -179639 -205736 -174880 -151477 -86129 -157972 -208518 -148422 -157187 -179270 -145983 -141280
7730 -141280 -132017 -195840 -182629 -182598 -179796 -153213 -199054 -201546 -167336 -226275 -228749 -178262 -140700
7717 -140700 -166953 -181860 -158207 -171236 -176389 -157537 -214975 -170634 -185682 -218552 -193625 -190754
7705 -190754 -211451 -184775 -184469 -185779 -137507 -143508 -204479 -179193 -132961 -141601 -185637 -238628 -228106
7692 -228106 -158302 -164695 -217138 -201040 -127396 -129408 -140486 -155966 -153515 -188022 -181196 -119192
7680 -119192 -139629 -122262 -148850 -160591 -172740 -155380 -155270 -160251 -146638 -159554 -165992 -124935
7668 -124935 -102239 -124466 -132037 -131822 -104251 -128370 -131518 -147335 -132124 -133971 -92835 -99165 -96523
7655 -96523 -97743 -127085 -96015 -73539 -89678 -113988 -94981 -102786 -80357 -95993 -99051 -105062 -106852
7642 -106852 -49387 -69086 -138875 -165617 -153393 -133588 -135512 -103563 -95933 -126131 -138977 -93008
7630 -93008 -132785 -102661 -98653 -108370 -104931 -83668 -119825 -120793 -115170 -109587 -93842 -82480 -96117
7617 -96117 -81339 -68848 -89024 -93915 -62290 -105459 -40666 -31157 -80763 -111243 -5806 20846
7605 20846 -76704 -113281 -108887 -105136 -42578 -13753 3130 -15179 -43080 -45255 -66648 -47217
7593 -47217 -28013 -7606 -53197 -61894 -96138 -70524 -24521 -19267 -56625 -42808 -52560 -40557
7581 -40557 -15600 -32563 -34258 -47129 -67733 -93273 -55213 -19670 5498 -33131 -22192 -62214
7569 -62214 -41655 -2219 -72336 -106486 -62001 -4204 -29901 -30262 -63450 -81863 -46534 -30622
7557 -30622 -63003 -61214 -48210 2949 -1821 -21896 -61903 -69702 -31031 -10367 -12340 -37047 -15927
7544 -15927 -38522 -90010 -64834 -52769 -7149 -35258 -60345 -63370 -18042 53633 63396 25877
7532 25877 -55860 -40158 -18722 8722 -14201 -43606 -16635 21778 21459 -9604 9634 -56819
7520 -56819 -47825 -48809 -35911 -79363 -45180 -21406 20072 15068 20047 -14311 -16621 -23674 -58957
7507 -58957 -55919 -47468 -42638 -40961 4242 -48972 -65396 -39650 -22621 15662 38677 21677 23432
7494 23432 -27101 -10989 5517 51238 -21335 -64229 -86159 -77746 -78131 -62742 -22768 58985
7482 58985 27001 -22163 -12057 -15136 -53816 -107234 -64518 -9108 -20909 -84741 -60725 -71407
7470 -71407 -81742 -74094 -19407 11091 -29429 -58451 -57558 -57266 -23030 -24479 -18343 -12832 -45898
7457 -45898 -17919 -11872 -5557 10307 15301 -2006 -20064 29027 8867 -95985 -119939 -43489
7445 -43489 -8787 34871 33285 21139 -20303 27128 40410 66539 95403 100046 126521 90917
7433 90917 84675 68449 79641 124170 44582 -3269 52167 62533 17378 -12017 -25080 -44831
7421 -44831 2649 7090 4414 -14193 36306 112457 91847 19516 31513 5001 -9970 46318
7409 46318 63233 25565 24579 25852 -28665 -29299 -28484 -21562 -19055 68875 71334 530 15872 -1968
7395 -1968 -24245 -12166 34570 65307 17437 -32748 -13119 22713 -5033 -47377 -63536 -45617
7383 -45617 -52686 -48457 -3178 -48873 25834 -745 51232 14785 -15813 12829 11547 -5219
7371 -5219 -16326 19662 95634 64659 -22068 18837 3229 28519 23618 8643 -28413 -25244
7359 -25244 -59552 -4287 3871 -25231 18727 20425 -64197 -72864 -51006 -58342 -38661 -51436 -57795
7346 -57795 -44794 41275 14742 -28521 -11285 15569 -6451 -1672 -23222 -72475 -72435 -34400 18240
7333 18240 -9233 -20590 -53247 -71555 -56133 -56037 4609 5195 19543 8603 49366 35377 -9974
7320 -9974 -23032 -56152 -34058 -53716 -47256 -47670 -55155 13076 10466 1724 -3255 -19364 33580
7307 33580 -32756 -28364 -428 -37737 -66404 -82570 -102285 -71339 -16391 -9721 -58187 -70893
7295 -70893 -42446 -28564 -37797 -39486 -73959 -50375 13120 -10172 -27192 11548 -26216 -28482
7283 -28482 18499 -27934 -39217 -50061 -85190 -56811 -14064 31182 29995 25855 14332 -4639
7271 -4639 16871 3131 -59477 -57063 -75721 -88357 -54944 -52572 -52572 -75793 -66232 -31761 -42091
7258 -42091 -46215 -71327 -70536 -29589 11738 2980 -40025 -59759 -77894 -71854 -62743 -87275 -27919
7245 -27919 -47711 -56146 -45855 -45929 -21299 -89524 -125185 -92773 -43907 -36835 -63096 -55725 -73843
7232 -73843 -88734 -66891 -80668 -105023 -43053 36100 23261 12763 -25258 -29439 -18306 4917
7220 4917 -50022 -101623 -140361 -102648 -51764 -71916 -37155 1942 -9812 353 -42780 -59402
7208 -59402 -44370 -18664 -53116 -68117 -112862 -79800 -14040 -49448 -27686 -25559 -23340 -9658
7196 -9658 11462 -11275 -4155 -74488 -59397 -15864 43984 4933 -65123 -26917 -31956 190
7184 190 41843 23084 14033 5432 42480 96826 52469 -320 -14980 -3195 9865 5141 6237
7171 6237 -21467 -50411 -75067 -23125 -12644 -67135 -65078 -48287 -14010 892 30625 23435
7159 23435 8246 -7109 -30727 -80804 -73205 -79790 -77016 -51058 -41499 -61853 -55574 -30063 -23761
7146 -23761 -53757 -28086 -7227 2970 -34689 -48425 10063 -10296 -7885 5184 -20298 17662
7134 17662 -31062 -47666 -20444 -52879 -42371 -50411 -33814 4176 -8427 -19059 -33941 -68859
7122 -68859 -35049 -24553 -53373 -23483 17359 2175 2497 -10508 -15721 -1607 -4991 6543 43007
7109 43007 -9089 -11620 -14307 18269 381 -56645 -49157 -10973 2346 5823 43681 22960 -3001
7096 -3001 13811 32091 37690 50134 73291 77962 30557 -53838 -51425 -7408 -16095 -30161 -7028
7083 -7028 -33847 -11474 15133 -28005 6582 -3439 38425 -5939 -1449 1929 -19925 -18043 -38077
7070 -38077 25658 19194 7355 4965 -22585 -33129 -34544 -3691 -3908 24492 24717 20602 48488
7057 48488 23774 -5769 39513 54358 37600 18494 -15453 8204 30719 56348 33224 -26551
7045 -26551 -15048 36988 20760 21624 28735 37459 18549 -6001 2546 17485 50908 54350 23623
7032 23623 27559 62441 65286 78862 105337 109987 105720 131898 159079 125959 135132 119153 90395
7019 90395 63402 57241 35302 -34313 30531 62957 42334 8197 21279 62422 71848 65443
7007 65443 68228 80292 76364 36387 17746 60886 28194 -5544 -28265 -42066 -16638 60431
6995 60431 93779 122654 71259 56318 41203 70345 82130 34472 74608 25618 18456 52145
6983 52145 78067 65170 48797 42622 74057 118818 132148 131931 100144 82851 78390 51967 35725
6970 35725 69164 106505 121594 105631 97645 100463 95031 66046 139701 119938 49792 23913
6958 23913 -3022 91747 105659 80323 109709 82959 36401 75334 101690 88957 112656 61630
6946 61630 83713 82763 97881 89128 33803 32818 73241 126678 83046 73971 95349 99922 105003
6933 105003 133367 120594 107141 108010 117593 130086 106963 113585 128864 106303 75474 134859
6921 134859 171522 143570 94372 43811 80197 80979 98186 74207 36165 66238 37486 23993
6909 23993 73869 75508 75036 85414 70492 42133 56638 123833 110991 123399 103608 111475 119366
6896 119366 90771 131926 130300 157329 113890 75918 84739 98041 58152 104807 100731 107067
6884 107067 121560 99752 109202 109649 83787 83584 75986 62610 49247 69753 52605 58536 64076
6871 64076 60214 56508 55475 73555 122161 134384 150813 165326 163411 194641 147770 72916 59544
6858 59544 70501 41466 130694 133589 72210 85763 77312 94761 85690 68675 87139 79758 95220
6845 95220 118873 138432 85637 124718 129987 94464 135018 148720 153090 135405 114572 97136
6833 97136 57776 94676 115941 121250 110830 64783 53128 99683 76037 112711 130068 86478
6821 86478 73054 69857 127982 126640 95213 62647 79334 63454 63083 46129 53780 75730 95706
6808 95706 72423 51680 58283 26039 64827 94783 67352 83971 99809 95557 98907 78557
6796 78557 54946 55830 118503 75178 54580 133311 120887 102034 79252 56634 98018 82523
6784 82523 84852 86809 131355 107291 148435 145897 145370 97599 69931 63566 96574 108062 108352
6771 108352 158835 128136 102132 90179 63046 59693 52662 4189 31870 57096 39157 52448
6759 52448 63487 130075 140994 85358 93944 116929 97592 82883 110109 102343 36412 55169
6747 55169 92840 92791 51388 16752 27661 19644 48585 48599 32627 98201 146575 83046 85039
6734 85039 35975 79891 101552 73544 81431 87471 83317 170461 178671 134509 64672 77034 33696
6721 33696 52243 125204 116879 114341 101347 108645 80456 117575 160470 89102 110323 105175 119612
6708 119612 68903 44821 72617 110413 164463 146011 158132 107548 98551 87705 74493 123601
6696 123601 134274 131080 131927 184355 225607 210942 178606 95941 107833 81159 132129 185553
6684 185553 199126 163896 142913 121650 61538 113976 168794 178618 222932 226631 227326 207082
6672 207082 251440 230926 217289 224303 242335 218074 193913 251812 270906 278988 289251 267566
6660 267566 230237 249323 299562 319104 295073 331468 328657 353304 378457 422636 441210 433455
6648 433455 476896 539049 594646 603203 631739 634728 662782 738321 789010 784556 864476 916770
6636 916770 950149 1000601 1010410 1043964 1030270 1065734 1064307 1058118 1036539 1018197 959798 936742
6624 936742 927145 914452 888485 838275 766335 719194 700483 638236 610417 614813 546370 508432
6612 508432 456334 440040 424773 428102 408790 393281 423685 401222 356957 312124 296191 298631
6600 298631 282741 302102 318207 256375 247144 270219 287561 311338 314467 273035 237357 221043
6588 221043 238797 210900 224563 194375 207759 185817 200453 243775 249177 182704 170164 237185
6576 237185 289036 264811 240303 244217 252952 239515 232540 248871 226916 240842 244621 260103
6564 260103 255347 199421 201130 194706 165950 152137 116931 139487 139839 208008 228776 201375 157302
6551 157302 138842 160585 181620 182606 176542 192532 175068 203142 206137 181971 146780 101598
6539 101598 113910 109768 115013 167886 166701 212556 198182 172620 116737 147773 165070 133976
6527 133976 131018 110678 139526 170401 167684 174260 186627 170775 125304 111820 112625 86383 163742
6514 163742 182171 196149 207888 219168 207307 144619 149993 154413 190106 237200 203294 164189
6502 164189 125098 166615 213474 155696 130690 167917 194207 230820 230594 199652 189015 166101
6490 166101 168670 114875 107315 133359 113376 139563 184122 183076 146896 153354 161907 162474 135089
6477 135089 178813 199667 197241 217354 238188 258685 228186 192532 167583 193897 247430 193781
6465 193781 192537 152065 138702 148265 171986 178121 165383 177008 177922 229677 186257 199987 210697
6452 210697 203804 211865 220868 195931 221667 245552 237028 251054 227032 237933 228894 239876 263926
6439 263926 232891 256155 262253 212305 234838 265877 274637 295093 245168 272950 307419 336020
6427 336020 366080 292266 265974 280313 291500 277381 294744 290252 262628 303987 304789 280056
6415 280056 304396 273600 278084 275178 310894 318375 342922 378895 382773 343810 378916 390276
6403 390276 399488 414434 425024 472079 484955 503329 533124 550196 550632 546689 547320 586441 618613
6390 618613 679701 704928 722406 668601 668314 722908 696298 666767 657245 658111 643969 622320 578452
6377 578452 504851 532195 538269 533285 552200 565401 576454 618105 678719 747458 750095 703790
6365 703790 737694 828904 875396 899959 889554 866996 848551 832378 807253 782699 783559 789538
6353 789538 696600 681896 699337 653228 673775 688992 669819 681420 678876 662700 692107 765914
6341 765914 822599 857286 923878 997086 1026908 1067698 1107745 1124960 1165007 1134313 1100213 1074749
6329 1074749 1013116 1003575 1057040 1009227 980071 975558 1018851 1007112 998681 1077529 1182715 1236562
6317 1236562 1236351 1344651 1468061 1554750 1613391 1647289 1699359 1729598 1719873 1740337 1813462 1763901
6305 1763901 1731808 1738964 1726298 1755333 1776732 1781609 1775115 1719075 1750097 1738265 1665578 1607545
6293 1607545 1646033 1705221 1658050 1641076 1649535 1699172 1685106 1746520 1794005 1848240 1879376 1940408
6281 1940408 1973925 2059641 2102214 2167973 2210973 2262454 2259663 2293657 2299611 2233874 2264938 2237517
6269 2237517 2180356 2125417 2110274 2123443 2054233 2034693 2006742 2003905 2025791 2061215 2032550 2026604
6257 2026604 2091051 2094598 2168725 2251575 2293079 2380406 2384640 2459064 2606090 2656558 2777073
6246 2777073 2839033 2884386 2909334 2875873 2849138 2756051 2650135 2584595 2472775 2435518 2332680
6235 2332680 2340770 2324580 2364626 2405024 2481586 2545620 2545042 2549128 2484960 2467522 2524088 2473886
6223 2473886 2422381 2386156 2345518 2354865 2380119 2347170 2283846 2218367 2206677 2223181 2244560 2247573
6211 2247573 2239187 2311415 2271350 2288702 2345807 2341268 2336735 2401380 2509902 2567172 2581415 2685602
6199 2685602 2825960 2979003 3113546 3254299 3494896 3744858 4137313 4578295 5207031 5948318
6189 5948318 6756647 7341983 7695891 7766345 7581435 7296194 6795739 6339309 5916317 5459516
6179 5459516 5154708 4906771 4636705 4487113 4395749 4279692 4261567 4267406 4306050 4402992 4557534
6168 4557534 4751751 4888080 5104225 5341211 5752739 6379155 7088903 7994736 9081736
6159 9081736 10012176 10731535 11092070 10999013 10656706 10142936 9556580 9012654 8497477 8008270
6149 8008270 7580673 7251624 7013978 6828303 6735775 6648887 6564726 6519938 6558516 6587401 6683928
6138 6683928 6863382 7004929 7187365 7476941 7854300 8269144 8812753 9417326 10153493 11064277
6128 11064277 12149725 13557842 15321154 17470759 20181738 23042499 25528509 27365179
6120 27365179 28251466 28111069 27194033 25604552 23763227 22071021 20440184 18971016 17749045
6111 17749045 16891930 16336355 15955874 15876343 15848547 16060478 16445819 17026375 17754242 18698808
6101 18698808 19779651 21000131 22441624 24291324 26706777 29814595 33749958 38356680
6093 38356680 43135974 47558315 51197483 54063721 56309381 58438900 60900123 64053753
6085 64053753 67916797 72084664 75992934 79234322 81472895 82389413 81830110 79776401
6077 79776401 76422451 72086381 67235532 62311850 57569861 53327904 49818749 46969124
6069 46969124 45010338 43877495 43558321 43991925 45302332 47554315 50960502 55712633
6061 55712633 62259975 70785644 81059548 92067257 102195046 109576578 112985293 112143652
6053 112143652 107456922 99830276 90414971 80416348 70676765 61620054 53592408 46790717
6045 46790717 41128779 36408434 32583642 29418127 26778291 24592967 22740263 21177132
6037 21177132 19844354 18754305 17873085 17143910 16565424 16121959 15894629 15845685 15860910
6028 15860910 15944535 16063306 16196284 16216603 16129669 16070770 15956609 15794471 15617948 15417989
6018 15417989 15167160 14858469 14569415 14513796 14569937 14737524 14781644 14721755 14592748 14347247
6008 14347247 14016779 13719894 13477355 13246576 13142818 13068467 13039229 12989662 12815026 12691662
5998 12691662 12611113 12595567 12669995 12808068 13212292 13899230 14943649 16346311 17874600
5989 17874600 19344798 20552673 21221408 21398296 21118611 20439163 19567215 18537937 17479798
5980 17479798 16519380 15681453 14905854 14403374 14113139 13963681 14082896 14376232 14908659
5971 14908659 15598257 16414503 17208825 18006185 18709259 19324544 19845378 20196345 20342839
5962 20342839 20389459 20329189 20224015 20078093 19996867 19922831 20012250 20154445 20386135 20804946
5952 20804946 21449567 22309375 23420364 24585398 25722806 26761443 27480123 27995546 28297384
5943 28297384 28484055 28545593 28572994 28525001 28387843 28254326 28244600 28330921 28481269 28724699
5933 28724699 28979842 29077443 29014657 28904672 28764376 28519216 28404402 28363046 28362699 28491153
5923 28491153 28585379 28671713 28778813 28884293 28981632 28978930 28896441 28672573 28404701 28160856
5913 28160856 27918302 27698219 27635733 27710427 27767432 27745260 27626699 27384853 26931675 26257948
5903 26257948 25447381 24465549 23423239 22485171 21597915 20774659 20192486 19710686 19196681
5894 19196681 18778699 18385524 18046908 17773827 17634544 17577363 17527541 17438015 17230492 16993937
5884 16993937 16630965 16267962 15976238 15624601 15172917 14650765 13995239 13247621 12443157
5875 12443157 11570214 10698614 9863853 9151791 8544888 8041330 7552922 7174037 6911364
5866 6911364 6809700 6798404 6805316 6820664 6827690 6845688 6817676 6672954 6515097 6240752 5876981
5855 5876981 5546073 5239174 4908962 4650530 4396162 4131346 3948400 3833244 3690844 3598001
5845 3598001 3442080 3317261 3225937 3174508 3151537 3094899 3034285 2936117 2873166 2856660 2797649
5834 2797649 2743846 2735554 2680795 2659181 2624638 2588167 2548069 2488163 2481227 2526713 2476469 2431963
5822 2431963 2473524 2461236 2453239 2455337 2405614 2388542 2354644 2344648 2300455 2320083 2276419 2212364
5810 2212364 2235697 2250329 2241055 2246376 2214508 2201024 2147364 2116654 2090122 2089414 2041530 2031921
5798 2031921 2023329 1966112 1937816 1916414 1885723 1832303 1828985 1835485 1847355 1773365 1762757 1739636
5786 1739636 1714935 1730368 1706499 1733665 1794534 1806251 1854362 1881382 1881057 1875690 1899706 1937689
5774 1937689 2003476 2018194 2013436 2047186 2049736 2045224 2069003 2096820 2047399 2013083 1964417 1922624
5762 1922624 1856894 1758626 1775483 1850646 1748334 1724678 1783514 1760249 1734260 1717634 1690850
5751 1690850 1761422 1757356 1755115 1768219 1752283 1732635 1774098 1805466 1867951 1874116 1829744 1864017
5739 1864017 1793610 1713463 1739683 1679371 1572479 1522360 1524650 1506285 1484622 1499045 1525292
5728 1525292 1514063 1473001 1473011 1467073 1497149 1468668 1432843 1448348 1407758 1382157 1397545 1357961
5716 1357961 1397289 1423187 1504980 1574136 1606025 1607141 1652052 1682872 1641749 1555025 1509674 1520322
5704 1520322 1521756 1506116 1471130 1475619 1478746 1468010 1434183 1461559 1477887 1459687 1472884 1476529
5692 1476529 1479536 1455235 1508484 1514471 1544351 1572971 1535844 1551011 1527314 1559221 1633928 1638175
5680 1638175 1662547 1701120 1726902 1684971 1652473 1615474 1589381 1552748 1550483 1548741 1590163 1570964
5668 1570964 1532568 1513842 1483297 1517144 1540046 1524522 1550036 1549739 1572583 1648847 1613929 1578718
5656 1578718 1561609 1597783 1607470 1654735 1655631 1626400 1624084 1625338 1670613 1711747 1721798 1699011
5644 1699011 1696064 1692417 1656199 1675949 1698988 1719973 1725471 1703578 1729820 1749182 1738517 1735610
5632 1735610 1753793 1751981 1804192 1816626 1792839 1841946 1862486 1815189 1867338 1926473 1934655 1917123
5620 1917123 1932874 1933328 1987916 1995864 1991093 2027968 1986656 1999043 2024232 2023075 2030235 2075867 2080888
5607 2080888 2095665 2073394 2067547 2046364 2044774 2066470 2088322 2118776 2082869 2106506 2140223 2118262
5595 2118262 2096158 2085127 2092935 2153419 2114005 2104627 2157546 2136351 2177248 2203457 2239570 2262218
5583 2262218 2282442 2249042 2257502 2263412 2318702 2430297 2522336 2515529 2517640 2503110 2544150 2570104
5571 2570104 2557489 2645451 2694935 2741806 2759315 2755729 2792665 2820390 2844365 2876190 2864542 2862276
5559 2862276 2811429 2834806 2873918 2884973 2882783 2853760 2834339 2863130 2928444 2947387 2933130 2938722
5547 2938722 2922398 2960893 2979612 2998674 3005320 3013528 3050447 3012303 3034472 3071125 3078011 3024129
5535 3024129 3024598 2984328 2913669 2895984 2870956 2865714 2866232 2877735 2881584 2845325 2874133 2889928 2923236
5522 2923236 2972465 2974340 3028577 3053622 3071833 3067824 2986607 3024829 2997911 2950760 2987693 2978203
5510 2978203 2938316 2916035 2917898 2907680 2908785 2903204 2871162 2877645 2877716 2835460 2847671 2873029 2903709
5497 2903709 2955196 2967538 2987988 3030002 3065812 2999699 3000757 3032949 3013907 3026438 3011151 2994707
5485 2994707 2978610 2971720 2999513 2984332 2948269 2956891 2945669 2947294 2967914 3001360 3002244 3001482 2991157
5472 2991157 3052297 3096526 3007029 2987216 3025577 3005472 3032793 3000137 2957105 2951591 2996511 3001880
5460 3001880 2971073 2962684 2926784 2899182 2950137 2984123 2968570 2982413 2949651 2967947 2986813 2986203
5448 2986203 2997200 2998435 3017953 2985985 2990641 3045497 3061742 3057058 2990784 2952559 3012669 3033469
5436 3033469 3032284 3054978 3064861 3045349 3054253 3050001 3049444 3039266 3049636 3010426 3036158 3109483 3087868
5423 3087868 3070573 3131373 3104927 3116222 3110186 3084954 3076268 3112479 3181377 3200433 3197657 3174228
5411 3174228 3162738 3182208 3159827 3117161 3072394 3115069 3153301 3126628 3083959 3048005 3087555
5400 3087555 3139771 3159975 3152013 3133854 3118924 3126180 3156623 3156974 3162144 3190190 3180039 3129003
5388 3129003 3161940 3181895 3190999 3130165 3077969 3078034 3088734 3127064 3169763 3191627 3200804 3230986
5376 3230986 3215820 3261186 3224957 3170679 3157794 3162058 3152163 3143812 3175701 3151869 3153217 3178681
5364 3178681 3157776 3203136 3145428 3136910 3106775 3129952 3176173 3162345 3158919 3145440 3150935 3193940
5352 3193940 3199348 3206108 3197254 3191122 3192599 3187280 3171117 3164337 3161907 3221812 3244725 3299159 3255645
5339 3255645 3246574 3250174 3325893 3322295 3295986 3297326 3283751 3265404 3267088 3277611 3310332 3355668
5327 3355668 3329280 3337952 3336656 3335308 3314688 3263904 3271124 3304459 3283312 3275938 3263336 3241449
5315 3241449 3221451 3172650 3217808 3248742 3251904 3219749 3198983 3231884 3198191 3195221 3142833 3128813
5303 3128813 3163641 3213435 3209309 3241479 3257311 3248631 3273389 3294103 3282265 3288840 3318329 3359346
5291 3359346 3353440 3378869 3375686 3376485 3397071 3371476 3339166 3352188 3389356 3377271 3398046 3430581
5279 3430581 3470621 3530612 3519477 3528414 3453788 3451760 3437000 3491918 3433791 3387199 3393917 3352821
5267 3352821 3330091 3270310 3231369 3212152 3200675 3198340 3231532 3263034 3302463 3313494 3285156 3207244
5255 3207244 3177915 3155944 3177796 3181813 3140631 3124012 3188575 3186658 3131901 3158439 3169465 3137680
5243 3137680 3135358 3137615 3074836 3023292 2993450 2967416 2924545 2893932 2880875 2859251 2838138 2820224
5231 2820224 2860267 2918889 2893275 2919198 2902311 2907838 2915644 2936026 2931038 2952156 2931308 2957763
5219 2957763 3025080 2986913 2967073 3010252 3020632 2948408 2937195 2939818 2987226 3046091 3051160 3068354
5207 3068354 3063899 3033156 3066124 3014560 3046165 3092760 3134087 3154940 3118319 3068372 3085285 3102183
5195 3102183 3110157 3086351 3078804 3115762 3166132 3224447 3250408 3226515 3262100 3302213 3289156 3218284
5183 3218284 3268464 3261900 3281938 3325961 3336194 3354481 3337807 3366217 3326468 3342059 3331444 3304624
5171 3304624 3317370 3340880 3274633 3225728 3220505 3218271 3151653 3190623 3162468 3140641 3076796 3070050
5159 3070050 3039215 3017736 3129247 3159783 3153218 3116028 3086902 3134413 3195630 3209454 3205231 3235629
5147 3235629 3203670 3180077 3248150 3202111 3189300 3145025 3127387 3158996 3200473 3237511 3181608
5136 3181608 3148735 3147980 3191999 3180896 3222138 3288028 3338119 3334647 3305852 3316069 3361107 3380652
5124 3380652 3393066 3425684 3433800 3418783 3405514 3449753 3460003 3540013 3614472 3629776 3599720 3616840
5112 3616840 3668259 3715203 3753102 3768041 3825387 3888522 3934011 4019311 4066273 4111971 4139975
5101 4139975 4156474 4120647 4156352 4124024 4135418 4063305 4047850 4044453 4086063 4062134 4082621 4081513
5089 4081513 4128455 4150614 4162160 4230238 4264554 4284578 4308989 4281259 4232888 4230760 4272832 4251668
5077 4251668 4185483 4173655 4096910 4085553 4126350 4078137 4022265 4012774 3995218 4056905 4075775 4061474
5065 4061474 4141331 4191384 4198175 4248186 4173301 4206750 4268002 4271459 4245254 4269747 4278576 4321180
5053 4321180 4312365 4260294 4266101 4354828 4382794 4419576 4394105 4432585 4459589 4487090 4507058 4528116
5041 4528116 4541758 4560464 4591723 4627451 4634215 4646340 4632088 4661908 4703983 4745438 4780528 4821764
5029 4821764 4831821 4947835 4941501 5017449 5070271 5146431 5156535 5250039 5391274 5477271 5591426
5018 5591426 5663193 5754933 5821431 5947116 6056577 6189663 6320185 6521462 6586933 6672304
5008 6672304 6749562 6851984 6930112 7025942 7128870 7246006 7322438 7413107 7462680 7514007 7615146
4997 7615146 7715039 7867390 8004602 8181471 8357736 8483222 8680684 8787532 8972457 9178047
4987 9178047 9357096 9562499 9742505 9853062 10024943 10162549 10278990 10380169 10499438 10550627
4977 10550627 10627690 10720741 10760165 10878673 10998080 11082320 11170271 11288807 11375010 11521643
4967 11521643 11689269 11903151 12140633 12318621 12580545 12808536 13148507 13523948 13853241
4958 13853241 14263059 14758948 15198702 15674643 16283649 16856118 17476253 18195844 18965237
4949 18965237 19815980 20771562 21797664 22924873 24091927 25389272 26791515 28227692
4941 28227692 29700956 31318485 32869860 34448543 36181000 37973190 39928595 42065264
4933 42065264 44291504 46813594 49523143 52400841 55512769 58970545 62662257 66636944
4925 66636944 70828884 75112693 79455676 83777122 88073037 92267064 96177743 99745929
4917 99745929 103043217 105975431 108484359 110656557 112518480 114017028 115381275 116578323
4909 116578323 117759089 119089593 120599692 122367619 124420167 126859435 129814832 133292097
4901 133292097 137511374 142485871 148146354 154336206 160793327 167174715 173075046 178058939
4893 178058939 181981144 184622326 185936512 186143554 185207102 183268367 180397724 176715972
4885 176715972 172511788 167817101 162904676 158072028 153441618 149261948 145586251 142470730
4877 142470730 140001567 138187797 136970461 136445340 136525416 137142174 138104058 139145229 139927259
4868 139927259 140114036 139461298 137790920 135167846 131734732 127577262 122801501 117610522
4860 117610522 112078257 106425396 100813365 95542492 90816131 86508008 82664347 79067073
4852 79067073 75792095 72793523 70004365 67468480 65257903 63434866 61903960 60713900
4844 60713900 59752961 59029541 58538373 58243336 57997518 58038640 58399387 59120126 60265825
4835 60265825 61747938 63395097 64851628 65775146 66019352 65595997 64555496 63094114 61503869
4826 61503869 59905249 58410475 57217383 56414727 55964715 55898836 56256452 57171802 58550038
4817 58550038 60235145 62212579 64084120 65538807 66409543 66504219 65898584 64566660 62858501
4808 62858501 61072862 59450772 58147479 57180624 56520944 56035757 55717805 55543439 55272970
4799 55272970 54714997 53790455 52491226 50769754 48807994 46689737 44415096 42191422
4791 42191422 40075549 38105726 36328428 34937143 33730396 32722439 31921621 31269306
4783 31269306 30823716 30487652 30181129 29915021 29649822 29372285 28990436 28642340 28285211
4774 28285211 27935405 27595881 27363133 27243982 27197653 27343471 27686553 28317293 29347890
4765 29347890 30726518 32459735 34259006 35779513 36668838 36838921 36275453 35076188 33496093
4756 33496093 31846922 30202240 28797905 27685438 27009970 26790176 27148158 28035572 29260310
4747 29260310 30566458 31633709 32116028 31910688 31074014 29570179 27707729 25725406 23722325
4738 23722325 21799308 20046107 18564128 17281602 16252501 15439415 14794090 14261304 13807795
4729 13807795 13422217 13184129 12954517 12700855 12498183 12278718 12126937 11876787 11644898
4720 11644898 11400693 11254217 11121375 11079835 10993166 10977923 10979952 10925838 10954015 11010959 11128951
4709 11128951 11259504 11368251 11540690 11808418 12153969 12475244 12893890 13466261 14148168
4700 14148168 14913048 15920882 17108787 18588371 20351394 22378318 24487952 26443691
4692 26443691 28051678 29131256 29594611 29390498 28724689 27742713 26584932 25471309 24502472
4683 24502472 23782801 23350738 23362202 23748286 24563757 25915323 27777125 29876589 32030629
4674 32030629 33979695 35528374 36533448 37121538 37300716 37202475 36825960 36272541 35498398
4665 35498398 34582466 33703542 32860842 32190152 31720672 31693814 32050581 32753763 33775628
4656 33775628 34839090 35781081 36442501 36723142 36720473 36508814 36352791 36422175 36838183 37737016
4646 37737016 39234158 41323157 43909593 46799792 49952173 52948437 55536359 57487206
4638 57487206 58757170 59317669 59400351 58967236 58226878 57185842 55926542 54397846 52532442
4629 52532442 50325385 47885461 45412262 43038812 40945155 39284934 38112324 37440076
4621 37440076 37093871 36952845 36697034 36394380 36000021 35607350 35404124 35497682 36039231 37033242
4611 37033242 38524524 40263405 42160689 44027010 45753639 46996602 47782555 48039618
4603 48039618 47863297 47362187 46670888 45733303 44691149 43541841 42297805 40949090 39509358
4594 39509358 37917921 36203649 34559035 33014712 31716747 30767390 30171509 29769992 29346220
4585 29346220 28753322 28006806 27012315 25814304 24562983 23418161 22534660 21834702 21545310
4576 21545310 21554621 21825472 22419431 23060612 23599609 23877142 23846954 23381602 22453457 21256535
4566 21256535 19877674 18325705 16724433 15223774 13899186 12751150 11759116 10893524
4558 10893524 10093403 9437288 8915232 8421173 7963115 7583089 7240710 6906035 6692290
4549 6692290 6402277 6143309 5901842 5718579 5568722 5461238 5371114 5206298 5066063 4955024
4539 4955024 4852719 4784676 4710217 4572045 4503614 4441646 4279518 4211475 4128435 4088497 4027138
4528 4027138 4053099 3978779 3920405 3907264 3818940 3774455 3723807 3701972 3643638 3638127 3625096 3571924
4516 3571924 3554188 3505105 3443673 3396672 3381784 3323061 3256149 3247673 3252606 3208198 3134722 3128250
4504 3128250 3146684 3132266 3011148 3029157 2952210 2915796 2914950 2913334 2857547 2888775 2891739 2883673
4492 2883673 2911897 2900119 2896628 2878285 2924032 2941064 2935712 2919078 2925245 2989664 3003492 3016792
4480 3016792 3079045 3125419 3188890 3330918 3594552 3977330 4445440 4911874 5207728 5296385
4470 5296385 5196911 4958037 4692464 4379526 4099004 3872758 3652690 3440812 3278313 3159901
4460 3159901 3146434 3153960 3158491 3119616 3023036 2959358 2930508 2911145 2858528 2820478 2753003 2749194
4448 2749194 2748191 2735848 2803288 2731022 2699305 2731592 2741805 2716030 2654031 2633017 2571075 2444222
4436 2444222 2426754 2431664 2367657 2361774 2329754 2342626 2334444 2342220 2336171 2352849 2337133 2376081
4424 2376081 2349060 2366640 2400679 2372178 2339413 2351736 2427671 2451886 2353766 2335438 2396694
4413 2396694 2431382 2459228 2414337 2441097 2492816 2511919 2464375 2530679 2563827 2627207 2667498
4402 2667498 2700119 2711478 2728699 2748288 2743912 2751082 2775556 2821880 2810119 2850778 2865172 2938550
4390 2938550 2918571 2968666 3082566 3137175 3184891 3204270 3231824 3284355 3324191 3324062 3351980 3307935
4378 3307935 3321853 3256136 3244479 3186323 3164573 3253742 3285193 3332938 3394696 3485231 3513688
4367 3513688 3539788 3554074 3607724 3641364 3643527 3647124 3625383 3588409 3590527 3559144 3502950 3501653
4355 3501653 3511800 3544953 3463034 3474665 3504535 3577769 3599804 3613942 3661140 3747144 3777845
4344 3777845 3801461 3815437 3880381 3935213 3942670 3957695 4027127 4141702 4203954 4254277 4202894
4333 4202894 4201392 4280927 4369784 4439655 4492660 4518973 4530039 4624851 4716285 4831364 4943666
4322 4943666 5017394 5058821 5026339 5013177 5067909 5130767 5149211 5215058 5263268 5290009 5360863
4311 5360863 5387127 5410781 5378751 5403991 5470022 5505259 5480727 5523322 5597339 5641311 5647218 5629583
4299 5629583 5614887 5537903 5583516 5562781 5548378 5530795 5556114 5549133 5589560 5586814 5562033 5606291
4287 5606291 5617945 5682318 5709484 5735027 5830632 5885328 5955340 5942239 5980678 6066807 6141738
4276 6141738 6148735 6174459 6180445 6190644 6254394 6267518 6342170 6424873 6439696 6569132 6646089 6747982
4264 6747982 6794567 6897082 6932089 6983204 7041274 7115113 7200934 7231067 7304133 7353201 7362364
4253 7362364 7407068 7484139 7581076 7699328 7813680 7949440 8149246 8418389 8594421 8892535
4243 8892535 9284135 9679592 10039719 10414713 10762154 11079160 11480645 11935016 12344484 12781157
4233 12781157 13241714 13749362 14171233 14667628 15165491 15709415 16288496 16891801 17474888
4224 17474888 18126112 18822366 19518864 20165556 20803019 21473045 22186449 22923946 23654646
4215 23654646 24364224 25066531 25839319 26539225 27170617 27862950 28550667 29237526 29959635
4206 29959635 30658466 31388178 32075703 32738412 33438604 34238484 35111586 36078830 37081439
4197 37081439 38110357 39256826 40434260 41676513 43036279 44437838 45939370 47583441
4189 47583441 49322613 50992020 52556436 53996311 55212316 56272786 57224431 58148745
4181 58148745 58969564 59810468 60668609 61542485 62437887 63363451 64258040 65104225 65837542
4172 65837542 66456705 67004024 67501603 68032166 68676739 69470394 70477190 71901252 73803264
4163 73803264 76269908 79162339 82383602 85879506 89418823 92994187 96395176 99625414
4155 99625414 102644375 105365765 107985742 110565487 113082933 115437053 117606978 119451869
4147 119451869 120876957 121806584 122248163 122257599 122087882 121634776 121087568 120618992 120363787
4138 120363787 120190440 120291429 120743708 121535221 122833835 124710458 127351850 131006278 135512918
4129 135512918 140398103 144843608 147919895 149482787 149902713 149417757 148262857 146872357
4121 146872357 145559024 144399978 143173517 141842364 140265759 138345812 135973094 133256293
4113 133256293 130304036 127260117 124270193 121420535 118699765 116054090 113466048 111109008
4105 111109008 109054128 107455637 106562019 106252241 106205300 105832550 104742699 102857842 100294720
4096 100294720 97212836 93959112 90974611 88284623 85984218 84080717 82486728 81114652
4088 81114652 79683695 78050495 76204971 74258431 72232841 70271679 68337793 66361989
4080 66361989 64406916 62316987 60261088 58158198 56064831 54182790 52516956 51021534
4072 51021534 49681930 48420609 47167744 45989369 44810983 43626854 42499297 41413984
4064 41413984 40390526 39406029 38462654 37463579 36535839 35682557 34799078 34014310 33307749
4055 33307749 32542810 31790530 31053209 30246387 29438035 28593519 27711536 26834818 26021917
4046 26021917 25246397 24522411 23812810 23165261 22556897 21915366 21315528 20795088 20277243
4037 20277243 19836246 19381087 18979400 18533480 18045847 17674244 17239291 16863671 16504244
4028 16504244 16191863 15863198 15613452 15444488 15308219 15192518 15073314 14954159 14868009 14805626
4018 14805626 14710271 14645784 14485687 14389693 14398663 14397285 14441539 14525257 14624027 14729570 14843090
4007 14843090 14972397 15063914 15141966 15251884 15469288 15650051 15892151 16117435 16392024 16648545
3997 16648545 16868097 17059796 17200895 17353722 17530045 17798620 18120436 18403358 18772621
3988 18772621 19145052 19481727 19781026 20087176 20393788 20625632 20795839 20987778 21211543
3979 21211543 21451311 21737932 21984770 22214861 22492544 22816065 23140121 23569599 24072181
3970 24072181 24739530 25442136 26265161 27149723 28018421 29012315 30038138 31062952 32101678
3961 32101678 33183563 34255554 35380075 36575455 37725187 38922165 40231434 41717867
3953 41717867 43335214 45121801 47059225 49165284 51375352 53768481 56218162 58627642
3945 58627642 60901295 62950009 64643057 65987918 66939303 67641882 68153518 68613843 69164809
3936 69164809 69805082 70581362 71422709 72363238 73190381 73944652 74509389 74687219 74487997
3927 74487997 73900475 72991404 71926611 70776752 69778616 68924174 68300399 67815169 67295833
3918 67295833 66596286 65638022 64349833 62713244 60871315 58931769 56951720 55018807
3910 55018807 53206758 51694305 50516026 49571923 48841561 48252860 47689064 47036066 46339296
3901 46339296 45520401 44633207 43682159 42695084 41851404 41098656 40466441 40013907 39714203
3892 39714203 39501075 39290663 39100019 38822522 38502772 38023612 37394591 36558254 35568002
3883 35568002 34511474 33362149 32293758 31253113 30317442 29529440 28913605 28505204 28182989
3874 28182989 27855957 27564488 27335802 27058853 26743053 26446849 26244105 26167180 26277102 26468705
3864 26468705 26779278 27317616 27943063 28599368 29386207 30250742 31135181 31992480 32801016
3855 32801016 33482564 33975983 34219915 34354469 34292958 34075198 33840999 33593898 33462127 33513414
3845 33513414 33945857 34748229 36023541 37892868 40317653 43190625 46539683 50248863
3837 50248863 54168788 57988926 61486478 64458480 66660904 68047707 68578995 68279334
3829 68279334 67263173 65866898 64385418 62973239 61779352 60939954 60515688 60429314 60693797
3820 60693797 61228718 61730250 62208119 62723956 63001369 63246620 63614185 64274359 65382592
3811 65382592 67018313 69145682 71696600 74486207 77348296 80109300 82693665 84970672
3803 84970672 86997631 88758473 90221048 91411466 92380866 93114918 93397637 93260001 92599494
3794 92599494 91387649 89780143 87720487 85409956 83091877 80961845 79163212 77825766
3786 77825766 77075495 76732522 76633474 76513113 76116451 75188476 73652052 71476893 68831910
3777 68831910 65789649 62636796 59650452 57058343 54846867 53030248 51613973 50544798
3769 50544798 49593604 48689086 47650259 46484041 45052336 43460503 41860110 40111976
3761 40111976 38334568 36525885 34790836 33201059 31774772 30561564 29477248 28653622
3753 28653622 28065345 27645059 27286128 26939713 26701462 26398201 26171836 26073168 26014637 25994778
3743 25994778 26120798 26219720 26264597 26226270 26084825 25800272 25402870 24960942 24529483 24088182
3733 24088182 23737327 23511171 23521507 23698119 24042422 24527717 25051131 25624347 26023591 26404297
3723 26404297 26662662 26704556 26614245 26411077 26106964 25625284 25132793 24477262 23702203 22788076
3713 22788076 21731828 20632172 19516874 18422892 17334845 16282572 15319404 14492993
3705 14492993 13705778 12980848 12418576 11865525 11318976 10929396 10617624 10344982 10118858
3696 10118858 9929974 9794434 9658689 9513046 9465695 9415528 9436033 9406158 9380813 9371042 9441816
3685 9441816 9529509 9571286 9620296 9743572 9910485 10059922 10115516 10202546 10289875 10353584 10453608
3674 10453608 10444223 10487041 10536269 10613341 10693335 10786594 10897162 11031196 11175265 11265374 11406981
3663 11406981 11615954 11711529 11749643 11767077 11719918 11691236 11646068 11550798 11453970 11382499 11296897
3652 11296897 11270603 11235518 11230813 11254564 11311438 11375008 11458606 11604320 11858849 12164347 12485848
3641 12485848 12827917 13265859 13717961 14202490 14737494 15224214 15695262 16089806 16503820
3632 16503820 16898594 17277007 17689865 18059558 18418204 18810193 19163857 19418117 19692980
3623 19692980 19978514 20237970 20471527 20754045 21034728 21399441 21819072 22244922 22841451
3614 22841451 23583496 24453504 25331002 26314487 27268752 28180964 29088521 29910509 30612121
3605 30612121 31306887 32066305 32939711 33878383 35040194 36516680 38324125 40609611 43516594
3596 43516594 46953984 50901240 55351291 60094809 65045191 70071610 74916313 79230311
3588 79230311 82636570 84989630 85977352 85717260 84269771 81831785 78640823 75054648
3580 75054648 71445832 67891414 64532880 61452239 58527720 55684310 53045267 50543598
3572 50543598 48161417 45837866 43592672 41442163 39317226 37318196 35400889 33519391
3564 33519391 31757618 30095846 28539392 27104188 25804543 24602254 23523016 22597194
3556 22597194 21782615 21039304 20490027 19958588 19465644 19088246 18663167 18259725 17936636
3547 17936636 17536082 17135432 16726839 16331559 15934054 15493240 15069442 14697533 14334247
3538 14334247 13995044 13737861 13516107 13288218 13108189 13002016 12937624 12852646 12757182 12646784
3528 12646784 12607155 12612117 12581489 12545665 12527001 12503645 12362334 12235226 12026138 11772653 11531965
3517 11531965 11244016 11008613 10794695 10574385 10353649 10044694 9792776 9626895 9491846
3508 9491846 9393251 9218994 9139164 9021646 9018148 8956740 8914884 8875898 8866795 8913871 9004527
3497 9004527 9065870 9071515 9128698 9174785 9327059 9478362 9618693 9797765 10000995 10199937
3487 10199937 10445458 10706725 10904211 10932129 10937599 10810014 10611328 10443776 10278667 10123996
3477 10123996 10020679 9991935 10011300 10019335 10032740 10079884 10088917 10188067 10265301 10356740 10538154
3466 10538154 10627759 10829953 11073450 11231033 11292784 11416862 11444571 11398995 11390725 11305785 11283703
3455 11283703 11239628 11180128 11146220 11178770 11200873 11283101 11254682 11271764 11433354 11595255 11759147
3444 11759147 11947201 12152825 12405853 12761872 13021647 13313728 13595239 13862000 14050597
3435 14050597 14140118 14177388 14263302 14384562 14505794 14790522 15112079 15445573 15980630 16612216
3425 16612216 17266422 17948554 18594107 19297830 20004182 20732358 21420752 22025091 22606162
3416 22606162 23031410 23291887 23347756 23277217 23138194 22937915 22785381 22679882 22642305 22685032
3406 22685032 22732812 22781928 22806819 22785492 22695051 22524666 22233124 21990110 21765275 21583907
3396 21583907 21566050 21610148 21809714 22155594 22514765 22979598 23460948 23886562 24333996 24850895
3386 24850895 25415196 26110587 27072921 28319831 29894462 31731470 33948441 36637008 39777463
3377 39777463 43338224 47477251 52322998 57843003 63950228 70446995 76968197 83082872
3369 83082872 88311231 92232281 94715838 95501235 94766694 92579587 89175661 84810110
3361 84810110 79812747 74528820 69228740 64241431 59587579 55398814 51711057 48592156
3353 48592156 45958997 43796372 42101832 40878279 40116919 39795563 39879517 40391824 41174947
3344 41174947 42287211 43800031 45799164 48162188 50940708 54160096 57749092 61632442
3336 61632442 65784633 70153321 74419182 78405169 81610770 83640317 84429906 84010424
3328 84010424 82662219 80713949 78286963 75585502 72694606 69547795 66255004 62783873
3320 62783873 59255931 55736164 52396149 49276132 46463745 44025910 41914671 40135763
3312 40135763 38741160 37530121 36549740 35817444 35322164 35054870 35090314 35395724 35892033
3303 35892033 36563967 37258160 37769934 38185387 38519343 38741606 38962883 39234479 39622678
3294 39622678 40106972 40816847 41684991 42817839 44246841 46048742 48293876 51035661 54342105
3285 54342105 58397846 63257043 69252561 76677437 86168406 98657064 115211260 136624800
3277 136624800 162878511 192735315 223812985 253282013 278830165 299285680 315157437
3270 315157437 327434008 336665946 342610012 344020654 339363217 327761081 309451487 285959654
3262 285959654 259349217 231929933 205448471 181164047 159915813 141815538 126891659
3255 126891659 114814739 105297429 97956346 92379139 88133434 84844740 82304399 80439799
3247 80439799 79194051 78920862 80058198 83037037 87924504 93337936 97471915 99362160
3239 99362160 98441312 94799690 89621410 83847881 78001571 72590010 67826080 63843270
3231 63843270 60547902 57881729 55674636 53706930 51882628 50194218 48649974 47394363
3223 47394363 46377227 45538018 44933332 44470881 44177161 44041355 44101760 44424330 45039127
3214 45039127 45851956 46878008 47910814 48851159 49416747 49513110 49095940 48274826 47169428
3205 47169428 45948241 44645993 43283920 41985750 40767594 39670571 38785164 38091224
3197 38091224 37561189 37202474 36951723 36923510 37088019 37504886 37987531 38728550 39681215 40827539
3187 40827539 42196234 43920309 46045145 48492417 51179272 54026530 57007779 60125409
3179 60125409 63253202 66397310 69425890 72263990 74705767 76643086 78292526 79937015
3171 79937015 82026386 84898371 88765825 94045779 101378886 111400595 125241201 144602434
3163 144602434 171129543 205730542 246953603 291231937 334619318 373793936 405651841
3156 405651841 426804078 435261207 431432852 418025160 399713580 381681609 367987300
3149 367987300 360546413 358682993 359904193 361450679 361489669 359817696 357320821 355124547
3141 355124547 353520738 351665055 347666163 339471926 325729705 306380965 282483717 255804826
3133 255804826 228431002 202015749 177813696 156684926 138949523 124579812 113248741
3126 113248741 104419658 97284160 91104116 85393299 79833426 74447023 69398419 64717420
3118 64717420 60385947 56596509 53266434 50358071 47765533 45510348 43479291 41771753
3110 41771753 40274453 38972655 37861780 36861832 35994072 35315796 34700060 34105268 33532410
3101 33532410 32986997 32432997 31828391 31139333 30437151 29593603 28686491 27736044 26771008
3092 26771008 25839460 24984519 24174498 23418121 22650546 22013827 21437373 20907054 20429373
3083 20429373 20014061 19608627 19120842 18565344 17992629 17401466 16796846 16238003 15659611
3074 15659611 15204260 14757430 14343131 14018285 13749693 13467649 13235153 13052856 12955620 12801198
3064 12801198 12675667 12593731 12486005 12466515 12530019 12547742 12562405 12521694 12533594 12373512 12271839
3053 12271839 12279257 12322251 12491193 12771552 13166997 13596871 13936173 14138994 14097009 13789277
3043 13789277 13359243 12838539 12308833 11764223 11204636 10767139 10425678 10091597 9845940
3034 9845940 9668723 9569024 9519073 9430460 9362676 9275314 9160514 9077801 8967002 8885383 8739477
3023 8739477 8583732 8426259 8201793 7982328 7747104 7527620 7305251 7094147 6863979 6630447
3013 6630447 6455201 6333335 6267087 6149378 6036896 5964625 5849244 5724371 5711547 5677726
3003 5677726 5623271 5633903 5676419 5620077 5537320 5527870 5574433 5600556 5640795 5707829 5812575
2992 5812575 5999386 6168879 6326666 6466011 6587824 6709457 6810704 6874239 6867961 6793497
2982 6793497 6762959 6603815 6402095 6154262 5907545 5603544 5324528 5104536 4929457 4719662
2972 4719662 4585983 4520711 4463671 4430340 4352577 4318989 4252529 4184585 4125304 4018147 3865405
2961 3865405 3763480 3649341 3529728 3385902 3244636 3151303 3033625 2957477 2813913 2679171
2951 2679171 2606839 2549787 2477689 2403778 2377874 2272668 2275001 2254920 2243864 2195327 2175030
2940 2175030 2108942 2068801 2095639 2071004 2042644 2054971 2039365 1990238 1990483 1970408 1961486 1928407
2928 1928407 1890403 1934195 1917320 1895793 1934791 1907989 1870401 1866505 1838079 1815979 1805530 1802292
2916 1802292 1752751 1708666 1736744 1739596 1725557 1719675 1729377 1708770 1704671 1662655 1660254 1640741
2904 1640741 1657932 1674848 1641225 1611672 1512570 1509519 1511734 1534230 1517123 1492524 1491418 1485145
2892 1485145 1466142 1487850 1461818 1415054 1380587 1370451 1400408 1399456 1378500 1386598 1486184 1579536
2880 1579536 1640958 1744376 1942321 2121994 2320810 2532023 2678854 2807404 2881518 2835663
2870 2835663 2782233 2752928 2738258 2641458 2545005 2510352 2494404 2467842 2495312 2452584 2417590
2859 2417590 2390908 2338972 2257567 2225387 2187917 2170501 2098059 1964557 1824821 1684157 1583838
2848 1583838 1481883 1333548 1219279 1089834 979658 971961 948536 901854 803841 714370 714697
2837 714697 763324 735139 655020 615008 636124 564077 536610 470081 490822 504124 485774 421880
2825 421880 397731 423535 416512 421083 411877 332652 323308 363088 410729 409854 369147 398824 375645
2812 375645 365234 385202 354800 328606 318260 300188 288907 327774 277899 246041 287252 301350
2800 301350 337756 304385 263376 198357 198654 254113 245595 194968 234848 216288 143229 92216
2788 92216 71882 73607 75504 129646 151493 77406 85863 81255 100695 118619 139503 136620 171149
2775 171149 149060 190525 204183 193608 222204 210908 272028 300830 276033 271383 304431 334134
2763 334134 326141 300807 244107 135342 166543 190698 161942 168226 140854 121633 108902 102409
2751 102409 114828 107990 103256 140797 147261 104183 89612 82251 90539 80183 153378 208534 243462
2738 243462 216061 199893 198946 234039 212524 142366 151762 197563 166042 129721 108903 136565
2726 136565 160478 163907 115066 62260 75519 116605 136193 98267 76215 104403 116239 104790
2714 104790 111568 73489 36840 68950 106022 170139 212251 210995 193803 123167 119959 130192
2702 130192 114076 35838 67324 113349 84378 80093 -7240 -29899 8090 22480 -35168 -78641
2690 -78641 -65054 -45560 -22753 -21823 -34813 -59338 -38573 4825 17550 15731 42560 -34678
2678 -34678 -59730 -71156 -63337 -23337 1105 -42301 -83017 -54429 -10377 15198 23837 50473
2666 50473 98750 113097 17566 -13605 5700 -49139 1365 33060 10375 -17437 43452 25061
2654 25061 -35849 -34488 -20780 -51756 -10321 33654 74229 77313 3969 -29989 -2505 19325
2642 19325 6597 19788 26279 28852 59295 24499 -1246 31054 -1833 45174 17908 28982
2630 28982 -1857 -42793 -13567 9386 -2130 -21819 -14879 -17042 -20025 -19031 -48647 -21749 25148
2617 25148 5404 -43878 -46713 -90112 -52513 -13808 -60853 -82196 -107378 -146224 -134293 -100666
2605 -100666 -66259 -62113 -20726 -13720 -20376 -38489 2901 2266 -42620 -66907 -98484 -66284 -73477
2592 -73477 -82389 -77119 -109921 -102166 -124495 -70899 -48249 -63190 -71136 -85769 -123225 -113855 -116423
2579 -116423 -105145 -79221 -88664 -85474 -41944 -41406 -105354 -72871 -90626 -89989 -75890 -80729 -61377
2566 -61377 -76792 -117342 -155259 -166672 -142359 -106392 -70205 -86592 -59931 -64232 -58815 -99845
2554 -99845 -120122 -144162 -90804 -58767 -42333 -63022 -22852 -43460 -79399 -50185 -65816 -94264
2542 -94264 -142503 -126039 -100652 -35585 -44446 -83205 -92493 -113517 -142175 -173468 -94926 -52712
2530 -52712 -38275 -42896 -40284 -115716 -119117 -60337 -26400 -56764 -33128 31530 9934 -37142
2518 -37142 -25227 34051 22482 -40183 -14416 -6490 19877 40443 30756 18648 -14394 -21936
2506 -21936 -27999 -12995 -1825 -27525 -58919 -12649 -2485 49236 67693 57149 50177 35666
2494 35666 42753 49811 3953 -1463 -23992 -14642 22568 77800 111369 135198 159635 145950 213235
2481 213235 218386 266131 317984 300297 328864 341364 360877 348606 362070 347131 380700 406403
2469 406403 459722 500475 548333 570848 653994 700320 796792 859829 927968 1041577 1151759
2458 1151759 1378179 1538130 1750493 1873542 2019288 2151874 2326253 2597175 2882068 3335192
2448 3335192 3949612 4954828 6801617 10130575 15611283 22351678 27586354 30635927
2440 30635927 31230825 28892120 25129771 21349405 17502033 14008268 11131766 8639008
2432 8639008 6791864 5464630 4638267 4087858 3674954 3453809 3285351 3012518 2760693
2423 2760693 2509829 2245278 1977439 1741527 1477954 1314048 1163797 1067440 1062544 1020140
2413 1020140 933115 882343 874099 866479 770454 718931 713780 662402 629288 610625 547323 516141
2401 516141 498532 500508 459420 405832 407965 414897 421150 355110 378590 397772 390239 312716 318053
2388 318053 303630 370090 345023 283222 283686 292310 247194 178710 169723 196725 218678 226337 181251
2375 181251 174379 216437 179163 168696 100916 65170 57388 66296 57590 140 -58871 5133
2363 5133 19070 17490 26323 35780 21870 45895 13946 -3403 28270 46468 -1822 -13279 91751
2350 91751 139048 91299 72631 35807 8616 -4477 5697 -723 -8071 -23444 -37951 -55207
2338 -55207 -53260 -46409 -6489 42112 -19388 -42187 -27801 -56665 -51483 -22038 -32324 -40983 -48923
2325 -48923 -8300 -29515 -14775 -929 -34579 -27592 -24788 -25966 44287 40337 -14298 -4971 -52421
2312 -52421 -74086 -39925 35496 4640 -56118 -35110 -18355 -17889 -56043 -65687 -68452 -87395 -100438
2299 -100438 -97924 -115142 -134868 -120873 -79309 -68583 -50609 -57418 -75910 -109266 -68559 -50913
2287 -50913 -40694 -27436 -12966 -39581 -51288 -21065 5925 11656 -35346 -48860 -64802 -47985
2275 -47985 -48014 -89911 -96917 -60108 -41378 -40329 -15967 -40301 -9 22689 -8141 -13013 -26998
2262 -26998 -53190 -106446 -124162 -124750 -99537 -60795 -32533 -53060 -65934 -45470 -75993 -99765
2250 -99765 -42865 -83509 -117685 -67814 -105208 -87920 -58882 -54058 -75269 -86383 -8822 -21997
2238 -21997 -23646 -67087 -55372 -35325 -50143 -17412 -31717 -68590 -84605 -80461 -139163 -131759
2226 -131759 -124595 -145957 -168946 -100678 -7451 -12022 -32227 -47863 -49630 -57625 -70181 -91637
2214 -91637 -55730 -67892 -109544 -74062 -24815 -90982 -112605 -105938 -63238 -76498 -93914 -53231
2202 -53231 -111912 -73107 -116574 -103858 -122305 -136208 -56974 -80007 -54592 -47205 -22553 -55514
2190 -55514 -51429 -38922 -98818 -91906 -98808 -108176 -97555 -81701 -72745 -35057 -49351 -36244 -40707
2177 -40707 -15141 -16617 9516 60272 14769 77944 92637 23066 10276 -18496 -16209 -31342
2165 -31342 -39402 -82822 -108471 -80248 -103183 -96944 -73004 -128764 -111871 -109535 -131101 -86202
2153 -86202 -58389 -17049 -43343 -42495 -27830 -18976 -2633 5716 8040 -24757 -90019 -88327 -43097
2140 -43097 -54941 -54379 -36935 -62502 -114895 -144273 -141301 -151052 -117817 -122160 -89476 -88486 -156646
2127 -156646 -230628 -202468 -136034 -161002 -139990 -85246 -83154 -98376 -105422 -99232 -124982 -116829
2115 -116829 -119555 -121265 -127645 -138674 -170824 -164094 -139670 -195395 -168175 -91751 -142104 -183739
2103 -183739 -199597 -225850 -200608 -191755 -189890 -171241 -160958 -126589 -114565 -147052 -143491 -137325
2091 -137325 -176658 -197913 -242784 -197369 -196451 -193841 -197328 -231475 -219936 -219391 -179693 -175601 -145155
2078 -145155 -166030 -198553 -213426 -204183 -183362 -180525 -231207 -212628 -176263 -121488 -141902 -193394
2066 -193394 -173906 -214422 -195936 -239695 -256370 -228527 -227727 -235738 -270880 -232570 -217711 -188305
2054 -188305 -226405 -227309 -231177 -252649 -215255 -209384 -256846 -264246 -247299 -266091 -289495 -284473 -277779
2041 -277779 -285770 -280656 -226408 -224777 -222535 -258946 -174977 -195475 -208345 -228612 -245685 -188618
2029 -188618 -166567 -168942 -252522 -273429 -297333 -289067 -246045 -202803 -228386 -192160 -184195 -203037
2017 -203037 -230520 -249426 -199289 -211721 -215168 -200089 -266045 -279069 -281840 -245757 -234161 -228601
2005 -228601 -230050 -218210 -226630 -219233 -233733 -234456 -215034 -186970 -183782 -215956 -256224 -274883 -245322
1992 -245322 -247439 -255866 -224908 -215298 -227031 -253821 -295138 -277944 -242729 -208098 -242222 -262267
1980 -262267 -249408 -239777 -269713 -288351 -277787 -227404 -113228 -121679 -169683 -201649 -197091 -210576
1968 -210576 -206419 -144447 -225803 -195304 -179853 -175126 -181818 -186336 -186623 -216278 -192213 -138577 -196731
1955 -196731 -203748 -203875 -260539 -270192 -268319 -216334 -213229 -203183 -221900 -221154 -217990 -219197 -242863 -226543
1941 -226543 -188125 -198494 -237870 -207204 -212230 -182824 -206638 -225134 -186743 -217558 -186118 -152330
1929 -152330 -165183 -217100 -170879 -130076 -131762 -125527 -169974 -179748 -172767 -157469 -170919 -175176 -176878
1916 -176878 -172911 -162834 -191224 -188305 -162503 -191149 -99465 -103578 -143534 -161657 -186847 -159298
1904 -159298 -116938 -152630 -151556 -136835 -158042 -97502 -144926 -175265 -147785 -134352 -93165 -75476
1892 -75476 -98384 -107756 -118156 -111004 -127261 -120561 -153675 -179185 -177613 -178220 -190374 -152958 -128610
1879 -128610 -151303 -104493 -85167 -86809 -78256 -78069 -66478 -109804 -137265 -148925 -112129 -76363
1867 -76363 -44137 -80418 -99506 -88004 -126469 -106569 -77493 -109687 -147657 -205235 -119858 -56124
1855 -56124 -86029 -98948 -154758 -188962 -128114 -118968 -123073 -87554 -131774 -114157 -100129 -88408
1843 -88408 -94077 -156483 -134218 -82746 -96943 -81890 -84596 -93056 -68887 -79681 -112404 -90893
1831 -90893 -46181 -30770 -79501 -96632 -50047 -60668 -57708 -41075 -105181 -110738 -76110 -87903
1819 -87903 -110489 -101579 -108902 -96752 -105928 -120711 -167698 -129635 -99198 -77653 -66650 -95869
1807 -95869 -137585 -157381 -164500 -161067 -127564 -103073 -84872 -100593 -86707 -84242 -39405 -46472 -28221
1794 -28221 -82739 -77485 -47018 -52076 -111129 -67251 -75976 -171299 -103079 -116355 -126394 -122995 -78299
1781 -78299 -84913 -104425 -100541 -87927 -157532 -130853 -73755 -90651 -63190 -96141 -141700 -137407
1769 -137407 -104437 -143225 -182854 -142871 -96839 -90507 -114053 -78518 -43075 8285 1155 -66727
1757 -66727 -95469 -99531 -92600 -115957 -89018 -80988 -46678 -8601 -46308 -120845 -157285 -209055
1745 -209055 -181980 -109754 -52684 -96209 -96924 -38209 -27568 -120156 -162246 -125646 -141299 -84791
1733 -84791 -113270 -116659 -98273 -148959 -193358 -216303 -214814 -126521 -82727 -156299 -128740 -131960
1721 -131960 -100936 -101530 -132167 -110765 -139048 -132699 -73850 -84614 -105310 -122404 -107853 -123801
1709 -123801 -125952 -95139 -113922 -103256 -110170 -109964 -86506 -72676 -114525 -82381 -55096 -72268
1697 -72268 -75592 -48689 -89760 -127265 -101929 -125045 -145527 -174680 -173974 -130263 -85009 -73100
1685 -73100 -111597 -108895 -116713 -100260 -119799 -111310 -131886 -81177 -75282 -159347 -115468 -109234 -103119
1672 -103119 -98981 -122841 -121019 -135250 -92208 -109975 -139677 -176041 -145129 -119379 -99320 -61789
1660 -61789 -70790 -109261 -111657 -96139 -95771 -121292 -89979 -104330 -151926 -130744 -147616 -121722 -109235
1647 -109235 -119308 -125948 -90036 -93609 -102448 -95311 -98828 -114455 -151280 -132510 -112057 -149926 -118120
1634 -118120 -141744 -167467 -203106 -200196 -169174 -131639 -94315 -79326 -82712 -100542 -121996 -113173
1622 -113173 -151712 -121638 -164051 -149496 -111382 -166241 -141222 -83173 -72388 -63000 -53195 -85218
1610 -85218 -93178 -111053 -152275 -161368 -172911 -159806 -159810 -202729 -198911 -143500 -135334 -178908 -163438
1597 -163438 -162283 -129350 -136623 -153410 -138889 -118350 -101715 -88218 -112005 -162976 -163702 -106409
1585 -106409 -101173 -105457 -123774 -121870 -146943 -131871 -152596 -175439 -116527 -115152 -156167 -137771
1573 -137771 -134052 -135668 -140607 -150968 -114604 -104626 -100127 -111115 -90319 -81032 -139495 -190280 -189570
1560 -189570 -156475 -219982 -216705 -170208 -214201 -217121 -182362 -188799 -194765 -96446 -124088 -151748
1548 -151748 -182107 -200583 -185759 -145268 -106381 -137217 -170008 -199521 -187434 -169648 -147810 -163215
1536 -163215 -125570 -139824 -172610 -142137 -90385 -62738 -58486 -90904 -136237 -177134 -115168 -93659
1524 -93659 -140338 -127993 -67114 -11125 -51358 -42583 -43090 -22732 -28708 -80772 -63477 -30875 300
1511 300 -22006 -63719 -33094 -48287 -70128 -86110 -72330 -54602 -51018 -80364 -107052 -90180
1499 -90180 -14655 -43978 -55884 -75150 -101090 -138115 -68434 -32078 -79873 -23988 27028 -37768
1487 -37768 -53693 -23220 -39537 -32458 -13810 -29186 -72755 -38588 -76052 -79350 -64097 -36035
1475 -36035 -43963 -7296 -10751 19080 11923 -54626 -71611 -64092 -47208 -21407 -22650 -25714 -8009
1462 -8009 13719 40188 29278 29290 16234 7500 60189 55617 29691 40768 4485 53876 47783
1449 47783 -2895 -22524 -13650 -11562 2882 17757 4390 -11628 -26416 19828 25981 -7086
1437 -7086 279 17759 -22601 -21369 -2467 154 -45151 -57250 -24879 385 -8342 -13578 -62890
1424 -62890 -7058 29296 480 -9527 22222 71868 37044 1358 9113 12000 10121 -23541
1412 -23541 340 70770 82594 58138 23704 77468 73246 260 -17564 -23350 -39833 -5838
1400 -5838 78076 93678 68772 43042 33439 86545 82446 92731 36212 43439 34675 45554 37585
1387 37585 12825 41146 22798 41825 74762 56127 33021 72029 21976 12302 24455 15582
1375 15582 6241 38046 55992 43617 77116 71270 47689 56017 10075 16440 26686 15900 32849
1362 32849 21139 -10514 -10710 -6084 -33836 -67678 -12247 -16144 -37278 37096 59299 68361 49311
1349 49311 37310 32572 25227 44342 73004 22578 37238 47401 20376 -25355 -2754 41837
1337 41837 77590 41542 79307 69634 52212 33567 53215 59236 91082 41557 40300 -21112
1325 -21112 -19906 20872 -17511 2383 -28906 6156 30704 66958 33156 71248 31459 -21569
1313 -21569 25634 42443 19462 -10533 -33572 -29209 -52623 -49394 -24438 11628 17112 5246
1301 5246 10756 36216 31102 28512 31441 -9469 -23780 -19590 -34573 -2182 -4088 -41130 -30654
1288 -30654 41208 39235 -17874 -29081 -9696 -39874 -1408 -46276 -29024 -31916 -54833 -62688
1276 -62688 -75221 -49658 -36873 -21354 -43893 -33935 -58756 -29887 -44688 -45457 -80997 -94049
1264 -94049 -70303 -60144 -34463 -23562 4568 21718 16661 39330 -5416 -70250 -44105 -4812
1252 -4812 10518 -28322 -15881 13318 -2886 -49468 -42633 -29214 519 -20409 -30269 -45424
1240 -45424 -62998 -58653 -7128 2435 -62227 -49213 -12248 31271 -809 20289 -22929 -35172
1228 -35172 6063 -14119 31636 8948 -35693 -57681 -306 -16370 -44948 -44853 -81110 -46575
1216 -46575 -7567 -3242 -2575 -4942 -15349 -44012 -27759 3642 14315 -23345 -42391 -22629 -54942
1203 -54942 -24968 -10141 -66697 -64279 -41130 -58410 -58084 -31313 -475 -11244 -15217 -15126 11256
1190 11256 24603 32581 -58342 -31720 2411 18579 -1426 -23836 -60438 -62092 -26117 -35632
1178 -35632 -11101 -12748 2041 -27082 -54199 -6656 35613 27014 20704 26579 39659 26817 -18091
1165 -18091 -55168 -61583 -64581 -80335 -56523 10431 -3449 -15389 -61619 16819 19367 -7816
1153 -7816 7177 -17189 -26121 -9616 6955 -29040 -72245 -63846 -18828 -6329 49189 35949
1141 35949 -32683 -11891 14107 -1291 27292 -29335 -29797 34050 32010 -25427 15923 26671
1129 26671 -16058 -19204 -2157 9650 10203 15836 44076 7899 10305 6463 10753 5720 3512 20016
1115 20016 15546 -16012 -39003 -39230 -54625 -71339 -31095 33248 24619 -45887 -75900 -33170 -1540
1102 -1540 14551 15290 -19730 23015 42044 40489 47053 26322 64330 75748 52435 11538 -36881
1089 -36881 -48327 -37427 -35508 -24632 -9763 -28151 -7363 -3261 -3138 1885 -4906 11005 -6057
1076 -6057 40241 7212 8737 -6015 25382 50322 71589 44167 18784 56376 112799 91760
1064 91760 62796 29504 35299 4762 21252 23240 17423 -9884 6202 32761 55400 53753 48815
1051 48815 -24270 -5524 -39773 -31131 -3781 2724 10392 -44 -30752 -49378 4479 -28261
1039 -28261 -30813 7491 27756 2757 -6104 -50444 -7636 -395 -10679 5379 -712 -24536 -59471
1026 -59471 -46586 10626 11558 14121 -15404 13867 -37823 3791 -20062 -36380 -25656 1273
1014 1273 -1512 -34308 -31744 -8111 28378 67243 -3565 -10207 20684 29908 -3095 3093 -24467
1001 -24467 -41867 -10334 1338 -13448 3746 -23559 -45952 -53211 -32820 59404 56619 60908
989 60908 32496 -12020 -28679 39905 45209 3235 -35852 -55109 -21410 58590 11185 395
977 395 9719 39179 47286 7659 18456 -14548 37153 64447 18002 4448 39194 13451 -27034
964 -27034 15617 -33457 -5386 13194 -29490 -19078 31086 42766 7612 27237 36323 29457
952 29457 11196 -19813 -30356 -6524 22388 -980 79090 61526 38678 65042 323 -5810
940 -5810 -27625 -13027 -2972 -2634 -2207 19964 30577 11907 20595 44506 99951 46052 6380
927 6380 65305 43574 31311 89798 46937 44959 78042 38189 8284 56565 75478 37868
915 37868 65892 69899 72585 76118 56740 27027 23628 60082 89429 68986 54624 44570 42477
902 42477 44430 -20228 -4733 33012 58412 43944 28719 72528 62735 49410 30424 -12005
890 -12005 15387 32926 23307 25848 32129 88333 71683 62963 77227 89874 90196 73387 45994
877 45994 55833 45272 62878 10234 11319 58061 101872 62287 33208 50073 19410 49756
865 49756 78347 75986 17292 60154 72927 73103 13005 -6963 32221 14359 21521 81384 116585
852 116585 67983 79058 40146 88215 159947 104473 72489 37896 50642 12105 39190 34589
840 34589 84329 114500 74591 55162 70224 59756 25988 30265 58969 76700 108193 99557
828 99557 82869 130784 111670 99403 67287 22455 72330 123911 90430 69726 51723 42578
816 42578 48615 62362 84232 76541 68824 135970 89265 79101 97263 57304 92135 113889 98683
803 98683 96038 128995 87787 55955 109840 135758 67063 59243 27672 38135 54527 50533 84056
790 84056 42668 96076 98177 93336 98368 56487 49143 61514 67074 44310 73484 54786 76112
777 76112 82166 69563 58199 21883 4283 35076 54328 39786 -11555 18803 88384 74300
765 74300 45506 -39115 19889 38818 35393 37280 62977 66671 58984 64048 110423 63437 69225
752 69225 102448 46358 6386 56704 56163 44871 69077 83174 43258 34201 68085 85406 89534
739 89534 136083 147108 67548 83441 90294 125801 76755 83159 130461 128728 62589 -7320 36589
726 36589 66181 74040 96860 82575 53211 32133 12850 25650 44011 12198 17797 58346
714 58346 40556 30569 53605 80981 92283 85028 45530 55108 41527 33161 58701 85871 103427
701 103427 35980 24976 43925 66838 71120 56864 59525 31790 19009 7023 3965 50269
689 50269 51995 63577 63672 63440 54372 66855 57721 26864 -40380 -27202 26771 59075 28857 26330
675 26330 54783 38599 25956 42204 59914 60882 69401 82538 115303 115952 75577 98304 50992
662 50992 43809 65329 40562 47296 -12525 -8583 17751 21193 50711 68796 105396 81778 52104
649 52104 63368 31653 42260 101086 62538 93140 129145 65696 57285 518 24925 73811
637 73811 73576 81972 92853 85815 84748 91618 85798 72010 100327 146701 118339 89120 35640
624 35640 39524 75607 96203 74031 59950 82865 70042 140952 151559 98318 104491 87470
612 87470 10840 -13159 38830 48418 13996 -4163 -7904 28671 88578 81544 53584 87609 74760
599 74760 79084 96472 75546 53002 78022 72069 26733 -14827 19751 75609 86448 57842
587 57842 13128 44965 93812 110402 105478 110366 77389 14813 28196 1066 62388 104404
575 104404 62095 86724 75590 64754 102982 122370 55623 48561 93534 116129 74392 -17866
563 -17866 12618 23097 60116 75855 49082 56137 33282 39128 78710 40105 23503 75645
551 75645 111954 119377 87585 61534 63324 67013 40767 67757 107729 102818 110323 110273 76653 27053
537 27053 44265 68195 25446 38019 61090 111348 131815 63906 87989 80712 67979 29938
525 29938 20063 -23179 -13768 20544 11002 47256 66222 88120 20066 26401 78509 77287 71349
512 71349 104790 116933 97281 63072 55732 72333 87770 64486 106638 132962 106965 92977
500 92977 100860 101673 44276 9758 40553 64681 65547 60215 106902 74077 72793 104059 66004
487 66004 107298 110158 119596 96511 69342 60927 38261 77291 60064 60891 60641 84168 111256
474 111256 131130 96245 114503 150836 131942 100223 75391 78470 47263 60009 105227 95875
462 95875 85808 62629 85938 49130 73350 85881 64450 66027 82074 65759 49791 42165
450 42165 74620 92101 96466 87562 68226 56025 29444 18421 45346 24852 34412 32363 36593
437 36593 16761 -17754 3666 -31506 -3634 11388 56548 73042 93441 42427 2779 57763
425 57763 123470 49997 88581 103499 66712 42474 40865 34950 31261 54846 57716 46189 75019
412 75019 21237 76471 38991 19673 43247 -9378 14654 -6661 1830 20868 24689 96819
400 96819 60874 35072 73279 70533 86299 -6052 -18098 44826 57098 -20342 15613 105070
388 105070 74425 57794 27340 44657 75361 -3345 7845 5441 40601 74602 49216 33586
376 33586 12909 54169 56224 27404 47846 48764 20521 53665 79277 74766 20249 40522 41553
363 41553 28986 28858 51038 41045 17287 264 -409 31980 30606 86 16710 57818 96145
350 96145 55013 3454 16581 24555 10241 66528 38382 43139 59838 41499 1293 -30745
338 -30745 -39486 10684 15159 -38310 -41636 -50967 71888 74722 119062 55987 48284 84322 58048
325 58048 55894 74273 71025 51900 54683 54291 -3737 4396 5184 47815 56130 54330 25356 76605
311 76605 78197 92903 134022 120154 72590 62019 31035 8878 43954 32565 30529 -14098
299 -14098 10583 62707 103461 102838 48402 -39726 -44491 50880 63272 16794 -21439 -16895 2977
286 2977 -2960 48947 54367 112853 42493 20622 67919 36021 58393 66849 70407 46561 30883
273 30883 20130 69445 85625 12729 -12821 19922 14730 -6944 20959 82390 53783 19589
261 19589 3084 -1002 3605 -28226 5481 87003 57034 99790 118846 44286 52070 56120 79106
248 79106 42543 37480 -31267 -34024 -10181 14502 26827 50052 26271 30394 64607 54292 33652
235 33652 -7905 8178 -18446 -30498 -7862 11602 21270 26215 10919 -11978 999 49447
223 49447 38010 29668 -14413 43908 54997 -1829 34076 22973 23869 4595 33095 2300 -21575
210 -21575 24701 32680 8753 6760 39009 70930 32826 57992 67210 75308 49866 92219 50524
197 50524 -9546 -3683 -9744 35680 57680 50780 60407 56545 25739 33030 52124 44237 68409
184 68409 63319 52471 8665 46974 89748 46047 80240 62308 62040 51541 50276 27490 -6303
171 -6303 21195 51848 79072 125780 67343 -2000 65597 85755 92987 104848 63178 88594
159 88594 106021 70772 40292 19345 73701 86988 42990 63151 80757 115336 56455 24066
147 24066 6403 19228 43634 39956 17146 21116 41931 45360 35207 19601 13125 12602 -9652
134 -9652 -25192 -29072 25934 18465 31990 49137 51749 28527 13051 64478 65864 40482 55974
121 55974 80806 78265 53869 1526 -30747 -2975 -17524 -29623 -15120 27770 49060 53369
109 53369 70756 40059 38911 30894 14397 57157 87833 59769 32530 40796 17193 7223 32224
96 32224 49021 7898 10689 43793 32402 25250 45211 71061 45849 65890 37588 39475 72366
83 72366 84878 71130 35091 61667 54691 58118 58303 10857 44900 37624 6282 -35461 -15687
70 -15687 50964 64104 9884 33745 20727 -10526 17363 78108 60013 39071 23125 7891
58 7891 38164 17521 18348 -12217 2568 55989 47393 40130 19374 20706 31330 40265 22116 9721
44 9721 16134 33438 -4481 50006 77370 60378 26812 25889 38724 69564 108411 73723 42685
31 42685 39140 27815 9625 43516 39536 56735 20814 47554 30112 33825 64654 45244 26214
18 26214 28857 37038 33486 35293 44784 55967 64170 53844 31082 30385 71932 80536 47403 -1257
4 -1257 -1820 17760 45442 50204
0 50204
$$ Imaginary data points
##PAGE= N=2
##DATA TABLE= (X++(I..I)), XYDATA
16383 -2523980 -2546448 -2551338 -2536224 -2502907 -2474757 -2399428 -2384845 -2393261 -2363472 -2335792 -2331584 -2318640
16371 -2318640 -2278148 -2235749 -2247518 -2225089 -2185074 -2175951 -2159527 -2139212 -2148131 -2051440 -2022261 -2029368
16359 -2029368 -1997898 -2002719 -1995333 -1947161 -1894382 -1878074 -1872493 -1884652 -1862946 -1850035 -1815210 -1820465
16347 -1820465 -1758310 -1752079 -1726646 -1686761 -1657140 -1634240 -1618787 -1616855 -1605069 -1561839 -1557214 -1535442
16335 -1535442 -1497295 -1492194 -1499960 -1476272 -1417544 -1381476 -1390045 -1368177 -1361863 -1342529 -1341261 -1350466
16323 -1350466 -1333673 -1297645 -1234151 -1230071 -1195882 -1194448 -1213434 -1187270 -1177266 -1090145 -1028434 -1045566
16311 -1045566 -1078175 -1047190 -1029439 -1016341 -1070729 -1035584 -994697 -976165 -962632 -987033 -947425
16300 -947425 -895286 -867631 -826236 -805458 -771693 -764332 -749023 -730068 -734127 -692781 -671926 -643299
16288 -643299 -648708 -659094 -672981 -600370 -588255 -600090 -587994 -600560 -523698 -511054 -502084 -488781
16276 -488781 -488468 -438271 -417804 -394297 -383572 -402514 -395872 -378794 -376588 -346701 -311205 -293560
16264 -293560 -281134 -292301 -269747 -249473 -283996 -227343 -176915 -184137 -146145 -100343 -122445 -135145
16252 -135145 -138614 -129766 -128768 -115236 -84841 -72011 -44087 2987 -16037 -58524 -64722 -60722 -26657
16239 -26657 -33672 28963 35299 38303 50716 48645 78597 124635 111798 113189 192342 208820 211596
16226 211596 194660 152284 179709 175024 166873 197140 221918 272814 245329 224264 230972 284673
16214 284673 314923 328457 351902 342623 311376 333599 334163 312385 333356 346937 337462 401548
16202 401548 434423 427810 428494 434217 427985 443086 440169 429569 445993 429111 458731 468134 431032
16189 431032 465045 503795 506389 448749 469837 509594 511631 491519 449320 461380 480459 478979
16177 478979 514815 596572 558350 542321 533985 573446 533111 559606 632612 632305 583453 547833
16165 547833 553961 599988 624150 593850 612048 646830 655898 636699 671737 661117 668813 731638
16153 731638 676775 621410 652553 730358 725448 701243 693743 701336 650442 644803 683410 701935
16141 701935 677808 661106 698243 705575 728811 729034 761442 774914 783193 759183 767385 760101 703818
16128 703818 627054 647284 699115 686399 703516 721412 693186 735607 782610 779116 753424 731549
16116 731549 743155 772181 762335 729960 731443 773760 779960 735029 742961 742574 764690 759191 748394
16103 748394 750899 741459 750649 767595 793644 785449 783737 783541 792366 814181 829476 870904 840799
16090 840799 807829 831415 797108 843176 862677 835737 849496 806002 829763 865726 836067
16079 836067 855594 864729 833349 835866 837883 848308 829439 812128 791626 785143 876999 896123
16067 896123 903924 861660 769896 757728 766423 804240 823570 801065 798787 834921 799838 819433
16055 819433 852288 883465 851271 806519 873630 832766 815299 832795 800265 837097 843464 863834
16043 863834 840058 814962 896010 885467 843511 824248 839338 799793 832803 847763 816043
16032 816043 791456 810132 817338 807869 828921 854227 852205 828751 853449 846856 917468 924777
16020 924777 854220 829397 839185 866623 858924 857594 831531 875917 877209 815673 816392 805405 816307
16007 816307 795566 861180 877919 843871 769392 820427 835277 863252 920477 888405 843183
15996 843183 857116 864825 902331 867211 833541 869433 895150 889399 836616 846064 815455 809466
15984 809466 835320 842942 855698 860289 842736 857757 873605 897379 862157 877105 890745 903808
15972 903808 927456 883031 866218 898872 869777 841664 850236 854476 831879 873177 884953 884564
15960 884564 859212 876177 907035 857836 826051 843870 927339 944355 908966 886793 904864
15949 904864 882749 850383 855394 853899 863738 877571 919813 936589 945074 920660 898555 920845
15937 920845 963586 935226 916321 921445 949763 892241 909774 923903 899864 951377 917960 874310
15925 874310 887988 894523 922886 938947 941397 932520 936090 905740 895586 899123 923172 904848
15913 904848 955530 973779 964156 942795 892311 939651 914044 907822 911044 960974 954360 896399
15901 896399 897430 937198 967630 983737 959650 981311 945559 953236 1001208 990635 979053 937572
15889 937572 928661 1001634 974921 962628 988217 1024315 1005281 1004997 1011951 992132 971857 988121
15877 988121 958472 972944 972408 975726 972566 944392 950422 943100 956181 987537 967890 975675 958686
15864 958686 988263 1015140 970581 969909 952727 957937 927548 944888 960547 955177 930759 886192
15852 886192 982875 1015704 1006034 994553 968246 967656 1037505 1012286 945285 928153 919857 966785
15840 966785 976757 968474 930332 974547 1012268 1018217 1005281 1021113 987216 982066 979405 1027437
15828 1027437 1048708 1037562 1052236 1055360 1018877 989533 989362 1016962 984850 976894 951568 937543
15816 937543 1050669 1024218 1018248 1024052 987822 1021552 1004860 1015108 1068224 1083138 1048212 999179
15804 999179 962954 1003548 1033825 997858 946222 944202 962965 975716 1041442 1079850 1089630 1088709
15792 1088709 1042735 1045100 1013458 1013352 1015558 1025325 1015193 1009190 1043616 1020884 975859 969070 995924
15779 995924 1000700 1011428 1019367 1035587 961905 1005723 1046468 1020043 1007324 989690 1006263 968478
15767 968478 960523 926754 983082 1021973 1014635 1003542 1005441 991188 970616 955867 944679 1006147
15755 1006147 1016403 1025474 984476 948667 999040 1023382 999492 1004153 972543 1008999 1001573 1004897
15743 1004897 1014742 973687 983510 1019223 996509 971984 973931 941504 980849 1060002 1028627 991328
15731 991328 1017774 1025955 1076280 1048243 1005699 957050 975934 1028392 1044295 1043245 1018589 1052792
15719 1052792 1056740 1021578 999814 1015757 1041667 1024024 985399 1013560 1031279 977832 987737 1030455
15707 1030455 977878 940580 987220 1015350 1035220 981701 970979 964376 940735 974677 1000594
15696 1000594 1025111 1012967 989151 1034636 1040928 1009391 1024124 998659 1039868 1006225 970580
15685 970580 1065241 1064660 1112701 1121121 1040655 1046068 1038308 1054364 1048033 1037792 1036158 1042096 1014502
15672 1014502 1051205 1053859 1074820 1058738 1091176 1094034 1056317 1058242 1035317 1027656 1071226 1099618
15660 1099618 1123535 1096596 1063588 1062304 1043397 1012183 1055034 1076289 1081245 1073453 1082089 1119061
15648 1119061 1088446 1100183 1116696 1099327 1061804 1085955 1109220 1074815 1060471 1070699 1099908
15637 1099908 1100669 1062066 1089549 1068846 1081893 1054597 1096764 1101575 1061713 1066550 1068022 1064820
15625 1064820 1074677 1025982 1089506 1066206 1053944 1073229 1069999 1073138 1089089 1091877 1100176 1111176
15613 1111176 1075339 1114060 1140028 1108945 1058395 1090140 1134913 1076415 1081585 1129495 1114158
15602 1114158 1087684 1098471 1136944 1094793 1135622 1127763 1132078 1118283 1150691 1177030 1165729 1178126
15590 1178126 1176725 1205090 1167670 1166740 1142768 1123117 1100488 1137290 1191371 1122050 1098062 1136977
15578 1136977 1159644 1190637 1189433 1194604 1174889 1198356 1224866 1189034 1151263 1163246 1164232 1173155
15566 1173155 1173806 1184902 1244719 1170655 1154660 1145564 1135869 1120700 1136142 1119330 1152844 1138720
15554 1138720 1129048 1155261 1153754 1166096 1184902 1237851 1221677 1207013 1175900 1183641 1166671 1135601
15542 1135601 1154333 1195487 1209817 1212602 1261881 1265410 1282264 1277140 1217944 1193692 1174859 1196332
15530 1196332 1160964 1182721 1241912 1226559 1266932 1264950 1251773 1239271 1235352 1258495 1226317 1166822
15518 1166822 1191624 1175300 1261879 1278434 1213279 1233706 1244302 1224723 1199115 1270730 1299077
15507 1299077 1279011 1188202 1176159 1209423 1232423 1249579 1321063 1309898 1288307 1296139 1288486 1268057
15495 1268057 1221356 1234026 1255939 1216331 1243103 1244668 1223726 1208274 1227683 1231638 1236895 1264749
15483 1264749 1244138 1197229 1215750 1264736 1217497 1260343 1237949 1237236 1254294 1229783 1262599 1274266
15471 1274266 1224972 1218368 1280080 1270731 1230735 1247584 1237372 1260330 1263619 1245219 1257580 1277122
15459 1277122 1231809 1212730 1257748 1235362 1230685 1249536 1268265 1186805 1239697 1254464 1245329 1273447
15447 1273447 1251479 1282426 1258376 1226916 1238918 1235307 1202256 1225741 1245966 1245362 1230878 1240280
15435 1240280 1223873 1246697 1246471 1312824 1325540 1237516 1233719 1269054 1287270 1269122 1253103 1283224
15423 1283224 1225977 1227337 1280792 1265815 1259747 1265174 1237681 1237290 1196780 1254923 1258572 1232796
15411 1232796 1222137 1210744 1258647 1266648 1273426 1253031 1236252 1294816 1316233 1317378 1274071 1274887
15399 1274887 1318897 1276289 1246812 1283204 1317133 1306830 1311974 1306363 1312398 1276730 1269015 1280958
15387 1280958 1307444 1323452 1312014 1301823 1310190 1288151 1307122 1285059 1331282 1342349 1290680
15376 1290680 1279583 1236875 1207061 1216733 1265043 1335531 1345733 1319106 1299080 1298015 1295467 1321213
15364 1321213 1288845 1315050 1323590 1353017 1311834 1324860 1388208 1429614 1406071 1414430 1380975 1348626
15352 1348626 1374407 1328160 1311176 1347773 1364858 1339897 1342084 1300919 1325501 1351739 1331215
15341 1331215 1331080 1364226 1348354 1340339 1340439 1377403 1350720 1354988 1390155 1361598 1368650 1356278 1342083
15328 1342083 1328855 1360246 1357579 1288638 1354833 1355508 1353069 1389322 1437626 1421016 1420670 1369500
15316 1369500 1406553 1402676 1378666 1385711 1370130 1371173 1367953 1352477 1354855 1376509 1385474 1414773
15304 1414773 1405856 1406278 1381347 1405255 1377186 1394854 1436266 1438644 1457909 1452092 1467163 1467186 1453129
15291 1453129 1465847 1444577 1440548 1423205 1430586 1434264 1505639 1513573 1475207 1440332 1438500 1432205
15279 1432205 1449394 1434679 1425266 1457045 1510860 1471108 1411194 1498402 1543512 1515167 1467140
15268 1467140 1465589 1440084 1408434 1401745 1442719 1492659 1447362 1420105 1442475 1495070 1513500 1483028
15256 1483028 1436907 1409938 1456035 1469189 1474335 1488063 1499673 1486598 1480816 1460903 1460134 1505051
15244 1505051 1514747 1462557 1445686 1456876 1496606 1545625 1534953 1439305 1416813 1470926 1452250
15233 1452250 1456407 1481887 1470226 1503730 1505928 1434856 1443581 1483842 1459042 1499510 1577452 1533596
15221 1533596 1469247 1489373 1467089 1456359 1446370 1493909 1506784 1480419 1469746 1467164 1447292 1478133
15209 1478133 1503134 1545164 1535460 1521746 1536813 1498837 1523220 1555175 1551740 1513112 1501171 1561724
15197 1561724 1517333 1510522 1509510 1526855 1520970 1537068 1560804 1582856 1529780 1487414 1499102 1541287
15185 1541287 1597119 1532906 1572721 1558363 1602659 1601581 1582612 1527470 1473376 1492535 1533079
15174 1533079 1559537 1509977 1526246 1540888 1539198 1567891 1537174 1536540 1514831 1516297 1495407 1512902
15162 1512902 1554151 1589734 1550550 1581143 1616987 1596982 1626623 1584437 1608914 1574003 1567433
15151 1567433 1595020 1560103 1537989 1527561 1545253 1533919 1547710 1584530 1632375 1571164 1566429
15140 1566429 1585256 1564235 1553461 1548641 1530603 1564617 1585810 1580090 1557758 1591797 1573857 1541469
15128 1541469 1548827 1589217 1631293 1654601 1664359 1612170 1565923 1584983 1558037 1562329 1573813 1592929
15116 1592929 1600428 1603321 1585181 1588009 1572561 1558835 1633001 1586557 1605339 1633711 1590238 1576504
15104 1576504 1602967 1624112 1613322 1583950 1604528 1569186 1558368 1608565 1627151 1631104 1639878 1592324
15092 1592324 1657254 1644919 1676753 1629777 1589375 1611076 1640395 1614743 1612872 1640669 1664406
15081 1664406 1674964 1640513 1675641 1680596 1659828 1645310 1609464 1620465 1617595 1627610 1593425 1536648
15069 1536648 1557541 1595868 1551932 1549211 1613866 1593334 1606813 1630042 1682656 1632097 1542223
15058 1542223 1556058 1578506 1596622 1581817 1564185 1539113 1501021 1538082 1583593 1600303 1637360
15047 1637360 1665556 1627685 1653899 1658946 1590915 1559071 1675951 1676555 1628308 1628410 1664728 1653902
15035 1653902 1609965 1647598 1630206 1624939 1636511 1645019 1680204 1686880 1597178 1593376 1651393 1688705
15023 1688705 1693472 1662520 1689934 1647720 1610668 1653787 1672892 1685654 1690303 1717171 1671067 1613090
15011 1613090 1668433 1663662 1652723 1688705 1729037 1679050 1673947 1686996 1675158 1640805 1651195 1653841
14999 1653841 1655560 1680720 1674877 1680882 1716895 1682157 1676296 1709057 1663723 1655716 1658425 1685112
14987 1685112 1666823 1692545 1669117 1688046 1706793 1727713 1706449 1647343 1625621 1670798 1714987
14976 1714987 1708468 1704945 1676121 1646392 1677533 1683478 1659907 1690044 1714184 1725145 1697823 1726765
14964 1726765 1732899 1718218 1715367 1718025 1718027 1661024 1671654 1737329 1755275 1718671 1656493 1647958 1701074
14951 1701074 1654548 1674644 1692335 1672049 1710933 1727708 1684563 1682599 1637034 1676038 1717529
14940 1717529 1729397 1781448 1731555 1708688 1741401 1726887 1685655 1649895 1694275 1712351 1731936
14929 1731936 1731467 1708194 1754957 1728804 1713517 1723850 1763926 1770349 1766989 1729439 1770498 1711311
14917 1711311 1671951 1719372 1768168 1739192 1744350 1743899 1776592 1810432 1798278 1755851 1740481 1732370
14905 1732370 1721377 1751673 1753407 1751852 1743432 1707961 1762274 1774366 1731882 1692856 1657939 1641332
14893 1641332 1727921 1743928 1705866 1700819 1729243 1803624 1694966 1656954 1676487 1743198 1776294
14882 1776294 1818341 1776524 1728812 1736567 1817597 1778186 1765178 1821612 1778110 1767994 1736104
14871 1736104 1779842 1809144 1795461 1757399 1758563 1799034 1762749 1762487 1792001 1781417 1727352 1742949
14859 1742949 1759920 1711755 1724109 1730171 1762973 1787852 1798944 1791543 1829010 1847238 1781538 1771436
14847 1771436 1754465 1781715 1780856 1726182 1740451 1782593 1838155 1818577 1797040 1766477 1798739 1806739
14835 1806739 1744510 1763684 1789513 1736561 1779969 1818040 1778852 1784550 1762328 1713991 1680828
14824 1680828 1739303 1781620 1798948 1824490 1777880 1828235 1865424 1803977 1850532 1830509 1801407
14813 1801407 1806452 1826316 1805272 1802013 1814706 1863122 1853269 1782580 1752109 1793206 1825402 1799024
14801 1799024 1796631 1818248 1794169 1775529 1821709 1784193 1751158 1844371 1764460 1762933 1807680 1759608
14789 1759608 1811219 1844710 1850026 1831967 1879912 1866280 1874380 1895142 1855420 1855259 1852696 1859991
14777 1859991 1854679 1878176 1865826 1853755 1829438 1807125 1820690 1859001 1877236 1864821 1908501
14766 1908501 1909623 1895135 1908562 1920138 1901545 1916226 1947944 1940274 1895121 1919450 1972786 1892053
14754 1892053 1838352 1882831 1912646 1941072 1929107 1920837 1932589 1938795 1894621 1869046 1920147 1933464
14742 1933464 1915616 1929454 1964270 1929948 1932926 1895250 1841326 1880029 1852446 1889145 1856857
14731 1856857 1852388 1895139 1902199 1928042 1959806 1891174 1877050 1933526 1962484 1966762 1994319 1987934
14719 1987934 1943682 1979170 1945579 1925087 1943118 1970319 1905571 1952049 1951425 1973180 2023917 1981260
14707 1981260 1925249 1908518 1962740 1941443 1949088 1922410 1887924 1915199 1896365 1931930 1948387
14696 1948387 1916151 1959917 1968745 2002854 2008976 1960900 1931911 1985380 1995505 2015839 1979968 1937551
14684 1937551 1941491 1904911 1911582 1929396 1914980 1913633 1979671 1982773 1961169 1924017 1929334 1963621
14672 1963621 1976522 2015646 1963924 1976845 2019134 1950923 1983846 2015864 2014845 2036324 2005805
14661 2005805 2008757 1986996 1974950 1979539 1950387 1919548 1939308 1962916 2014610 1978919 1950225 1941408
14649 1941408 1999030 1988081 1979669 2007298 2040001 2032715 2041406 2042547 1998374 2009468 1983776 2013675
14637 2013675 2023103 2058562 2050746 2047132 2010419 2029107 1985033 1962269 2064982 2080687 2038366 1997891
14625 1997891 2005647 1976333 1960661 1983016 2002777 2076376 2109520 2033066 2010202 2058409 2055976 2047018
14613 2047018 2070152 2060850 1988168 2028759 2031119 2006376 1997855 2027437 2065034 2026282 2034058 2073434
14601 2073434 2049645 2028216 2019283 2027516 2002161 2041085 2037579 2015306 2033131 2075247 2056783 2034363
14589 2034363 2012825 2015520 2048245 2009765 2019761 2045387 2014334 2066917 2120152 2089684 2072890 2106863
14577 2106863 2095098 2053927 2022347 2035694 2079650 2090387 2049231 2007567 2028016 1990228 1976633
14566 1976633 2025133 2048798 2048009 2072256 2095143 2121380 2097132 2096043 2090152 2098644 2163763 2144843
14554 2144843 2131479 2128039 2153685 2125146 2061113 2086865 2094309 2109861 2068247 2130392 2138277 2099347
14542 2099347 2139159 2135690 2113355 2128429 2161080 2122253 2070108 2063690 2068478 2063535 2112695 2126521
14530 2126521 2149872 2152655 2144728 2149065 2160139 2175934 2194755 2204378 2186741 2165778 2123543 2126428
14518 2126428 2073368 2066517 2109382 2145985 2106498 2094847 2094059 2135011 2143288 2107280 2049521 2054326
14506 2054326 2143399 2118665 2088556 2049758 2062495 2122205 2103448 2131512 2153862 2162131 2147982
14495 2147982 2150332 2116369 2195277 2235389 2242399 2250381 2259649 2227195 2136233 2138928 2151250 2162628
14483 2162628 2195643 2197077 2211339 2237947 2203677 2211849 2215134 2204237 2177812 2171621 2139363 2141794
14471 2141794 2169837 2167561 2187739 2189346 2147974 2091483 2125416 2157315 2214400 2240533 2189341 2206601
14459 2206601 2170777 2198543 2219117 2215219 2188562 2191344 2231849 2262978 2213373 2164011 2192584 2244781
14447 2244781 2240162 2223823 2233711 2236995 2255177 2241692 2195485 2194690 2226746 2213018 2199478 2203423
14435 2203423 2213295 2237190 2220910 2217888 2226274 2227206 2212134 2262662 2238880 2264844 2263104 2228606
14423 2228606 2244707 2221945 2184039 2262434 2288251 2229153 2245780 2255499 2246674 2209674 2257445 2220189
14411 2220189 2156918 2220654 2249488 2243840 2243632 2223535 2233939 2252465 2275571 2261413 2240848 2210183
14399 2210183 2228416 2215096 2236993 2277068 2254032 2225330 2247896 2210096 2215766 2212798 2176139 2211201
14387 2211201 2252194 2302985 2252077 2237897 2249662 2283492 2247847 2210996 2214138 2245498 2275329
14376 2275329 2279059 2260844 2256887 2295527 2247059 2255233 2244027 2252986 2292616 2299229 2253366 2254094 2311241
14363 2311241 2300126 2343949 2331328 2293254 2243031 2261389 2299520 2267377 2233175 2219083 2298793
14352 2298793 2263514 2243910 2239571 2264495 2259412 2241076 2282838 2245505 2266832 2282319 2261654 2280834
14340 2280834 2303863 2336438 2255560 2231201 2271269 2259589 2295450 2305571 2287214 2331576 2353004
14329 2353004 2302770 2298570 2278829 2308840 2361380 2391334 2347711 2330796 2365413 2309761 2266928
14318 2266928 2300711 2337299 2308484 2266485 2295159 2326373 2276629 2292205 2331629 2338971 2356202
14307 2356202 2294269 2256220 2305807 2362626 2318398 2275241 2288128 2326140 2328692 2364455 2292457
14296 2292457 2242767 2312079 2342938 2371046 2399028 2391243 2338478 2373877 2352361 2300594 2341167
14285 2341167 2348503 2307076 2270730 2240947 2244811 2254223 2329713 2338489 2293755 2330919 2325352 2305269
14273 2305269 2336192 2321312 2265341 2293522 2356429 2337917 2310776 2307331 2332889 2360625 2340887
14262 2340887 2305588 2352192 2316695 2285866 2330822 2337125 2337572 2312570 2349002 2357312 2330937 2342482
14250 2342482 2362934 2372924 2338347 2315470 2337361 2337587 2358533 2357607 2322322 2306533 2357234 2375702
14238 2375702 2364402 2376159 2353518 2336767 2347530 2365973 2379849 2401065 2327719 2380220 2394179
14227 2394179 2377659 2322480 2317573 2348602 2358951 2361663 2361935 2356114 2323627 2374256 2361234 2337484
14215 2337484 2338070 2338733 2410926 2424595 2390747 2407512 2410012 2401711 2408054 2428980 2421525 2403217 2401246
14202 2401246 2409920 2384638 2378862 2414240 2403240 2412963 2456020 2446594 2450441 2418442 2372803 2416429
14190 2416429 2470614 2402383 2361021 2354368 2363948 2393562 2408125 2387053 2382061 2428391 2435212 2430273
14178 2430273 2434737 2416041 2433857 2428443 2429837 2416962 2421964 2417872 2430828 2437106 2446128 2433288 2426611
14165 2426611 2442134 2425502 2416503 2428286 2476491 2460765 2436187 2464201 2444934 2471878 2447111
14154 2447111 2485646 2516609 2506022 2496616 2479239 2492527 2422728 2365695 2360731 2409137 2431299 2413824
14142 2413824 2449253 2451356 2457616 2472283 2478649 2485548 2475309 2454950 2486402 2488415 2468458 2486765
14130 2486765 2492336 2515951 2539627 2543235 2509051 2484646 2487503 2478977 2477414 2494421 2483002 2443668
14118 2443668 2420779 2468669 2518815 2465595 2462012 2504857 2501922 2513778 2502706 2514046 2512132 2529850
14106 2529850 2516136 2495196 2504665 2530885 2513407 2509670 2539730 2531480 2483872 2477572 2480558 2501836
14094 2501836 2448716 2462489 2484827 2483487 2472470 2494068 2528005 2487244 2446546 2488185 2510813
14083 2510813 2501128 2510574 2550176 2546300 2525990 2517771 2505071 2492135 2483599 2485259 2515760 2537526
14071 2537526 2516808 2548628 2533897 2557101 2549989 2567894 2586335 2592116 2600825 2568885 2595479 2571363
14059 2571363 2554281 2536920 2531700 2526291 2545967 2575507 2568532 2496619 2457601 2532474 2584388 2621712
14047 2621712 2644652 2595282 2553597 2563824 2598664 2607588 2609826 2577990 2552781 2558421 2565604 2567440
14035 2567440 2537553 2557824 2566381 2613363 2656219 2637604 2614350 2626013 2599189 2606254 2645090 2616124
14023 2616124 2579554 2618619 2561151 2573351 2578026 2596394 2628999 2626120 2634754 2633750 2648462 2604456
14011 2604456 2590320 2663197 2671435 2617295 2644640 2675945 2666702 2619134 2613781 2590708 2627705 2691134
13999 2691134 2647308 2599825 2596682 2603561 2607725 2646240 2617338 2637817 2641897 2613071 2685384 2661843
13987 2661843 2666073 2689637 2678449 2658564 2679906 2609689 2598549 2675516 2675674 2666815 2689054 2698230
13975 2698230 2650505 2694857 2703055 2705465 2642666 2654213 2628864 2610786 2654394 2656234 2702546 2716714
13963 2716714 2690230 2689208 2715555 2683798 2670201 2746350 2733085 2716421 2707372 2702898 2702233 2683127
13951 2683127 2718146 2736782 2706351 2627434 2624922 2669087 2717549 2720684 2735047 2756656 2727511 2732476
13939 2732476 2729760 2714553 2711818 2671889 2708191 2708564 2744682 2715114 2700226 2721014 2689956 2732040
13927 2732040 2709521 2665934 2656702 2684945 2631910 2624487 2718474 2772939 2732698 2714696 2668318 2681635
13915 2681635 2706967 2743357 2712614 2701608 2685191 2654868 2695607 2698558 2690054 2712624 2710867 2695213
$$ [...]
##END NTUPLES=NMR SPECTRUM
##END=
