##TITLE=1H_DE-80H_X3
 200.13MHz, d2o
 8 sc
 
 19ns.26.2.2025
##JCAMPDX= 6.0         $$ Bruker NMR JCAMP-DX V2.0
##DATA TYPE= NMR SPECTRUM
##DATA CLASS= NTUPLES
##ORIGIN= UXNMR, Bruker Analytische Messtechnik GmbH
##OWNER= pz
$$ XWIN-NMR		Version 3.5
$$ Thu Jun 11 10:24:34 2026 Russian Standard Time (UT+4h)  Yarkov@DPX200
##.OBSERVE FREQUENCY= 200.1313
##.OBSERVE NUCLEUS= ^1H
##.ACQUISITION MODE= SIMULTANEOUS
##.ACQUISITION SCHEME= undefined
##.AVERAGES= 8
##.DIGITISER RES= 18
##SPECTROMETER/DATA SYSTEM= spect
##.PULSE SEQUENCE= zg30
##.SOLVENT NAME= DMSO
##.SHIFT REFERENCE= (INTERNAL, DMSO, 0, 15.4869)
##AUDIT TRAIL= $$ (NUMBER, WHEN, WHO, WHERE, WHAT)
$$ ##TITLE= Audit trail, XWIN-NMR		Version 3.5
$$ ##JCAMPDX= 5.01
$$ ##ORIGIN= Bruker BioSpin GmbH
$$ ##OWNER= Yarkov
$$ C:/Bruker/XWIN-NMR/data/yarkov2/nmr/H-C/1/pdata/1/auditp.txt
$$ ##AUDIT TRAIL=  $$ (NUMBER, WHEN, WHO, WHERE, WHAT)
(   1,<2026-06-11 10:23:30.76 +0400>,<Yarkov>,<DPX200>,
      <created by zg, POWCHK disabled, PULCHK disabled
       configuration hash MD5:
       00 E9 B6 7A A2 85 ED C7 34 08 36 98 17 FE 4E 26
       data hash MD5: 16K
       6A 2E A9 04 E8 0E 24 48 32 32 02 2B 8B EE 8E BE>)
(   2,<2026-06-11 10:23:37.75 +0400>,<Yarkov>,<DPX200>,
      <Start of raw data processing
       efp BC_mod = 2 LB = 0.25 FT_mod = 6 PKNL = 1 PHC0 = -6900.219 PHC1 = 13.42196 SI = 16K 
       data hash MD5: 16K
       C4 3C EE 8D F2 AD F9 7F 7D AA 0A AC 0F 6B 36 02>)
$$ ##END=
$$ 
$$ hash MD5
$$ AF 30 3C B4 2E 11 68 36 DC 2C 2E BE 24 50 2C 31
##$RELAX= 
##$RELAX= 
##$RELAX= 
##$RELAX= 
##$RELAX= 
##$RELAX= 
$$ Bruker specific parameters
$$ --------------------------
##$DU= <C:/Bruker/XWIN-NMR>
##$EXPNO= 1
##$NAME= <H-C>
##$PROCNO= 1
##$TYPE= <nmr>
##$USER= <yarkov2>
##$AMP= (0..31)
100 100 100 100 100 100 100 100 100 100 100 100 100 100 100 100 100 100 
100 100 100 100 100 100 100 100 100 100 100 100 100 100 
##$AQSEQ= 0
##$AQ_mod= 1
##$AUNM= <au_zg>
##$AUTOPOS= <>
##$BF1= 200.13
##$BF2= 200.13
##$BF3= 200.13
##$BF4= 200.13
##$BF5= 200.13
##$BF6= 200.13
##$BF7= 200.13
##$BF8= 200.13
##$BYTORDA= 1
##$CFDGTYP= 0
##$CFRGTYP= 5
##$CHEMSTR= <none>
##$CNST= (0..31)
1 1 145 1 1 1 1 1 1 1 1 1 1 1 1 1 1 1 1 1 1 1 1 1 1 1 1 1 1 1 1 1 
##$CPDPRG= <>
##$CPDPRG1= <>
##$CPDPRG2= <>
##$CPDPRG3= <>
##$CPDPRG4= <mlev>
##$CPDPRG5= <mlev>
##$CPDPRG6= <mlev>
##$CPDPRG7= <mlev>
##$CPDPRG8= <mlev>
##$CPDPRGB= <>
##$CPDPRGT= <>
##$D= (0..31)
0 0.7 0 0 0 0 0 0 0 0 0 0.03 0 0 0 0 0 0 0 0 0 0 0 0 0 0 0 0 0 0 0 0 
##$DATE= 1781159010
##$DBL= (0..7)
120 120 120 120 120 120 120 120 
##$DBP= (0..7)
150 150 150 150 150 150 150 150 
##$DBP07= 0
##$DBPNAM0= <>
##$DBPNAM1= <>
##$DBPNAM2= <>
##$DBPNAM3= <>
##$DBPNAM4= <>
##$DBPNAM5= <>
##$DBPNAM6= <>
##$DBPNAM7= <>
##$DBPOAL= (0..7)
0.5 0.5 0.5 0.5 0.5 0.5 0.5 0.5 
##$DBPOFFS= (0..7)
0 0 0 0 0 0 0 0 
##$DE= 6
##$DECBNUC= <off>
##$DECIM= 32
##$DECNUC= <off>
##$DECSTAT= 4
##$DIGMOD= 1
##$DIGTYP= 9
##$DL= (0..7)
0 120 120 120 120 120 120 120 
##$DP= (0..7)
$$ [...]
##$SUBNAM2= <"">
##$SUBNAM3= <"">
##$SUBNAM4= <"">
##$SUBNAM5= <"">
##$SUBNAM6= <"">
##$SUBNAM7= <"">
##$SUBNAM8= <"">
##$SUBNAM9= <"">
##$SW= 18.0517328524113
##$SWIBOX= (0..15)
0 0 2 0 0 0 0 0 0 0 0 0 0 0 0 0 
##$SW_h= 3612.71676300578
##$TD= 16384
##$TD0= 1
##$TE= 0
##$TE2= 300
##$TE3= 300
##$TEG= 300
##$TL= (0..7)
0 120 120 120 120 120 120 120 
##$TP= (0..7)
150 150 150 150 150 150 150 150 
##$TP07= 0
##$TPNAME0= <>
##$TPNAME1= <>
##$TPNAME2= <>
##$TPNAME3= <>
##$TPNAME4= <>
##$TPNAME5= <>
##$TPNAME6= <>
##$TPNAME7= <>
##$TPOAL= (0..7)
0.5 0.5 0.5 0.5 0.5 0.5 0.5 0.5 
##$TPOFFS= (0..7)
0 0 0 0 0 0 0 0 
##$TUNHIN= 0
##$TUNHOUT= 0
##$TUNXOUT= 0
##$USERA1= <user>
##$USERA2= <user>
##$USERA3= <user>
##$USERA4= <user>
##$USERA5= <user>
##$V9= 5
##$VALIST= <valist>
##$VCLIST= <CCCCCCCCCCCCCCC>
##$VD= 0
##$VDLIST= <DDDDDDDDDDDDDDD>
##$VPLIST= <PPPPPPPPPPPPPPP>
##$VTLIST= <TTTTTTTTTTTTTTT>
##$WBST= 1024
##$WBSW= 4
##$XGAIN= (0..3)
0 0 0 0 
##$XL= 0
##$YL= 0
##$YMAX_a= 34833
##$YMIN_a= -61290
##$ZGOPTNS= <>
##$ZL1= 120
##$ZL2= 120
##$ZL3= 120
##$ZL4= 120
##$ABSF1= 0
##$ABSF2= 0
##$ABSG= 0
##$ABSL= 0
##$ALPHA= 0
##$AQORDER= 0
##$ASSFAC= 0
##$ASSFACI= 0
##$ASSFACX= 0
##$ASSWID= 0
##$AUNMP= <proc_1d>
##$AZFE= 0.1
##$AZFW= 0.1
##$BCFW= 0
##$BC_mod= 2
##$BYTORDP= 0
##$COROFFS= 0
##$CY= -3
##$DATMOD= 1
##$DC= 0
##$DFILT= <>
##$DTYPP= 0
##$F1P= 0
##$F2P= 0
##$FCOR= 1
##$FTSIZE= 16384
##$FT_mod= 6
##$GAMMA= 0
##$GB= 0
##$INTBC= 1
##$INTSCL= 3.241238e-09
##$ISEN= 128
##$LB= 0.25
##$LEV0= 0
##$LPBIN= 0
##$MAXI= 10000
##$MC2= 0
##$MEAN= 0
##$ME_mod= 0
##$MI= 1.114404
##$NCOEF= 0
##$NC_proc= -10
##$NLEV= 6
##$NOISF1= 3.799351
##$NOISF2= 2.8
##$NSP= 0
##$NTH_PI= 0
##$NZP= 0
##$OFFSET= 15.48687
##$PC= 1
##$PHC0= -6900.219
##$PHC1= 13.42196
##$PH_mod= 1
##$PKNL= yes
##$PPARMOD= 0
##$PSCAL= 0
##$PSIGN= 0
##$REVERSE= no
##$SF= 200.130006971982
##$SI= 16384
##$SIGF1= 3
##$SIGF2= 2
##$SINO= 0.751879
##$SIOLD= 32768
##$SREGLST= <19F.Aceton>
##$SSB= 0
##$STSI= 16384
##$STSR= 0
##$SW_p= 3612.71676300578
##$SYMM= 0
##$S_DEV= 0
##$TDeff= 16384
##$TDoff= 0
##$TI= <>
##$TILT= no
##$TM1= 0
##$TM2= 0
##$TOPLEV= 0
##$USERP1= <user>
##$USERP2= <user>
##$USERP3= <user>
##$USERP4= <user>
##$USERP5= <user>
##$WDW= 1
##$XDIM= 16384
##$YMAX_p= 503040122
##$YMIN_p= -7095013
$$ End of Bruker specific parameters
$$ ---------------------------------
##NTUPLES= NMR SPECTRUM
##VAR_NAME=  FREQUENCY,     SPECTRUM/REAL,   SPECTRUM/IMAG
##SYMBOL=    X,             R,               I
##VAR_TYPE=  INDEPENDENT,   DEPENDENT,       DEPENDENT
##VAR_FORM=  AFFN,          ASDF,            ASDF
##VAR_DIM=   16384,         16384,           16384
##UNITS=     HZ,            ARBITRARY UNITS, ARBITRARY UNITS
##FACTOR=    0.220516191357247, 1,           1
##FIRST=     3099.38736345208, 0,            0
##LAST=      -513.329399553697, 0,           0
##MIN=       -513.329399553697, -7095013,    0
##MAX=       3099.38736345208, 503040122,    0
$$ Real data points
##PAGE= N=1
##DATA TABLE= (X++(R..R)), XYDATA
$$ [...]
7108 2285872 2196796 2193652 3189730 3174762 3273429 3519991 2631369 2260596 1726316 1280420
7098 1280420 2185530 2882831 3230936 3458155 2795681 2345123 1729539 1392265 2112935 2241308
7088 2241308 2447331 3184469 2569624 2625745 2379879 2378558 2073749 2625744 3282711 3216400
7078 3216400 2873504 3016415 2346271 1666917 2236091 2762578 3305250 3794329 3039248 2388974
7068 2388974 1717054 1189083 1830568 2493002 2670917 3187666 3434454 3354887 3177558 2144885
7058 2144885 1259669 2323970 2932687 3528940 2701082 2396174 2120537 2289635 3370406
7049 3370406 3619770 4240531 4589164 3737374 3339482 3193723 2894923 1850890 1878934 2706729
7039 2706729 3198992 2803976 2828086 2104666 2001321 2977558 2962280 2749142 4134887 4416556
7029 4416556 3824265 3692948 3309153 2325273 3042792 3065732 2616076 2657936 2708827 2284180
7019 2284180 1749796 2863793 3411573 3497200 4468698 4580999 4465950 4544044 3336467 2826655
7009 2826655 3472087 3112733 2583821 2605194 2715440 2854684 2351974 3257338 3398576 3133875
6999 3133875 4240173 4472258 4215558 4633698 3722532 3010876 3458460 3013942 3368106
6990 3368106 3145616 3201898 2899414 2474014 2369573 2397994 2703551 3391386 3683658 4049553
6980 4049553 4782055 3360193 2927293 2890890 2372061 2754360 2820098 2507474 2970706 2603948
6970 2603948 2980274 3581019 3437324 3680881 3694265 3749600 4456535 2906576 2845131 2930189
6960 2930189 2286276 2680168 2459783 2505751 3087368 2655564 3407072 3375960 3655577 4017254
6950 4017254 4123535 3520395 4399292 4018573 3619497 4015524 3792889 3738274 3635653 3284754
6940 3284754 3449435 3572272 4394700 4325781 4045293 4305026 3268355 2921902 3647977 3202501
6930 3202501 3435079 3492243 2803828 3255327 3434103 2787279 3287315 3766126 4032445 4524942
6920 4524942 4313730 4295676 4745955 3410281 3170659 3231962 2917273 3937661 3359854 3760172
6910 3760172 4225088 3254263 3697338 3878544 3209026 3712116 3693248 3700714 4530228 4464365
6900 4464365 4258588 4365984 4273515 4391350 4380411 3410330 3946264 3817681 3362059 4109671
6890 4109671 3727209 3624124 3964332 4024356 4332591 4844005 4463083 4720080 4048852 3315489
6880 3315489 3372032 3201720 3363315 4197483 4710811 4806592 4116450 3554999 3596226 3340216
6870 3340216 3772933 5081832 4728838 4152784 3790196 3487480 3079770 3277803 4625542
6861 4625542 5479424 5186500 5277485 4519003 2972670 3401311 3669701 3636133 4730286 5131065
6851 5131065 4629377 4137213 3617370 3280777 3756246 4390120 4993071 4849213 4695817 4895435
6841 4895435 3311573 3703092 4809924 4423638 4959091 5486301 4499305 4008605 3497485
6832 3497485 3123104 4646910 5028081 5776143 5709347 5348822 4698401 3668206 3245167
6823 3245167 4336122 3984390 4362707 4688511 4000322 3285181 2880536 2700680 3921534
6814 3921534 4511094 4890495 4911261 4592133 4722970 4251004 4195302 5095794 4521115 3811471
6804 3811471 3678622 3665266 3575271 3846894 3541922 3925687 4487727 4147360 4136564 4023767
6794 4023767 4508095 5182321 5018374 5104387 4424762 3425729 3379162 3543834 3724607 4562474
6784 4562474 4927075 4779557 4721640 4502399 4389379 5333145 5307411 5655536 5245837 4946596
6774 4946596 4116185 3345712 3919956 4377390 4936316 5499855 5939266 5199334 5304004 4731360
6764 4731360 4122825 4477506 5357766 5219424 5568868 4875406 4390869 5051946 5676973 5131069
6754 5131069 4812381 5337338 5419236 4913015 4635256 4357806 4867116 6094770 6358613 5428916
6744 5428916 5575496 5477349 4462026 3784444 4706602 5029670 5576236 5543314 5263383 5193291
6734 5193291 4690962 5210632 5586536 5748856 6507778 6021760 5788561 5594535 5551197 5887978
6724 5887978 6543043 6273886 6403799 5750243 4942403 4868573 4908026 5822491 6034088 5491185
6714 5491185 5777127 5699623 4817262 4721647 5029655 4798458 5560504 5363538 5479032 5128935
6704 5128935 4372241 4478604 4830203 5694357 6919801 6591760 6542838 6372579 5857585 5882752
6694 5882752 5979142 5831630 5923128 5344625 5016540 5119315 4598023 5646378 6013771 5383719
6684 5383719 5898479 5709562 5612787 5704646 5872413 5470325 6080140 6835511 6361146 5973776
6674 5973776 5860503 5430206 5497417 6204895 6768721 6371694 5301888 5167604 4836928 5745921
6664 5745921 6514084 6820059 7083029 6768353 6149281 5263577 4656476 5019546 5196287 6386884
6654 6386884 6677483 6032724 5906079 5680629 5330583 6063621 6541533 7168536 8065176 7346075
6644 7346075 6386344 5732975 5412795 5740095 6132063 7303911 7130098 6061905 5297959
6635 5297959 4260997 4489873 5841491 6830923 7610562 7886083 7915273 6897789 6009464
6626 6009464 6427494 6288327 7094574 8213909 7858800 7586664 6997884 6058505 5704057
6617 5704057 6811255 7684047 8218998 8156320 7637003 6607122 6134929 6593157 6170210
6608 6170210 6511204 7790101 7378032 6444354 6287545 6215933 6014058 6813505 7680579 8137923
6598 8137923 8414653 8319465 6930668 7088174 7391528 7047500 7318322 7666504 7470626 7026634
6588 7026634 6351933 7261326 7067105 7474482 8017701 8210782 8288194 8079019 7050409 7091149
6578 7091149 7610634 7078771 6907143 7110395 6710451 6777579 6724645 7098082 7348536 7758552
6568 7758552 7824076 7820447 7651185 8165139 7869193 7622620 8158959 7980420 7413551 6897470
6558 6897470 6889015 6850132 6823932 7346410 7993844 8111435 7701142 7646330 8072157 8431084
6548 8431084 8278329 7831580 8189382 7701157 7488033 7224550 6745192 7170922 6590789 6798517
6538 6798517 7941853 7449248 8068009 8476071 8691105 9298493 8588881 8153587 8562045
6529 8562045 7942292 8277237 7921490 7617373 7846802 7605119 7482597 7932614 7215380 7975155
6519 7975155 8502528 8689363 9772015 10203420 9579186 8774264 8005236 8035809 7725024 7698482
6509 7698482 7968852 7717955 7354464 8052997 7600965 8850334 9574634 9794842 10667529
6500 10667529 10035227 9232184 8621762 8322185 8446722 8498516 9513000 9785145 9229458
6491 9229458 9054855 9162307 9141014 10332438 11047169 11511332 11647390 11371470 10754521 9996686
6481 9996686 9293645 9431081 9585842 10239539 10527031 10063604 9837434 9455780 8677148 9139306
6471 9139306 9700308 10772969 11586155 11674732 10690252 9920595 9376368 9584367 9106979 9876443
6461 9876443 10741501 10377753 10132288 9481130 9339704 10397469 11605668 12327264 13033322
6452 13033322 13045522 12263070 10494121 10033425 9828068 10044109 10412992 10886475 11176857
6443 11176857 10706912 10373696 9923227 10033153 10806588 11326369 12452985 12839903 12564004
6434 12564004 11494672 10742994 11482937 12216809 11700447 11288860 11481521 11010583 10500588
6425 10500588 10959375 10308465 10776826 12519287 12860763 12509248 13448934 13023402 12425635
6416 12425635 12112864 11675089 11095059 11579226 12375110 12176036 11375517 12101660 12083165 11706590
6406 11706590 12872279 13159079 13177836 13752589 13073562 13053341 13438030 13675872 13473106 13048477
6396 13048477 13165083 12575506 11721625 13167838 13067161 12452910 13604124 13268772 13075314
6387 13075314 14676884 14554663 14814759 14614175 14837684 15227299 14505161 15022980 15344603
6378 15344603 14662912 16174825 16150806 15735778 16908605 16266722 15855399 17323164 16744879
6369 16744879 17699962 19293749 19416283 19010435 18442412 18108631 18687690 18701280 20508995
6360 20508995 20933545 20120258 20468440 19623500 19520214 21331287 21827418 22657854 24191153
6351 24191153 24606849 24806889 23698371 23594922 23319616 22700383 25078316 25987686 25618693
6342 25618693 27035327 25986767 24985191 27290571 27862364 29323274 32143892 31466840
6334 31466840 31997660 32203905 31747779 32414958 32675245 35112026 36699958 35996350 37134185
6325 37134185 36147785 35595393 36984217 37068627 38060295 40115948 39970658 39643894 39724407
6316 39724407 39611447 39268904 39946941 40469948 41008827 40564381 40952833 40902711 40893204 42426085
6306 42426085 43297650 44539832 46893940 46946797 47274377 47448150 47995681 47977270 48480350
6297 48480350 49034321 49042815 49234051 49502705 49755054 49735499 50578096 51710176 52087886 52720672
6287 52720672 52769417 52440887 52022927 52125791 52400796 51593861 51311408 49902180 49030372
6278 49030372 47929956 47284594 48245974 48313036 49334365 49663568 49218807 49038120 48935778
6269 48935778 48672606 50010901 49789040 50089280 50468217 48987463 48384367 48398886 48140047
6260 48140047 49079969 48402459 48214781 48957230 47990992 47663925 47895084 47028455 47378098
6251 47378098 47421144 46867134 45711364 43631440 42478872 41648800 40238123 40775438 39743272
6242 39743272 38950920 39300057 38628130 37592775 37447924 37600039 37599538 37851351 37652741 36864521
6232 36864521 34990227 33652982 32978226 32158329 33107846 32825710 31847898 32908863 32085523
6223 32085523 32211364 32314178 31589543 31568374 31930584 32057084 32027397 30743185 30171765 28809687
6213 28809687 27488361 27770368 27502887 26176610 26776277 25937628 24808174 25671442 25142962
6204 25142962 24164563 25281762 24325889 24323491 24346020 23943434 23719043 22729241 22578245 22046887
6194 22046887 21487595 23073368 22569371 22682503 24161506 23220390 22154493 22672307 22557771
6185 22557771 22442533 22931858 23095209 22894490 22572613 21814010 21085758 20121201 21611285
6176 21611285 21693517 21774658 23331368 23065391 21819546 21762632 22154884 22581400 22767445 22916533
6166 22916533 22445490 21372839 21498267 20470322 19785102 20975928 21166005 21422422 22278997
6157 22278997 22440306 21769763 22173522 22533789 22266241 22181277 22275130 21789807 21810287 22645972
6147 22645972 21543148 20448555 21041827 21115653 21362580 22204922 22548742 22248639 22123721
6138 22123721 22157450 21924527 21758151 22710811 22790867 22600456 23366707 22643066 21805431 22006391
6128 22006391 21333836 21160604 21970453 22507693 23112735 22756942 23379068 23269386 22822531
6119 22822531 23452329 24049622 23944175 24471137 24418796 23359077 23259025 22928704 23379670
6110 23379670 24492485 24971906 26339149 27198499 27458758 27549359 26887552 26821346 27721923
6101 27721923 27668750 28322867 28680254 28172185 27802820 27559745 27403695 27677333 27140041 27993894
6091 27993894 28016596 27663299 28245669 28657081 28147909 28527023 28736056 30087825 31296935
6082 31296935 31152967 31404571 31913280 31698402 32210416 32555682 32635940 33213702 32860454 32559528
6072 32559528 32410899 32137830 32641644 32697105 32178307 32414114 32530129 32566046 32017244 32024442
6062 32024442 32734992 32701201 33483456 34458181 35015549 34946213 34808313 35347816 36656225 37071794
6052 37071794 37556952 38277703 38800592 39000576 39565785 40966470 41706071 43116538 43983789
6043 43983789 45165058 47417937 49407587 51092604 53654266 56325285 58087763 60658183
6035 60658183 62740651 64484440 66400345 67548089 69419607 71009048 71789756 73172628
6027 73172628 74727259 76851527 79337739 81708264 85188769 89479727 93382699 97329985
6019 97329985 101199142 105166501 108817678 111998434 115284715 117744429 117892973 117684261
6011 117684261 115334335 113090222 111530808 108200308 104903580 103146929 100373733 98281966
6003 98281966 95470392 92981950 91931849 90530277 91653907 92400835 92399245 93344123 94050638
5994 94050638 94843630 97272274 99304688 100743585 102237004 103949589 104672812 104691231 104467014
5985 104467014 104594285 102666811 100715217 99096546 96431315 93086910 89463695 84588646
5977 84588646 80973690 77354594 72906974 69355165 66699510 63971746 60866709 58506383
5969 58506383 56246352 53284277 51876203 51422349 50406533 48890232 48149798 47406093 47213088
5960 47213088 47024679 46806599 46526058 47400562 48336891 48672405 49213872 48387152 47743963
5951 47743963 47426693 46196835 45667553 44504511 43136729 41267231 39495441 37796267
5943 37796267 35478402 33925315 33841212 32671314 31052471 30513636 29348124 29076958 29386965
5934 29386965 28924497 28553088 28394239 27572282 26096625 25720580 25529355 26289214 26002224
5925 26002224 26377965 26496776 25887491 26694983 27160860 27617002 28529265 28604130 28146046 27951953
5915 27951953 26527246 25982073 25831480 25544441 25487261 24836880 23525906 22053874 20100862
5906 20100862 20107366 21025844 20554671 21415586 21256676 19452809 19527245 18422580 18028003 18861606
5896 18861606 18747237 19363272 18595160 17895701 18233029 17569592 17969619 18978309 19200655
5887 19200655 20654198 20795183 19043760 18913004 17598363 16895679 17559987 17644737 17999143
5878 17999143 17791628 16456233 15886583 14031057 14388326 14837519 14651348 15825758 16360465
5869 16360465 15472904 14316538 13748072 13941522 14220364 14773572 15541869 14823669 13924447
5860 13924447 13487932 11495945 11820749 12987163 13738082 13952460 14088885 13959864 12590741
5851 12590741 12044739 11855949 12033754 13034894 13755864 13408674 12592267 12375380 12000818
5842 12000818 12312230 12951882 13095883 13898306 13547260 12920604 12738837 11842222 11860543 11463514
5832 11463514 11872975 13182090 12450650 12447812 12093898 11260309 12373896 12540356 11651426
5823 11651426 12260524 11959785 11585934 11960102 11807934 11782385 11264352 11190164 11592090 11838932
5813 11838932 12113640 11856588 10513006 11337482 11837347 11422437 12725430 12692217 12076076
5804 12076076 11875112 11812094 11611995 11202155 10790865 11081803 11132493 11367864 11765604 11037618
5794 11037618 11590148 11858258 10805290 11280302 12051719 12331473 13224652 12866187 12348104
5785 12348104 12938812 12680417 13139195 13811770 14661518 15686527 15606727 14608657 14386295
5776 14386295 14488985 15349781 17123434 17502747 17454917 18034006 18096081 20474163 22977614
5767 22977614 26698694 32072640 39557488 49252638 62368685 77479623 94182183 108027312
5759 108027312 114443197 108945526 93086235 76776441 63116271 50093580 39484652
5752 39484652 33130311 28423758 25302153 22845677 20531708 17772630 16315206 15003540
5744 15003540 13515042 13133367 13131870 12565460 12408839 11174033 10807720 10284361 11194577
5735 11194577 11544143 11718105 12232682 10921261 10661784 11708076 10740648 10923513 11587714
5726 11587714 11295458 11558479 10775862 9999361 9447904 9498307 10316331 10292507 9608804 9469404
5716 9469404 9008826 8670812 9530974 9246794 9085772 10303835 9516536 9193472 8938182
5707 8938182 8120841 8836325 9231806 9476660 10072696 9398385 9848745 9441052 8844115 10276742
5697 10276742 9898275 8565190 9331901 8702185 8489362 8731452 8327956 8496341 8516343
5688 8516343 7997553 8344616 7764122 7570074 7424430 8161454 8570696 8176509 7559452 7852703
5678 7852703 7573993 7018802 7402459 7284086 7656578 8123421 7213639 7105699 7193908 6909357
5668 6909357 7457480 7590345 7560280 6849468 6810122 6206734 5596656 5729349 6337269 7273557
5658 7273557 7740121 7586309 6860563 6580346 6918026 7360676 7041045 6993946 6510578 5456508
5648 5456508 6078770 5917524 5299839 5783932 6241048 6768040 7680153 7089946 6729104 6586727
5638 6586727 6230016 6756342 6944246 6920492 6907229 5991263 6129206 5599378 5395243 5539729
5628 5539729 6020660 5723832 5899260 5967311 6146242 7086598 7294782 7153037 7613906 6507336
5618 6507336 5945691 5962729 5474118 5905138 5758570 5399996 4897006 4451665 5417827 5295573
5608 5295573 5466556 6693394 5618442 5622332 5841010 5268894 5067637 5426202 5227756 6015581
5598 6015581 6430576 6075391 5809698 4760673 4552677 4842863 6097264 7828542 7430124
5589 7430124 6521358 6523728 4599572 4348439 5537288 5617225 5595898 5594148 4820061 4541980
5579 4541980 4217234 4759491 5743380 6636378 8375025 7386902 6374057 5522120 4594359
5570 4594359 4877906 5389843 5864007 5888506 5955054 5268888 4078840 4114373 4827797 5765546
5560 5765546 7682273 8003029 6805725 5890181 4951645 3731521 4159620 4809518 4686147
5551 4686147 4765951 4756459 3625337 3081945 3942006 5198718 6006399 7236263 7240332 6736605
5541 6736605 6914521 6070434 4569510 4865229 5155252 4485500 4802227 4774410 3899250 3044851
5531 3044851 3390161 4081162 5252065 6476479 6801234 5844978 5967833 5142289 4362751
5522 4362751 4946704 5118449 4906427 4863670 3984273 3405731 3797539 4569034 4681753 5481939
5512 5481939 6258017 6935679 6461044 6562022 6322402 5781689 6114494 5857106 4782367
5503 4782367 4549704 4396080 4260266 4688000 4553871 5227569 5732591 6071642 6179304 6386264
5493 6386264 6795134 7462450 7071958 5799706 5798696 4767029 4702463 5404421 5391232 5890970
5483 5890970 6545114 6034280 6429275 6641495 7129756 8260271 8970721 8505435 8238617
5474 8238617 7561489 6649534 6675530 6678736 7735658 8040539 8474671 8877115 7911545 7914754
5464 7914754 8890453 9265473 10062468 10933775 10381455 10178968 9308273 8710922 9353747 9772749
5454 9772749 10143960 10415722 10372098 10494169 10150438 9674372 10036919 10369409 11196193 12628273
5444 12628273 11694058 11341239 11262982 10054957 10749098 10675224 10959715 11866871 11782908 11741492
5434 11741492 11899568 11374348 12147604 12339836 12647687 13161623 13189914 12478254 12262942 11287577
5424 11287577 11680367 12590689 12294764 13411011 13395347 12834846 13080060 12175988 13111239
5415 13111239 14387566 14588188 14637469 14686386 14548853 14970804 15047622 14645334 14744800 14622303
5405 14622303 14294412 14096333 13091317 13017385 12234279 12287418 13157955 12884121 12710206 12478890
5395 12478890 11595226 11285455 11327761 10733072 10636720 12065026 12127075 11399611 11536158 11118415
5385 11118415 11015361 10643194 11037746 11627341 11342648 11663434 12284554 11590290 11813580
5376 11813580 12181224 11812133 11987223 11766540 11515754 11664868 10339812 9412235 8597398
5367 8597398 8563821 9636741 9630622 9610461 8871659 8513759 8293783 8015394 7985789 8856928
5357 8856928 9170366 8995865 9085841 8219311 7841941 7765191 7730159 7699976 7832233 7662625
5347 7662625 6932052 6434597 6338668 6129621 6018831 6961465 7277107 7496034 7939981 6606731
5337 6606731 5893471 5475871 5374340 5881166 6227177 5786958 4528499 3810958 4162043
5328 4162043 4225659 5045765 6510920 6655410 6766213 6748929 6237256 6102110 6071037 6368912
5318 6368912 6037489 6052392 6258809 4676698 3835060 4305525 3658018 4808401 6106180
5309 6106180 5937444 6728442 6991435 5729718 5880481 5509586 5478064 5633751 5306821 5066607
5299 5066607 4607750 4272352 5090567 4412213 4793004 5943953 5035879 5418740 6145668
5290 6145668 5696468 6436560 7184008 6574128 6074691 5441413 4664431 4482823 4219061 5206705
5280 5206705 5556792 5314677 5998271 4769058 5227577 5832319 5493674 7213103 7904499
5271 7904499 6585618 6216389 5499253 5133945 5160083 5349231 6544701 7063976 6234947
5262 6234947 6941063 6039061 5763041 7678121 8056940 8953431 9403266 8242902 7284812
5253 7284812 6154546 5883909 7226624 7457613 8037620 8853533 8328397 7738257 6884291
5244 6884291 7590619 9389947 10450847 12112590 12989824 12342557 11738531 10824764 10362432
5235 10362432 11217716 12034844 12685353 12546273 12702596 12032598 12186833 13156076 14940384
5226 14940384 16491943 17559459 17649413 17063291 16576311 15875180 16619495 17778832 18607248
5217 18607248 18970485 18591094 18848573 18523196 17930239 19486416 20589093 21468131 21880400
5208 21880400 22232794 22371904 22384646 22039955 22850917 23399194 24243162 25117030 24228968 24258989
5198 24258989 25175442 25202429 26604962 27917375 29824723 31063510 31245901 31826129 32294887
5189 32294887 32869345 34666370 34558461 34655533 35670648 34951554 34331475 35043485 35726003
5180 35726003 36835990 38274909 38962239 39091745 38334620 39001193 39684076 40190432 41866233
5171 41866233 41976563 41685420 42122018 40776452 40042934 41600454 41972132 42549031 43789827
5162 43789827 44127060 44423951 44127440 43913533 44382548 45020943 46699632 47527910 46763762
5153 46763762 46508482 46038331 45311736 45783395 46372790 46597753 47556630 47323264 46836677
5144 46836677 47246891 47695051 48217006 48632126 49377237 49759525 50432406 50287143 49615924
5135 49615924 50248120 51007813 50887190 51214494 52052087 52360755 51709322 51200664 52379861
5126 52379861 52298350 52827229 52812568 51871788 51606672 51781342 50639900 50423485 50156851 49606592
5116 49606592 49695684 50172348 49372429 48820440 49135945 49496446 49496740 49830355 50154706 48604049
5106 48604049 48389398 48728652 47417204 46827642 46566085 45286232 44357140 44434599 43833223
5097 43833223 43387189 43307312 43200161 41773649 41702310 41701877 40138848 39397036 39790870 38672721
5087 38672721 37858210 38182187 35755602 34778112 34148467 32931044 32832516 33198649 33033169
5078 33033169 32961383 32832225 31913651 30986259 30265891 30264240 29860123 29915341 30040604 28757787
5068 28757787 27581039 26582708 25186451 25677751 25707905 25941879 26436272 26477168 26104240
5059 26104240 26147481 26517698 25882389 26051580 26709886 26541941 25679635 25712098 25681402 24639867
5049 24639867 24628786 25936083 26143802 26767474 27702425 27100916 25952499 26859417 26950038
5040 26950038 27124833 28568245 28570861 28300642 28301699 28379818 28331738 27927621 28703014 29778118
5030 29778118 30065031 31050195 30879863 29901677 30851452 31017837 31027519 32131894 32565308 32003877
5020 32003877 32318757 32127435 31496863 31056511 32135464 33056199 32812931 34242557 34677295
5011 34677295 33558970 34518368 34741457 34522065 36096402 36873409 36825816 37508150 37390788
5002 37390788 36993192 37380458 37775902 37587535 37807838 38531926 40466594 40934413 41804096
4993 41804096 42649817 42388349 43689163 44725067 44398951 45245922 44929706 44274256 44156089
4984 44156089 44157595 44005068 43899670 44237924 44667542 44267713 44749836 45301788 44703612 44664539
4974 44664539 44407778 44600746 45272622 45723121 45144105 44869348 44809165 45415514 46558311
4965 46558311 47730672 48034272 48070975 48939730 49155236 49468539 50231812 51236255 51163579
4956 51163579 50678599 49640471 48524692 48880291 47985118 47677419 47459670 47344300 46812035
4947 46812035 45950008 45819182 45938590 45688469 45448629 45467214 45395565 44989848 44484713 43534247
4937 43534247 43005177 43145048 42771101 43117257 44247631 43987063 43978566 44046537 43819631 44584716
4927 44584716 45977582 45799502 46324198 46064648 46445459 46406496 46080527 47000009 47890475
4918 47890475 48612655 50010209 50226129 50344680 51372857 52018449 52796414 54115406 55560682
4909 55560682 55985433 54996629 54030516 53500161 53389443 53250196 53762561 54102699 54368559
4900 54368559 54650619 54575731 55085277 55809233 57197834 58896652 60660994 61473071 61895297
4891 61895297 62549140 63002556 63031963 64358663 65924270 67056778 67366008 66729158 66046412
4882 66046412 66142736 65991223 66129013 65774470 65045757 63959814 61799352 59486467 58170007
4873 58170007 56878484 56453034 56214259 55675256 55319684 53855916 53179614 54037247 54763492
4864 54763492 55326331 55981199 56865765 57497156 57147306 57361235 57764727 58290062 59554616
4855 59554616 60705088 61308103 62186749 61637876 61438187 62002546 62090169 62512126 62786791
4846 62786791 62211678 62121933 61019988 60553350 60232155 60082866 61315299 62408045 62507382
4837 62507382 64249720 65425052 67379375 71196324 76363727 84579860 94738791 105531452
4829 105531452 116769341 126925361 133243041 132432097 123162277 112082261 102169445 93045390
4821 93045390 83398162 75698731 70390861 67137535 64193888 62399521 60317069 58896524
4813 58896524 56855460 54322759 53020821 51699626 49979207 49829735 49270622 48798813 48506908
4804 48506908 46802653 45807392 46104535 45963733 45951498 45650572 46206371 46194291 45082884
4795 45082884 44002032 43441348 43539413 44248226 43974898 44129882 44910025 44167759 43712409
4786 43712409 43862743 44347408 45725276 46893664 48363275 49075294 49260154 50673002 52218614
4777 52218614 53944198 56827860 59175867 61372122 64006608 65883080 67909566 69817068
4769 69817068 71435606 74561334 76969379 78877991 81139556 83156836 84107247 85068409
4761 85068409 86692210 88889054 91071148 91863507 93699312 94046207 94741599 96583358 97697681
4752 97697681 100301816 103111835 105575738 109037596 112241708 115170823 118703514 122114976
4744 122114976 125953748 129328599 131708979 134941873 136027178 136273059 136479109 135575115
4736 135575115 135370596 134304647 131696468 127685279 124487181 121748774 118681376 115839485
4728 115839485 113380315 111075209 107419172 105090115 102121615 98729613 96826517 95015904
4720 95015904 92483555 91063415 89955755 87976418 86019978 84936969 82574538 80420086
4712 80420086 79090785 76654538 73421690 70849387 67610055 64398065 61110078 57949194
4704 57949194 54887880 51613744 48598363 45060550 42108721 40480545 38328143 36787570
4696 36787570 35113416 33424519 31590046 29580376 27799725 27347600 25553910 24688140
4688 24688140 23415715 22166427 21786906 20062812 19077645 19539591 18720306 18686030 19149801
4679 19149801 18314900 18506693 17862748 16802428 17167419 16939871 16456426 15985350 14412139
4670 14412139 14516493 13609299 12631475 13210201 12929514 13027940 13912420 13001207 12021575 11621362
4660 11621362 10850230 12211039 11625366 11240697 10705379 9295663 9388481 9633953 9600248
4651 9600248 10201245 10074834 9640429 10706690 10532019 10608768 10790291 10139142 11139482
4642 11139482 10332805 9729798 9766190 7748498 7875589 8102345 7693254 8568176 9297089
4633 9297089 9983975 10745568 11575706 13659152 15803735 18818514 22722397 25509500 28511158
4624 28511158 30647927 29436710 27899751 25678365 22769320 20633114 18862181 16773339
4616 16773339 16358057 15884059 16589237 16938254 19232309 21175228 22511803 23942700 24700227
4607 24700227 25038829 26718219 28593916 30754780 32932206 36081612 38678568 41093192
4599 41093192 43867231 47503263 48990760 50452172 52502454 52365354 53900507 55847173
4591 55847173 56422585 57770518 58511685 57119798 54756263 52715903 50898509 49211093
4583 49211093 48232768 47949135 46264820 44579548 43138555 39480233 36033966 33176987
4575 33176987 29378365 27440086 26659328 24933244 23106550 20955309 18839494 16082652
4567 16082652 13155725 12625503 11072940 10515413 11357078 9970455 9625939 9314915 7362914
4558 7362914 6941028 6911856 6679794 7014296 6769246 7358537 6941591 5906269 5678356 4766782
4548 4766782 4677487 6520785 6155998 6606943 6545706 4772524 5044367 5434530 5626691 5701719
4538 5701719 5596974 5832561 4747346 4727270 5552313 5136991 4879192 5558306 4997507 5413752
4528 5413752 5497831 4683068 4406812 4265930 4598454 4301936 4347920 4864281 4347910 4393332
4518 4393332 5008015 4121072 4045175 5355042 4636642 5169016 5065670 4269443 4092527 3859047
4508 3859047 3288525 2892325 2760223 3904808 2650416 2848312 3959738 2729168 2511517
4499 2511517 3682371 2966496 2833964 3275318 3123973 3556174 3242560 3066232 2844750
4490 2844750 2683885 3518481 2921086 2211229 2987971 2488229 2516668 3584430 2506354
4481 2506354 2999875 3705732 3607761 3439063 3635678 4100672 2983530 2518827 3197716 1623878
4471 1623878 1151399 2810095 3371791 3155288 3634444 2895010 2524777 3444285 3457007 3705843
4461 3705843 3570722 4001288 4185900 3415525 3373027 2605451 1289710 1706409 2290923 2259454
4451 2259454 2142850 2578058 2716096 3104098 3772052 4224518 4555043 4388500 3416280 3358180
4441 3358180 3733148 3417447 2651296 2963261 3156434 2628793 2020738 2381660 2852927 3218383
4431 3218383 4002442 3734699 3862532 4173011 3751190 3606064 3355592 4004456 3936201 3209597
4421 3209597 2899729 2969247 1894991 1967274 2194760 2278560 3086290 3872799 3832903 3650789
4411 3650789 3578589 3352467 3536536 3703559 4019127 3533952 3297450 2913921 2161617 2682152
4401 2682152 3573155 3442397 4088551 4527559 3962535 4059373 3692731 3576470 3954448 4611206
4391 4611206 4275831 3895653 3449876 3553030 2548702 2628377 3580315 3667496 4670528 4890825
4381 4890825 3487223 3237145 3233864 3374758 4432980 5246791 5246415 4888454 3426680 3036872
4371 3036872 1730455 2512482 3971922 3525385 4301232 5859783 4615090 4270136 4346631
4362 4346631 3567175 3397161 4583313 4985357 4931863 4769652 4510339 3105961 3542644
4353 3542644 4623124 4762415 6097623 6862718 5883550 5486346 5533380 5135902 5160896 5526941
4343 5526941 6099520 5214490 5070929 5627545 4256211 4070494 5257241 5024219 6301226
4334 6301226 7726676 7472049 6635192 7468996 6627294 6686346 7217447 7971964 7655054 8070944
4324 8070944 8862184 8094241 7932103 9132278 9035658 10366794 11760545 12120162 11586440
4315 11586440 11964274 11749548 11128017 11524422 12084425 12749872 14021768 13887368 13061943
4306 13061943 12501406 12899321 12180119 13456462 14834950 15315682 15697918 16494716 16012942
4297 16012942 15361650 16169577 16701434 17305033 17974992 18080583 17862606 17693887 17336143
4288 17336143 17890703 18588229 19918370 20669773 20379097 21005951 20871192 20476657 20859642
4279 20859642 21351659 22714239 24059131 24482789 24781523 24650908 24383263 24627537 24498563
4270 24498563 24864587 25184208 24996681 25940879 26536156 26266557 27006206 27506367 28315900
4261 28315900 29065745 30059008 30489742 30245995 30973714 31912765 31648520 32046382 33096265
4252 33096265 33310060 35071720 36284704 37588202 38278282 38505726 39581788 40164780 41210972
4243 41210972 42488393 42427226 44236754 47267296 48759822 51769284 56151077 60221888
4235 60221888 67167623 78606833 94241616 116633945 144810133 176735666 208947165
4228 208947165 235648295 245696235 226740286 194256379 165769724 138726674 113981237
4221 113981237 94701090 79962980 70492788 64910338 59793446 56382337 54321919 52619016
4213 52619016 49183504 47100396 44649389 42119382 41656449 41972335 40167954 39515200 39117590
4204 39117590 36912919 35015255 35313611 34839160 34775212 35535842 35660867 34860086 34968904
4195 34968904 35329894 34558237 34424642 35196658 34146368 33813142 34102470 32748608 30967242
4186 30967242 30606095 30106088 30844371 31997334 31724727 30580612 31032359 31184018 29836764
4177 29836764 29702658 31194930 30677390 30854330 32065830 30587428 29765341 29988433 29643620
4168 29643620 29253857 31042038 31654521 31253843 31501058 31891960 30322017 30400859 31702691
4159 31702691 30876935 30719607 30712803 28776276 27051189 27253420 27033528 27378890 28514141
4150 28514141 28761143 28443829 28031189 28385135 27497439 27089361 27659049 26597747 27262353
4141 27262353 27406539 25502952 25206645 25521446 25530081 25367185 26864548 27332782 27397948 28571134
4131 28571134 29847520 29399693 29603320 31006493 31468302 32788248 33595770 32235491 31970274
4122 31970274 32984690 34239397 35146870 35969590 36941162 37329333 38667776 40754136 41963786
4113 41963786 43836576 46229994 45740423 46388495 47573960 47472557 48462034 49756382 51036044
4104 51036044 52178489 53238893 54673007 55637338 57217969 59683750 61469350 63502669
4096 63502669 65629266 66097260 66942577 67413751 68202573 70914744 73785901 76394617 77470786
4087 77470786 78461539 79716588 81107138 82854092 85158165 86857903 88490022 89048894
4079 89048894 89104321 88909767 89257926 89652525 90712873 91156302 92354883 92430756 92326378
4070 92326378 92975935 93587023 95116764 97881830 100575897 103184308 105573732 107279754
4062 107279754 109517019 112600231 116847866 121758855 126314969 130667952 133334970 133227807
4054 133227807 132498938 132025282 132144347 132803915 133076751 133107645 133304064 132602758 131930561
4045 131930561 131213254 131491297 132049866 131906396 132176445 132524338 132724451 133773946 134986924
4036 134986924 136306746 137560407 138643187 139474840 140357346 139817800 139318869 139372603 139269036
4027 139269036 138758580 137512813 136855490 135999665 135424810 135563990 135429056 135258859 135611756
4018 135611756 135113635 134223939 133245622 133242496 133112301 133015667 132370460 131305596 129429596
4009 129429596 128104318 127009219 126617667 126348182 124827430 123063435 121684296 119967507
4001 119967507 117339645 115464451 113981213 112258012 111037211 110091848 107909947 105685060
3993 105685060 104296376 102402815 101290938 101290620 100771218 100232375 99497250 98672330 97823546
3984 97823546 97369898 97172222 98167347 97962953 97924000 96913299 95263079 94243471 93784758
3975 93784758 93150493 92092547 90448289 89150854 87814025 85834296 83923504 82898150
3967 82898150 82110145 81814207 80016851 79698266 79216313 77155995 76356725 76249740 76218945
3958 76218945 76678643 76584536 76492127 77558317 78269099 79635304 81503905 82444137 82787308
3949 82787308 81648926 79609781 78734893 77904456 77000934 76217907 74770145 74732015 74117106
3940 74117106 73172944 72621097 71577342 70312707 68541328 66624090 65325268 63759889
3932 63759889 62371493 62604908 62948383 62774926 62809381 62896103 62678432 62817236 63327588 65207223
3922 65207223 67565847 68622673 70102849 69217873 66816814 63911931 60891822 59224813
3914 59224813 58580991 57197019 55854543 54707676 52801896 51867822 51139089 51326736 51762005
3905 51762005 51155519 50916816 49345532 47057550 46778618 45650918 45377256 46391227 45695395
3896 45695395 45061882 44558309 42577503 41698936 41122520 41156034 42302943 42180032 42473870
3887 42473870 42274259 41261723 41665636 42093603 43098612 44625932 45704790 46107197 47784879
3878 47784879 47838870 48557949 50191876 51135403 53278637 55917676 57598678 60608001 62263055
3869 62263055 64841690 67528077 68855182 71510294 74437984 75763044 77893473 79049232
3861 79049232 80193915 81829489 82800322 84023599 86292385 88194806 89762416 90701264
3853 90701264 90625663 91427292 91655477 91830155 92125600 92011910 92462059 92140589 91195462 91082164
3843 91082164 90740142 89957580 89850098 89755297 89428839 90919308 91521412 90273989 89353846
3834 89353846 89125361 88211515 86374063 85338115 84419649 82601063 81470874 79867493 77906274
3825 77906274 76106319 74502715 72584250 72149927 71904424 69612407 68290279 67848974 66311408
3816 66311408 64826244 63611606 63405936 62966140 62230437 61202143 60152786 59893983 59066120
3807 59066120 57437580 56641005 56826837 55677186 54852000 54145446 52423402 51330950 50657425
3798 50657425 49642849 49258973 49377897 47760378 46494780 46031794 45791582 45860243 45413005
3789 45413005 46210858 46739190 47013093 47334167 46995319 46768737 46635863 45918734 46215533
3780 46215533 46493499 45713074 45848781 45990080 45130804 44733082 44668194 44832701 45629153 45555234
3770 45555234 45858139 45693429 45579544 45583857 45019447 45229377 45158100 43879274 42581673 41723330
3760 41723330 40523243 39481195 39073030 38370619 38152467 37526800 37156085 37145366 37158081
3751 37158081 37249389 38037726 37789522 38266491 37868773 37113631 37405963 37441867 37992444 38621273
3741 38621273 38603198 39282139 40199260 39724205 38890594 39155748 39933862 40132018 40124145 39050196
3731 39050196 38926496 38491211 38035753 37917891 38210605 38816615 38844512 37909451 37341574 37569394
3721 37569394 36830253 37100262 38089168 38524229 38613975 37938804 37038689 35835231 34880268
3712 34880268 35315580 35759509 35463638 34857982 33860171 32326114 31575709 30976679 30928100
3703 30928100 30903744 31015833 30351838 29111907 27908584 27366641 26572855 27155849 27819374
3694 27819374 27699093 27823266 26538486 24473533 23248365 22669831 22709820 23599785 24519794
3685 24519794 23973599 23824234 23326567 22183674 21663131 22098842 22432561 22199104 22748481
3676 22748481 21333603 19077696 18298144 18238039 17793265 18422728 18350141 17527318 17166336
3667 17166336 16259538 15441939 15741122 15785496 16366429 16673519 17182236 17237699 16223836 15923880
3657 15923880 15836769 15777971 16764824 16385006 16200367 16920422 16707873 16048474 17628145 17505463
3647 17505463 16710410 18191990 19483086 19086206 18509980 18266557 17918058 17013466 18551569
3638 18551569 19469921 18517594 19726008 20411896 19320912 19995404 20082511 19547284 20488250
3629 20488250 21446879 21398697 21361139 21856417 20910036 20636245 20697379 20729668 20210903 21107692
3619 21107692 22198902 21203407 21528956 22444264 21568418 21574196 22186702 22019664 21913615 22316843
3609 22316843 21371941 20596556 21391349 20826424 20614463 21956151 22543449 22432044 21868337
3600 21868337 22047068 21873423 22225012 23470355 23343303 23441607 24657638 25178637 24816104
3591 24816104 25214960 26097314 26514831 27204678 28417037 29271077 30128933 30630216 31154562
3582 31154562 31818625 32773022 31959500 32183404 33152818 32717814 33369756 34597985 34158112
3573 34158112 35110051 36848577 36865682 37335227 39251696 40726103 41715991 42734251 43457113
3564 43457113 43703724 44707347 45495638 44941695 45116664 45599794 45170419 44219355 44356841
3555 44356841 42881229 42298436 42427992 41894375 41517016 41883672 41699131 40591472 39792839
3546 39792839 40230832 39667933 39792983 40426972 40202985 39882880 39951008 39167765 38572001 38430081
3536 38430081 37733591 36632283 36019779 35439596 34307152 33399879 32450098 31300765 30610078
3527 30610078 31333402 30783948 29464120 29039332 28466054 28011382 27877729 27767666 27699016
3518 27699016 27086578 27766633 28052652 27440423 27528062 27976127 27866275 28644122 29264251 29270006
3508 29270006 29258722 29210735 30444837 30609762 30851867 32311934 32230275 32631063 33690334
3499 33690334 33051965 33524288 33575610 33292965 33281395 32104578 31226318 30129014 29144412
3490 29144412 29689109 28689261 27013101 27171876 26248271 26470454 27484832 27193539 27811439
3481 27811439 28251160 27297077 25687995 25450497 24865399 24201710 23732836 24480566 23206099
3472 23206099 21421742 21131803 19084217 17883589 18371696 18442833 18657763 19244679 18780802
3463 18780802 17307461 16478894 16416683 16242669 16803339 17771325 17470753 16461407 15613748
3454 15613748 14552352 13890896 14778569 15142215 15245404 15855483 15185316 14581401 14277194
3445 14277194 13383684 12620277 13535614 14433874 14053558 14284543 14531737 13148415 13326568
3436 13326568 14158009 14676095 15443837 16378405 16861776 17280163 16945158 17280662 17078286
3427 17078286 17933812 19102549 19514085 20434794 20987052 20165901 20525018 21506413 21227127
3418 21227127 22368872 23043708 22963168 23541795 23558265 23313926 22257167 21988797 22157853
3409 22157853 21959295 22236367 22486263 21544921 21116586 21407621 21370333 21359618 21277219 21761414
3399 21761414 21761166 21454325 21090830 20630642 20520395 21525822 21855434 21997174 24141864 24561058
3389 24561058 24966221 26933966 28202488 29630910 31593914 33259308 35656088 37796483
3381 37796483 39317642 41065827 41390884 42625532 43637617 44133834 44769124 44161275 43091199
3372 43091199 43385106 43171994 42160599 41551420 39982562 38412859 37718487 36614310 35634701
3363 35634701 34513665 33458159 32891845 31525185 31139529 31947242 32350063 32818901 34143836
3354 34143836 34194479 34739288 35675730 34763951 34657982 34532800 35168164 35290037 34714682 35005589
3344 35005589 34497238 33887919 34406290 34914775 35082600 36817880 37728933 37479886 38169511
3335 38169511 38666548 39197945 40268389 40747059 41351554 42517542 42833732 43390962 43650528
3326 43650528 44543835 45239696 46687180 48958191 50329735 51997121 54738291 55839727
3318 55839727 58025324 63361126 68638831 74740544 83238491 92107361 102584680 114126175
3310 114126175 125693946 137897251 147575709 154565627 157745169 155461963 149750740 140482590
3302 140482590 129837486 120233776 109652044 100115534 93780994 86969124 82020178 79534825
3294 79534825 77692000 77329852 77708985 79236663 82150413 85340652 89519779 92991157
3286 92991157 94606470 96401472 94790799 91201019 87859485 82577738 77049138 72458721
3278 72458721 68284761 64585973 60875614 59017236 56779528 54867129 54070916 53867989
3270 53867989 53840055 54071577 53776590 54911742 57714235 61472544 67016279 72898036 80009860
3261 80009860 87695656 96719189 106812283 117084383 127643852 137513134 143340134 144864536
3253 144864536 142164394 134841639 125022263 114996879 105379089 96089795 88228684 80862198
3245 80862198 74809615 69638145 65590980 62009967 59760923 58177991 56851488 56596973
3237 56596973 55809628 54832982 55171386 56089976 58449834 60936088 62584541 65378853 68957944
3228 68957944 72752831 77391984 82844839 88210609 96013157 104838580 115795545 129260429
3220 129260429 144895990 164064577 187205542 211915102 240051766 269276526 297860555
3213 297860555 325778716 346981621 361493841 368335607 364908591 352213737 333421447
3206 333421447 309565557 284200706 257834642 231601425 207165036 183872530 163194487
3199 163194487 144940182 128594713 115303504 103970252 93505487 84865634 76597061
3192 76597061 69747522 64881904 59298462 55069813 52178021 49622396 47433779 44431029
3184 44431029 42392055 41671760 40592158 40602814 40133462 39045373 39317925 38320660 37288487
3175 37288487 36879608 35242399 34421760 34384184 33293651 32651409 32154803 31003667 31068863
3166 31068863 30278024 29574792 29813948 29595610 30448644 30360385 30162518 30995273 30714586 29522776
3156 29522776 30567873 29800900 29196838 29787112 29622997 30078755 30092253 30710684 31083154
3147 31083154 31715802 32902771 33478286 33750725 34543954 35190677 34638365 35296600 36561348
3138 36561348 37134566 38457696 39700321 40695258 42197871 43772894 44843553 46639263
3130 46639263 49869931 52838134 55797404 59071232 62476916 65869075 69481868 73065619
3122 73065619 77550859 83540051 91267384 100263516 110867660 122405717 134645146 150661214
3114 150661214 169489308 190646427 213204269 236896737 260480398 282956210 302594148
3107 302594148 320242184 333922547 343703060 349460255 350175288 347487432 341839300 335243392
3099 335243392 329699220 326143875 324654442 325508655 326464679 326296289 325572084 321798547 315237320
3090 315237320 307705061 297418609 284708555 270386596 255190319 239312147 225090932
3083 225090932 212896068 204296780 198511195 194918131 193064497 191543303 190669098 191003567
3075 191003567 191174804 191652662 194602151 199150748 206880350 216312766 225922871 235687716
3067 235687716 242995464 244742169 242478468 234479063 220890303 203844782 185391401 166837647
3059 166837647 148333213 131884378 117687559 105272810 95195223 85437396 76977882
3052 76977882 70937303 66110809 61670442 57213184 53589641 49822921 46717616 44793665
3044 44793665 42058789 40551216 38791307 36801573 35789329 34073263 32287137 30898575
3036 30898575 29879134 29162350 29082335 29027832 28716232 28187613 27459247 26367758 24790034
3027 24790034 24456739 24752721 22812234 22123285 21297920 19427680 18035410 17759096 18326154
3018 18326154 18824707 18960944 18542890 16985314 15853919 15346190 14878675 15288516 15318375
3009 15318375 14565472 14425644 13645186 12178272 11047512 11154656 11035174 10874490 10968388
3000 10968388 11079763 11424900 11395981 10889338 10505846 9840808 9853385 9258808 9062535 8979302
2990 8979302 7757285 7596672 7563403 7942955 7656259 7766027 7259500 6807200 7194154 6595915
2980 6595915 6406146 6033350 5954411 6397650 5818630 5785926 6701128 6533118 6428425 6462907
2970 6462907 6433676 7211263 6729032 6887857 6895943 5835509 5819940 5578099 4555994 5504545
2960 5504545 5030783 4054300 4669557 4644366 4146478 4539441 5105945 5473997 4936388 5197907
2950 5197907 5492269 4803170 4614636 4306922 3289173 3741724 3150647 2846392 3586194
2941 3586194 4418330 4097755 4189298 4590336 4781096 5043404 5350226 5254138 4592990 5683987
2931 5683987 5063404 4824429 5692630 5039117 3820974 4748384 5051734 5391427 5587211
2922 5587211 5880159 5280025 4140991 4030831 4152953 4407290 5138442 4443826 3876146
2913 3876146 3757778 3020282 2487135 2558777 2220462 3000458 3444043 2915333 2380392 1781113
2903 1781113 1852104 1416408 1751159 3463591 2632636 2903272 3196646 1673210 1713168 2240887
2893 2240887 2196824 3253598 3907448 3901644 3040758 2525616 2854358 1942964 1532055 2161274
2883 2161274 1904206 1612872 2683903 1527936 1035646 1673045 1054571 1201502 1874724
2874 1874724 1478396 1990066 1971641 2239028 868408 554025 1792222 1026395 983701 2152665
2864 2152665 1204909 578415 1312551 594090 1233687 1772398 1470814 1695297 1902033 2328140
2854 2328140 1376292 532068 976334 529784 233470 1443850 989127 1012378 1353638 84697
2844 84697 -5623 750447 976564 1490577 1590327 1463252 845977 -139642 163544 200139
2834 200139 348138 1571428 857987 1468877 1888987 906880 2070422 2470078 2755083
2825 2755083 3297426 3406522 3768762 2433159 1570573 2359914 1517892 2525544 4222512
2816 4222512 2942464 3748783 3931226 2056055 2867792 2939747 2969398 3379789 2650791 3515949
2806 3515949 2513032 1618399 2953717 1657532 2033263 3424978 2089615 3334749 3709118
2797 3709118 1659416 2583069 2750870 2810948 3576008 2226723 2650509 2159480 1240519
2788 1240519 2643473 2095379 3312419 5325156 2961300 3097986 3039414 1438954 3499284
2779 3499284 3613293 3315776 3751247 1998589 1450668 1172646 53213 1536161 1661407
2770 1661407 1887814 3229319 1938640 1509987 1074448 921207 3085351 2990343 2123973
2761 2123973 3187680 1910030 82905 -121598 -1062917 -334307 1649397 2317763 3321163
2752 3321163 2428157 1412466 1207362 511309 1715135 2739586 2141721 2453015 1656442
2743 1656442 -712169 -828875 -1200914 -835192 826519 1295247 1154415 1413850 845507
2734 845507 -881579 -284767 1451753 1793445 1766172 2265138 1593416 -516341 -694720
2725 -694720 -1345485 -1527882 188249 1144553 153490 6706 -96265 -112889 66938 687513
2715 687513 961456 1253788 1058938 50590 -1236326 -1627676 -1458384 -968837 -410673
2706 -410673 650620 304338 447232 559304 -709865 396937 1369317 -176956 154289
2697 154289 27357 -704088 -620199 -1226682 -1265273 -868687 -7280 72487 281066 843617
2687 843617 1482051 851095 2039801 2610499 680052 548479 282721 -331495 748624
2678 748624 664495 548483 347587 222149 353985 580488 1178941 2469230 2431733 2436650
2668 2436650 1965085 -200196 -42179 -51011 -523452 1158348 1749382 820161 1019391 485245
2658 485245 -361081 -221265 195678 1612403 2570123 2574812 1847783 464235 805618 1271666
2648 1271666 865735 1413956 1436830 1348507 1372984 1147488 432054 598550 1512580 2650563
2638 2650563 3029656 2658127 1897073 1843427 1091672 702415 572440 916186 899919 960386
2628 960386 312701 -470481 -719769 894 726599 1404608 2091413 2603578 1361684 229426
2618 229426 283512 -111067 457389 1152379 1369972 804775 430758 -106313 462639 1086753
2608 1086753 279022 353560 813323 335297 -273962 -84384 587417 1072142 1516281 1139421
2598 1139421 708155 1477216 1623093 1678549 1973071 2903110 3217372 2595350 3420388 2390156
2588 2390156 1024763 1495343 765030 744537 1263031 848856 506370 -89294 -88261 -202131
2578 -202131 383635 634663 692825 334061 636454 603248 -246632 368231 113891 -234777
2568 -234777 753573 -331308 -527981 -106593 -42090 289882 606785 1203841 1680429 979844
2558 979844 1100767 731111 -455532 657559 996052 557186 1655091 316240 -597334
2549 -597334 492755 379058 1034368 1583525 1406177 1642801 1946707 1838801 1350212 1347850
2539 1347850 2285645 1506038 290995 1047595 821074 201468 631009 559071 924767 2024549
2529 2024549 1723274 1860703 2199550 1812637 2184023 1672419 1738578 1370213 588487 1612240
2519 1612240 1308854 839146 1682119 1642006 1414779 2231314 2612210 2418205 2534333 3141733
2509 3141733 3433742 2471528 1629845 1160126 112232 550768 846992 1073397 1838844
2500 1838844 1567227 1429028 1661094 1578290 1675123 1858436 3088439 2369229 1496866 1647504
2490 1647504 613691 853470 964401 1033519 1225595 1527017 2646416 2236953 1973670
2481 1973670 2528114 2156204 1368708 2251755 2015441 1295862 1657724 841995 418943 700446
2471 700446 57472 443085 592553 699018 1349190 1448734 1595858 2025917 1226178 1797209
2461 1797209 1666096 72638 115693 -618090 -400815 -93347 -484615 877301 1463957
2452 1463957 1399566 2324203 2042448 2231512 2869445 2833554 2990233 3311010 2252432 2335923
2442 2335923 1318552 140073 756190 257655 978232 1761103 1095428 1894022 1272679
2433 1272679 1571823 2721650 2161570 2709123 3482282 2099077 2034501 1615772 701246
2424 701246 844299 1096008 855153 2107709 1735124 2513791 3547202 3140189 4311259
2415 4311259 4998158 5947079 6317853 5517735 5278144 4780544 3439348 3293729 2994891
2406 2994891 3304991 4115194 3416454 4189879 4244463 3910343 3926080 4191207 4845817 6165856
2396 6165856 5859992 4962921 4928090 3819850 2726069 2505910 2979098 3879604 4254179
2387 4254179 4517903 4815802 4457898 4786801 5163026 5690692 6317548 6317469 6720703 5621328
2377 5621328 5473403 5919439 5634865 5721640 6642872 6723721 6700724 7199092 7092954 7795389
2367 7795389 7928178 8189556 8713880 9159018 9024489 8023107 7663332 8626697 8580897 9880781
2357 9880781 11284371 11564714 13248754 14883179 15283330 16818036 18571317 19595966 22045319
2348 22045319 24748374 27314640 29076346 31212598 34288957 36030532 38264018 41485846
2340 41485846 42414958 44132125 47266517 51194543 59982219 70701345 85680828 108409048
2332 108409048 141151218 187714098 249188925 319224659 396372743 463658596 503040122
2325 503040122 480923546 406585015 334636979 273706677 213892806 162322559 126521663
2318 126521663 102664825 85795658 73212167 63853245 56779850 51809598 47730223 43206170
2310 43206170 38168594 33917457 28455149 24862991 23097406 20219535 18634041 18258217
2302 18258217 17530826 16756726 16122668 15593477 15036890 14569531 14028727 13430357 13338147 13536482
2292 13536482 13124007 13071681 14126562 13092784 12577555 12653827 12050144 12262747 12378126
2283 12378126 11244053 10200798 9880428 9588948 8737920 9466672 9554578 9063167 9380675
2274 9380675 9062383 8142816 8530823 8658775 8628159 8433211 8368037 8102165 6870014 7099524
2264 7099524 6859106 6892376 7064910 7082983 5987993 5658389 5488579 4245108 4513884 5107170
2254 5107170 5122769 5644945 6110007 5460342 4097865 4136563 4405896 3142638 3258031 3061429
2244 3061429 2631398 2847099 2936458 2163284 2510451 3328924 3029161 3561566 3355028 3580801
2234 3580801 3200802 3105696 2690700 2209232 2697304 2622298 2228257 2623740 2568263 2263572
2224 2263572 1734399 1649012 1814789 2268841 2180589 1956504 2364383 2530084 1814704 2267239
2214 2267239 1459503 1154943 1420375 1387206 1870372 1918153 1221865 1260036 1438793 1783649
2204 1783649 1683961 1981102 2165236 2252893 2129269 2123933 1417027 1268263 2172597 1197625
2194 1197625 1714590 2418258 1423877 575701 -229211 -333437 180615 842469 1028937 1765558
2184 1765558 1230028 854032 266097 -166192 339508 247601 407748 1240557 1569086 729056
2174 729056 409205 -280504 819830 2175476 2301006 3101652 2329082 1009046 524362
2165 524362 253596 946100 1179245 828512 2094224 1885698 776631 127830 -560480
2156 -560480 25588 1360912 953497 1144596 2071478 982328 920959 1118651 1249118 1612822
2146 1612822 1674131 2110313 1439937 29593 372106 -346128 -172026 748747 1104418 1095196
2136 1095196 1330421 916936 282910 433052 455456 1048255 890020 668260 956908 768408
2126 768408 417576 104107 27927 332184 609199 -72363 663382 580211 978583 1815873
2116 1815873 1651171 1363431 1486857 964875 376944 -220730 417654 75763 -189331 25911
2106 25911 426790 594546 1030873 1275184 1412898 2195779 2209199 947770 646411 -100829
2096 -100829 -333514 -30685 -24273 743802 685298 -57872 -481353 -304507 -381123 486636
2086 486636 1035779 995171 860650 55515 987 -224432 -376451 623046 942759 1068436
2076 1068436 991510 449568 -148614 309472 475629 1031193 1694114 1792789 1071716 121939
2066 121939 971569 1349837 982932 1854551 2108036 1420439 2002227 2165401 1678128 2587038
2056 2587038 2479516 2791351 3231196 2171453 1720773 993326 15086 186443 489240
2047 489240 915338 610049 30689 38052 -668928 -636672 383608 832756 1317691 2126629
2037 2126629 1069639 970814 1227801 1057461 1321755 855186 1768234 1502339 284442
2028 284442 943431 44333 -303026 693974 1226838 729326 663698 336604 54933 685189
2018 685189 397752 1099445 1928694 1546048 385615 222037 471216 -236490 232818 1759185
2008 1759185 1346300 1305865 1085039 131206 -147836 998933 1719147 1904189 2078132 1954516
1998 1954516 538600 465998 1040720 -41766 140972 1332719 490618 146198 452784
1989 452784 -305725 -170208 729771 435081 1157863 1168018 742469 -29450 -668101 -213472
1979 -213472 -700840 115100 1277581 36803 -437393 -528876 -1401348 -499830 67713 392054
1969 392054 457802 207092 565202 -317420 -89927 300570 -513681 60403 1061422 -407807
1959 -407807 -649657 -567085 -1313736 -327441 228427 -14878 496801 133675 205136 -429054
1949 -429054 -168663 1036998 497521 382467 259993 -418469 -767011 -1113623 -828660 270138
1939 270138 364964 612616 867330 9708 406394 739665 802303 948786 452794 913840
1929 913840 744408 84092 -128362 -821306 -886718 141675 48256 401516 372683 -572078
1919 -572078 -8406 311653 229398 1145794 1292013 916742 189634 -398264 38378 -740012
1909 -740012 -425915 1245463 520775 -33304 805929 49777 218818 1421659 1253675
1900 1253675 2043058 1573139 683242 902234 582634 -606864 -433405 419911 1079366
1891 1079366 485639 719564 1170091 366182 23371 1072975 1147488 2005422 2411292 1369630
1881 1369630 1077972 1007640 -319107 -298460 100218 723517 17128 669781 1277190 291729
1871 291729 887454 1186200 583852 1777697 2629373 1720188 959308 703910 -120858 -1035935
1861 -1035935 -318694 -796251 -807422 346095 727531 -146364 251377 1091753 1279865 2046358
1851 2046358 2322133 1415380 1112065 1197272 -169059 -849675 -1031844 -1254394 -1074730 620510
1841 620510 943399 -145435 -562317 -1051821 -622833 732301 1959588 1944615 1895744 1464680
1831 1464680 -835420 -2136640 -1313463 -929019 88800 927290 339191 -313815 -628591
1822 -628591 -1202992 -625493 886866 1749323 2034770 2109800 1669051 -91005 -1301503
1813 -1301503 -1612068 -1469472 -587747 384881 -482596 -987451 -1367397 -2401650 -1480885
1804 -1480885 198840 1638098 2043866 1740509 1243973 -461560 -965513 -162414 -565168
1795 -565168 -207921 641901 3063 -172959 -518662 -998699 370128 930887 1236008 1929523
1785 1929523 2167843 1556276 565304 -70550 269647 -1113373 -490265 372485 -899222
1776 -899222 -659571 -1184897 -1828344 -160180 19878 325690 1166627 1260888 1726748 1657382
1766 1657382 929171 1578870 535953 1208960 1202960 -422827 -297721 156095 314449 1298314
1756 1298314 983190 422267 1342833 1539018 1773787 2168636 2250554 2262889 1174422 839684
1746 839684 131805 -860002 -619059 236679 -582402 729311 1479955 430854 381299 -95171
1736 -95171 859274 1808732 1879136 1890952 1387021 971636 -261817 -1523851 -1609766 -1096442
1726 -1096442 -930125 134333 300948 -885553 -562572 287261 314617 997285 1998243
1717 1998243 1454088 1560744 818113 -463904 -1102239 -1151950 -640333 -129366 55910 175744
1707 175744 -678709 -153861 -18082 50753 367250 1455531 1172177 719748 114330 -253375
1697 -253375 -850717 -677722 -456810 -422737 -942562 -795025 -621663 -1233905 -241649 -54407
1687 -54407 370152 1818777 1340516 1230651 1374082 478612 -51949 -841143 -1745911 -1080757
1677 -1080757 -1490315 -1540514 -1039778 -1296011 -647433 486462 445321 1503535 1631844 645906
1667 645906 320618 302543 287212 273771 -277640 -335316 -658060 -349595 902223 575435
1657 575435 625866 1890495 1474709 1573698 1314598 210999 698213 1423086 1922136 1529595
1647 1529595 557067 -102890 -615050 -1372854 -1439168 -1280612 -593157 1204801 1441696 1261518
1637 1261518 1547113 337433 227490 788894 1715511 1803380 1524978 1964644 797908
1628 797908 -258959 253302 -643375 -171167 1304895 1490889 1413672 1408800 237089 -622745
1618 -622745 -111519 746494 1687011 2236053 1819053 843384 -380791 -883945 -1347798 -109007
1608 -109007 1191765 1301826 1262855 1235046 127369 153481 589815 1319724 1765552 2182256
1598 2182256 2116102 317204 -546924 -1143777 -2173283 -1060723 601557 879293 1405609
1589 1405609 465116 -557658 -308264 77826 744607 1020031 2495995 2584870 114351
1580 114351 -1067965 -1423343 -2068370 -892755 478783 150570 178467 -219216 -1142745
1571 -1142745 -913069 -167381 -28169 606824 880257 920233 -68234 -695802 -398598 -1151616
1561 -1151616 -618642 183861 -546413 51542 -526120 -564116 56405 -26700 1102120 1352366
1551 1352366 1479675 1273167 799340 193218 185269 -138983 -713417 87148 -435671 -502775
1541 -502775 -361032 -701967 352170 547244 562402 1070605 120312 279969 916657 585083
1531 585083 388368 -230379 -398422 -406072 -1407529 -874429 -323438 31826 1221642 955413
1521 955413 603521 968710 1235510 1160543 1777271 1147859 1031076 733754 504063 351512
1511 351512 -378825 -454346 -384950 280604 1252137 1027310 790126 979404 -104714 179007
1501 179007 1293051 972488 1304185 1314431 265034 -13690 -174474 -1078251 -373611 128277
1491 128277 -22167 259554 -236554 567276 1026592 1500048 2360515 2339036 2317924 1828852
1481 1828852 179897 -174931 102544 -121150 620209 899499 720251 -59185 93816
1472 93816 595529 462002 1563654 2415946 1461432 1730267 1069943 -270803 256088 1175798
1462 1175798 595517 620894 678658 -663188 -1306523 -813648 -427840 -25087 1008615 1277775
1452 1277775 718393 325282 426675 -576127 -583103 378516 242163 57859 365013 -732068
1442 -732068 -1716388 -1633113 -1238735 -394415 1464841 1347953 390739 -350501 -423518 -522732
1432 -522732 39390 1381645 1745552 700481 327701 -1242296 -1248421 322930 359810 914418
1422 914418 1576184 1580648 1123274 493368 635963 332613 436114 1374406 1594666 909554
1412 909554 531670 -379446 -1277719 -347059 -630898 -381094 1374082 579748 16299 564482
1402 564482 -677886 -332009 -110319 -5986 33391 -659873 -671927 -1116332 -2035005 -694777
1392 -694777 -176162 -262220 685275 684723 347836 985993 553021 648522 815509 -288527
1382 -288527 456371 760884 488092 816314 449912 411767 -2575 -602860 494233 185923
1372 185923 -4280 1191557 983868 281925 749009 1115569 852681 783191 833690 698269
1362 698269 486565 283824 37401 -1045860 -163014 -239046 132703 1007906 739961 774039
1352 774039 1818818 800700 184813 1040244 1122081 576970 195752 409561 -17665 -817366
1342 -817366 -863745 -136785 -181360 1051460 1492736 1045876 1230601 841916 411696 978200
1332 978200 883682 1644816 1656905 441699 -1069593 -1216561 -873351 286071 875912 1304510
1322 1304510 437612 253307 403595 -584851 -492519 321508 556101 599691 1019134 530349
1312 530349 -502966 -486894 -612850 -440764 -29530 429534 13863 -423196 -592595 -886105
1302 -886105 -255154 156280 5746 -137798 389083 18782 -830450 531460 594711 -263063
1292 -263063 544497 759789 547302 1069153 1369689 133815 -651000 -44785 -731147 -289046
1282 -289046 359431 -161622 59465 562646 422892 70737 625515 561863 69212 604603
1272 604603 774375 -286467 -432893 25423 -556809 -1140769 -256511 -797547 -494726 393798
1262 393798 -158474 -699881 -493350 -378537 -94242 848786 1359939 349049 -551540 -203302
1252 -203302 -568640 -257818 853688 851002 1175439 1687554 416945 -405430 1002014 1093949
1242 1093949 964107 1654841 433536 -87051 -431088 -521315 -213478 -517330 858226
1233 858226 1032095 123304 1045655 433488 -450784 1167473 1512447 1335874 1861232 1169498
1223 1169498 -410579 -843175 -855043 -666156 43817 1309538 1358026 374143 1312947 668855
1213 668855 -309475 798370 696868 651043 961156 -310373 -1332748 -1191683 -864058
1204 -864058 -511713 289859 970168 850563 880599 390487 169915 -52677 2264687 2202782
1194 2202782 1347448 1395622 -326839 -1777522 -1751826 -1384223 -994799 -343649 602460 1209490
1184 1209490 676419 594311 1145056 1009029 1791136 2161657 1365179 1295945 324768 -743430
1174 -743430 -1010251 -1383734 -567282 330222 -9364 -374390 -514023 -480130 -472707 -68057
1164 -68057 1340365 1268911 769248 193551 -725146 -1322699 -823125 -382241 -965300 -716049
1154 -716049 -248440 -166663 -291509 239309 286887 1116163 2023671 2061784 1910997 1288305
1144 1288305 53513 6031 191016 5130 214549 334486 -630612 -682512 -819886 -85060
1134 -85060 -182755 359886 1826672 705003 440831 493883 -319177 -54323 282113 -216688
1124 -216688 -307494 -743822 -684170 -725547 193234 875664 457643 934100 1131929 368482
1114 368482 300372 519556 103677 1229536 753697 -458178 -542987 -897132 -1062276 87612
1104 87612 798389 875279 1086139 1156288 529589 610541 631752 872513 1378824 1727178 856959
1093 856959 -92563 -920045 -944436 -678058 554181 1714020 1815445 1434215 310255
1084 310255 -825480 -508169 128713 474073 1444724 2065161 760755 -501076 -996679
1075 -996679 -1597582 -1474237 -16775 1496744 1130888 1082266 699630 -223579 -437035 467915
1065 467915 147502 881498 1865793 612066 52965 -401995 -1561961 -715769 932111
1056 932111 1385558 889407 663004 326483 -693989 -786606 653025 991238 1798389 1811900
1046 1811900 647663 -225784 -307747 -963795 -791781 402047 958520 1592101 1058274
1037 1058274 293083 -409633 -932888 213007 1345722 788625 1258114 82443 -450174
1028 -450174 -613300 -1574100 -354476 874228 38682 732808 486450 -214227 220503
1019 220503 -495549 -64859 541944 848337 731250 238535 -200257 125136 -231508 757095
1009 757095 1603262 527169 322411 403764 -364687 627066 -129383 -817825 -553383 -71684
999 -71684 101830 7148 15046 256458 110794 59496 104642 -162678 10446 155877 -537884
988 -537884 19942 381871 -594812 246743 216010 -628728 149593 -4591 87787 217063
978 217063 455757 1070988 378987 152838 -73244 50284 919287 442126 -541039 -133526
968 -133526 -692842 -758792 460830 859298 378630 1050715 1346415 481421 847312 1102137
958 1102137 955183 519507 467097 883688 -106753 -175751 -63400 112080 988638 1374735
948 1374735 842919 643055 396379 -194230 -377781 444743 241082 1152577 1778689 1451960
938 1451960 581393 484954 -215787 -250030 568431 479306 1072131 1245708 1048696 232346
928 232346 65887 751345 668102 603478 992148 344625 -190034 309635 585437 355133
918 355133 1332141 1418304 1238826 792095 518294 -35348 -364337 743444 742653 366876
908 366876 334870 -381798 -244004 349072 -191758 684375 1837554 1372404 863075 254828
898 254828 -296254 -656508 -629214 -135087 192724 -53132 -201640 -636255 -1160791 -1106219
888 -1106219 -1245829 -392832 613476 36494 442012 570838 -881500 -686259 -66279
879 -66279 -198867 807386 157725 -417077 -325518 -475621 388199 -435355 260257 1244537
869 1244537 144694 -374897 -190922 -1191430 -786652 268021 34199 452640 951701
860 951701 49338 -97139 -443678 -625679 -1036751 -693886 760403 -580037 -286765 93578
850 93578 -997615 -749536 -149199 -497038 -199341 1380967 769334 579633 740692 -292206
840 -292206 -671340 -509000 305035 789581 996375 1288380 793117 249530 48375 -1096033
830 -1096033 -327544 578320 615670 741776 890593 1003773 499260 770229 1208169 782820
820 782820 1907816 1412736 119231 787948 575107 -528284 -361677 756720 801366
811 801366 948079 1479035 528522 -62729 165637 -516512 -545819 998006 1816521 640235
801 640235 615079 -313038 -1552436 -394869 451868 204321 782953 1320601 649512 -171889
791 -171889 168425 -368376 -465926 1714427 2148862 954851 546365 -311003 -1845900 -930398
781 -930398 209729 176646 1257903 1801822 1011881 11957 178996 204381 -199109 1332281
771 1332281 1829611 644304 1077103 347665 -1050606 -562089 -232027 -453970 583935
762 583935 1221315 189385 20943 -289670 -331157 -560550 406469 1127769 -122625 -188809
752 -188809 -480955 -1572939 -1009553 -847861 -1528117 -212172 291941 329105 346274 379773
742 379773 351497 39160 453432 773376 267227 281700 480553 -258752 434151 412702
732 412702 -359001 669040 1164204 998879 869869 837134 567307 539360 452347 229375
722 229375 128392 -328837 -310427 -854671 -809658 -431712 -1166766 -891180 6271 622208
712 622208 1245871 843249 647680 611664 113822 215775 310176 -340363 180790 -156298
702 -156298 -386479 -133819 -749006 -402288 -12072 709792 1157432 704152 848101 1202158
692 1202158 674584 761239 962559 926839 956908 633349 407827 262356 468038 268527
682 268527 668137 1010014 1097418 1651565 1675912 1402245 961544 1628514 1633166 1016948 616421
671 616421 -413467 -1069510 -805867 -477780 -318516 -121744 434970 262139 454319 542392
661 542392 446925 1025365 1246135 1398629 698882 328479 -724904 -1683092 -1816093 -814497
651 -814497 210982 435121 1438381 1334122 395804 534775 461618 535767 1373645 1514117
641 1514117 1403294 1175652 -515052 -927085 -24575 632605 998757 1092851 1260776 608492
631 608492 -394859 324148 592637 721460 1837641 924125 141168 -203008 -1649254
622 -1649254 -2267208 -1578327 -1080872 435989 871867 548117 824185 102780 -10588 203699
612 203699 -164626 972672 1171761 564689 338710 -774759 -1534498 -1256679 -956809 -146559
602 -146559 952072 864481 921791 1129014 793055 -261688 -304971 355070 400827 303968
592 303968 385782 41393 -594350 -1197948 -1549490 -358846 383082 402281 350867 970515
582 970515 471725 321032 826834 946424 496302 822415 523396 -633257 -528460 -783883
572 -783883 -1162723 -1110305 -448641 34812 -178457 395700 880919 458732 611601 675557
562 675557 -64704 674124 378211 4390 692977 170971 53865 -722668 -282250 765643
552 765643 289813 1022121 1265913 234657 1062551 906338 693348 1141991 839594 64471
542 64471 498485 -41190 -223458 168382 -19878 922470 1094735 336511 1028050 667942
532 667942 763505 340968 -446395 253751 439637 504071 1271631 1009825 366190 376448
522 376448 226855 300310 499204 185010 794144 1228849 262661 485377 -2107 101108
512 101108 342176 253788 580719 353636 27871 1071613 1169723 480924 779332 1502564
502 1502564 1473265 1394169 1930481 1712382 423253 296233 283066 -333820 -49826 467613
492 467613 342608 406699 470152 -355666 395510 232560 4896 212819 381751 7195
482 7195 -664928 -317118 -472605 -205665 -468425 221497 582217 -83358 453305 59035
472 59035 -240656 578354 395423 240616 506329 334498 -186201 -190678 -248264 742850 429317
461 429317 120240 674497 -482227 -496140 20303 -111651 334983 826825 1314289 1159216
451 1159216 -189457 276113 -264581 -722525 698020 179383 108763 894054 -195147
442 -195147 -287358 430533 407727 1336622 1198267 171083 -845919 -840346 -193607 534636
432 534636 145334 867320 874964 64872 1397036 133584 -906246 475619 560431 1190109
422 1190109 1464175 -196982 -331092 44406 -183978 -180434 896965 1544750 1546835 1088016
412 1088016 1043238 66040 285528 1512578 1029984 297487 1219248 631810 -156809 429032
402 429032 -110134 -190034 1135099 2078348 1404678 1472207 1573198 421822 540266 852824
392 852824 942598 1079019 724910 -67505 -1120446 -648939 -455928 -562124 406807 965432
382 965432 18804 305054 -25309 -329447 692060 784086 864429 890660 703526 425683
372 425683 -232989 102134 80771 -1227039 -102733 754753 3452 947860 1386145 -143999
362 -143999 1303293 2282640 1025274 978339 408975 524871 101079 -765265 -528797 -1240916
352 -1240916 -509086 796493 -902173 353095 1274524 -111114 988670 134808 -1017537
343 -1017537 593858 -99343 13891 -314223 -1298362 -29722 -585165 -856983 296986
334 296986 111327 660432 1891712 453943 759060 773379 -442599 436070 -48366 -484038
324 -484038 1018078 84386 -418771 -841590 -1643857 -50988 482416 849695 1900215
315 1900215 962753 427133 502050 -244928 331763 980220 938673 1742852 272921 -916714
305 -916714 -624929 -1364641 -277603 740833 1399877 2294842 1417401 -180037 -367257
296 -367257 -751903 -49750 424151 631348 651189 -399862 -1072701 -634816 -862876 -539285
286 -539285 632704 1663202 1579336 965900 86411 520337 30911 -324179 1174877 1107820
276 1107820 52201 -189092 -1321985 -1977206 -932304 24478 1284828 2037105 1601639
267 1601639 1236646 912976 3397 -452189 74275 231654 1003601 312559 214471 5239
257 5239 -1030864 134851 667671 703116 1414890 1321402 200962 137929 -355155 365692
247 365692 1054754 1289182 1451500 737212 82623 -40562 -1016159 -372505 370053 811152
237 811152 1286983 1180254 579952 821193 466653 590887 814147 735712 761405 -346666
227 -346666 -485607 218193 -874438 92720 997685 1100202 2278094 1534214 224781
218 224781 425043 -947 -120793 268537 110538 -206203 -513893 -104615 221032 -128460
208 -128460 67504 430850 -52730 318632 -150889 -400163 147778 273287 247243 863275
198 863275 547192 -585900 -415388 -669354 -633869 -126288 52859 -672577 -1206589 -230083
188 -230083 698174 571741 1073225 1260570 944526 720069 160926 -810433 -1076494 48048
178 48048 -1590 572907 531214 -296380 -395242 580434 982608 554815 1024272 811840 82685
167 82685 65843 41955 -100556 273546 580695 427063 -201982 -35867 -179983 -751783
157 -751783 -277437 -234138 -251476 587893 436410 245414 479891 291317 -118012 -143333
147 -143333 -40005 -5227 -306798 -644024 -749811 -697738 163489 149689 30157 652818
137 652818 534357 -53187 237562 70615 625252 902478 686602 440231 4520 -133688
127 -133688 -117568 -1103235 -546423 -232310 -270106 510090 401230 283 507025 794090
117 794090 613918 586159 181352 -346617 -386493 -909761 -1315388 -1428095 -586658 -286027
107 -286027 -446600 -52719 -3531 378259 321634 -46832 235826 485639 660732 611363
97 611363 434966 -401404 -670877 -859596 -376732 169111 43105 40741 356111 92546
87 92546 -341950 -270752 -150845 349222 1232459 829810 442870 -267089 -1530271 -1337288
77 -1337288 -1406487 -1174420 -200348 257595 234071 219520 -108044 -220312 52612 648391
67 648391 1030595 873443 400040 -89085 -1455607 -1558282 -1706808 -1620525 -955767 -309678
57 -309678 -297562 -699512 -737468 -489637 -570396 151787 1114909 1029360 538236 349191 -139421
46 -139421 -399331 -698991 -511658 -112038 -493290 -411754 -203528 -451517 -85293 119621
36 119621 412204 820559 964640 1154636 259906 -750013 -1084313 -1441988 -1369776 -776954
26 -776954 -686648 -1125100 -791747 -513554 -174693 149535 532072 1138135 884937 216290
16 216290 -80453 -709640 -493435 -932516 -622492 -738903 -1090882 -1266922 -1885649 -1800278
6 -1800278 -1055441 -368396 -210619 57561 250734 -79109
0 -79109
$$ Imaginary data points
##PAGE= N=2
##DATA TABLE= (X++(I..I)), XYDATA
16383 -4721841 -4214095 -3320074 -3599835 -3185426 -3008521 -2999591 -2541583 -2177746 -2510886 -1934760
16373 -1934760 -2125917 -2371094 -2793858 -3526419 -3843487 -3959116 -3391484 -3047820 -3099771 -2988941
16363 -2988941 -2886416 -2317815 -1871886 -1495170 -1204885 -688943 -727350 -1409367 -1854858 -1990332
16353 -1990332 -1995062 -1554856 -1688370 -1044065 -1573296 -1765559 -1790667 -1872014 -1280039 -668957
16343 -668957 -408667 412918 613257 140816 57915 -36683 -490603 -734891 -423916 -629836
16333 -629836 -1028158 -1110879 -724435 -809616 -91784 612366 257928 871067 756047 331037
16323 331037 1164472 812162 412612 378920 -83229 -310164 -772018 -177742 136025 -387524
16313 -387524 343705 467942 408296 1244540 1476006 1505891 1891682 1455038 1437336 1045873
16303 1045873 769879 826069 511272 275572 847115 651759 1193572 1337841 930657 1870809
16293 1870809 2095203 2308596 2545770 1938069 1646026 1302365 702050 862903 708743
16284 708743 1273118 1756478 1433151 1927993 1809055 1080735 1814665 1778885 2265204 3710654
16274 3710654 2676963 3131595 2921336 1829890 2356816 1625836 1829284 1933131 1603368
16265 1603368 2240396 1816153 1436467 2146526 2351301 2703276 3342452 2857091 2878702 3161657
16255 3161657 2074571 2087527 2618708 2447285 2772282 2800929 2973858 3006008 3388482 3835367
16245 3835367 3641351 3363731 3697100 3394766 3974091 4011293 3537095 3698137 3513449 3184647
16235 3184647 3690898 3195921 3313631 3576207 3845493 4788721 4583042 3796240 4638996
16226 4638996 4571232 4131184 3847440 3661014 4443491 4494654 4210864 4256578 3981436 4277897
16216 4277897 4702186 4466164 4866321 4758015 4877479 4634003 4097265 4606988 4247712
16207 4247712 3699893 4200809 4331551 4388209 4762670 4139541 4556869 5154783 5230301 6879365
16197 6879365 6368202 5724369 5373795 4081337 4498583 4900913 4534225 4909400 4960194
16188 4960194 4912169 5055761 4383196 4671515 4952172 4959998 5673138 5340511 5718313 6341252
16178 6341252 5421773 4745264 4458438 4438128 4766807 5120925 4829687 5224793 4978112 4845568
16168 4845568 4790284 4694451 5581065 5341376 5763267 5840486 5376955 5307269 4417151 4184321
16158 4184321 4709126 4466040 4706426 5238152 5310775 5082692 5092093 4545339 5238631 4952679
16148 4952679 5268828 5665537 5396594 5287698 5185579 3645753 4616055 4734294 4490784
16139 4490784 5393151 6007420 5394643 5949563 6221317 5808018 5732682 4927079 4541656 4798096
16129 4798096 4735602 4597566 4026522 4207581 4640883 4579245 5407076 6047589 6236909 6207524
16119 6207524 5705859 4902642 4641609 4690497 5262514 5526414 5758434 5603235 5037818 4538901
16109 4538901 4859680 4623588 5002792 5906701 6749837 7016952 6674336 5350992 5316266
16100 5316266 5046237 5163981 5236091 6240332 5656377 5010899 4068569 3836485 4053153
16091 4053153 4752236 6435484 7121436 7302189 6632334 5793341 5696633 5379300 5552947
16082 5552947 5844609 6016757 6721933 5752190 5295376 5300580 5666115 6255507 6964926 7412465
16072 7412465 7663903 7545293 6478217 5944733 5571404 5874700 6085385 5855699 6108632
16063 6108632 5896670 5490016 4866989 4834320 5621886 6107569 7321062 7514501 6393076
16054 6393076 6620215 6602766 6965592 7357303 6566597 5432978 4939347 4775567 4336254
16045 4336254 4926546 5297665 5358199 5115603 5340982 5553661 5261580 6274588 6275958 6149308
16035 6149308 7272375 6426400 5315150 5827822 5448316 4883661 5284066 5742227 5202886
16026 5202886 4727039 5192798 4668411 4231439 5289862 6135836 6550426 6895473 5849904
16017 5849904 4520317 4845071 4790293 4785977 5783822 5889392 5582144 5235251 4669004 4167813
16007 4167813 4210272 5566641 6048342 5729940 6793174 6063989 4698994 4489658 3795826
15998 3795826 4132338 5910181 6617844 6527206 5970326 5084858 4300923 4199613 4936519
15989 4936519 5809039 5870336 6628116 6065416 4237448 4589677 4516848 4616965 5958065
15980 5958065 6236822 5471079 5847953 5063062 4769614 5048388 6117593 6459150 5674907
15971 5674907 6399626 6133167 5548356 6471018 5775668 5571618 6284475 5964288 5410772
15962 5410772 5455870 5322008 5414117 6028049 6778641 7146170 5905998 6092102 6448691 6062576
15952 6062576 6763126 7218938 6359307 6663518 5989527 5390695 6056710 5640069 5683250 6012652
15942 6012652 6469471 6212806 6202646 6495818 6546243 6550286 7540798 7914342 7232736 7050971
15932 7050971 5739540 4785923 5018880 5705044 5978582 6191143 6547967 6253732 6243230
15923 6243230 6187037 6169225 6490815 7322488 7470695 6911543 6781104 5879232 5728242 5780700
15913 5780700 5609044 6144321 5622774 5564106 5628063 5363030 5715826 5610583 5842780 6776344
15903 6776344 6708224 7762056 7802369 6315113 6029718 5213393 4500576 5278993 5465027
15894 5465027 5502140 4405891 4228728 4868515 4711728 5470668 6232868 6969095 7204199
15885 7204199 6819861 5977063 5701345 4665446 4607428 4763074 4598076 4699451 4944698
15876 4944698 4372432 4516184 4599039 5070382 5857872 5667103 6727343 6963229 6286447
15867 6286447 6292344 5727704 4992232 5025199 4808834 4924016 5807932 5440346 5101887 5345806
15857 5345806 5976208 6289525 6658849 7114855 7370687 6762404 6487260 5992801 5167588
15848 5167588 5572919 4979631 4714215 5229855 5122213 5583888 6010965 6038039 6407722 6322624
15838 6322624 7035556 6980016 6818655 6663383 5843596 5668174 5644899 5613537 5705732 5695017
15828 5695017 5540624 6065619 6433763 5994799 6376577 6537886 7527682 7861267 6844111
15819 6844111 7199933 6819626 5593891 5305465 5473334 5008846 5462208 5479984 5658708
15810 5658708 6301691 6686625 7594297 7579544 7884499 7895361 7497908 7214130 6977362 5760711
15800 5760711 5613086 5497192 4846075 5551213 5273455 4887313 5481481 5767160 6394382
15791 6394382 7010984 7108723 7354522 6586310 7271259 7184809 5776962 6363463 6416484 5414082
15781 5414082 4945239 3988185 4469798 4982061 5218446 6605410 6423606 6040984 6515029
15772 6515029 5650608 4972455 6045488 5934920 6111400 6065966 4948373 5277915 5308602
15763 5308602 4781623 5606852 5531443 5691913 6146494 6242255 6421015 5880703 5226797 6156009
15753 6156009 5097554 5515342 6610779 5558672 5356632 5111718 4426505 4962473 5041178
15744 5041178 4902864 5562121 5633128 6044797 5334752 4952293 6190762 5843847 5441707
15735 5441707 6773437 5573683 5441273 6108592 5509674 5746990 6057937 5691386 5628077
15726 5628077 5507437 6276316 6075785 5688815 6059991 5625311 4984596 6435336 5859286
15717 5859286 6098409 6781575 5839383 6204338 6022790 5638732 5630775 5607978 5697760 5597944
15707 5597944 5357110 6039060 5755087 5372891 6657734 6141542 6051780 7449730 6335410
15698 6335410 6285618 6642016 6209093 6633833 6592324 6611335 6312371 5677106 6315687 5872836
15688 5872836 6139854 7176178 6506750 6160641 6656058 6285420 6594124 6700697 6193363
15679 6193363 5915287 5983235 5900764 6088952 6379756 7038405 6334545 6585843 7819194 7556077
15669 7556077 7404225 7162888 5871198 5513750 5921883 6219001 6511023 6382913 5617723
15660 5617723 5180150 4693798 4982253 5583395 6599432 7240553 6752943 7160294 7019131
15651 7019131 6736749 6697812 7141022 6616411 6279376 5638416 5340956 4927032 4826954 4737179
15641 4737179 5360542 6419034 6725707 6587132 7174789 6814965 6690051 6941656 6755920
15632 6755920 6765720 6579833 6115637 5419019 4582567 4396262 5473679 6022867 7008006 7313712
15622 7313712 7144119 6963362 6568772 6495464 7179131 7089352 6796872 6478913 5261168 4936369
15612 4936369 4820220 4498611 4851568 5266010 6352224 6426403 6258967 6446283 5462451
15603 5462451 5424710 6464785 6776759 6914585 6653400 5913992 5248833 4572384 4741998
15594 4741998 5297216 5947520 6577720 6219371 6370882 6486107 5988789 7463893 8491336
15585 8491336 7277311 7400148 7075140 5666010 5448984 5605309 5309535 5845845 6938132
15576 6938132 7021200 6026650 5825912 6117945 5141347 6325041 8200279 8582340 7997375
15567 7997375 7334692 5373538 4536151 5230001 5155789 6019645 7222163 7048256 6155163
15558 6155163 6051449 6750079 6299061 7249075 7936324 7025872 7351200 7430971 5697292
15549 5697292 5367609 5509161 5431329 6249013 6123112 6908244 6769763 6836507 7547471 6821802
15539 6821802 7045558 7306095 6428471 6995374 6694497 5555312 5114796 5143510 5805926
15530 5805926 6086333 6254278 6832558 6916600 6677426 7005687 6359874 5975339 6552100 6148337
15520 6148337 6949582 7275492 6284181 6094690 5938793 5746101 5702554 5086155 5192809 5309540
15510 5309540 5774615 6102933 6251236 6901376 7161690 6787144 6735910 6784847 5925313 6100371
15500 6100371 5921542 5269002 5494371 4901733 4717379 5121954 5638893 5877443 6076393
15491 6076393 6558265 7113113 6774459 6932938 7303677 6638737 6333317 6176780 5983683
15482 5983683 5264368 5206215 4821618 5174535 5487839 5232038 5587513 5558040 5338732 5559052
15472 5559052 5864334 6073733 6404944 6415635 6320832 6252670 5653335 5209819 5124082 5548293
15462 5548293 6115413 5988111 6104286 5874650 5978139 6193101 5837860 5914582 6744349 6516743
15452 6516743 6194633 6863722 6755289 6310186 5736607 5937992 5530918 4895632 5914829
15443 5914829 5911420 6093095 6608855 6117059 6259631 7673205 7078408 7017367 7174173 6464555
15433 6464555 6004419 5867873 5641938 5670333 6006254 6183479 6710380 6205078 7181566 7315921
15423 7315921 6832162 7568851 7446744 6861932 7227923 6571217 6381953 6511409 6750616
15414 6750616 6629871 6442569 6231634 5964289 6150330 7314141 7265541 6533321 7310457
15405 7310457 7336690 6796331 7116967 6044570 5459951 6086314 6142436 5715494 5807913 6205709
15395 6205709 5622820 6027050 6993594 6467797 6276207 7629237 7398230 6838314 7211490
15386 7211490 6077041 5766381 6744726 6125166 5727130 6162123 5660045 5296630 5676709
15377 5676709 6111011 6172888 6413657 7218024 6655551 6649635 7162464 5926485 4706535 4975038
15367 4975038 4554309 4016368 5327623 4895635 4671918 5416131 5612764 5686212 6285306
15358 6285306 7264102 7196749 7158741 7754990 7292939 6353082 5886522 4946538 4288664 5283498
15348 5283498 5779640 5701099 6764571 6668274 6300125 6726424 7062962 7516520 8344018 8497191
15338 8497191 7161872 6363292 6425402 5618609 5390631 5502577 5467740 4861495 5081852 4887361
15328 4887361 5114621 6276685 6676616 6523270 7221526 7424118 6685793 6198759 5243070
15319 5243070 5393499 5608415 5477156 6058432 5616385 5676866 5813171 5226924 6167401 7292506
15309 7292506 7001592 8285071 8077787 7287397 6909330 5540170 4757435 5678047 5209149
15300 5209149 6134806 6505840 6285067 6368921 6022932 6134431 5796256 6341111 7788085
15291 7788085 8050393 6663770 6801841 5780025 5190980 5847473 5424629 6095348 6353038
15282 6353038 5507806 5812286 5969947 6754407 6998299 7401448 7612874 7210515 6382612
15273 6382612 6769247 5583487 5405715 6397458 6380137 6606098 6786495 5842055 5586670
15264 5586670 6053948 6437242 7084400 7373071 7489062 7075211 6608666 6466290 5921245
15255 5921245 5959821 6897416 6258913 6486549 6891010 5637241 5097976 5650828 5660201 6640056
15245 6640056 7746362 7281365 6269543 5898273 6007532 5387313 5615328 6567541 6185515
15236 6185515 5828279 6279033 6080158 5167821 5689355 5477117 5775712 6844399 6498533
15227 6498533 6328777 6267894 5851534 5690840 6492396 7001865 6642277 6283105 6204319 5609475
15217 5609475 5281216 5912030 5649786 5594800 6176295 5572976 5451969 6186601 6276075 6464394
15207 6464394 6902313 6891449 6387455 6278633 6685099 6213394 5868244 6834906 6013267 5556538
15197 5556538 6855981 5563230 5283883 5858109 5812556 6198852 7298573 7467999 7132014
15188 7132014 6619181 6683517 6371115 6852452 7675421 7094453 6361799 6385854 5135912 5117650
15178 5117650 6216302 6193109 6877093 7594584 7140204 7226189 7404401 7394926 7653859 7481603
15168 7481603 7545417 6801795 6041407 6779549 5621268 5249619 6725787 6121968 6795175
15159 6795175 7690252 6978457 6781133 6963643 6430017 6885286 7396701 7555796 6507465
15150 6507465 5287671 5469749 5237860 5473317 7028979 6301016 7003190 7417672 6034789
15141 6034789 6702052 7235998 7278115 7934934 7917140 7243708 6896832 5968960 6130960 5762073
15131 5762073 5264995 6624777 5980273 5901775 6215519 5327576 5654207 6280493 6387613
15122 6387613 7633117 7723843 7013947 6696994 5412197 5073136 5355153 5791328 6695800
15113 6695800 5888401 4972512 6295731 6202330 6554547 7381107 7095499 7243817 7334646 6414993
15103 6414993 6380842 5663867 5708533 6195026 5639152 5433039 5471101 5345091 5563768 6103542
15093 6103542 5856523 7238632 7049098 7402694 7332954 6881621 6039989 5547928 5242588
15084 5242588 5904916 6124599 6459838 6238278 6121490 6621607 6881300 7326134 7495792
15075 7495792 7969597 8145983 6906954 6344935 6075095 6557568 5662001 4615131 5555181
15066 5555181 5367112 5583933 5798602 5225395 5819167 7102106 7337454 7818898 8106042
15057 8106042 7410370 7612025 6678160 6019571 6421229 5808152 5855253 5288331 5109336 5030447
15047 5030447 5151358 6193255 7188674 7283947 8458569 8030783 7549369 8010312 7528530
15038 7528530 6773980 6510075 5563273 6002460 5904666 5624197 5708406 5213293 5426676 6503523
15028 6503523 6844660 8243376 7884354 7050768 7287384 6803547 6426694 6752360 5943682
15019 5943682 6112777 6126238 5459988 5542296 5307853 6313193 6867242 6492633 7215310 8161458
15009 8161458 7420266 8128392 7202006 6294232 6972369 5878533 6128599 6740133 6497916
15000 6497916 6867000 6565123 5792218 5534663 5664382 6264513 7234711 6998607 7148663
14991 7148663 7277413 7117781 7355809 7064349 7267634 7624484 7030497 7007781 6982666 6371555
14981 6371555 6159322 6145414 6560905 7228972 7660038 8065644 7769842 6739641 6841821
14972 6841821 5967772 6459442 7194820 6453740 6787583 5799417 4731721 5527379 5708864
14963 5708864 7173897 7912862 6995961 7137957 7135219 6862505 6470101 6034369 5926071 6043109
14953 6043109 5784163 6785293 6680071 5685311 6460442 6432749 6387704 7082440 7462649 7518711
14943 7518711 6868448 6417390 6634138 6865811 6782569 6891391 6506602 6600746 6385930 5797423
14933 5797423 6031355 5899405 6327950 7135020 7642484 7565156 7271310 6643165 6275368 6774515
14923 6774515 6503775 6316409 5905091 6088539 5389908 5127523 5496848 5285734 6749231
14914 6749231 7162836 6347809 6145509 6441225 6444797 6136578 6915167 7100075 6641545 7042490
14904 7042490 6785746 5745477 5649804 5768369 5667366 6303510 7096577 6655389 6290513
14895 6290513 6868650 6741044 6616791 7132058 7581720 7283600 7748359 7212555 6059454
14886 6059454 6383067 5726546 5203931 5783461 6488767 6811523 6491477 6461598 6440452 6067402
14876 6067402 6527580 7262126 7003446 6996078 6680067 5897618 7089168 6553569 6393625 6366421
14866 6366421 6057475 6427352 6707519 6624115 6159527 6130269 6533952 6310143 6763153 7349784
14856 7349784 7660446 6888344 7305707 7234052 6163284 6696630 6088884 5442203 5796535
14847 5796535 5823054 6311318 6971226 6886347 7049628 7875634 7760753 7724261 7637259 7952954
14837 7952954 7027122 5911478 5983416 5515472 5550923 6291850 6639300 6743424 7153200 6375465
14827 6375465 6432293 7180144 7493123 7143152 7269201 7336186 7130570 6341805 5810768 4803296
14817 4803296 4831662 5809385 6445032 6032624 6173826 6448072 6054158 6327985 6596245 7298388
14807 7298388 8214760 7866772 6846913 6087883 5936178 5054696 6051102 6141256 5971400
14798 5971400 6812833 6017107 6051060 6495548 6977595 7990596 8258335 8013070 8059800 7316452
14788 7316452 6534567 5653225 4772922 5117816 5662639 5890307 6614515 6642311 5904419 6436207
14778 6436207 6736592 7208963 8114078 8351768 8350710 7175225 5930701 5033927 4400019
14769 4400019 5438991 6115225 5800728 6710500 6572766 6503184 7352236 7346439 7282617 7985440
14759 7985440 8413985 8351455 7913526 6920252 6333172 5371262 5469434 5516212 5877910 6760476
14749 6760476 6197135 5394528 6114695 6458949 6738850 7627997 7911454 7834044 7493603 7147169
14739 7147169 6987609 5943272 5864709 5497603 5169867 6101195 6692160 7082749 6305116
14730 6305116 6346386 6618270 6721966 7660344 8037120 7556806 7008962 5984342 4877869
14721 4877869 5779589 5405324 5995103 7000558 6495551 6360433 6407740 6061024 6646307
14712 6646307 7371372 8486974 8395171 8304329 8453631 6590267 6123107 5690661 4124692
14703 4124692 5356096 7263374 7153527 7956532 7514742 6508714 6683828 6991563 8011061
14694 8011061 8477090 7638708 7523662 5942542 4997770 5283927 4839944 5725293 7243399
14685 7243399 7285487 7329524 6897482 6983255 7341872 7579921 6905248 6752309 6863914 7142435
14675 7142435 6708082 5702934 5380940 4576455 5146319 6572371 6888316 6947865 6226412
14666 6226412 6220577 6538309 6610531 7347809 7125658 7119392 7587120 6297484 5712474 6754359
14656 6754359 6698976 6609164 7056055 6980790 6945057 6340629 6457885 6636289 6439692 7434023
14646 7434023 7424696 6545040 6629265 5742522 5262540 6150090 6388402 6736682 6297516 5522587
14636 5522587 6000553 5423503 6325291 6844842 6867704 8293167 8181291 6924486 6495940
14627 6495940 6121901 6162858 6649087 6802949 6196894 6537269 6419901 6084265 5838183 6729267
14617 6729267 7642060 8042507 8538677 8417545 6961703 7158662 6770984 5728087 6771654
14608 6771654 6814823 7547012 7942822 7143424 6505585 6714981 7913054 8041245 7431816
14599 7431816 7916299 7746383 6907329 6854666 6389747 5611134 7171787 7536209 7177246
14590 7177246 7684037 7159312 6664146 6462615 7145753 7343402 6164594 6861795 6757300
14581 6757300 6264872 7012891 6870272 6295264 7492616 7130984 6555802 7276414 6718401
14572 6718401 5825289 5906344 7373933 7332962 7170558 7766425 6774355 6453309 7147134 7339079
14562 7339079 6458749 7012334 6938687 6201553 6211922 6409912 5830263 6298010 7868613 7268836
14552 7268836 6280674 6946099 6165623 5943182 6740162 7162014 6552131 6966227 6753403
14543 6753403 6725541 6130324 6057277 5471269 6175493 7441276 6623209 6588601 6974756 6120583
14533 6120583 5835620 6643052 7281231 7843075 7625976 7143670 6688703 6099674 6629777
14524 6629777 6598755 6665251 7458161 6960174 6812413 7384150 6169139 6163129 6668309 7241383
14514 7241383 8336224 8296014 7584078 6889709 5805445 5223474 6016488 6428846 6904861
14505 6904861 6887890 6415367 6319904 5714086 5923941 6889443 7323329 8109198 7674741 7899885
14495 7899885 7288129 6764307 6852044 6375096 6768893 6638337 6377299 6918953 6974294 6832140
14485 6832140 6920263 6745373 7365239 8606553 8519477 8234986 7422265 6169954 5699393
14476 5699393 6168733 5875961 6556130 6529143 6532613 6255624 6517296 7272742 7438821 7207846
14466 7207846 8057036 6990083 8049835 8506703 7409895 6961638 6811120 6523427 6257145
14457 6257145 5736643 6404822 6951188 6680042 7377144 6902670 6507610 7425790 7368783 7755222
14447 7755222 9060742 7545929 6943676 6239491 5356568 5529947 5343993 5988867 6428331
14438 6428331 6603929 8127334 8373143 7612171 8354657 8034314 7944990 9622753 8946539
14429 8946539 7693458 6496240 4766540 4887452 5674001 6154688 6941089 7305638 7063672
14420 7063672 6904107 6502769 7600356 7598281 7968274 9283911 8209187 7312451 7342672
14411 7342672 5564696 4796044 5536789 5495514 5986985 6865014 7437506 7609370 6552026
14402 6552026 7476293 8050868 7377433 8523666 7803781 6595900 7010669 6582285 6542207
14393 6542207 6614703 6088390 6300425 6144165 5622777 6401589 7111960 7839915 8102224 7378069
14383 7378069 8383612 8502960 7569242 7532007 6900787 5804553 5667487 5139878 6002554
14374 6002554 6834345 6266235 6619906 7337368 7319620 8011552 8260273 8316372 8154533 7341703
14364 7341703 6498087 7075742 6265654 5909614 5804641 4868213 5311928 5436351 6140049
14355 6140049 7583160 8041829 8805239 8713845 8412186 8644725 7983621 7361407 7554510
14346 7554510 6889522 7231980 6827202 5371765 5443535 6053591 6349106 7327308 8069869
14337 8069869 8331695 8798539 8607416 7606179 7491620 6602208 7115591 7482738 6987542
14328 6987542 7058134 6279712 5531720 5843364 6602219 6959952 7497115 8085050 8235576 7467102
14318 7467102 6980168 7383654 7482738 7207739 7924456 6515801 5997430 6141529 5231809
14309 5231809 6122339 5981752 5861595 7008275 7342479 7481936 7488943 7293003 7782289 7690193
14299 7690193 7529898 7974056 6386392 5724717 6816445 5533282 5833843 6962888 6614807
14290 6614807 6482199 6686381 7052784 7746314 7589222 8247660 7761438 7539241 7754656
14281 7754656 6611853 6130485 6826840 5778659 6422895 7792443 6886767 6796741 6378458
14272 6378458 5828646 6058248 6708431 7569157 8206484 7512870 7551646 6749856 6554790 7153723
14262 7153723 6313890 6601566 7879746 7393793 7602940 7453537 6573006 7199359 7341969
14253 7341969 7338443 8147508 7676667 7779990 6948297 6100891 6285131 6378369 6609320 7924633
14243 7924633 7206003 7019325 6521405 6138204 6705394 7019213 7901531 8307501 8147455
14234 8147455 7718045 6556189 6092093 6360305 6175123 6676423 7565358 7238576 6966042
14225 6966042 6933112 6620122 6495342 6701466 7703287 8218399 7969530 8259015 8067734
14216 8067734 7834773 7433937 6390025 6288003 6723585 6995783 7231751 6542767 6554528
14207 6554528 6401558 6721173 6910272 7565013 7485003 7917843 8131792 7580824 7592533 7042620
14197 7042620 6396551 6252234 6448668 6831585 7197934 7234217 7661975 6991906 6781468 6779924
14187 6779924 6717623 6993270 7956814 8114138 8001843 7571461 7004667 6214482 5893477 6754764
14177 6754764 6441774 6356753 6443941 6173912 6670406 7028930 6897018 7082905 7911349 8767535
14167 8767535 8383182 8302403 7069526 6591035 6480420 6478025 6660737 6825915 7343025 6031824
14157 6031824 6347609 6706460 5653026 6308218 7669157 7845607 8049721 7205022 7272594
14148 7272594 7126716 6627320 7331727 6852222 7002918 7392687 6733423 6375272 6431948 6866878
14138 6866878 6743051 6946057 7240994 7487669 7637112 7681625 6719477 6964795 6976299 7077936
14128 7077936 7176252 7692530 7553549 6986010 7242267 6922138 6617275 6950398 6405659 6482520
14118 6482520 7163925 6896077 6729217 7400088 7730653 7651104 7629063 8003663 7620271 7014131
14108 7014131 7441187 7223863 6857935 6650843 6839035 6919314 7386903 8356803 7877517 7949687
14098 7949687 8284159 7114516 6801599 6659251 7078457 7431403 7289922 8301983 7661599
14089 7661599 7632016 7308619 6757294 6752389 7705660 7595045 7163387 6996275 6754711 6568372
14079 6568372 6925312 6899478 6872618 7311233 7349824 7279580 6938140 7420776 6991172 6738217
14069 6738217 7169324 6504553 6645738 7983871 7591651 7197661 7206300 6853266 6944274 8013143
14059 8013143 8282080 7296602 7073782 7374899 7074328 7501386 8340760 7056140 7312757
14050 7312757 8113064 7243110 6729038 7318686 7224793 6707748 6402702 6125424 5966532 6044079
14040 6044079 7728579 7321539 7200816 7594848 6602892 6426691 7830581 7513077 7022346
14031 7022346 7801797 8066787 7982161 7793970 7367229 6797682 6473465 7268801 7544038 7705803
14021 7705803 7667930 7017582 6290068 7410287 7604645 7663161 8393835 7988997 7363304 7333965
14011 7333965 7014249 6487647 6956266 7741023 7575217 7744690 7902282 6763279 5680987
14002 5680987 6193713 6368549 6466343 7830224 8359367 7806368 7655440 6679711 6242645
13993 6242645 7225448 7984930 8071371 7431628 7136553 6658949 5919245 5610343 6123912 6822877
13983 6822877 7396802 7756526 7891089 7717380 7263638 7314922 7582234 8372019 8252155 7674446
13973 7674446 7611594 7926527 7601563 7248457 7298554 7707565 7776228 8606137 7616716 7072345
13963 7072345 6965391 6502295 7429106 8210516 8445020 8616009 7776505 6873139 7162893
13954 7162893 6478714 6586163 7231701 7174606 7000582 6220488 6544593 7020968 7058757 7850270
13944 7850270 8336579 7935604 8218137 7731251 7579370 8011575 7054984 6827787 7029612
13935 7029612 6294690 6495195 6298513 5885443 6728260 6589590 7919333 8894620 8395285
13926 8395285 8482443 7828161 7339536 8311741 7872162 7671134 7873777 6269831 6132119
13917 6132119 6759978 6315846 8280223 8174225 8326262 8062560 6953251 7319194 7740591
13908 7740591 6883976 7739372 7016601 6982535 7734706 6302059 6582401 6632576 6380692 7286583
13898 7286583 7566894 7908011 8084310 7475055 7207710 6822468 6360603 7509858 7816718
13889 7816718 7340543 7548692 6740604 5796027 6473021 6577544 7263296 7984343 7292266
13880 7292266 6746600 6949851 7138236 6995837 7313586 7822460 7252007 6806224 7405557
13871 7405557 6541847 6193050 7171313 7407550 7482318 7943343 7532194 7297079 7574862 7780192
13861 7780192 8322635 8571417 8381935 7790462 7037128 7120112 6583100 5808382 7841590
13852 7841590 8234166 7235554 7011525 6881222 6653197 6677117 7480707 7979836 8412396 8123459
13842 8123459 7583208 6752672 6539917 6537562 6673182 7874986 8413441 7996600 7282210 6777130
13832 6777130 6166773 7125019 7808409 7727372 8416439 8682291 7749735 7582729 7202809 7149503
13822 7149503 7630637 8493175 9442789 8692227 7576803 6550365 6365939 7164988 7951694
13813 7951694 8144511 8257790 8603358 7615895 6505150 6248079 6212469 7428146 7289874
13804 7289874 7788979 7994336 6353617 5888287 6115205 6238893 7392337 7856347 8098207
13795 8098207 7991323 7103278 6892167 7422564 7470126 8802150 8900098 9136173 8738753 7446463
13785 7446463 7208642 6682431 6461640 7838474 7899205 7437699 7824455 7389054 6735793
13776 6735793 7505950 7728281 7754895 8022367 8357825 8317798 6967450 6984821 7239268 6601782
13766 6601782 7215909 6945979 6282315 6494392 7111619 6634950 7258928 8403739 8303175
13757 8303175 8953205 8227464 7968559 7510085 7520654 7684375 7259785 7169054 6489135 6397885
13747 6397885 6877229 7214530 7422620 8032066 9047361 8929934 8590984 8400466 7477052
13738 7477052 6965429 6811695 7412813 7837599 7826188 7705295 7347558 7019802 7248704 7211454
$$ [...]
##END NTUPLES=NMR SPECTRUM
##END=
