##TITLE=1H_DE-80H_X3
 200.13MHz, d2o
 8 sc
 
 19ns.26.2.2025
##JCAMPDX= 6.0         $$ Bruker NMR JCAMP-DX V2.0
##DATA TYPE= NMR SPECTRUM
##DATA CLASS= NTUPLES
##ORIGIN= UXNMR, Bruker Analytische Messtechnik GmbH
##OWNER= pz
$$ XWIN-NMR		Version 3.5
$$ Tue Jun  9 10:46:06 2026 Russian Standard Time (UT+4h)  Yarkov@DPX200
##.OBSERVE FREQUENCY= 200.1313
##.OBSERVE NUCLEUS= ^1H
##.ACQUISITION MODE= SIMULTANEOUS
##.ACQUISITION SCHEME= undefined
##.AVERAGES= 8
##.DIGITISER RES= 18
##SPECTROMETER/DATA SYSTEM= spect
##.PULSE SEQUENCE= zg30
##.SOLVENT NAME= CDCl3
##.SHIFT REFERENCE= (INTERNAL, CDCl3, 0, 15.2973)
##AUDIT TRAIL= $$ (NUMBER, WHEN, WHO, WHERE, WHAT)
$$ ##TITLE= Audit trail, XWIN-NMR		Version 3.5
$$ ##JCAMPDX= 5.01
$$ ##ORIGIN= Bruker BioSpin GmbH
$$ ##OWNER= Yarkov
$$ C:/Bruker/XWIN-NMR/data/yarkov2/nmr/H-C/1/pdata/1/auditp.txt
$$ ##AUDIT TRAIL=  $$ (NUMBER, WHEN, WHO, WHERE, WHAT)
(   1,<2026-06-09 10:45:13.51 +0400>,<Yarkov>,<DPX200>,
      <created by zg, POWCHK disabled, PULCHK disabled
       configuration hash MD5:
       00 E9 B6 7A A2 85 ED C7 34 08 36 98 17 FE 4E 26
       data hash MD5: 16K
       81 FD 08 6A F0 85 AE FC 75 87 89 F6 30 C6 6E CF>)
(   2,<2026-06-09 10:45:17.68 +0400>,<Yarkov>,<DPX200>,
      <Start of raw data processing
       efp BC_mod = 2 LB = 0.25 FT_mod = 6 PKNL = 1 PHC0 = -6736.819 PHC1 = 13.42196 SI = 16K 
       data hash MD5: 16K
       2E 1E EC 19 D7 14 5F BA 4F D6 4F D5 33 15 96 F1>)
(   3,<2026-06-09 10:45:31.87 +0400>,<Yarkov>,<DPX200>,
      <pk PHC0 = -163.4 PHC1 = 0 
       data hash MD5: 16K
       8E 48 89 96 9E F0 88 84 AA 50 65 37 31 87 37 D2>)
$$ ##END=
$$ 
$$ hash MD5
$$ 46 35 54 BE 88 34 A4 46 E9 E5 63 21 5E 81 DD CD
##$RELAX= 
##$RELAX= 
##$RELAX= 
##$RELAX= 
##$RELAX= 
##$RELAX= 
$$ Bruker specific parameters
$$ --------------------------
##$DU= <C:/Bruker/XWIN-NMR>
##$EXPNO= 1
##$NAME= <H-C>
##$PROCNO= 1
##$TYPE= <nmr>
##$USER= <yarkov2>
##$AMP= (0..31)
100 100 100 100 100 100 100 100 100 100 100 100 100 100 100 100 100 100 
100 100 100 100 100 100 100 100 100 100 100 100 100 100 
##$AQSEQ= 0
##$AQ_mod= 1
##$AUNM= <au_zg>
##$AUTOPOS= <>
##$BF1= 200.13
##$BF2= 200.13
##$BF3= 200.13
##$BF4= 200.13
##$BF5= 200.13
##$BF6= 200.13
##$BF7= 200.13
##$BF8= 200.13
##$BYTORDA= 1
##$CFDGTYP= 0
##$CFRGTYP= 5
##$CHEMSTR= <none>
##$CNST= (0..31)
1 1 145 1 1 1 1 1 1 1 1 1 1 1 1 1 1 1 1 1 1 1 1 1 1 1 1 1 1 1 1 1 
##$CPDPRG= <>
##$CPDPRG1= <>
##$CPDPRG2= <>
##$CPDPRG3= <>
##$CPDPRG4= <mlev>
##$CPDPRG5= <mlev>
##$CPDPRG6= <mlev>
##$CPDPRG7= <mlev>
##$CPDPRG8= <mlev>
##$CPDPRGB= <>
##$CPDPRGT= <>
##$D= (0..31)
0 0.7 0 0 0 0 0 0 0 0 0 0.03 0 0 0 0 0 0 0 0 0 0 0 0 0 0 0 0 0 0 0 0 
##$DATE= 1780987512
##$DBL= (0..7)
120 120 120 120 120 120 120 120 
##$DBP= (0..7)
150 150 150 150 150 150 150 150 
##$DBP07= 0
##$DBPNAM0= <>
##$DBPNAM1= <>
##$DBPNAM2= <>
##$DBPNAM3= <>
##$DBPNAM4= <>
##$DBPNAM5= <>
##$DBPNAM6= <>
##$DBPNAM7= <>
##$DBPOAL= (0..7)
0.5 0.5 0.5 0.5 0.5 0.5 0.5 0.5 
##$DBPOFFS= (0..7)
0 0 0 0 0 0 0 0 
$$ [...]
##$SUBNAM2= <"">
##$SUBNAM3= <"">
##$SUBNAM4= <"">
##$SUBNAM5= <"">
##$SUBNAM6= <"">
##$SUBNAM7= <"">
##$SUBNAM8= <"">
##$SUBNAM9= <"">
##$SW= 18.0517328524113
##$SWIBOX= (0..15)
0 0 2 0 0 0 0 0 0 0 0 0 0 0 0 0 
##$SW_h= 3612.71676300578
##$TD= 16384
##$TD0= 1
##$TE= 0
##$TE2= 300
##$TE3= 300
##$TEG= 300
##$TL= (0..7)
0 120 120 120 120 120 120 120 
##$TP= (0..7)
150 150 150 150 150 150 150 150 
##$TP07= 0
##$TPNAME0= <>
##$TPNAME1= <>
##$TPNAME2= <>
##$TPNAME3= <>
##$TPNAME4= <>
##$TPNAME5= <>
##$TPNAME6= <>
##$TPNAME7= <>
##$TPOAL= (0..7)
0.5 0.5 0.5 0.5 0.5 0.5 0.5 0.5 
##$TPOFFS= (0..7)
0 0 0 0 0 0 0 0 
##$TUNHIN= 0
##$TUNHOUT= 0
##$TUNXOUT= 0
##$USERA1= <user>
##$USERA2= <user>
##$USERA3= <user>
##$USERA4= <user>
##$USERA5= <user>
##$V9= 5
##$VALIST= <valist>
##$VCLIST= <CCCCCCCCCCCCCCC>
##$VD= 0
##$VDLIST= <DDDDDDDDDDDDDDD>
##$VPLIST= <PPPPPPPPPPPPPPP>
##$VTLIST= <TTTTTTTTTTTTTTT>
##$WBST= 1024
##$WBSW= 4
##$XGAIN= (0..3)
0 0 0 0 
##$XL= 0
##$YL= 0
##$YMAX_a= 530766
##$YMIN_a= -669128
##$ZGOPTNS= <>
##$ZL1= 120
##$ZL2= 120
##$ZL3= 120
##$ZL4= 120
##$ABSF1= 0
##$ABSF2= 0
##$ABSG= 0
##$ABSL= 0
##$ALPHA= 0
##$AQORDER= 0
##$ASSFAC= 0
##$ASSFACI= 0
##$ASSFACX= 0
##$ASSWID= 0
##$AUNMP= <proc_1d>
##$AZFE= 0.1
##$AZFW= 0.1
##$BCFW= 0
##$BC_mod= 2
##$BYTORDP= 0
##$COROFFS= 0
##$CY= -3
##$DATMOD= 1
##$DC= 0
##$DFILT= <>
##$DTYPP= 0
##$F1P= 0
##$F2P= 0
##$FCOR= 1
##$FTSIZE= 16384
##$FT_mod= 6
##$GAMMA= 0
##$GB= 0
##$INTBC= 1
##$INTSCL= 3.241238e-09
##$ISEN= 128
##$LB= 0.25
##$LEV0= 0
##$LPBIN= 0
##$MAXI= 10000
##$MC2= 0
##$MEAN= 0
##$ME_mod= 0
##$MI= 1.114404
##$NCOEF= 0
##$NC_proc= -6
##$NLEV= 6
##$NOISF1= 3.799351
##$NOISF2= 2.8
##$NSP= 0
##$NTH_PI= 0
##$NZP= 0
##$OFFSET= 15.29735
##$PC= 1
##$PHC0= -6900.219
##$PHC1= 13.42196
##$PH_mod= 1
##$PKNL= yes
##$PPARMOD= 0
##$PSCAL= 0
##$PSIGN= 0
##$REVERSE= no
##$SF= 200.130044899462
##$SI= 16384
##$SIGF1= 3
##$SIGF2= 2
##$SINO= 0.751879
##$SIOLD= 32768
##$SREGLST= <19F.Aceton>
##$SSB= 0
##$STSI= 16384
##$STSR= 0
##$SW_p= 3612.71676300578
##$SYMM= 0
##$S_DEV= 0
##$TDeff= 16384
##$TDoff= 0
##$TI= <>
##$TILT= no
##$TM1= 0
##$TM2= 0
##$TOPLEV= 0
##$USERP1= <user>
##$USERP2= <user>
##$USERP3= <user>
##$USERP4= <user>
##$USERP5= <user>
##$WDW= 1
##$XDIM= 16384
##$YMAX_p= 406715871
##$YMIN_p= -1566198
$$ End of Bruker specific parameters
$$ ---------------------------------
##NTUPLES= NMR SPECTRUM
##VAR_NAME=  FREQUENCY,     SPECTRUM/REAL,   SPECTRUM/IMAG
##SYMBOL=    X,             R,               I
##VAR_TYPE=  INDEPENDENT,   DEPENDENT,       DEPENDENT
##VAR_FORM=  AFFN,          ASDF,            ASDF
##VAR_DIM=   16384,         16384,           16384
##UNITS=     HZ,            ARBITRARY UNITS, ARBITRARY UNITS
##FACTOR=    0.220516191357247, 1,           1
##FIRST=     3061.45932829557, 0,            0
##LAST=      -551.257434710209, 0,           0
##MIN=       -551.257434710209, -1566198,    0
##MAX=       3061.45932829557, 406715871,    0
$$ Real data points
##PAGE= N=1
##DATA TABLE= (X++(R..R)), XYDATA
$$ [...]
6005B8949071L17453L14612K29129J59871N1281m2333r9456j46737j56144r9408
5995B9477339n4350Q061R8769J48865K26498K81227L53435L63738L47175K02448
5985C1453205J04977J6030l8064j08833j01291j09607q2217j34222j25458r2694
5975C0781826j09142n4617o3270q246P682O0910Q485K1772J7202o6425r7664j41625
5963C0356888k15627k20959k99130m26768m30050n64098o46028o57082o16146
5954B6281000n76300m99869l98751k92510k99506k87875l56576l77168m01138
5945B2791307n26233n03441n26967n02879m79909m48316m37377m24381l66984
5936A8574820m23540m74636m45907n57387n90234o14046o06847o59235o33652
$$ y = [28949071, 29266524, 29581136, 29810265, 29970136, 30021417, 29979084, 29879628, 29732891, 29576747, 29477339, 29422989, 29431050, 29529819, 29678684, 29905182, 30186409, 30539844, 30903582, 31250757, 31453205, 31558182, 31574212, 31536148, 31427315, 31326024, 31216417, 31134200, 30999978, 30874520, 30781826, 30672684, 30618067, 30554797, 30546551, 30554233, 30615143, 30623628, 30645400, 30662602, 30596177, 30498513, 30356888, 30141261, 29920302, 29621172, 29194404, 28764354, 28200256, 27554228, 26897146, 26281000, 25704700, 25204831, 24806080, 24513570, 24214064, 23926189, 23569613, 23192445, 22791307, 22265074, 21761633, 21234666, 20731787, 20251878, 19803562, 19366185, 18941804, 18574820, 18151280, 17676644, 17230737, 16673350, 16083116, 15469070, 14862223, 14202988, 13569336]
5927A3569336o02680n27767m39162l66891l08427k18214k13036j87591j67714
5918A0537854j38631j58983k08120k39350k23905l05783l26890l60155l67091
5909H208946l77084l66729l35921l46858l03384k88683k81721k48118k32168k15889
5899E212391j83243j46207j33497j14978p6286q3814m6776j5312p9680m1547k6716
5888D264335k2691l0680q4825l9018j19561r6052j18031o7682q5648j04563q4756
5877C410828p0534n5516m2922q4543k9518k2517l9837M677j8196p6322j6078j1239
5865B948283M407M6247O043n3417k9237l3522o032J8016l5371j5708r242j0398
5853B830069J090j897m0179n470l1257j3471O857j3425K1632k4737l7111K9570
$$ y = [13569336, 12966656, 12438889, 11999727, 11632836, 11324409, 11106195, 10893159, 10705568, 10537854, 10399223, 10240240, 10032120, 9792770, 9568865, 9263082, 8936192, 8576037, 8208946, 7831862, 7465133, 7129212, 6782354, 6478970, 6190287, 5908566, 5660448, 5428280, 5212391, 5029148, 4882941, 4749444, 4634466, 4558180, 4474366, 4427590, 4412278, 4332598, 4291051, 4264335, 4241644, 4210964, 4126139, 4087121, 3967560, 3871508, 3753477, 3685795, 3600147, 3495584, 3410828, 3340294, 3284778, 3241856, 3157313, 3127795, 3105278, 3065441, 3070118, 3051922, 2975600, 2959522, 2948283, 2952690, 2998937, 3004980, 2951563, 2922326, 2888804, 2882772, 2900788, 2865417, 2849709, 2840467, 2830069, 2831159, 2829262, 2789083, 2783613, 2752356, 2738885, 2745742, 2732317, 2753949, 2729212, 2692101, 2721671]
5841B721671N0908k0769j5969q668K5361k7625J4207M719n620J876L4605J0879
5829B785575n893N0506N124L9253k2571l0149J0046K1842l3189L234j7150J895
5817B808523K5475k334k070l9344k1398m4838o674o627J521L7583L438j4408M6881
5804B785728J9549J2804N972J5880j4391M7083K1910pK6155K2288L4251J293K4963
5791C003478J3347p689j2782K1847k2913p386j6832k1590l2113L8602J8329k0507
5779B953791j2556k6590P275l1717N260r102p029K4618J7687K473J0637j6460
5767B918287J5214J538j8615j3875N053K1286j0208k0840o8952K2191l3000R580
5755B827659q898j1932n7964Q72Q569k3128K30L2524L7004J4549L1184L409m1978
$$ y = [2721671, 2772579, 2751810, 2735841, 2727173, 2752534, 2724909, 2739116, 2743835, 2738215, 2740091, 2774696, 2785575, 2779682, 2830188, 2835312, 2874565, 2851994, 2821845, 2831891, 2853733, 2820544, 2823778, 2806628, 2808523, 2833998, 2831664, 2829594, 2790250, 2768852, 2724014, 2717340, 2710713, 2712234, 2749817, 2753255, 2738847, 2785728, 2805277, 2818081, 2824053, 2839933, 2825542, 2872625, 2894535, 2894528, 2920683, 2942971, 2977222, 2978515, 3003478, 3016825, 3009136, 2996354, 3018201, 2995288, 2987902, 2971070, 2949480, 2917367, 2955969, 2974298, 2953791, 2941235, 2914645, 2921920, 2890203, 2895463, 2886361, 2879332, 2903950, 2921637, 2924110, 2934747, 2918287, 2933501, 2935039, 2916424, 2902549, 2907602, 2928888, 2918680, 2897840, 2828888, 2851079, 2818079, 2827659, 2818761, 2806829, 2748865, 2749737, 2758306, 2735178, 2735408, 2767932, 2804936, 2819485, 2850669, 2854078, 2812100]
5742B812100N458K8803k1854j7402j1254L5522n0816M85k9917M3968O185m5760
5730B755518M5254l851k1864j8187L4334Q733R211k0344J6651O103K4148l834
5718B831872J0647L7878P3291O6133O4836K6202O756k2034o2932m9437k1372j4374
5706B947466k2385J0326m1662k3060m0022M0908J0006r684J8989P872P475J2270
5694B918499j827k1655k7854r106M6137J7806k645J6450K6053J7854P4380N2921
5682C107013L3703M1908J3919k4217o4491m0284l191R367k5378l0137j593Q004
5670C024623m9047J2683J7716k3303K8570K7168m6434o363J9025K248j164l5931
5658B969791p870N782J7833N2109p524j584K8344n09L8191L325L1846O625k7677
$$ y = [2812100, 2817558, 2846361, 2824507, 2807105, 2795851, 2831373, 2780557, 2781042, 2751125, 2795093, 2801278, 2755518, 2800772, 2796921, 2775057, 2756870, 2791204, 2799937, 2809148, 2788804, 2805455, 2811558, 2835706, 2831872, 2842519, 2880397, 2953688, 3019821, 3084657, 3110859, 3117615, 3095581, 3032649, 2983212, 2961840, 2947466, 2925081, 2935407, 2893745, 2870685, 2830663, 2871571, 2881577, 2871893, 2890882, 2898754, 2906229, 2918499, 2916672, 2895017, 2867163, 2858057, 2904194, 2922000, 2919355, 2935805, 2961858, 2979712, 3054092, 3107013, 3140716, 3182624, 3196543, 3172326, 3107835, 3067551, 3064360, 3073727, 3048349, 3018212, 3016619, 3024623, 2975576, 2988259, 3005975, 2982672, 3011242, 3038410, 2991976, 2985613, 3004638, 3006886, 3005722, 2969791, 2961921, 2967703, 2985536, 3037645, 3030121, 3028537, 3056881, 3056372, 3094563, 3097888, 3129734, 3136359, 3108682]
5645C108682j751K796k6470o8994J9639J9593k1070q190o728j8929L6304r841
5633C025041o764K1034L6001N4506J9133r068m486N9405L3696k9404M6264K2574
5621C267932k2850L075J8898l118J3262K4737j5l7106l570q722J1925j2527p810
5608C244111K9214K264L363j7876o262k4132l274K7847K2342q801q297K2582J7949
5595C301030j4849l6437m1044j276l524n0646j8618j8142k8169L0909J5067k0890
5583C113411j520r949j9793M3290K2739J8556K4375J4966R125J4828K4850M3056
5571C297934l414M0208N2703N1645J7625K5480M1225J1356q399N686O2818j7361
5559C577506o4679L0969J0619L2581k8858l2821r15k8566L6704K7306K6156n422
$$ y = [3108682, 3106931, 3109727, 3083257, 3014263, 3033902, 3053495, 3032425, 3024235, 3017507, 2998578, 3034882, 3025041, 3018277, 3039311, 3075312, 3129818, 3148951, 3139883, 3135397, 3194802, 3228498, 3199094, 3245358, 3267932, 3245082, 3248157, 3267055, 3263937, 3277199, 3301936, 3301921, 3264815, 3261245, 3252523, 3264448, 3251921, 3244111, 3273325, 3275589, 3278952, 3261076, 3254814, 3230682, 3227408, 3255255, 3277597, 3268796, 3260499, 3283081, 3301030, 3286181, 3249744, 3208700, 3207424, 3203900, 3153254, 3134636, 3116494, 3088325, 3119234, 3134301, 3113411, 3111891, 3101942, 3082149, 3125439, 3148178, 3166734, 3191109, 3206075, 3215200, 3230028, 3254878, 3297934, 3294520, 3334728, 3387431, 3439076, 3456701, 3482181, 3523406, 3534762, 3526363, 3532049, 3594867, 3577506, 3512827, 3543796, 3554415, 3586996, 3558138, 3525317, 3524402, 3495836, 3532540, 3559846, 3586002, 3580580]
5547C580580J5851k435K7680M51m6359k7083k8149l6569l7919o2147o8380l8099
5535C277422j395k7929r854J72k9608J801l7765m7152J1364N811J2263n021n14
5522C149595L1214J0305q722K6247o0880m5702r810j3530m7326n6734n3934j0721
5510B910002o179k7351r258k2888l2021M110j4651k0978M3899j8657K2249m4633
5498B783644L97k5707J7512P617J9406Q413l6707p731Q25R724j036L2245j5468
5485B793134m480j0953J4500j0692J986J3018M236j6861k0014K4592J9452j0171
5473B797747m3718M905Q470p460j2625K1891r14j4506k5748j6138M069m0077k3335
5460B652561K6031j70K9721l467J323k8748K0797P545k1808K0066q189j1738J814
$$ y = [3580580, 3596431, 3593996, 3621676, 3622127, 3575768, 3548685, 3520536, 3483967, 3446048, 3383901, 3315521, 3277422, 3276027, 3248098, 3238244, 3238416, 3208808, 3210609, 3172844, 3125692, 3137056, 3142867, 3155130, 3150109, 3149595, 3180809, 3191114, 3182392, 3208639, 3147759, 3102057, 3092247, 3078717, 3031391, 2974657, 2920723, 2910002, 2903823, 2876472, 2867214, 2844326, 2812305, 2816415, 2801764, 2780786, 2824685, 2806028, 2828277, 2783644, 2784041, 2758334, 2775846, 2783463, 2802869, 2811282, 2774575, 2766844, 2767669, 2777393, 2776357, 2808602, 2793134, 2788654, 2777701, 2792201, 2781509, 2783495, 2796513, 2800749, 2783888, 2763874, 2788466, 2807918, 2797747, 2754029, 2758934, 2767404, 2759944, 2747319, 2769210, 2768296, 2753790, 2728042, 2711904, 2715973, 2675896, 2652561, 2678592, 2678422, 2708143, 2704676, 2705999, 2677251, 2698048, 2705593, 2683785, 2703851, 2695662, 2683924, 2685738]
5447B685738j4224o668K1268r638J1229j2607J2760j0836J6984J6853P509j7689
5435B700679N586l3044k5538K1862O188K9680m7481j8021Q566L0587M190j0574
5423B672680p169K0103J7127l3740k3437k4231k159O284k058O883l101J0105M6643
5410B683930J5014j8197L813j9891J751J6180j1012K4784j9006R089K4811L082
5398B714348l2684N569R354K5716m371j2530L1294j4642k1164J08J8358K4036
5386B743392n0986l518K1301J0564l55p608J376j7432J7948j422p118j622l1667
5373B672853K6666M0710L3281k9407k525p460K6639k9659K0566n206q021j5463
5361B722974j3205O639k4457r980J3940K7488j3787J6180m221O983J70K0404R34
$$ y = [2685738, 2671514, 2664846, 2686114, 2676476, 2687705, 2675098, 2687858, 2677022, 2694006, 2710859, 2718368, 2700679, 2706265, 2673221, 2647683, 2669545, 2675733, 2705413, 2657932, 2639911, 2648477, 2679064, 2683254, 2672680, 2665511, 2685614, 2702741, 2669001, 2645564, 2621333, 2619174, 2625458, 2623400, 2630283, 2627182, 2637287, 2683930, 2698944, 2680747, 2684560, 2664669, 2666420, 2682600, 2671588, 2696372, 2677366, 2686455, 2711266, 2714348, 2681664, 2687233, 2696587, 2722303, 2717932, 2705402, 2736696, 2722054, 2700890, 2700998, 2719356, 2743392, 2692406, 2688888, 2710189, 2720753, 2720398, 2712790, 2714166, 2696734, 2714682, 2713260, 2706142, 2704520, 2672853, 2699519, 2740229, 2773510, 2744103, 2741578, 2734118, 2760757, 2731098, 2751664, 2746458, 2738437, 2722974, 2709769, 2716408, 2691951, 2681971, 2695911, 2723399, 2709612, 2725792, 2721571, 2728554, 2728724, 2749128, 2750062]
5348B750062K0021o045p91k1609K9704j3514k437l5808L703K4140k1512P499j6929
5335B716484K158j0705J2756k6579j6584l5788Q215j1321J9411k9730K0108Q345
5323B656770J8494j1834m3877M9808m2315j0992m7705N1141k2364L3935o339K2618
5311B647340n781N7970K0144r797l4702j3361K6730k1846k618K8342P7656J658
5299B771735J2104j2055N9354k8999L6668M7334K1996n879R632n604j2015L1433
5287B925704j2456J6025M39N1678J3838N3218L4732M1266j0654J4703K1237L891
5275C153621j6546J371p660k9391j8170l5205M8944Q163k8494O042P4766N107
5263C162548l221k427L3181K0998J4989J8440J5739m2949j5803k6245k528j9965
$$ y = [2750062, 2770083, 2764038, 2763247, 2741638, 2771342, 2757828, 2755391, 2719583, 2723286, 2747426, 2725914, 2733413, 2716484, 2718642, 2707937, 2720693, 2694114, 2677530, 2641742, 2649957, 2638636, 2658047, 2628317, 2648425, 2656770, 2675264, 2663430, 2619553, 2669361, 2627046, 2616054, 2568349, 2619490, 2597126, 2631061, 2624722, 2647340, 2641559, 2699529, 2719673, 2709876, 2675174, 2661813, 2688543, 2666697, 2664079, 2692421, 2770077, 2771735, 2783839, 2771784, 2831138, 2802139, 2838807, 2886141, 2908137, 2902258, 2911890, 2906286, 2894271, 2925704, 2913248, 2929273, 2929712, 2981390, 2995228, 3048446, 3083178, 3124444, 3113790, 3128493, 3149730, 3153621, 3137075, 3138446, 3130786, 3101395, 3083225, 3048020, 3096964, 3105127, 3076633, 3082675, 3157441, 3162548, 3159327, 3156900, 3190081, 3211079, 3226068, 3244508, 3260247, 3217298, 3201495, 3175250, 3172722, 3152757]
5251C152757j6757N374J2059L2127J779L8831J859M2274k5557j3679J5096m371
5239C241792K1232n067k3307K4435J2449L3062M939K0189K5489j4974j4419J9519
5227C345339J5314J2076J9183K401J4367m5737j5490m2661j7465n897j5327J6613
5215C282716j3008K3546k4178m3633J9679K1944l1777j0875l6594j2026K2974
5204C198768M741j3702j4484J282j0487J6801j408j2149o546R862r497j0498J1725
5191C164408L228K14N151j2961J4203o869O383l9598j2656n965J4114m604j6822
5178C108226m277J5671N515K9758L3848k1230j7840J1325Q496J0853J995r434
5166C172906L5751K802j78m0909L7928K9075J1174M037p607K4248J2251j247l8061
$$ y = [3152757, 3136000, 3141374, 3153433, 3185560, 3187339, 3226170, 3228029, 3270303, 3244746, 3231067, 3246163, 3241792, 3263024, 3257957, 3234650, 3259085, 3271534, 3304596, 3309535, 3329724, 3355213, 3340239, 3325820, 3345339, 3360653, 3372729, 3391912, 3394313, 3408680, 3362943, 3347453, 3304792, 3287327, 3281430, 3266103, 3282716, 3269708, 3293254, 3269076, 3225443, 3245122, 3267066, 3235289, 3224414, 3187820, 3175794, 3198768, 3203509, 3189807, 3175323, 3176605, 3166118, 3182919, 3181511, 3169362, 3162816, 3172678, 3163181, 3152683, 3164408, 3167636, 3167850, 3173001, 3160040, 3174243, 3167374, 3173757, 3134159, 3121503, 3115538, 3129652, 3125048, 3108226, 3103949, 3119620, 3125135, 3154893, 3188741, 3167511, 3149671, 3160996, 3169492, 3180345, 3182340, 3172906, 3208657, 3211459, 3211281, 3170372, 3208300, 3237375, 3248549, 3252586, 3244979, 3269227, 3281478, 3280231, 3242170]
5153C242170K3584K8102K067K4626J0414J281O8227K4910K5726L2465M7888K6668
5141C558128M3400L6252J120M1240P2388N1168K0933N5045J4058Q3490K8344K5598
5129D031164J4687L6598M7670K4083n938m397J9339J2841N4322r990L0119J8712
5117D269210O3499l889N2950L1445M6222p867L8896j347K6561K5251k8107L2835
5105D545659N9028K778j3989N7205j0943K1108m410P6886k1935L6733m3815K9953
5093D734258L0785M2277K0911K3324K3439l123M1349N1913O7225L9170P2370M8443
5081E192341O1671K3573M3910j0311P0716N6375K6580M3371P9204N0035N8496
5070E695961P2713L6190J09425O7957R4084L4245J00993M2120R5535M5857Q9890
$$ y = [3242170, 3265754, 3293856, 3295923, 3320549, 3330963, 3332244, 3400471, 3425381, 3451107, 3483572, 3531460, 3558128, 3601528, 3637780, 3638900, 3680140, 3752528, 3803696, 3824629, 3879674, 3893732, 3977222, 4005566, 4031164, 4045851, 4082449, 4130119, 4154202, 4148264, 4143867, 4163206, 4176047, 4230369, 4220379, 4250498, 4269210, 4332709, 4328820, 4381770, 4413215, 4459437, 4451570, 4490466, 4489119, 4515680, 4540931, 4512824, 4545659, 4604687, 4607465, 4593476, 4650681, 4639738, 4660846, 4656436, 4733322, 4711387, 4748120, 4704305, 4734258, 4765043, 4807320, 4828231, 4851555, 4874994, 4871871, 4913220, 4965133, 5032358, 5071528, 5143898, 5192341, 5254012, 5277585, 5321495, 5311184, 5381900, 5438275, 5464855, 5508226, 5587430, 5637465, 5695961, 5768674, 5804864, 5914289, 5982246, 6076330, 6110575, 6211568, 6253688, 6349223, 6395080, 6484970]
5059F484970R2784J31560J19759J16290J16560R0795J63250J31432J29391J14667
5049G691458J57948J19485J58550R3950J49832R1294J31535Q5008J56024J51230
5039H986314J54482J25003J24866J73529J44635J62569J42393J85276J76561K51414
5029A0627042J54502J94426J72614K55524K21282K51902K04884K14193K26121
5020A2522490K36323K31587K41064K21088J66934K37183J94749K21428J77653
5011A4450499K33376J87236K30577K16195L29276L17279L36794L83375M13609
5002A7098216M49346M96957N80633N61289O61008O38465P29341Q07259R09079
4993B2931593R30069R97931J109327J227841J334429J509158J534632J731371
$$ y = [6484970, 6577754, 6709314, 6829073, 6945363, 7061923, 7152718, 7315968, 7447400, 7576791, 7691458, 7849406, 7968891, 8127441, 8221391, 8371223, 8462517, 8594052, 8679060, 8835084, 8986314, 9140796, 9265799, 9390665, 9564194, 9708829, 9871398, 10013791, 10199067, 10375628, 10627042, 10781544, 10975970, 11148584, 11404108, 11625390, 11877292, 12082176, 12296369, 12522490, 12758813, 12990400, 13231464, 13452552, 13619486, 13856669, 14051418, 14272846, 14450499, 14683875, 14871111, 15101688, 15317883, 15647159, 15964438, 16301232, 16684607, 17098216, 17547562, 18044519, 18625152, 19186441, 19847449, 20485914, 21215255, 22022514, 22931593, 23861662, 24859593, 25968920, 27196761, 28531190, 30040348, 31574980, 33306351]
4985C3306351J964470K038304K234700K434170K647924K770945K961260L130755
4977E3488879L267727L335348L465506L542314L627618L633041L675386L633221
4969H1669040L600076L568854L497768L331989L213396L122319L025018K995704
4961A08024164K965647L042660L179851L325235L500088L632329L740371L824793
4953A35235138L926356M005578M112652M275593M467446M600843M646891M640247
4945A69910744M678537M504890M300787L954203L441123K757219J778813P69438
4937A96095754l37036j430044k293761l012076l447339l716102l768808l643436
4929A74447152l419573l104515k762638k413479k108022j752458j548619j451862
$$ y = [33306351, 35270821, 37309125, 39543825, 41977995, 44625919, 47396864, 50358124, 53488879, 56756606, 60091954, 63557460, 67099774, 70727392, 74360433, 78035819, 81669040, 85269116, 88837970, 92335738, 95667727, 98881123, 102003442, 105028460, 108024164, 110989811, 114032471, 117212322, 120537557, 124037645, 127669974, 131410345, 135235138, 139161494, 143167072, 147279724, 151555317, 156022763, 160623606, 165270497, 169910744, 174589281, 179094171, 183394958, 187349161, 190790284, 193547503, 195326316, 196095754, 195758718, 194328674, 192034913, 189022837, 185575498, 181859396, 178090588, 174447152, 171027579, 167923064, 165160426, 162746947, 160638925, 158886467, 157337848, 155885986]
4921A55885986j364064j421540j554479j629820j817348k000432k148222k293637
4913A41656444k439461k561267k637461k641582k616978k530133k401508k183205
4905A21644849j933394j655183j420455j291960j343834j547050j745887k059617
4897A08647469k415393k603278k720180k796301k842526k822295k719968k484073
4889H7243455k248395j846757j462354j004276o62034m20974k30028k47239k84515
4880G8836883l22630m91451o90075r69940j270751j602077j941872k195483k370795
4871F6981809k436083k484608k397747k190714j957891j651182j306409r80797
4863E1576378n50798k76136j38611m1996j58609l31813n50050p53680r21581j044663
$$ y = [155885986, 154521922, 153100382, 151545903, 149916083, 148098735, 146098303, 143950081, 141656444, 139216983, 136655716, 134018255, 131376673, 128759695, 126229562, 123828054, 121644849, 119711455, 118056272, 116635817, 115343857, 114000023, 112452973, 110707086, 108647469, 106232076, 103628798, 100908618, 98112317, 95269791, 92447496, 89727528, 87243455, 84995060, 83148303, 81685949, 80681673, 80019639, 79598665, 79368637, 79121398, 78836883, 78514253, 78022802, 77332727, 76362787, 75092036, 73489959, 71548087, 69352604, 66981809, 64545726, 62061118, 59663371, 57472657, 55514766, 53863584, 52557175, 51576378, 51025580, 50749444, 50610833, 50568837, 50410228, 50078415, 49528365, 48774685, 47853104, 46808441]
4853D6808441j156879j242601j282455j372122j353488j254011j128205r80093
4845C7038587q11799o25183m17066k09925k7145J03144K89361K88214K96037L16840
4835C6241065K61842J91330K14700K66164L52785N33509O97190R79234J126155
4826D0863974J307679J449012J391219J131969Q41283M53248P0986k46531m49306
4817D6813533o07359o12382n10677l38854r4593J59800M36740N65386O18342N90287
4807D7020223M61337J70832k10628o81564j049557j501153j766963j956851k038923
4798C8446753j993532j863137j691853j498705j205388r21917o32859l65619j79742
4789B8094001j30570k2778q4196j70282l18968m24116n09755n99142o10020n91022
$$ y = [46808441, 45651562, 44408961, 43126506, 41754384, 40400896, 39146885, 38018680, 37038587, 36226788, 35601605, 35184539, 34974614, 34947469, 35050613, 35339974, 35628188, 35924225, 36241065, 36502907, 36694237, 36908937, 37175101, 37527886, 38061395, 38758585, 39737819, 40863974, 42171653, 43620665, 45011884, 46143853, 46985136, 47438384, 47509370, 47262839, 46813533, 46206174, 45593792, 45083115, 44744261, 44649668, 44809468, 45246208, 45811594, 46429936, 47020223, 47481560, 47652392, 47441764, 46760200, 45710643, 44209490, 42442527, 40485676, 38446753, 36453221, 34590084, 32898231, 31399526, 30194138, 29272221, 28639362, 28273743, 28094001, 27963431, 27940653, 27856457, 27686175, 27367207, 26943091, 26433336, 25834194, 25224174, 24633152]
4779B4633152o02179n37737l98587l97195l04687k86374k28015k63044k66139
4770B1349195l74692m46177m69065m70014n14387l89022k62635j61935N1289K20274
4760A8532831M72137O75452R16216J071382J135842J051050Q23928M31369R9578
4751B5209785l09865o53578q58049r75359r73435r52389r04044o93957n77162
4742A8311947m62005k25435j13404O3381K17229L86604M90136O92274P98430R49552
4732B1108709J021172J095841J168758J204459J291138J194861J117636R16449
4724C0119023P24040N30203M71392L37923K88407N8361j32111l55052n88810q29515
4714C0623861r29645r34719q64142o89460n60769k89177p9047J04620K18239L49704
$$ y = [24633152, 24030973, 23493236, 23094649, 22697454, 22392767, 22106393, 21878378, 21615334, 21349195, 20974503, 20528326, 20059261, 19589247, 19074860, 18685838, 18423203, 18261268, 18312557, 18532831, 19004968, 19680420, 20596636, 21668018, 22803860, 23854910, 24678838, 25110207, 25209785, 24899920, 24246342, 23388293, 22412934, 21439499, 20487110, 19583066, 18889109, 18311947, 17849942, 17624507, 17511103, 17574484, 17791713, 18178317, 18668453, 19360727, 20159157, 21108709, 22129881, 23225722, 24394480, 25598939, 26890077, 28084938, 29202574, 30119023, 30843063, 31373266, 31844658, 32182581, 32470988, 32529349, 32397238, 32042186, 31453376, 30623861, 29694216, 28759497, 27895355, 27205895, 26645126, 26355949, 26276902, 26381522, 26599761, 26949465]
4704B6949465L84496N02088N54028N78687N78078N47802M51882L52611K70255
4695C1169392K32749J78417J25015J4980j46647l49944n29291o84278p63971p09083
4685B8537339o77269n59920l93320k53144p2163J04708K64662M37898O25338P99516
4675B8813645Q95600R60822Q40428O46873L77811Q4496k00964n28964o78542q07642
4665C0403563q51946r47967j022125j068514j126921j110918j037277q86083p40287
4656B1611525n17754k43695m278K17740M60543N35253N80152N11209M02089K18531
4646B3771315Q8016P894k5204m5864q9501p5656o2123j11835j99742l12453n25947
4635B2418900p72216r50389j050554j115262j100251j077486r33860q34088p00291
$$ y = [26949465, 27333961, 27836049, 28390077, 28968764, 29546842, 30094644, 30546526, 30899137, 31169392, 31402141, 31580558, 31705573, 31720553, 31573906, 31223962, 30694671, 30010393, 29246422, 28537339, 27860070, 27300150, 26906830, 26653686, 26581523, 26686231, 26950893, 27388791, 28014129, 28813645, 29709245, 30670067, 31510495, 32157368, 32535179, 32619675, 32418711, 31889747, 31211205, 30403563, 29551617, 28603650, 27581525, 26513011, 25386090, 24275172, 23237895, 22351812, 21611525, 21093771, 20850076, 20845798, 21063538, 21524081, 22059334, 22639486, 23150695, 23552784, 23771315, 23859331, 23867225, 23842021, 23796157, 23706656, 23631000, 23568877, 23457042, 23257300, 22944847, 22418900, 21646684, 20696295, 19645741, 18530479, 17430228, 16352742, 15418882, 14584794, 13884503]
4626A3884503n32856m50228m39635k92515j81529m8405N8247J80453K49829K72481
4616A2700345K72598J50143K54j77949l20686m76748n72180o41317n86981o07214
4606I740265n24434n03928m60533l90976l88725l65673l20702l13613k62525j98076
4596F011080j90526j09147j27974m2380o8359j12799j29920j47064j42871j22512
4586D817528j42895j13104j18190j01979r0265r8540p5284o5543n1688p3784Q16
4575C887072m4688l3573p4912O640n0902M468m9411k8033k6087k2165k1699n0604
4563C496106j292m4780j9605o2132J0783m5608M510m1704r508q12k6809l2379
4551C226770J2848j0696l272m113r893J3442K245J4576k6079O2207k3156r911
$$ y = [13884503, 13351647, 12901419, 12461784, 12169269, 11987740, 11939335, 11997582, 12178035, 12427864, 12700345, 12972943, 13123086, 13123340, 12945391, 12624705, 12147957, 11575777, 10934460, 10347479, 9740265, 9215831, 8711903, 8251370, 7860394, 7471669, 7105996, 6785294, 6471681, 6209156, 6011080, 5820554, 5711407, 5583433, 5541053, 5472694, 5359895, 5229975, 5082911, 4940040, 4817528, 4674633, 4561529, 4443339, 4341360, 4251095, 4152555, 4077271, 4011728, 3960040, 3886256, 3887072, 3842384, 3808811, 3733899, 3740539, 3689637, 3694105, 3644694, 3616661, 3590574, 3568409, 3546710, 3496106, 3494814, 3450034, 3430429, 3368297, 3379080, 3333472, 3337982, 3296278, 3286770, 3285958, 3259149, 3226770, 3239618, 3228922, 3225650, 3221537, 3211644, 3225086, 3227331, 3241907, 3215828, 3278035, 3254879, 3244968]
4539C244968j6451M5777j2572N5141J5372K2821L1255M7575L4511j4375M7016
4528C501038J0926N5558O360O5121J3340P3036Q2543R1617P8878K21184L07376
4517D506977N07777N98495N08255K51740M9802j17145l27669l47499l90008k76838
4507D963887k96220k56574k07975j16887j43667o2018q9357k5188k810n0363k0640
4496C692188l052J4649k8186j0373l4812l163k7219K9354p914M0051j7588K3127
4484C667062j3044q048P183J6657K345L1942L4943j057J734k2867L4780k937N536
4471C754229j2003j4267K2628J9285M036M1597O201Q9153N4083M6838O470K326
4459D020576N8682M6209P5691J7716M8175K6777O0348M4364M5004N6327M8853
$$ y = [3244968, 3228517, 3274294, 3261722, 3316863, 3332235, 3355056, 3386311, 3433886, 3468397, 3454022, 3501038, 3511964, 3567522, 3573882, 3639003, 3652343, 3725379, 3807922, 3899539, 3978417, 4199601, 4506977, 5014754, 5613249, 6121504, 6373244, 6423046, 6305901, 5978232, 5630733, 5240725, 4963887, 4667667, 4411093, 4203118, 4086231, 3942564, 3880546, 3791189, 3766001, 3763191, 3712828, 3692188, 3689136, 3703785, 3675599, 3665226, 3630414, 3627251, 3600032, 3629386, 3621472, 3661523, 3643935, 3667062, 3654018, 3645970, 3653153, 3669810, 3672155, 3704097, 3739040, 3737983, 3739717, 3716850, 3751630, 3748693, 3754229, 3742226, 3727959, 3750587, 3769872, 3773908, 3815505, 3821706, 3910859, 3964942, 4011780, 4018250, 4020576, 4079258, 4125467, 4201158, 4218874, 4267049, 4293826, 4354174, 4398538, 4443542, 4499869, 4548722]
4448D548722n901K3227O7142R8481O9512O2560P8074N2659P2880Q4991J05680
4437E258027N4802J23364R9644P3569J39278J67033J26377J91677K31036K70091
4427F734898L15231L90726M15231M28978M68567M59969M21504L40830L31006L25713
4417A0632653K71304J84688J93594J66250J76975J82712K11473K12444K72391
4408A2504484K64564K99220L40173L65671L57027L16397K80739J84471J41201
4399A5053947M2695K4249l0060p7999r7593j17557p2171p1450l7825j1640J5844
4388A4620440O1538L9384M2185P4670M8542R383Q0166L0089M3786L2426K8101
4377A5110710N992j956J4974M4487O6758Q8568J94143J99554K66036L24433M22306
$$ y = [4548722, 4542821, 4566048, 4633190, 4731671, 4801183, 4863743, 4941817, 4994476, 5067356, 5152347, 5258027, 5312829, 5436193, 5535837, 5609406, 5748684, 5915717, 6042094, 6233771, 6464807, 6734898, 7050129, 7440855, 7856086, 8285064, 8753631, 9213600, 9635104, 9975934, 10306940, 10632653, 10903957, 11088645, 11282239, 11448489, 11625464, 11808176, 12019649, 12232093, 12504484, 12769048, 13068268, 13408441, 13774112, 14131139, 14447536, 14728275, 14912746, 15053947, 15096642, 15120891, 15090831, 15012832, 14915239, 14797682, 14725511, 14654061, 14616236, 14604596, 14620440, 14681978, 14721362, 14763547, 14838217, 14886759, 14896142, 14976308, 15006397, 15050183, 15082609, 15110710, 15116702, 15114746, 15129720, 15174207, 15240965, 15329533, 15523676, 15723230, 15989266, 16313699, 16736005]
4366A6736005N13940N22839O11958N39872N86970N65151N61207M95821M74341
4357B1608104L98611L25913J99631J82462J49775J42804J44479J27990J17843
4348B3397612J57445K00833J46872K08279J64286J25832J0234j5121j46023k25507
4338B4024742k67598l44135m05578m15725m25036m43660m15192m09768l82085
4329B0515965l13811l06901k70817k68681k36781j33880j29786j13704j51094
4320A8590510j67844j36203j44768j35263k10784j51608j28208j57712j56329
4311A7201791j21900q4191P140J9442J47413J89803J84990K39067L30787L25946
4301A8440288K97514L21084L04230K16951J23726O3312o777l8506l5642p1900
$$ y = [16736005, 17249945, 17772784, 18384742, 18924614, 19511584, 20076735, 20637942, 21133763, 21608104, 22006715, 22332628, 22532259, 22714721, 22864496, 23007300, 23151779, 23279769, 23397612, 23555057, 23755890, 23902762, 24111041, 24275327, 24401159, 24411393, 24396272, 24250249, 24024742, 23757144, 23413009, 23007431, 22591706, 22166670, 21723010, 21307818, 20898050, 20515965, 20202154, 19895253, 19624436, 19355755, 19118974, 18985094, 18855308, 18741604, 18590510, 18422666, 18286463, 18141695, 18006432, 17795648, 17644040, 17515832, 17358120, 17201791, 17079891, 16995700, 17002840, 17022282, 17169695, 17359498, 17544488, 17783555, 18114342, 18440288, 18737802, 19058886, 19363116, 19580067, 19703793, 19767105, 19760328, 19721822, 19686180, 19614280]
4291A9614280q7198J338m2389K8268J7056J06626J27885J71947K15835K42269
4281B0395917K62231K33939K22727J89857J46310J57391J85602J35381J70991
4272B2100346J73481K48064L11079L37073L83699M32119M32957M38546M72348
4263B5329712N19544N15586N08176N94302O11123O24911O42923O28694O55725
4254C0630696P35841P48049P36781P39319P75719Q10624P85794Q12795P67592
4245C7543210Q82049Q91507Q75235R39009R69993R98623J144609J184255J270547
4236D6699037J331505J433772J504144J479048J466885J345274J244431J173812
4228E7677908J098943R66515R16341Q83867Q90099Q64936Q82472R36388R92281
$$ y = [19614280, 19527082, 19528420, 19486031, 19514299, 19531355, 19637981, 19765866, 19937813, 20153648, 20395917, 20658148, 20892087, 21114814, 21304671, 21450981, 21608372, 21793974, 21929355, 22100346, 22273827, 22521891, 22832970, 23170043, 23553742, 23985861, 24418818, 24857364, 25329712, 25849256, 26364842, 26873018, 27467320, 28078443, 28703354, 29346277, 29974971, 30630696, 31366537, 32114586, 32851367, 33590686, 34366405, 35177029, 35962823, 36775618, 37543210, 38425259, 39316766, 40192001, 41131010, 42101003, 43099626, 44244235, 45428490, 46699037, 48030542, 49464314, 50968458, 52447506, 53914391, 55259665, 56504096, 57677908, 58776851, 59743366, 60659707, 61543574, 62433673, 63298609, 64181081, 65117469, 66109750]
4219F6109750J025961J024268J068775J081658J107857J150749J219678J308441
4211G5097137J423843J550197J827355K066986K304130K551477K776534K968837
4203I2566496L034197L056748K952642K822791K641248K449156K271338K081066
4195A13875682J809472J632019J363530J095492P87118N90531M21255K37455J07374
4186A21919928J06855J24905K33521L09776L93591N44242O35641Q06945R46414
4177A26021818J088729J214450J334679J321862J261109J189045J017555Q47961
4169A35297208P58431O63899N19186M22968L2107n14180j305797k040002k605201
4160A31228619k948588l023007k818716k381077j856360j353721r61805o32527
$$ y = [66109750, 67135711, 68159979, 69228754, 70310412, 71418269, 72569018, 73788696, 75097137, 76520980, 78071177, 79898532, 81965518, 84269648, 86821125, 89597659, 92566496, 95600693, 98657441, 101610083, 104432874, 107074122, 109523278, 111794616, 113875682, 115685154, 117317173, 118680703, 119776195, 120563313, 121153844, 121575099, 121812554, 121919928, 122026783, 122151688, 122385209, 122694985, 123088576, 123632818, 124268459, 125075404, 126021818, 127110547, 128324997, 129659676, 130981538, 132242647, 133431692, 134449247, 135297208, 136055639, 136719538, 137238724, 137661692, 137693799, 137179619, 135873822, 133833820, 131228619, 128280031, 125257024, 122438308, 120057231, 118200871, 116847150, 115885345, 115252818]
4152A15252818n22002n08054n89090p78889j000752j285499j678467j944245k203665
4143A04742155k323785k247645j995438j642135j266587r95049r08612j092859
4135I2270045j444775j857547k301677k611918k768809k849633k717541k534022
4127G3184123k399138k179362k007264j817634j728019j613626j585599j582169
4119E8271312j553560j600657j598304j625151j641676j561422j479112j355008
4111D5856422j319566j252538j187334j181122j159608j165943j129131j115947
4103C6345233r66951r49539q20895o05476k84179K19404N44337N86621M22475
4094C4491030m85654j149787j217591j313495j418002j319095j202625j165076
$$ y = [115252818, 114730816, 114222762, 113633672, 112854783, 111854031, 110568532, 108890065, 106945820, 104742155, 102418370, 100170725, 98175287, 96533152, 95266565, 94271516, 93362904, 92270045, 90825270, 88967723, 86666046, 84054128, 81285319, 78435686, 75718145, 73184123, 70784985, 68605623, 66598359, 64780725, 63052706, 61439080, 59853481, 58271312, 56717752, 55117095, 53518791, 51893640, 50251964, 48690542, 47211430, 45856422, 44536856, 43284318, 42096984, 40915862, 39756254, 38590311, 37461180, 36345233, 35378282, 34428743, 33607848, 33002372, 32718193, 32937597, 33481934, 34068555, 34491030, 34005376, 32855589, 31637998, 30324503, 28906501, 27587406, 26384781, 25219705]
4086B5219705j093949r83417q16712p63614o71819o71965n70363n21536m77218
4077A8649112m22190l28314k82753k08660j89719j43613j26633j68648j05814
4068A6672768r1792j25126j50885j31000j56892n5249l4585L9640J03368J43461
4058A6213708J47885K00657K66460K57092K61929K02878K20039J87569J55784
4049A8114001R8725J13200P5139L3746M5175N2407L8435P2758J07854J25483J83229
4038A9060152K17653K55211K41394J92787J87226J78373J18007O3767J2698L9732
4028B0567000J992K142k6329O4558J17266J39201K36807K56830K65720L09781
4018B1934968L74667L17827L40644L05547K86981K82300L38615L28488M00566
$$ y = [25219705, 24125756, 23142339, 22325627, 21562013, 20890194, 20218229, 19647866, 19126330, 18649112, 18226922, 17898608, 17615855, 17407195, 17217476, 17073863, 16947230, 16778582, 16672768, 16580976, 16455850, 16304965, 16173965, 16017073, 15961824, 15927239, 15966879, 16070247, 16213708, 16361593, 16562250, 16828710, 17085802, 17347731, 17550609, 17770648, 17958217, 18114001, 18212726, 18325926, 18401065, 18434811, 18479986, 18532393, 18570828, 18643586, 18751440, 18876923, 19060152, 19277805, 19533016, 19774410, 19967197, 20154423, 20332796, 20450803, 20514570, 20527268, 20567000, 20568992, 20571134, 20544805, 20609363, 20726629, 20865830, 21102637, 21359467, 21625187, 21934968, 22309635, 22627462, 22968106, 23273653, 23560634, 23842934, 24181549, 24510037, 24910603]
4009B4910603M80377N33285O04644O96604Q16041Q90519R79584J003931J052847
4000C1968435J056799J104632J045365R57453R10266Q71573P45337O72686N70954
3991C9903500N43451N36005N24024N77729O58544P13952P81354Q17617P32918
3982D5789094P11951N76414L68727J42423l7807k50892m05359n39699n46490n15045
3972D5293317m46499l04553j46472l8141M9285K01552J35577M1078j15956k45399
3962D4423789l95294n82128q00307r09372j013123r92831r35791q16646o96854
3953C7281443o22728m80661m01375k81567k30811k61764k94899j77605j52324
3944C4377709q1429m3881R8671K82756N26814P96628R54256J124873J252224J352627
$$ y = [24910603, 25390980, 25924265, 26528909, 27225513, 28041554, 28932073, 29911657, 30915588, 31968435, 33025234, 34129866, 35175231, 36132684, 37042950, 37914523, 38659860, 39332546, 39903500, 40446951, 40982956, 41506980, 42084709, 42743253, 43457205, 44238559, 45056176, 45789094, 46501045, 47077459, 47446186, 47588609, 47550802, 47299910, 46894551, 46354852, 45808362, 45293317, 44846818, 44542265, 44395793, 44357652, 44406937, 44608489, 44744066, 44785144, 44669188, 44423789, 44028495, 43446367, 42646060, 41736688, 40723565, 39730734, 38794943, 37978297, 37281443, 36658715, 36178054, 35776679, 35495112, 35264301, 35002537, 34707638, 34530033, 34377709, 34296280, 34252399, 34351070, 34633826, 35160640, 35957268, 36911524, 38036397, 39288621, 40641248]
3934D0641248J314553J263112J185855J193223J149430J090643J122629J226797
3926E0187490J465074J661667J995819K302536K542487K703362K555404K120740
3918F7534579J563249P81165j14158r80049j632478k082885k360382k280570k108897
3909E8319574j761969j281012p11943l4589O30920J322827J954429K464451K678016
3900F3580704K766173K507004J963906J078672J55766p75680j633749k297891
3892F7344905k760821k969948k920685k738628k311439j787494j177019n23122
3884E0155749J57841P56822J340833J830406K065029K169843J934375J550509
3876F1961407R68391L74315l67611r65297j507201j834997k074221k070924k016071
$$ y = [40641248, 41955801, 43218913, 44404768, 45597991, 46747421, 47838064, 48960693, 50187490, 51652564, 53314231, 55310050, 57612586, 60155073, 62858435, 65413839, 67534579, 69097828, 69878993, 69764835, 68784786, 67152308, 65069423, 62709041, 60428471, 58319574, 56557605, 55276593, 54564650, 54530061, 55160981, 56483808, 58438237, 60902688, 63580704, 66346877, 68853881, 70817787, 71896459, 72052225, 71276545, 69642796, 67344905, 64584084, 61614136, 58693451, 55954823, 53643384, 51855890, 50678871, 50155749, 50313590, 51070412, 52411245, 54241651, 56306680, 58476523, 60410898, 61961407, 62929798, 63304113, 62936502, 61971205, 60464004, 58629007, 56554786, 54483862, 52467791]
3867E2467791j915377j739497j519782j310876j058109q88110p60874o21092n14478
3858D2139596m34348m60681m12061m57762m73673n22552n17251n06879m31569
3849C7922820l80066k43229p7343P5917J96617K60014L84187M48509M65619M63158
3839C9516203N17340M55633M25436L16409K58121J08994n4630k52187n25894p36918
3829D0028507r28106j081957j264815j312641j339085j286665j223515j095106
3821C0496617r42411q24451o70556n32415m63994l96265m51801n51834o30145
3812B5032745p64288q17614r17297r77870j025143j001952r76888q73538q13711
3803A6864444o85297o36431n49675m80804l83440l46493k90168j49976k00808
$$ y = [52467791, 50552414, 48812917, 47293135, 45982259, 44924150, 44036040, 43275166, 42654074, 42139596, 41705248, 41244567, 40832506, 40374744, 39901071, 39378519, 38861268, 38354389, 37922820, 37542754, 37299525, 37222182, 37298099, 37494716, 37754730, 38138917, 38587426, 39053045, 39516203, 40033543, 40489176, 40914612, 41231021, 41489142, 41598136, 41543506, 41291319, 40765425, 40028507, 39100401, 38018444, 36753629, 35440988, 34101903, 32815238, 31591723, 30496617, 29554206, 28729755, 28059199, 27526784, 27062790, 26666525, 26214724, 25662890, 25032745, 24268457, 23450843, 22533546, 21555676, 20530533, 19528581, 18551693, 17678155, 16864444, 16179147, 15542716, 14993041, 14512237, 14128797, 13782304, 13492136, 13342160, 13141352]
3794A3141352j21627r8088q7517r0994j09399j31679j35256j75398j11782j82565
3784A1897047k09363j27043q8625q1369l0313l391k951Q3255J19952J37570P5701
3773A1770470Q5473Q8338R0844Q999n925o1070j14640j27213j78184j88833k92240
3762A1076019l01354l23051k77801k68457k90037k80874k09039k22138k10639
3753H692629k05326j53432j29994o5637j04516q9034m4176q4374m9296O71j5626
3742G751889j9492M2831J0091J7138r336O6290R6571J01411Q6944R0562J15422
3731H350321J56765J38082J23685J43607J84696K34984K01044J92525J49636J87158
3721A0062503K19772J49388J49111J71563J33513J15067O3255L3069q740j6159
$$ y = [13141352, 13019725, 12921637, 12834120, 12743126, 12633727, 12502048, 12366792, 12191394, 12079612, 11897047, 11687684, 11560641, 11472016, 11390647, 11360334, 11356943, 11353992, 11437247, 11557199, 11694769, 11770470, 11855943, 11944281, 12035125, 12044124, 12038199, 11977129, 11862489, 11735276, 11557092, 11368259, 11076019, 10774665, 10451614, 10173813, 9905356, 9615319, 9334445, 9125406, 8903268, 8692629, 8487303, 8333871, 8203877, 8138240, 8033724, 7944690, 7900514, 7816140, 7766844, 7767515, 7751889, 7732397, 7775228, 7785319, 7802457, 7793121, 7859411, 7955982, 8057393, 8144337, 8234899, 8350321, 8507086, 8645168, 8768853, 8912460, 9097156, 9332140, 9533184, 9725709, 9875345, 10062503, 10282275, 10431663, 10580774, 10752337, 10885850, 11000917, 11064172, 11097241, 11088501, 11072342]
3711A1072342J263K4539J9243K453L5513Q1685J59048J07961J38446K18297K47173
3700A2107963K54484K93474M00053M64308N16589N66070N49649M72332N03073
3691A6127995M50268M41973M54885M57185M47418M29469M42911M37445M18656
3682B0108205M04866L87317L79607M07942L85082M94785N33363O12801O55576
3673B4369544O87508P92637Q85244J016142J060942J112680J119069J113923J070363
3664C3228052J067826J094158J031391J046957J157681J283089J473547J671683
3656D3054384K066689K468129K952939L475425L961797M396880M688921M934795
3648G1999959N006525M808373M282429L517939K593349J578701M25563o23974
$$ y = [11072342, 11073605, 11098144, 11117387, 11119840, 11155353, 11237038, 11396086, 11504047, 11642493, 11860790, 12107963, 12362447, 12655921, 13055974, 13520282, 14036871, 14602941, 15152590, 15624922, 16127995, 16578263, 17020236, 17475121, 17932306, 18379724, 18809193, 19252104, 19689549, 20108205, 20513071, 20900388, 21279995, 21687937, 22073019, 22567804, 23101167, 23713968, 24369544, 25057052, 25849689, 26734933, 27751075, 28812017, 29924697, 31043766, 32157689, 33228052, 34295878, 35390036, 36421427, 37468384, 38626065, 39909154, 41382701, 43054384, 45121073, 47589202, 50542141, 54017566, 57979363, 62376243, 67065164, 71999959, 77006484, 81814857, 86097286, 89615225, 92208574, 93787275, 94212838, 93588864]
3640I3588864j526549k187258k703684k974395l145097l156537l083074k997088
3632G1815182k862521k750674k625131k508492k418832k352671k386311k333704
3624E1576846k233011k219004k117591j989042j895936j804224j712752j621281
3616C5984005j562168j456546j342160j227320j071500q93209p69774o21162m82400
3607B6557766l70309k05358j40735n6216j9841j2296K5408R8451P5146L4712L3662
3596B6020390P8230J04178J70165J98848K36297K13718K43303L15975K49826K79358
3586B8110288K22924J74542J44462J43125R0474J12070N6592k2088j01459j36784
3576B8794146k05949k64200k82543l31256l44564m06208m21440m78476n06212
$$ y = [93588864, 92062315, 89875057, 87171373, 84196978, 81051881, 77895344, 74812270, 71815182, 68952661, 66201987, 63576856, 61068364, 58649532, 56296861, 53910550, 51576846, 49343835, 47124831, 45007240, 43018198, 41122262, 39318038, 37605286, 35984005, 34421837, 32965291, 31623131, 30395811, 29324311, 28431102, 27661328, 27040166, 26557766, 26187457, 25982099, 25841364, 25785148, 25765307, 25753011, 25778419, 25876870, 25952016, 25986728, 26020390, 26098620, 26202798, 26372963, 26571811, 26808108, 27021826, 27265129, 27581104, 27830930, 28110288, 28333212, 28507754, 28652216, 28795341, 28885815, 28997885, 29054477, 29032389, 28930930, 28794146, 28588197, 28323997, 28041454, 27710198, 27365634, 26959426, 26537986, 26059510, 25553298]
3567B5553298n18261n50589n62506o29571o37582o63811p07430o38393o66506
3558A9978649o47707p21421o73019o37860o12799n79706n09187n00596m24846
3549A4671508l46577k83319j65992j76072j09085k0151k0374k0276M1717R5651
3539A3667030J37968J59876K02265K19310K07639K10520K22581K78754L08638
3530A5614581L60861L28618L11363L05973L25996L17310K89459K85919L30048
3521A8470128L02343L59394L63474L69097M40014M49016N34706N32547N32172
3512B2352891M91571N03523M00331L38937K06537R2925p9438k58763n08239p07831
3502B2832444p51589q23391p71102p30794n96154m78720l49098k33201j31217
$$ y = [25553298, 25035037, 24484448, 23921942, 23292371, 22654789, 21990978, 21283548, 20645155, 19978649, 19330942, 18609521, 17936502, 17298642, 16685843, 16106137, 15596950, 15096354, 14671508, 14324931, 14041612, 13875620, 13699548, 13590463, 13570312, 13549938, 13529662, 13571379, 13667030, 13804998, 13964874, 14167139, 14386449, 14594088, 14804608, 15027189, 15305943, 15614581, 15975442, 16304060, 16615423, 16921396, 17247392, 17564702, 17854161, 18140080, 18470128, 18772471, 19131865, 19495339, 19864436, 20304450, 20753466, 21288172, 21820719, 22352891, 22844462, 23347985, 23748316, 24087253, 24293790, 24386715, 24307277, 24048514, 23540275, 22832444, 22080855, 21257464, 20486362, 19755568, 19159414, 18680694, 18331596, 18098395, 17967178]
3493A7967178j8748O0305J71336K09789K67926L27217L74394M06301M82378M88697
3483B0736773M77637M92899M65382M21834L55598K64298K48054J48715J78330
3474B3789520J99739K02930K39174K57191K36376J98753J32673R1773P2351J342
3464B5421822K3050K6990J49041J75437J73276J63795J33322N0767L3577k3205
3454B6327872r4258j53708j49846p9953j12369j1028K0928N5382J89244L05066
3444B6297330M04959N11318N99380O50549N32780M16750K73067J23304m196o3796
3434B9741445j8057L9168J94158K91928N40473O64073P73118R14414J083876J249642
3424C5474238J376869J499590J581891J572830J530989J283489R95393N93231
$$ y = [17967178, 17948430, 18008735, 18180071, 18389860, 18657786, 18985003, 19359397, 19765698, 20248076, 20736773, 21214410, 21707309, 22172691, 22594525, 22950123, 23214421, 23462475, 23611190, 23789520, 23989259, 24192189, 24431363, 24688554, 24924930, 25123683, 25256356, 25348129, 25420480, 25421822, 25444872, 25471862, 25620903, 25796340, 25969616, 26133411, 26266733, 26317500, 26351077, 26327872, 26233614, 26079906, 25930060, 25850107, 25737738, 25726710, 25747638, 25803020, 25992264, 26297330, 26702289, 27213607, 27812987, 28463536, 28996316, 29413066, 29686133, 29809437, 29805241, 29741445, 29723388, 29762556, 29956714, 30248642, 30789115, 31453188, 32226306, 33140720, 34224596, 35474238, 36851107, 38350697, 39932588, 41505418, 43036407, 44319896, 45315289, 45908520]
3416D5908520J02660l18815p31079j047551j319068j460018j559164j590280j656463
3407C6328742j627341j577530j471222j348206j206895j026960q61468o98615
3399B6510505m80537k39052m1889J56884L33768M74254O82627Q34018Q98067J045184
3389C0173829J090993J068887J053102R62222Q87712Q09037O11185L83929Q8279
3380C7129175j73002l92817n70568o06430o95828o78822p08436o91627p27989
3371C1883656p23530p28373p72612p13213o35242m75390k81230m1959O2140J4009
3361B7588256j03669l04077n05182n50881o06761n74258m97851l43037k13219
3352B3889321r9873L6738J21950K47307L78134M62378N96405P46411Q57989R71205
$$ y = [45908520, 46011180, 45692365, 44961286, 43913735, 42594667, 41134649, 39575485, 37985205, 36328742, 34701401, 33123871, 31652649, 30304443, 29097548, 28070588, 27209120, 26510505, 26029968, 25790916, 25749027, 25905911, 26239679, 26713933, 27396560, 28230578, 29128645, 30173829, 31264822, 32333709, 33386811, 34349033, 35236745, 36045782, 36656967, 37040896, 37129175, 36956173, 36563356, 35992788, 35386358, 34690530, 34011708, 33303272, 32611645, 31883656, 31160126, 30431753, 29659141, 28945928, 28310686, 27835296, 27554066, 27512107, 27574247, 27588256, 27484587, 27180510, 26675328, 26124447, 25517686, 24943428, 24445577, 24102540, 23889321, 23789448, 23826186, 23948136, 24195443, 24573577, 25035955, 25632360, 26378771, 27236760, 28207965]
3342B8207965J121778J253162J400191J628522J900138K252506K657095L163632
3334D3584989L853189M718846N819882P212296Q630304R785459J0405720J0331819
3326A04342504R598604Q372284O821962N015622L041359P84980j618748l990696
3318A32367871o030694p536806q401225q583860q214434p414887o537716n534691
3310G4113558m515099l577095k711427j789059q99619J08058J417119L072102
3302F5218538M939145O214845N873681L857151J314206q89011k995493m726430
3294G8806632n352763n162383m629445m079945l388471k722840k218142j829824
3286D9422819j638003j472527j316915j161576r34006o37118m23232k01078o7439
$$ y = [28207965, 29329743, 30582905, 31983096, 33611618, 35511756, 37764262, 40421357, 43584989, 47438178, 52157024, 57976906, 65189202, 73819506, 83604965, 94010685, 104342504, 113941108, 122313392, 129135354, 134150976, 137192335, 137977315, 136358567, 132367871, 126337177, 118800371, 110399146, 101815286, 93600852, 86185965, 79648249, 74113558, 69598459, 66021364, 63309937, 61520878, 60621259, 60729317, 62146436, 65218538, 70157683, 76372528, 82246209, 86103360, 87417566, 86528555, 83533062, 78806632, 73453869, 68291486, 63662041, 59582096, 56193625, 53470785, 51252643, 49422819, 47784816, 46312289, 44995374, 43833798, 42899792, 42262674, 41839442, 41638364, 41570925]
3277D1570925J48336L72148N67916Q42471J112391J434313J526362J491664J262770
3268E0329296Q52470L19540j72868n49785p88066r26853q93490p97481o14478
3259D6758285m03966j63930J12474L85827O33482Q63152J121568J334179J592749
3250E2233820J776401K075092K339464K719401L120852L653326M305498N099794
3242G7323648O087907P442072R256747J1561029J4541688J7911277K1264399K4169614
3234A89558381K5923855K6350375K5852480K4970523K4462979K4185898K3208539
3227C64513030K0316749J4902266O983826k413403j1994425j9950527k5301549
3220C47055967k7838942k7662432k5267283k1234771j6349107j0590662m248017
$$ y = [41570925, 41719261, 42091409, 42659325, 43501796, 44614187, 46048500, 47574862, 49066526, 50329296, 51181766, 51501306, 51328438, 50778653, 49990587, 49063734, 48170244, 47372763, 46758285, 46354319, 46190389, 46302863, 46688690, 47322172, 48185324, 49306892, 50641071, 52233820, 54010221, 56085313, 58424777, 61144178, 64265030, 67918356, 72223854, 77323648, 83411555, 90853627, 100110374, 111671403, 126213091, 144124368, 165388767, 189558381, 215482236, 241832611, 267685091, 292655614, 317118593, 341304491, 364513030, 384829779, 399732045, 406715871, 404302468, 392308043, 372357516, 347055967, 319217025, 291554593, 266287310, 245052539, 228703432, 218112770, 213864753]
3213B13864753K654462J0045838J7235192K3143379K6703169K6825374K3302711
3206C43774878J6739603R032068K508670j174617j476281M08121K044029R17816
3198C72774287l373375r289925j5059187j9690296k2177251k2306210k0770786
3191B60107257j8744211j6992605j5625756j4614860j3734982j2772647j1654995
3184A55967201j0241027q559242o427286l803107o03150L550319Q627289J4098491
3176A52609488J8245667J9054435J5376391Q291565J02156p467836j3479382j7183786
3168A75548698j8205474j7443006j5833367j3883744j1737111r739770p947986
3161H0758240o449177n262503m345617l555043k940424k381430j965226j565121
$$ y = [213864753, 216519215, 226565053, 243800245, 266943624, 293646793, 320472167, 343774878, 360514481, 369546549, 372055219, 370880602, 369404321, 369812442, 371856471, 372774287, 369400912, 360110987, 345051800, 325361504, 303184253, 280878043, 260107257, 241363046, 224370441, 208744685, 194129825, 180394843, 167622196, 155967201, 145726174, 137166932, 130739646, 126936539, 126333389, 129883708, 138510997, 152609488, 170855155, 189909590, 205285981, 213577546, 213679702, 206211866, 192732484, 175548698, 157343224, 139900218, 124066851, 110183107, 98445996, 88706226, 80758240, 74309063, 69046560, 64700943, 61145900, 58205476, 55824046, 53858820, 52293699]
3153E2293699j277438j109526r71603q21235o87422o65483p12918q66628r92408
3144D4189038j218745j354255j556470j564280j537240j525991j333586j133814
3136C2964657r40926o47280m16261j73818R9878J75859K94811K02615O8426j59764
3126C1468197m36503p53230r53819j160194j209009j245848j211426j099679j057752
3117B2340737q84608p79637o65197n43729k96390j75830L4957J51089L00033K19358
3107A9700783P7799r9051k55005l91313l53872l79318k90866j67177j12140L3543
3097A7763383J64463L79681N57853P81612R52518J192271J334948J405201J431057
3088B5962987J341396J186840J009987P70315N06812K34750j02330l72537o08773
$$ y = [52293699, 51016261, 49906735, 48935132, 48113897, 47426475, 46760992, 46048074, 45181446, 44189038, 42970293, 41616038, 40059568, 38495288, 36958048, 35432057, 34098471, 32964657, 32023731, 31376451, 30960190, 30786372, 30886250, 31062109, 31356920, 31559535, 31627961, 31468197, 31031694, 30278464, 29324645, 28164451, 26955442, 25709594, 24498168, 23398489, 22340737, 21456129, 20676492, 20011295, 19467566, 19171176, 18995346, 19030303, 19181392, 19481425, 19700783, 19778582, 19679531, 19424526, 19033213, 18679341, 18300023, 18009157, 17841980, 17729840, 17763383, 17927846, 18307527, 18865380, 19646992, 20599510, 21791781, 23126729, 24531930, 25962987, 27304383, 28491223, 29501210, 30271525, 30778337, 31013087, 30910757, 30538220, 29929447]
3079B9929447p46904q27617p45397n71558k98537m0822K94078M83954N88453N43834
3069B8608931M83341L39094J37932r3902l73629o41105r47207j157507j421589
3060B4934359j595059j660145j521086j495954j380381j250476j051969r52496
3052A4026793q02919o75135n41429m71086l81031l44172k92910k26052j55287
3043A0136772j03009j25716n7406j3722R896L1860Q3529J09567K13485K49282
3033A0534538L54936M48864N85433P39484R23318R99215J050927R68777O76393
3024A7281885M28334Q6173k25050n06195o53825p23827o64017o09910m61904l20653
3014A3631011j49650L9537K31018M17963O05483O32876O03513M81103K26945m9897
$$ y = [29929447, 29182543, 28354926, 27609529, 27037971, 26739434, 26698612, 26992690, 27476644, 28065097, 28608931, 29092272, 29431366, 29569298, 29475396, 29101767, 28460662, 27513455, 26355948, 24934359, 23339300, 21679155, 20158069, 18662115, 17281734, 16031258, 14979289, 14026793, 13223874, 12548739, 12007310, 11536224, 11155193, 10811021, 10518111, 10292059, 10136772, 10033763, 9908047, 9850641, 9836919, 9846815, 9878675, 9962204, 10071771, 10285256, 10534538, 10889474, 11338338, 11923771, 12663255, 13586573, 14585788, 15636715, 16605492, 17281885, 17710219, 17796392, 17571342, 17065147, 16411322, 15687495, 15023478, 14413568, 13951664, 13631011, 13481361, 13520898, 13751916, 14169879, 14775362, 15408238, 16011751, 16492854, 16719799, 16669902]
3004A6669902l97459o81088q98092j036748j071027j058769j006029q91042q22876
2995H806772o57732n81692n05612m28315l40374k68633k37848k12884j49688q7069
2985E336925j40881j19416j31890p0597p1678j14508o9356m8358p1365r4440q5149
2974D319287p8704q0874m9501o2379n3970k9384j4864k5414n0687N686j8374J9405
2962C880227j4715j0944J4062M6298j3154J7833O3309R1436R4920P9732P9762
2951D328766J13297J20612R7455Q3455P8282Q8449N3518Q9902O8298J6309p0157
2940E068186j05098j51498j75984k08990j95113j86286j70299q3914r1942o8005
2930C631057m627L369o012Q1072J19518R7249J16342R1443O4605j4636n3291j3364
$$ y = [16669902, 16272443, 15591355, 14693263, 13656515, 12585488, 11526719, 10520690, 9629648, 8806772, 8149040, 7567348, 7061736, 6633421, 6293047, 6024414, 5786566, 5573682, 5423994, 5336925, 5196044, 5076628, 4944738, 4874141, 4802463, 4687955, 4618599, 4570241, 4498876, 4404436, 4319287, 4240583, 4159709, 4110208, 4047829, 3993859, 3964475, 3949611, 3924197, 3873510, 3879196, 3860822, 3880227, 3865512, 3854568, 3868630, 3914928, 3901774, 3919607, 3982916, 4074352, 4169272, 4249004, 4328766, 4442063, 4562675, 4660130, 4743585, 4821867, 4910316, 4963834, 5053736, 5122034, 5138343, 5068186, 4963088, 4811590, 4635606, 4426616, 4231503, 4045217, 3874918, 3791004, 3699062, 3631057, 3626430, 3629799, 3623787, 3704859, 3824377, 3921626, 4037968, 4129411, 4194016, 4179380, 4126089, 4112725]
2918D112725j4371j5617j2444n3230o8242j19129j12884j66316j00022r5093j33579
2907C221798j36731r3545q7612q6896p0934p5642n1017q3717j418k124R258j6099
2895B525321M0394M6495R4320Q0315N1278n926k0443l8960n9142q5985j36482
2884B491185j21974p7493k4093r8009r2147p0716j3446o3460n6179k2252p3757
2873A777659j0530J9539l546K692j5393m310k1966K2372J1885k9059j0512K721
2861A741552j5024k4679P752j1143J4561j0702J511q217k8152M745l7876j8899
2849A615429k2532k3070j2186P539j4134o2598j6934m4911N410j0378K928j7495
2837A407068j1994q857j512K7364j083q269N229l692J0596j4926J8064p784p8211
$$ y = [4112725, 4098354, 4082737, 4070293, 4017063, 3948821, 3829692, 3716808, 3550492, 3450470, 3355377, 3221798, 3085067, 2991522, 2903910, 2817014, 2746080, 2670438, 2619421, 2535704, 2534286, 2532162, 2541420, 2525321, 2565715, 2612210, 2706530, 2786845, 2838123, 2832197, 2811754, 2772794, 2713652, 2627667, 2491185, 2369211, 2291718, 2267625, 2169616, 2077469, 2006753, 1993307, 1929847, 1873668, 1851416, 1777659, 1767129, 1786668, 1783122, 1785814, 1770421, 1766111, 1744145, 1766517, 1778402, 1749343, 1738831, 1741552, 1726528, 1701849, 1709601, 1698458, 1713019, 1702317, 1703828, 1695611, 1667459, 1672204, 1634328, 1615429, 1592897, 1569827, 1557641, 1565180, 1551046, 1488448, 1471514, 1426603, 1432013, 1421635, 1424563, 1407068, 1395074, 1386217, 1384705, 1412069, 1410986, 1402717, 1407946, 1404254, 1414850, 1399924, 1417988, 1410204, 1331993]
2824A331993l1684j5012N999j5321n313j3247j0951J7586J449m8963l379J1362
2812A224519j9300k6306l2470L7187J9607l4019n9306J1824k8516L2703O631l2306
2800A100248K8762l3487J7067K633j8662j1576P289J3588M1788j1766m5687j8027
2788A072170L1580m0426J1185L3477K6151M846m308k8036l4863l0305J8756L7603
2776A097830r055r606k709K168j3514J964k2285M0604M669o88K5544k5740o265
2763A082917J7649l7675l7682Q89m35L9412m8825l4758n3433O646J8942j2898
2751I40749k8913K7234m957K9388j2581k3817Q275j6322K2660j4993J085n769
2739I22039L7709r966M722j9863M544k0427j5997M210J4836K9190N958q606j9772
$$ y = [1331993, 1300309, 1285297, 1291296, 1275975, 1270662, 1257415, 1246464, 1264050, 1265499, 1216536, 1213157, 1224519, 1205219, 1178913, 1146443, 1183630, 1203237, 1169218, 1109912, 1121736, 1093220, 1125923, 1132554, 1100248, 1129010, 1095523, 1112590, 1115223, 1096561, 1084985, 1092274, 1105862, 1147650, 1135884, 1090197, 1072170, 1103750, 1063324, 1074509, 1107986, 1134137, 1138983, 1134675, 1106639, 1071776, 1041471, 1060227, 1097830, 1088775, 1079169, 1076460, 1078628, 1065114, 1067078, 1044793, 1085397, 1090066, 1089378, 1114922, 1089182, 1082917, 1100566, 1062891, 1025209, 1026098, 1025663, 1065075, 1016250, 981492, 928059, 934705, 953647, 940749, 911836, 939070, 934113, 963501, 950920, 927103, 935378, 919056, 941716, 926723, 927808, 922039, 959748, 949782, 954504, 934641, 939185, 918758, 902761, 906971, 921807, 950997, 956955, 948349, 928577]
2726I28577M3078l1457l2263p725Q712Q919k6040R62J7256K341k5565J412K8891
2713I17098M0224N358l2585k8123O407K458k2183l8870R805p028J808j4648j6279
2700H23442o317J0139J117l166j8780P479j6180K4387j5899r852M5156l5478L807
2687H09855l419k4600k576p235p370K7496J2364k8955j8950l6850K9995O794j3973
2674G42576n834K8940K1654j6826q284J7276m693j4704R757m3280j1469O965j3161
2661G08917J6795n815j6674L6266j9093k7261l0192K7043K4295J1216j2173o5135
2649F48189L1422N383J0413r543n874Q803k1333P62L9227j044j2205K4925k22
2636G18903r973J5459o353P84N367n5026K1105J1049K102k8362j2466J7176K1586
$$ y = [928577, 971655, 940198, 907935, 900210, 908922, 917841, 891801, 892763, 910019, 912360, 886795, 888207, 917098, 957322, 962680, 930095, 901972, 908379, 910837, 888654, 849784, 859589, 852561, 854369, 839721, 823442, 817125, 827264, 828381, 825215, 806435, 813914, 797734, 822121, 806222, 796370, 841526, 806048, 809855, 806436, 781836, 779260, 772025, 764655, 792151, 804515, 775560, 756610, 719760, 749755, 756549, 742576, 736742, 765682, 787336, 770510, 762226, 779502, 774809, 760105, 769862, 726582, 715113, 722078, 708917, 725712, 719897, 703223, 739489, 720396, 693135, 662943, 689986, 714281, 725497, 713324, 648189, 679611, 684994, 695407, 685864, 679990, 688793, 667460, 668222, 707449, 706405, 694200, 719125, 718903, 708930, 724389, 718036, 718820, 724187, 669161, 690266, 701315, 703417, 675055, 662589, 679765, 701351]
2623G01351l7699L465J0827M806q535o900K4792k766j1820p550O076n1888K2764
2610F46923L7933k0344l032L8804p04n022L9695m1672j0338L2198O64o536j7306
2597F91263l2532l10J9206j3119k6275J1927N936j0109K9244j7270K0393K5900
2585G04254k5904J1632L2521l7301j4840J1979k6982l4354K5528K5610j1621j6000
2573F44522j4414K885J5473O529j3135j0880l6930J8126J4818o31M0929J5909
2561F83201j5998K9528j5151l8418Q445K798k4396O487J2932n281j9150L0846
2549F55843J6932K6219K302j6589K4822n587j6351J60j150J7587N773M53K7013
2536G37427L5344L4956l344j4332L0919J2978k411L4011J9273L9197J0590M308
$$ y = [701351, 663652, 667117, 677944, 682750, 674215, 667315, 692107, 689341, 677521, 669971, 676047, 624159, 646923, 684856, 664512, 661480, 700284, 699580, 694558, 734253, 692581, 682243, 714441, 715105, 708569, 691263, 658731, 658421, 677627, 664508, 638233, 650160, 656096, 645987, 675231, 657961, 678354, 704254, 678350, 689982, 722503, 685202, 670362, 682341, 655359, 621005, 646533, 672143, 660522, 644522, 630108, 632993, 648466, 654995, 641860, 630980, 594050, 612176, 626994, 626363, 667292, 683201, 667203, 696731, 681580, 643162, 651607, 654405, 630009, 636496, 649428, 644147, 624997, 655843, 672775, 698994, 701296, 684707, 709529, 703942, 687591, 687751, 686601, 704188, 709961, 710414, 737427, 772771, 807727, 804383, 790051, 820970, 833948, 831537, 865548, 884821, 924018, 934608, 938916]
2524I38916J2070M362M3141N7547O5866J15120J38665J11247J28011Q2314N3587
2513A750846P6597M2155R4053J52144K22413L51491N22353R06004J631061K663240
2503H412357L251599K694343J207539K0341o66620j557271k148903k045613j602845
2494G564927j364439j178226r45479o73014m86418k77834j85596j43350j39042
2485B171529j90860j24321j36483j29387j04838r9742r7231p6769j04128o3247
2475A044523o6370J7511m2818j9306m4911k8224k460j7078j7220m3219k4301J256
2463G57383j1716k5467L557j9969L7178l5409J7985n6566J850j8629L3231k9821
2451F53607k827K1031j9863L059p427k0738K419J4653r557O234k9742k4851k9768
$$ y = [938916, 950986, 955348, 998489, 1056036, 1121902, 1237022, 1375687, 1486934, 1614945, 1697259, 1750846, 1827443, 1869598, 1963651, 2115795, 2338208, 2689699, 3212052, 4118056, 5749117, 8412357, 11663956, 14358299, 15565838, 15586179, 14919559, 13362288, 11213385, 9167772, 7564927, 6200488, 5022262, 4076783, 3403769, 2917351, 2639517, 2453921, 2310571, 2171529, 1980669, 1856348, 1719865, 1590478, 1485640, 1385898, 1288667, 1211898, 1107770, 1044523, 978153, 995664, 952846, 933540, 888629, 860405, 857945, 840867, 823647, 780428, 756127, 757383, 745667, 720200, 723757, 703788, 740966, 705557, 723542, 666976, 668826, 650197, 683428, 653607, 650780, 671811, 651948, 655007, 647580, 626842, 629261, 643914, 634357, 640591, 610849, 585998, 556230]
2438E56230J5942N910K5169P17N571q769k6063j6995l1460M247l389L3529p514
2425E53125J321l5455k0747K733K0893k595R784l2780J8232J214L938k0753l8765
2412D60145J2986l2101Q963l3503K8137r896Q602l2351J2053n4585L5093N434
2400D08977J1938o027L4101r43m7737K8079l84O832Q817p879l5588R062j6721
2387C92527J8820r35l0521Q035M0569k3700j208l2239O558K5482n878k2233O756
2374C82033M1264k8687L655k0706R708j1055K6913j1863k3747k3693K9154k1340
2362C51636j2642j4084J2930K4030m0570J3365K3511N335j055K2326m6690R693
2350C47785l5983K6876j9981j1925j9858L6109J7726j1348K2180m4270q194M631
$$ y = [556230, 572172, 578082, 603251, 603968, 609539, 600770, 574707, 557712, 526252, 530499, 527110, 560639, 553125, 554446, 518991, 498244, 500977, 521870, 519275, 529059, 496279, 514511, 515725, 519663, 498910, 460145, 473131, 441030, 449993, 416490, 444627, 434731, 443333, 410982, 423035, 368450, 403543, 408977, 420915, 414888, 448989, 448046, 400309, 428388, 428004, 434836, 443653, 435774, 400186, 409248, 392527, 411347, 410412, 379891, 387926, 428495, 404795, 403587, 371348, 377906, 403388, 397510, 375277, 382033, 423297, 394610, 398265, 377559, 387267, 376212, 403125, 391262, 367515, 343822, 372976, 351636, 338994, 324910, 337840, 361870, 321300, 334665, 358176, 363511, 362456, 384782, 338092, 347785, 311802, 338678, 318697, 306772, 286914, 323023, 340749, 329401, 351581, 307311, 299117, 303748]
2338C03748J4438m399K3447l2456p397m646K5010k5532K2559k0283J9058J8491
2326C32038j9527j5643n130L578J3514l667l188R012o745K5163j6157n905k3889
2313B83454L1047p412K3774l09J9235k9496j8190l399l8237J1345J4513j3314
2301B73011J76L6475j6524K0902l4918J4824J9452j535m68k447l242l6063R826
2288B79469k0241j2731k202j0987l1035M9590p387N4013q381q648k9016K6433
2276B78877j9793j8559J48J1002r811L5432O5k9688m021L0430N7800n1619J2810
2263B93073Q106P364m0263M9110o3635M5492j3584K4629k1034J9868r041j4937
2251B85148Q379o5399M0995k40Q714K822K8728k1076J8562m8198J2444J357p45
$$ y = [303748, 318186, 313787, 337234, 304778, 297381, 292735, 317745, 292213, 314772, 294489, 313547, 332038, 312511, 296868, 291738, 295316, 308830, 305163, 301975, 310987, 304242, 329405, 313248, 307343, 283454, 314501, 307089, 330863, 330554, 349789, 320293, 302103, 298704, 260467, 271812, 286325, 273011, 273187, 309662, 293138, 314040, 279122, 293946, 313398, 311863, 311395, 308948, 305706, 269643, 279469, 259228, 246497, 244295, 233308, 202273, 251863, 244476, 298489, 290108, 281460, 252444, 278877, 259084, 240525, 240673, 251675, 241864, 277296, 277361, 247673, 243652, 274082, 331882, 280263, 293073, 301179, 308543, 268280, 317390, 253755, 299247, 285663, 310292, 289258, 309126, 300085, 285148, 293527, 228128, 269123, 268883, 277597, 280419, 309147, 288071, 306633, 258435, 270879, 272236, 271491]
2238B71491j0806J2788r628N783J8098J611L5148K3107q568k0328J1424n6620
2226B73500K3676k4973M3975k4241j6096K593k5312n262k3008K7026N050k1836
2214B35092k7507p40j2650K6657J1793R619m8024K3319J4643p307m663J4432Q285
2201B42949j6446L865j9744p013L0379J5265j3734M1641k5313k0841r325K9004
2189B50687k5266P47N441J3032j0403j6820L3678k1197n250j4937k6255J6790
2177B00247K4259l246p386l1409J9054k8989J3416p37J4075P744J6559J9231q419
2164B34399n4546j4732J0651J5612J9751k578K9838l0229j3531j1922L1268j6955
2152A97026j3731q743L5737L188J2801j5927L4406l0576m3686L4987J7749n808
$$ y = [271491, 260685, 273473, 263845, 269628, 287726, 289337, 324485, 347592, 339024, 318696, 330120, 273500, 297176, 272203, 316178, 291937, 275841, 278434, 253122, 247860, 224852, 251878, 256928, 235092, 207585, 206845, 194195, 220852, 232645, 242264, 194240, 217559, 232202, 224895, 220232, 234664, 242949, 226503, 230368, 210624, 203611, 233990, 249255, 235521, 277162, 251849, 231008, 221683, 250687, 225421, 226168, 231609, 244641, 234238, 217418, 251096, 229899, 224649, 209712, 183457, 200247, 224506, 221260, 213874, 182465, 201519, 172530, 185946, 185209, 199284, 207028, 223587, 242818, 234399, 179853, 165121, 175772, 191384, 211135, 208557, 238395, 208166, 194635, 182713, 213981, 197026, 183295, 174552, 210289, 213477, 226278, 210351, 244757, 214181, 170495, 205482, 223231, 217423]
2140B17423k53q839j3686J4078l2883n357J8799J9824l3728J2028j9749L444j863
2127A69238l403K1957J3024J217l6964K022K6012m937j5388j4290J1431j1345
2115A58574j0260K8214j7093K0873L5159L146l4538Q441j3694J6810N95j1719
2103A84508M871l6241n00J8935J4018l37L1194l485J743m5319J2112k81K7782
2090B09000l788J0638m071p534m59l6120J6539J7002M969l837r31L3j4542l3890
2076A53009R028L333J5348k6885J5808K5348K992k2472J0383K3397k824m429J769
2063B03805j7068N531M5008q087j2792k7251k546l5064p133J1584j7797K110O570
2050A46870O091K9081L9149l1898m062K5794O838l7808J693j0981K3221p765j5983
$$ y = [217423, 217170, 208331, 194645, 208723, 175840, 170483, 189282, 209106, 175378, 187406, 167657, 171101, 169238, 165835, 187792, 200816, 202033, 165069, 167091, 193103, 188166, 172778, 158488, 169919, 158574, 148314, 176528, 159435, 180308, 215467, 218613, 184075, 192516, 178822, 195632, 196227, 184508, 189379, 153138, 152638, 171573, 185591, 185254, 216448, 212963, 214706, 169387, 181499, 181218, 209000, 205212, 215850, 211779, 204245, 203786, 167666, 184205, 201207, 206176, 202339, 201408, 201441, 186899, 153009, 162037, 165370, 180718, 153833, 169641, 194989, 197981, 175509, 185892, 209289, 206465, 202036, 203805, 186737, 192268, 237276, 229189, 216397, 189146, 186600, 151536, 144403, 155987, 138190, 140300, 146870, 152961, 182042, 221191, 189293, 185231, 211025, 217863, 180055, 181748, 170767, 193988, 186223, 170240]
2037A70240J0832m007l0602k4959j5145L7007K5817J8244k527k7471L0037k5661
2025A61805l710K9598K2950l3555J7050p757o042m2279J6597o21j1417j5193j4998
2012A12428J3402J1433K1778Q184K7970k0579R053Q515N95j2568l3009J4408L7275
1999A98885n8858k9709L9522J443J1263k0942k825j7296K3845q391j648k029J651
1986A34911j7275L9390L952k4117J3251J4877p249o038n417k6206j3596k8394
1974G8089M0809J1492K0911o849O244l6061L8941m640K4536l6016k746J2856P92
1961A48358o696k9052M3450j8663k4342Q173j777Q820N896j3844N6705m4109L193
1948A36112M886k1452N105j7308N7440L9143l9405j4321j6333j6948O808K4745
$$ y = [170240, 181072, 177065, 146463, 121504, 106359, 143366, 169183, 187427, 184900, 157429, 187466, 161805, 158095, 187693, 210643, 177088, 194138, 186381, 180339, 138060, 154657, 154036, 142619, 127426, 112428, 125830, 137263, 159041, 167225, 195195, 174616, 183669, 192184, 192779, 180211, 147202, 161610, 198885, 140027, 110318, 149840, 151283, 162546, 141604, 138779, 121483, 145328, 136937, 135289, 133260, 134911, 117636, 157026, 160978, 136861, 150112, 164989, 157740, 151702, 146285, 120079, 106483, 78089, 118898, 130390, 151301, 144452, 150696, 114635, 153576, 148936, 173472, 137456, 134710, 147566, 148358, 141662, 112610, 156060, 137397, 113055, 121228, 119451, 128271, 134167, 120323, 177028, 132919, 136112, 140998, 119546, 124651, 107343, 164783, 203926, 164521, 150200, 133867, 116919, 123727, 148472]
1936A48472K3461k5994K2677O982l024k1972o614m1760J5092K122k3457R2R534
1923A05611P91k786J3995o276n331J1456J5330j3858R189m6183Q93J4488O3798
1910A61117l3268n0924R079O0603L245m2971j2466K4934q290j1866M9651k0469
1898A28375L323n683M494m3964K0692J445Q547k4252Q330L319n9K3527K1359J4587
1884A64040l7789r004j6547k54j5343L7877J373J1425l5671K4288l0225r613K2840
1871A07397K9602j5482p543K1722l141J6086l6996K597l037M2035k1267k347r802
1858A19824j0688j3819L9875J1151j9674j4674k0351n758L8172R603m2221J8957
1846A10397j378K1887n2590j394p82K7707k4145K296J8966L645J7320l6279J1759
$$ y = [148472, 171933, 145939, 168616, 175598, 172574, 150602, 143988, 102228, 117320, 119442, 95985, 96077, 105611, 106402, 103616, 117611, 111335, 106004, 117460, 132790, 118932, 128121, 81938, 82831, 97319, 161117, 127849, 76925, 86004, 146607, 149852, 106881, 94415, 119349, 111059, 99193, 148844, 128375, 131698, 126015, 130509, 86545, 107237, 108682, 117229, 92977, 101307, 104626, 104567, 128094, 149453, 164040, 126251, 117247, 100700, 100446, 85103, 122980, 124353, 135778, 100107, 124395, 94170, 84557, 107397, 136999, 121517, 113974, 135696, 132555, 148641, 111645, 114242, 111205, 153240, 131973, 129626, 119824, 109136, 95317, 135192, 146343, 126669, 111995, 91644, 85886, 124058, 133661, 91440, 110397, 109019, 130906, 78316, 76922, 76140, 103847, 79702, 81998, 100964, 104609, 121929, 85650, 97409]
1833I7409Q196r786M230l251k5193L1712k7809M6931m800R533l5954j22K6257
1820A17353j4829k7143l0373R984K5266M3984j6469j5462j5763K2911l4562L2395
1808I7292l17K2204o573j0397k5480K072J5337J385J7246j3496K1938l6989J5927
1795A00149n560k1888k3688N9221J6536L750q755l1188Q446K6806l7412k4066
1783F2351M3129o071Q820J0087M4309k3854p525j1527Q395k6712J270k066K800
1770A03406j3624j9773J1924j3788n772j4064r159j5621L1910J0663L3973j2124
1758H7951k749J415J2428K2751n323L182j5212k293k3197L4513k8899K247O574
1745I3388P119j9775q711l0K6576K634k9058M4174j3200J1309j8618O713l937
$$ y = [97409, 105605, 95819, 100049, 96798, 71605, 103317, 75508, 122439, 117639, 127172, 91218, 91096, 117353, 102524, 75381, 45008, 54992, 80258, 124242, 107773, 92311, 76548, 99459, 64897, 97292, 96975, 119179, 112606, 102209, 76729, 78801, 94138, 95523, 112769, 99273, 121211, 84222, 100149, 94589, 72701, 49013, 108234, 124770, 128520, 119765, 88577, 97023, 123829, 86417, 62351, 105480, 99409, 108229, 118316, 162625, 138771, 131246, 119719, 128114, 101402, 102672, 100606, 103406, 89782, 70009, 81933, 68145, 62373, 48309, 39150, 23529, 55439, 66102, 100075, 87951, 85202, 86617, 99045, 121796, 116473, 119655, 104443, 102150, 78953, 113466, 84567, 86814, 93388, 100507, 80732, 72021, 71991, 98567, 101201, 72143, 116317, 103117, 114426, 95808, 102521, 98584]
1732I8584J2473k3968r250m4955L0508J1173k2914K2312M414O369Q336K279k3906
1719G1455n999m893J6893j1193J7960j5173k875J7256K906j4123o069J1769K8350
1706A06264P837m4065j5959p123M4097j784l69j646J0419q842K8031l7306P615
1693H7169n260j2249L144K8147R252o2271j3764p144J4003m538J6644J9959L4305
1680A07397k1185p947J0373k6061j1221M5421k3608j6307k2496J1124n953J5731
1668E5268J5632J0452K1709R792m4320K109J8743l2425j1251J351k442J9690J0240
1655G4548O472j0376j3503k1191L6912l2253j344O170m983r422M3427M6210l6861
1642H3806k5518m521J9204K991p843l3244K7133p214N7235l8710J2209q429k5953
$$ y = [98584, 111057, 87089, 77839, 32884, 63392, 74565, 51651, 73963, 78377, 84746, 93082, 95361, 71455, 65456, 60563, 77456, 66263, 84223, 69050, 66175, 83431, 86337, 72214, 66145, 77914, 106264, 114101, 70036, 54077, 46954, 91051, 89267, 88898, 87252, 97671, 88829, 116860, 79554, 87169, 81909, 69660, 72804, 100951, 110203, 47932, 34168, 27024, 41027, 36489, 53133, 73092, 107397, 86212, 78265, 88638, 62577, 51356, 96777, 73169, 56862, 34366, 45490, 39537, 55268, 70900, 81352, 103061, 112853, 68533, 70642, 89385, 56960, 45709, 47060, 44618, 64308, 74548, 81020, 70644, 57141, 35950, 72862, 40609, 39265, 45435, 40452, 31030, 74457, 120667, 83806, 58288, 53767, 72971, 75962, 68119, 34875, 62008, 54794, 112029, 73319, 85528, 77099, 51146]
1629E1146k6927O351N950k2221L2591K6169l6614J7506K6778l5973K278J0992
1617E8026k3490L0269J1628k8917J5869m66L192o052K24j0475j5999J7243k4546
1604B6506K3236K2089j9456K1959j5498Q446J153L742K0026k8382n8278N621K8879
1591D0043L7746p87r50o661l5752K5848J0791j7626J2909j6681K9616J7505j7593
1578G8408j1885j2447J6565l0694Q215L8918J3899K1951P30k877j8490q729K9695
1565A23259l2695j3461J3224l7846K1394r866J296r094j3565j7191m32K718O610
1552C4351K0999L977j2485J076p335J0723M7618J899n220j0313j9243n14r4j9684
1538D5755L8088k6198j2823j2973N282K2774J5719L253l6691J4132l896N540L77
$$ y = [51146, 24219, 30570, 36520, 14299, 46890, 73059, 36445, 53951, 80729, 44756, 47034, 58026, 34536, 64805, 76433, 47516, 63385, 62919, 66111, 60059, 60283, 49808, 33809, 51052, 26506, 49742, 71831, 52375, 74334, 58836, 67282, 68435, 72177, 92203, 63821, 5543, 11164, 40043, 77789, 77002, 76052, 69391, 33639, 59487, 70278, 52652, 65561, 48880, 78496, 96001, 78408, 66523, 54076, 70641, 39947, 48162, 87080, 100979, 122930, 123660, 120783, 102293, 93564, 123259, 90564, 77103, 90327, 52481, 73875, 64009, 65305, 56211, 42646, 25455, 25023, 27741, 34351, 55350, 59327, 46842, 47918, 40583, 51306, 98924, 100823, 95603, 85290, 66047, 65533, 65439, 45755, 83843, 57645, 44822, 31849, 37131, 59905, 75624, 78877, 42186, 56318, 52422, 57962, 58339]
1525E8339j079m7697M8654j4447M18Q18j0974J1227r671K0287k3674K0844J0665
1512F3710p975m2131M3155L199l3544k250J6609j7192M2578k2508k2597j0299
1500A0755K9124j2343J0584K5949k292K4430M83O728J496M04j9599o64k9751K7131
1486G2435p484q485l3693K8995M948j1437J2277j4600J3058J2507L6483o0305
1474D4699j0810o969J3646K116j6008m054L4150N507R394j444q111k1409n256
1461C5451J9332j2068J3537k0007N1038l7125J6268R88l6302o558j2345k5878
1449a3669m171m511M4030q849k8196L0079j2316J001m103J5312j7894j0125r740
1436b3152L2069N779L2670M4430k7005p367K6559k0865m1137N585j9547M6875
$$ y = [58339, 57260, 9563, 58217, 43770, 44188, 45006, 34032, 45259, 35588, 55875, 32201, 53045, 63710, 55735, 13604, 56759, 59958, 26414, 24164, 40773, 23581, 66159, 43651, 21054, 10755, 39879, 27536, 38120, 64069, 61777, 86207, 86690, 93418, 94914, 95318, 75719, 75055, 45304, 72435, 64951, 56466, 22773, 51768, 56716, 45279, 57556, 42956, 56014, 68521, 105004, 44699, 33889, 26920, 40566, 42682, 26674, 22620, 56770, 62277, 71671, 70227, 62116, 40707, 35451, 54783, 42715, 56252, 36245, 87283, 50158, 66426, 67414, 31112, 24554, 12209, -13669, -17840, -22351, 21679, 12830, -15366, 14713, 2397, 3398, -705, 14607, -3287, -13412, -23152, 8917, 14696, 47366, 91796, 64791, 57424, 83983, 63118, 21981, 27566, 8019, 54894]
1424E4894L5264l7401j2580K9599k9536L3448l5267j5948J8380J9484m3225k02
1412A6910J5393K351j8458N147k750q761J4828p385L6490j3818k848J439J0861
1399D9399j4276J6680J645L1805l8587J3795j4231j4978K7898q412J5665j6348
1387E0055j96j486O543m4618K749N1904j0591n6869J9868K8641m905l1516J6641
1374B6220j5506Q98L8483k0085K9301l0214O6146m0402R944l0331r44j5767K2787
1361D0530J7672r162K1139k8581j4809j104J1851M3101l666j3468m264k4628L4760
1348F9371m2510L5216j3677J6477L46M849p079J1006j63j5767O137M962l7243
1335C1925j4274L7403L3798j3995N268l191m7827q267K8883q313n2506O2127k4904
$$ y = [54894, 90158, 52757, 40177, 69776, 40240, 73688, 38421, 22473, 40853, 60337, 17112, 16910, 32303, 34654, 16196, 21343, 18593, 9832, 24660, 17275, 53765, 39947, 37099, 38538, 49399, 35123, 51803, 53448, 85253, 46666, 60461, 46230, 31252, 59150, 50738, 66403, 50055, 49859, 48373, 54916, 10298, 13047, 64951, 54360, -2509, 17359, 46000, 41095, 9579, 26220, 10714, 11612, 50095, 30010, 59311, 29097, 95243, 54841, 64785, 34454, 33510, 17743, 40530, 58202, 49040, 70179, 41598, 26789, 25685, 37536, 80637, 76971, 63503, 59239, 34611, 69371, 26861, 62077, 48400, 64877, 65223, 70072, 62993, 73999, 73836, 58069, 64206, 69168, 31925, 17651, 55054, 88852, 74857, 80125, 76934, 29107, 20840, 49723, 41410, -11096, 51031, 26127]
1322B6127J3692K3300k4066K2979j6071k5366k180J9194j4160M434J5221l8904
1310D200r119M0332J4134m014q709J5184l705j954k4120n256J1402j0683J6039
1297C3731m1873n087J1975K1920L0711j7110p735L7727J2183k1218j7133j9808
1285A8283M764o528L0749m591j1187J686j7351J6715J3284k4447n968J7845l319
1272B9935m029J0188K8711m1597N391J8130k1630R124Q339k2409j7771R056p10
1259A0728q296J9095k325j4688K7665Q704o259J0773o022k0519J4560O462l6934
1246B944K8095L763l9879L0170q277k4400o443Q608K3902J0105j8631Q229K1113
1233C9299r166l5539K4756K2297k1192k450j0049p770K4008N9708j1200m2070
$$ y = [26127, 39819, 63119, 39053, 62032, 45961, 20595, 18415, 37609, 23449, 27883, 43104, 4200, -4919, 35413, 49547, 45533, 36824, 52008, 48303, 46349, 22229, 16973, 28375, 17692, 33731, -8142, -13229, -1254, 20666, 51377, 34267, 26532, 64259, 76442, 55224, 38091, 18283, 23047, 16519, 47268, 42677, 31490, 33176, 15825, 32540, 45824, 21377, 15409, 33254, 29935, 25906, 36094, 64805, 23208, 28599, 46729, 25099, 34223, 42562, 20153, 2382, 11438, 10728, 2432, 21527, 19202, 4514, 32179, 40883, 34624, 45397, 39375, 18856, 33416, 39878, 2944, 31039, 34802, -5077, 25093, 16816, -7584, -14027, -5419, 18483, 28588, 9957, 18186, 39299, 30133, -5406, 19350, 41647, 20455, 18005, 7956, 186, 24194, 83902, 72702, 30632]
1221C0632K3986k6260M199P569J2779q485n981K2902J2719K951k1872Q906l9332
1208B4713o822N141L9654k4118k0975O706k857J0277o448N072m43k5974j0066
1195f140J2768J7179L4283j6981r16j3676J6967l2047P851J1445J7873r943k9767
1182H896K307n072J696J9904k250k8777J7431j0002P436q94J788R198J5916q429
1168B9148j9332J619K8343m328j282Q028k0617k2753K3389M5093k5103j0564j2121
1155A9520o053k7294K0655K8335k916J149J5732j7053j0393K8600k2956j129J4522
1142D0719k9022k1344K421K2968j3836k182K5525r126J9365k0946M912J0675J4556
1129D4685k8256j385N921K9537k6225N5J229j9125L335K0606j1401k7701J4456
$$ y = [30632, 54618, 28358, 32557, 40126, 52905, 44420, 38439, 61341, 74060, 77011, 55139, 64045, 24713, 17891, 23032, 62686, 38568, 17593, 24299, 21442, 31719, 25271, 30343, 29900, 3926, -6140, 6628, 23807, 58090, 41109, 40193, 26517, 43484, 11437, 19288, 30733, 48606, 38663, 8896, 11203, 6131, 7827, 27731, 25481, -3296, 14135, 4133, 11569, 10675, 12463, 21661, 37577, 29148, 9816, 11435, 39778, 35450, 34168, 42196, 21579, -1174, 22215, 67308, 42205, 31641, 19520, 13467, -13827, 6828, 35163, 32247, 33396, 49128, 32075, 21682, 50282, 27326, 26197, 40719, 11697, -9647, -7226, 15742, 1906, -276, 25249, 16123, 35488, 14542, 19454, 30129, 44685, 16429, 15044, 20965, 50502, 24277, 24332, 25561, 6436, 9771, 30377, 18976, -8725, 5731]
1116E731l0246r781L0682K3284j3401o429L6076L425l0178l676j9170J9997M2115
1103D8429j6251k87j1885M618l1819k1776M9194J6615l8691k594M267N717J598
1090G135k287p930P278k009k4344L3967K6202n804J4603k6035l5570L1869m488
1077A2587L599n1064K7614J6382j3097J7505J3183L090J1698P589k6862j7663
1065D561L8643l999l9950J3892K1763J2577k8186j3725J8850n2J0874m588l7417
1052f757O034q411m987J4880j8504N265J3774J7431k8561J3504J5156j9047j4801
1039a5024r480N285O347K0069P431l9357K9036J7065M031J0670J3673m987l7357
1026G402J1252K5570J0568j4634j4956j956k5012j36M958R269N237j2714M5190
$$ y = [5731, -24515, -34296, -3614, 19670, 6269, -160, 35916, 39341, 9163, 5487, -13683, 6314, 48429, 32178, 31891, 20006, 24624, -7195, -28971, 20223, 36838, -1853, -4447, -180, 5537, 7135, 4848, -3082, 4196, 2187, -22157, 11810, 38012, 32208, 46811, 20776, -14794, 17075, 12587, 16186, -34878, -7264, 9118, -3979, 13526, 26709, 29799, 41497, 49086, 22224, 4561, 43204, 39205, -745, 13147, 34910, 47487, 19301, 5576, 24426, 24374, 35248, 30660, -6757, -723, -9134, -14121, 759, -17745, -12480, 1294, 18725, -9836, 3668, 18824, -223, -15024, -24504, -19219, -12872, 7197, 14628, -24729, 4307, 21372, 25403, 36073, 49746, 44759, 7402, 18654, 44224, 54792, 40158, 25202, 23246, -1766, -1902, 3056, 12325, 17562, 4848, 50038]
1013E0038j5438j6714l756J0306K0413k3007J4524m593k9320J567K2634j3281
1001A3373r689m849J2144J2351j5341k9025M993K1835J0216k0174l8076L8422
989c820L115l693l0043Q731J0600J5335j4805k505o758J5380J9406K0767j337
976C0373K9930m016m2293Q340K5661j1689m393M8121l4661j703m5782K0728k5111
963f495K0382l7512k668R690J3348J6176r605j0031j1875K3509j9691M2979l9152
950a0945K0597K9578j5780m9580L033M462M9848p227o73k3033L3963k9725p375
937b857M3678k7024j094k4143L118K897K4975q663J6244j8423J1584j9817j3535
924a3060m385J3385k321k6107q53K04N3669l100J2108o527q310r515k3547j3090
$$ y = [50038, 34600, 17886, 14130, 24436, 44849, 21842, 36366, 31773, 2453, 4020, 26654, 13373, 3684, -1165, 10979, 23330, 7989, -21036, -16043, 5792, 16008, -4166, -42242, -3820, -705, -4398, -34441, -25710, -15110, 225, -14580, -17085, -23843, -8463, 10943, 31710, 30373, 60303, 56287, 13994, 22334, 47995, 36306, 31913, 80034, 45373, 43670, -2112, 18616, -6495, 13887, -23625, -26293, -16603, -3255, 12921, 3316, -6715, -18590, 4919, -14772, 28207, -10945, 9652, 39230, 23450, -26130, -23097, -18635, 31213, 23986, 23313, 280, 34243, 4518, -2857, 40821, 13797, 12703, -11440, -8322, -5425, 19550, 10887, 27131, 8708, 20292, 475, -13060, -17445, -4060, -6381, -32488, -33341, -33137, 20532, 17432, 29540, 23013, 14703, 5188, -18359, -31449]
910c1449K658p537L0156p524p286L149k2477J7456K0483K4825p55J548k0161J8995
896B2081J799k5836l6077M3601j9272k9200K6823J2456r287l4626J2664M2933
884H059K5384O021j7549l0957k114k0408J9716O25J4722l51j2510K5222J6838
871C2698J747j3790j6164j806K4960j4960J0327l1866Q455j0236r748R844M1817
858C1278O566j2090o348l1316P430J5547j5319L287L5271K0890J2286m5523m189
845A7770O64j7828j7857J9456j0194N652k2694J1356L2065l2525P861J3105j4793
832g962p832n368P750K1436m853K0718j2458j0894j7947q779N100J8611n928q20
818i226J3241K216K7787l6470k7078N825J0037M328p010k6465J7865L7569K1267
$$ y = [-31449, -28791, -36328, -6172, -13696, -20982, -17833, -40310, -22854, -2371, 22454, 21699, 23247, 3086, 22081, 23880, -1956, -38033, 5568, -13704, -42904, -16081, -3625, -12912, -47538, -34874, 8059, 33443, 39464, 21915, -9042, -11156, -31564, -11848, -11223, 3499, 3148, -9362, 15860, 32698, 34445, 20655, 4491, 2685, 27645, 12685, 23012, -8854, -399, -10635, -20383, -10539, 31278, 37844, 25754, 19406, -11910, -4480, 11067, -4252, -965, 34306, 55196, 67482, 21959, 17770, 18434, 606, -17251, 2205, -7989, -2337, -25031, -13675, 18390, -14135, -6274, 6831, -7962, -15794, -21162, -13412, 8024, 3171, 23889, 11431, 537, -17410, -26189, -21089, -2478, -8406, -9226, 4015, 6231, 34018, -2452, -29530, -23705, -13668, -9340, -16350, -42815, -24950, 12619, 33886]
805C3886q163k8164j603O267K536j921l17k9163K610J9080N137m657j8648K904
791b0216p649n412J7880J0238J0632J2713l278K4147j4224K4265k1028l4846K6870
778B0092o412K6825P946j8867l219J6803l1230K0745k1058m74J6366O294K256
765C6067o287j6168n070k504k6560k108K203O178J3968n002p861K0310q408j0311
751a1553m617j680K4837K7678k6921j7905N362l585p698j1220J8154K3735n138
738I449P124k5152n435Q156M198j2884J4704J9237R895k1660R313K1568j5347
725B3166k5207k4042Q39L5483l5093k1793Q592L3516q85J6408j6718k7567J1743
712b1558j2610j3997R028K7935k239J4865k3356j146J4640J8248k9802k0628q609
$$ y = [33886, 25723, -2441, -4044, 2223, 4759, 2838, 2521, -26642, -24032, -4952, 185, -4472, -23120, -20216, -27865, -33277, -15397, -5159, 5473, 18186, 14908, 39055, 24831, 49096, 28068, -6778, 20092, 13680, 40505, 48451, 29584, 26365, 43168, 11938, 32683, 11625, 11151, 27517, 33811, 36067, 29780, 13612, 8542, 6038, -20522, -22630, -20427, -14249, -281, -5283, -13144, 7166, -1242, -11553, -16170, -17850, 6987, 34665, 7744, -10161, -4799, -8384, -16082, -27302, -9148, 14587, 9449, 16573, -8579, -14014, -5858, -1660, -14544, 160, 19397, 29292, 7632, 16945, 38513, 23166, -2041, -26083, -25244, 10239, -24854, -46647, -38055, -4539, -5424, 10984, -5734, -33301, -21558, -34168, -48165, -39137, -11202, -13441, 1424, -21932, -23078, -8438, 9810, -19992, -40620, -49229]
699d9229J1448o525j1963N6389P837k7579J9836N842P56r590K371j9704K5128
686E017J1141l2965K3001k970l9298j6439K5341J4930J1609j2522L7933k754k6847
673d823M215j9908J4214m2273M250Q27J9070M3024J089k6215J4274J3470m0276
660a9062k3976r063J8209J2149L3954l337K5898R25j1705O545j8314J198o091
647G330j2690R128L965j0509K5794J936m272k323k4830p366j2657j4218M012J6218
633b0482q109L191L468k9087J0526L531L8090O733K809o147R161K9802k7993k7581
619a2088J4866j6876j5355K325J9187L8808m0520q938L0942k6493P079j488l8113
606d6664J9400J7608m2040j0597K7936L071j5176K6744R304j9120K2292l1046
$$ y = [-49229, -37781, -44306, -56269, 120, 7957, -19622, 214, 6056, 6812, -2778, -407, -20111, 5017, 16158, -16807, 6194, 3224, -36074, -52513, -27172, -12242, -633, -13155, 24778, 22024, -4823, -608, -20516, -6302, -48575, -44325, -43498, -24428, 18596, 19685, -6530, 7744, 21214, -19062, -43038, -52101, -33892, -21743, 12211, 8874, 34772, 35697, 23992, 30537, 12223, 13421, 7330, -5360, 3768, 7733, -2776, 23018, 24954, 20682, 18359, -6471, -13837, -26494, -40712, -36700, -20482, -28591, -25400, -21932, -51019, -40493, -36962, 1128, 7861, 10670, 4523, 13684, 43486, 15493, -12088, 2778, -14098, -29453, -27128, -7941, 30867, -9653, -18591, 12351, -14142, -7063, -8551, -46664, -27264, -9656, -51696, -62293, -34357, -31286, -46462, -19718, -10414, -29534, -7242, -38288]
594c8288r099M2417J2641l2925j068K2105N204j8707l0840J9912J9846M8633J0399
581E0230k7575j0981k4565J3622l3552j1892P088R172j3507K7825j6653j1615
569d2403K3524J8290k2355j0247M348m716M7639j4483m420l1908q256J7602J0890
556a6495L092k628k937K222K2120J2695k4927j587J6890J5608n0267j6894L0268
543a2840P693j393j8484r313m256L0993k908J6015O422J8967m1659k6975K3229
530a4509J2766M492l2435J2997J3062l5900J2803l422n8466K0801N1001k7515
518d4325L1120K1491j9950N169Q602K1053j9049p308p306q049r318O281P305j9161
504c3445p569K1409j8996j1711Q691M2996j1277M487O32j0196J0568j3851q668
$$ y = [-38288, -47387, -4970, 7671, -25254, -26322, -4217, 987, -17720, -48560, -28648, -8802, 39831, 50230, 22655, 11674, -12891, 731, -32821, -44713, -37625, -28453, -41960, -14135, -30788, -42403, -18879, -589, -22944, -33191, -28843, -33559, 14080, -403, -4823, -36731, -44987, -27385, -16495, -13403, -16031, -18968, -16746, 5374, 18069, -6858, -8445, 8445, 24053, -26214, -43108, -12840, -5147, -6540, -25024, -34337, -38593, -7600, -10508, 5507, 11929, 30896, -10763, -37738, -14509, -1743, 2749, -29686, -16689, -3627, -39527, -26724, -30146, -88612, -67811, -16810, -44325, -13205, 8286, -11664, -6495, 2107, 23160, 4111, -3197, -10503, -18552, -27870, -21589, -14284, -33445, -41014, -19605, -38601, -50312, -41621, 1375, -9902, -5415, -4783, -14979, -4411, -18262, -26930]
491b6930m438K7204N959j517Q704O190l1407J571K2946J0895k3312k4553M375
478b4313Q088K3088j7450L808J9953m7188Q634o031J602K263j4031J1898K955
465b6724M8960n7056L171J7497M98m2612J1283K7062R420j6034m590P1580l4509
452G946j7281L548J5275K978j0392J489M444j8432j9483Q601l143o15O255r265
438b8075k3458J1685L8271k6418q95J3654j9143j0151J9227N689J099O202l8467
425e0780K0955K4346J7035K8702k9496j0018k3761M930M040L052j2885Q693k4592
412c9779K5533J8897O68l2262n489l045J2739l742m157K5443j9189R62l5366J4488
398d4299k4449J7795k0948j2574K7852M1746R029m3999J0201L8460J3198Q75J3269
$$ y = [-26930, -31368, -4164, 1795, 278, 8982, 15172, -16235, -14664, 8282, 19177, -4135, -28688, -24313, -16225, 6863, -10587, -6779, 13174, -34014, -25380, -31411, -29809, -27546, -41577, -29679, -26724, 22236, -34820, -31649, -14152, -13654, -56266, -44983, -17921, -8501, -24535, -29125, 42455, 7946, -9335, -5787, 9488, 12466, 2074, 3563, 8007, -10425, -29908, -21307, -24450, -25065, -18810, -28075, -51533, -39848, -1577, -27995, -28890, -15236, -34379, -44530, -25303, -19614, -18515, -12313, -50780, -29825, -5479, 11556, 40258, 10762, 744, -23017, -18087, -14047, -10995, -23880, -15187, -39779, -14246, 4651, 5319, -26943, -32432, -35477, -22738, -26480, -30637, -5194, -24383, -23421, -58787, -44299, -68748, -50953, -71901, -84475, -56623, -14877, -5848, -49847, -39646, -1186, 12012, 12887, 26156]
385B6156m6001k2739L3246J3783k0343m3791k3427L6209J9416J9677j3152j4242
373c5208n484L202j0909k7598L9246L1781Q379j1448R694l0919K8968L367p780
360d709K989j8473Q593J1710R336m051l0132r27R925J1445J6389j5936j8901l8136
346f0878K8302j96r513J436J1789K1945j5618j224J5301J2782j4589j2389J2467
333a0385J6263l0237j4982k3073O9912K2310j7619k4357J816J7556M635j825o460
320C554J2848l0996j0119j9505L6638K3511j8257l3397M4035M081m7421j9866
308e4894J4090N296l665k1383L2752r190k8481L7718m355L2251j9065r971j5649
295d4546N211r718O228K7373J4861l1473k2683k289P405J7396j3277J7415J5700
$$ y = [26156, -19845, -42584, -9338, 4445, -15898, -59689, -83116, -46907, -27491, -7814, -20966, -35208, -40692, -37490, -48399, -75997, -36751, -4970, 3409, -8039, 1655, -29264, -296, 3071, -4709, -1720, -20193, -11600, 110, 9446, 5395, -24737, -25664, -15739, -4294, 12095, -3841, -22742, -60878, -32576, -32772, -42285, -40849, -29060, -7115, -22733, -23957, -8656, 4126, -10463, -22852, -10385, 5878, -24359, -39341, -62414, 7498, 29808, 12189, -12168, -10352, 7204, 11839, 10014, 3554, 16402, -14594, -24713, -44218, -7580, 15931, -2326, -35723, 8312, 12393, -35028, -54894, -40804, -35508, -39173, -60556, -27804, -36994, -65475, -27757, -32112, 139, -18926, -28897, -44546, -39335, -49053, -42825, -15452, -591, -32064, -54747, -57036, -49631, -32235, -45512, -28097, -12397]
282a2397K0682j2348m772j4296J8814j5036p509j8667l238k521K9682p116k6564
269e5286K788M959O519o686J2657N935L8200k8516k7572j1995j410k4381p066
256i1854L9927k3414J8636J8783J7542m923l2453J7640L5206O635j4150m883q972
243b6280P189r565l47k2583K5606m7848j3549L2342R935j0395J0057k0358j659
230f7455J9083n067P46k8358p295k1051j8483Q756M8666j4764M3577K77j3621
217e4989k1135L0472l567j2869q327O283j1354l246l6293j1379K1357P568p338
204a04817K170K6765J3984l173l1169L2290j3732m5892j8297J9092j241L492Q545
191a11983q771L756K5403Q809m044j704Q565o604L060K496o043O706k5267k4295
$$ y = [-12397, 8285, -4063, -8835, -23131, -4317, -19353, -26862, -45529, -48767, -51288, -21606, -28722, -55286, -52498, -47539, -41020, -47706, -35049, -29114, 9086, -19430, -47002, -58997, -60407, -84788, -91854, -51927, -75341, -56705, -37922, -20380, -25303, -57756, -40116, -4910, 1725, -12425, -17308, -26280, -19091, -28656, -29003, -51586, -25980, -73828, -87377, -55035, -45100, -55495, -45438, -65796, -67455, -48372, -53439, -52693, -81051, -88346, -109397, -127880, -119124, -70458, -85222, -41645, -41368, -54989, -76124, -45652, -49219, -62088, -70415, -64132, -75486, -78732, -115025, -126404, -105047, -97479, -104817, -102647, -75882, -61898, -65071, -96240, -63950, -77682, -123574, -141871, -122779, -124020, -120528, -111983, -120754, -116998, -91595, -82786, -86830, -88534, -79969, -86573, -83513, -81017, -87060, -80354, -105621, -129916]
177a29916J2249j9579R023J0692k1522j2906J8897j2926J873j7386L3861r946
165a37586k3262j0125K9920p468j6781J6827K9281j7854k5426Q837q547n047k6002
152a93233P880M788K2411j8221L5440J537m8101j2422J0682K7992J4695k4611
140a71163k756l995J73J3298k5805L425m5240K1225L1111n207m3383J5278j6983
127b30022k5603l0762J3690K4174p578n039M748J7156l641P534l8O272j4734K6237
113b17606j4716j7182j8989O420j6967K3629o877K121j2812J0191j6580k8403
101c07771l459K112J2389p72O010l0989j1435j4823J6829P221j3260Q826n975
88c35097K5296k6979K2736l794k631K284l181k8764J5189j3119j2799p151J464
$$ y = [-129916, -117667, -137246, -128223, -117531, -139053, -151959, -133062, -145988, -144115, -161501, -127640, -137586, -160848, -170973, -141053, -148521, -165302, -148475, -119194, -137048, -162474, -153637, -162184, -167231, -193233, -185353, -180565, -158154, -176375, -140935, -139398, -187499, -199921, -189239, -161247, -146552, -171163, -173919, -177914, -177741, -164443, -190248, -186823, -232063, -210838, -179727, -184934, -228317, -213039, -230022, -255625, -286387, -272697, -248523, -256101, -261140, -256392, -239236, -242877, -235343, -235381, -229109, -243843, -217606, -232322, -249504, -268493, -262073, -279040, -255411, -262288, -260167, -272979, -262788, -279368, -307771, -311230, -309118, -296729, -297501, -291491, -322480, -333915, -348738, -331909, -324688, -337948, -329122, -335097, -309801, -336780, -314044, -317838, -320469, -318185, -321366, -350130, -334941, -348060, -360859, -368010, -366546]
75c66546k2049l700J0861P553j477k3231J67p910R218j7946K3823n1607L8600
62d04244j3942R746k2857j0723j0073O285l193o070J033j7159q11p974K6279l5136
48d88839O649r22L538k6890J2596J5450Q798n30k9948j0599J0251j474o977R831
34d99066k5265j3625r847n922l609L2066N313k1667k3306Q018o102J0731j0850
21e63131Q55J525p96j8636j3246K893j7889L27l5252J853j1028K6380k0450J5775
7f30820K6949k4046k2215L128n279j3289J1873
0f53699
$$ y = [-366546, -388595, -392295, -381434, -373881, -375358, -398589, -398422, -406332, -397114, -415060, -391237, -442844, -404244, -418186, -408440, -431297, -442020, -452093, -445808, -449001, -455071, -454038, -471197, -472008, -479982, -453703, -488839, -482190, -483112, -479574, -506464, -493868, -478418, -469620, -470150, -500098, -510697, -500446, -501920, -508897, -499066, -524331, -537956, -547803, -553725, -557334, -525268, -519955, -541622, -564928, -556910, -563012, -552281, -563131, -562276, -560751, -561547, -580183, -593429, -590536, -608425, -608098, -643350, -641497, -652525, -626145, -646595, -630820, -603871, -627917, -650132, -647004, -652283, -665572, -653699]
$$ Imaginary data points
##PAGE= N=2
##DATA TABLE= (X++(I..I)), XYDATA
16383b495127M6640M6839J8305M2874L8473L0627M6044L3540K4993K8579O2206
16372b076007L1739L7920L0235M8741L6769N3053L1354K0569M5155N2090M3666
16361a644716M7579J9121N4575L2332K0039L5538L8024O0997K6791L5267K8317
16350a246136N3656L2889N7023J7814M6471L8541N8345K8068K3683L0828L8830
16339h19988O1955J8283M0160K7847K8508K4264L8547K9095M5542L3591M9177
16328d23019M416M1121N0188J9058O1166K7313L8134L1733M0848J3843M2758L7446
16316a4995K5686J7589M2172N2315Q0059J4517J2140K1515J5660L5936O2208N1290
16304D16092J7317M1184K7737K2852N159P0640K2686N5793J8510K5393J1020L5058
$$ y = [-2495127, -2448487, -2401648, -2383343, -2340469, -2301996, -2271369, -2225325, -2191785, -2166792, -2138213, -2076007, -2044268, -2006348, -1976113, -1927372, -1890603, -1837550, -1806196, -1785627, -1740472, -1688382, -1644716, -1597137, -1578016, -1523441, -1491109, -1471070, -1435532, -1397508, -1336511, -1309720, -1274453, -1246136, -1192480, -1159591, -1102568, -1084754, -1038283, -999742, -941397, -913329, -889646, -858818, -819988, -758033, -739750, -699590, -671743, -643235, -618971, -580424, -551329, -505787, -472196, -423019, -418603, -377482, -327294, -308236, -247070, -219757, -181623, -149890, -109042, -95199, -52441, -14995, 10691, 28280, 70452, 122767, 202826, 217343, 229483, 250998, 266658, 302594, 364802, 416092, 433409, 474593, 502330, 525182, 530341, 600981, 623667, 679460, 697970, 723363, 734383, 769441]
16292G69441L3544M9422L4883P415L5711K7252K7019J1660M4986K7303K1850J7303
16280A107789M6276P162K7281J1441J9168L1945L5684L3013N5947N2613J2700
16269A441019J2074J1069M3007K4098K1770J1519L6063j0720N0401M2215K9210
16258A711725J5266J5375L7807M099J3237M5362K3417J9874K903P443N8675K3854
16246A979037J6105K7590r254M3114N3305J4163J8889j0419K9376J9917Q288L2536
16234B222647J1508L1612K562M4954K2770K2207K1423L1775O495J4550L0195M3279
16222B505977J4630N863K9177N434J3228j3948L2754K6636L8753k4897K9342K1300
16210B684249L7809J2983J3631L470J4747K4296l865L473M604N575L370J3591
$$ y = [769441, 802985, 852407, 887290, 894705, 930416, 957668, 984687, 996347, 1041333, 1068636, 1090486, 1107789, 1154065, 1161227, 1188508, 1199949, 1219117, 1251062, 1286746, 1319759, 1375706, 1428319, 1441019, 1453093, 1464162, 1507169, 1531267, 1553037, 1564556, 1600619, 1589899, 1640300, 1682515, 1711725, 1726991, 1742366, 1780173, 1784272, 1797509, 1842871, 1866288, 1886162, 1889065, 1896508, 1955183, 1979037, 1995142, 2022732, 2013478, 2056592, 2109897, 2124060, 2142949, 2132530, 2161906, 2181823, 2190111, 2222647, 2234155, 2265767, 2268329, 2313283, 2336053, 2358260, 2379683, 2411458, 2417953, 2432503, 2462698, 2505977, 2520607, 2526470, 2555647, 2561081, 2574309, 2560361, 2593115, 2619751, 2658504, 2633607, 2662949, 2684249, 2722058, 2735041, 2748672, 2752142, 2766889, 2791185, 2787320, 2790793, 2795397, 2800972, 2804342, 2817933]
16198B817933M7448J2276j5866K6268N2743j3353J4035l956j9337N0679L5856
16187C004726j9211M378K1826K3604J6822j6409J5116L3236j554L1741l659o114
16175C104502K9565J8790r337J4898K6257j6568k0071K5154L625J3322K5364K1121
$$ y = [2817933, 2865381, 2877657, 2861791, 2888059, 2940802, 2927449, 2941484, 2937528, 2918191, 2968870, 3004726, 2985515, 2989893, 3011719, 3035323, 3052145, 3035736, 3050852, 3084088, 3082534, 3114275, 3110616, 3104502, 3134067, 3152857, 3143520, 3158418, 3184675, 3168107, 3148036, 3173190, 3176815, 3190137, 3215501, 3236622]
$$ [...]
##END NTUPLES=NMR SPECTRUM
##END=
