##TITLE=1H_DE-80H_X3
 200.13MHz, d2o
 8 sc
 
 19ns.26.2.2025
##JCAMPDX= 6.0         $$ Bruker NMR JCAMP-DX V2.0
##DATA TYPE= NMR SPECTRUM
##DATA CLASS= NTUPLES
##ORIGIN= UXNMR, Bruker Analytische Messtechnik GmbH
##OWNER= pz
$$ XWIN-NMR		Version 3.5
$$ Tue Jun  9 10:53:55 2026 Russian Standard Time (UT+4h)  Yarkov@DPX200
##.OBSERVE FREQUENCY= 200.1313
##.OBSERVE NUCLEUS= ^1H
##.ACQUISITION MODE= SIMULTANEOUS
##.ACQUISITION SCHEME= undefined
##.AVERAGES= 8
##.DIGITISER RES= 18
##SPECTROMETER/DATA SYSTEM= spect
##.PULSE SEQUENCE= zg30
##.SOLVENT NAME= CDCl3
##.SHIFT REFERENCE= (INTERNAL, CDCl3, 0, 15.3701)
##AUDIT TRAIL= $$ (NUMBER, WHEN, WHO, WHERE, WHAT)
$$ ##TITLE= Audit trail, XWIN-NMR		Version 3.5
$$ ##JCAMPDX= 5.01
$$ ##ORIGIN= Bruker BioSpin GmbH
$$ ##OWNER= Yarkov
$$ C:/Bruker/XWIN-NMR/data/yarkov2/nmr/H-C/1/pdata/1/auditp.txt
$$ ##AUDIT TRAIL=  $$ (NUMBER, WHEN, WHO, WHERE, WHAT)
(   1,<2026-06-09 10:53:14.64 +0400>,<Yarkov>,<DPX200>,
      <created by zg, POWCHK disabled, PULCHK disabled
       configuration hash MD5:
       00 E9 B6 7A A2 85 ED C7 34 08 36 98 17 FE 4E 26
       data hash MD5: 16K
       6B 07 FE EE E8 03 CC 33 44 BB BB BD A7 13 FA 62>)
(   2,<2026-06-09 10:53:19.12 +0400>,<Yarkov>,<DPX200>,
      <Start of raw data processing
       efp BC_mod = 2 LB = 0.25 FT_mod = 6 PKNL = 1 PHC0 = -6900.219 PHC1 = 13.42196 SI = 16K 
       data hash MD5: 16K
       BD 91 04 03 63 04 EE F3 C2 A2 0D A2 A3 57 1E 40>)
$$ ##END=
$$ 
$$ hash MD5
$$ F6 EE DF EB 8D BF DA 26 7F FD D5 28 1C 51 C0 13
##$RELAX= 
##$RELAX= 
##$RELAX= 
##$RELAX= 
##$RELAX= 
##$RELAX= 
$$ Bruker specific parameters
$$ --------------------------
##$DU= <C:/Bruker/XWIN-NMR>
##$EXPNO= 1
##$NAME= <H-C>
##$PROCNO= 1
##$TYPE= <nmr>
##$USER= <yarkov2>
##$AMP= (0..31)
100 100 100 100 100 100 100 100 100 100 100 100 100 100 100 100 100 100 
100 100 100 100 100 100 100 100 100 100 100 100 100 100 
##$AQSEQ= 0
##$AQ_mod= 1
##$AUNM= <au_zg>
##$AUTOPOS= <>
##$BF1= 200.13
##$BF2= 200.13
##$BF3= 200.13
##$BF4= 200.13
##$BF5= 200.13
##$BF6= 200.13
##$BF7= 200.13
##$BF8= 200.13
##$BYTORDA= 1
##$CFDGTYP= 0
##$CFRGTYP= 5
##$CHEMSTR= <none>
##$CNST= (0..31)
1 1 145 1 1 1 1 1 1 1 1 1 1 1 1 1 1 1 1 1 1 1 1 1 1 1 1 1 1 1 1 1 
##$CPDPRG= <>
##$CPDPRG1= <>
##$CPDPRG2= <>
##$CPDPRG3= <>
##$CPDPRG4= <mlev>
##$CPDPRG5= <mlev>
##$CPDPRG6= <mlev>
##$CPDPRG7= <mlev>
##$CPDPRG8= <mlev>
##$CPDPRGB= <>
##$CPDPRGT= <>
##$D= (0..31)
0 0.7 0 0 0 0 0 0 0 0 0 0.03 0 0 0 0 0 0 0 0 0 0 0 0 0 0 0 0 0 0 0 0 
##$DATE= 1780987993
##$DBL= (0..7)
120 120 120 120 120 120 120 120 
##$DBP= (0..7)
150 150 150 150 150 150 150 150 
##$DBP07= 0
##$DBPNAM0= <>
##$DBPNAM1= <>
##$DBPNAM2= <>
##$DBPNAM3= <>
##$DBPNAM4= <>
##$DBPNAM5= <>
##$DBPNAM6= <>
##$DBPNAM7= <>
##$DBPOAL= (0..7)
0.5 0.5 0.5 0.5 0.5 0.5 0.5 0.5 
##$DBPOFFS= (0..7)
0 0 0 0 0 0 0 0 
##$DE= 6
##$DECBNUC= <off>
##$DECIM= 32
##$DECNUC= <off>
##$DECSTAT= 4
##$DIGMOD= 1
##$DIGTYP= 9
##$DL= (0..7)
0 120 120 120 120 120 120 120 
##$DP= (0..7)
$$ [...]
##$SUBNAM2= <"">
##$SUBNAM3= <"">
##$SUBNAM4= <"">
##$SUBNAM5= <"">
##$SUBNAM6= <"">
##$SUBNAM7= <"">
##$SUBNAM8= <"">
##$SUBNAM9= <"">
##$SW= 18.0517328524113
##$SWIBOX= (0..15)
0 0 2 0 0 0 0 0 0 0 0 0 0 0 0 0 
##$SW_h= 3612.71676300578
##$TD= 16384
##$TD0= 1
##$TE= 0
##$TE2= 300
##$TE3= 300
##$TEG= 300
##$TL= (0..7)
0 120 120 120 120 120 120 120 
##$TP= (0..7)
150 150 150 150 150 150 150 150 
##$TP07= 0
##$TPNAME0= <>
##$TPNAME1= <>
##$TPNAME2= <>
##$TPNAME3= <>
##$TPNAME4= <>
##$TPNAME5= <>
##$TPNAME6= <>
##$TPNAME7= <>
##$TPOAL= (0..7)
0.5 0.5 0.5 0.5 0.5 0.5 0.5 0.5 
##$TPOFFS= (0..7)
0 0 0 0 0 0 0 0 
##$TUNHIN= 0
##$TUNHOUT= 0
##$TUNXOUT= 0
##$USERA1= <user>
##$USERA2= <user>
##$USERA3= <user>
##$USERA4= <user>
##$USERA5= <user>
##$V9= 5
##$VALIST= <valist>
##$VCLIST= <CCCCCCCCCCCCCCC>
##$VD= 0
##$VDLIST= <DDDDDDDDDDDDDDD>
##$VPLIST= <PPPPPPPPPPPPPPP>
##$VTLIST= <TTTTTTTTTTTTTTT>
##$WBST= 1024
##$WBSW= 4
##$XGAIN= (0..3)
0 0 0 0 
##$XL= 0
##$YL= 0
##$YMAX_a= 284526
##$YMIN_a= -357981
##$ZGOPTNS= <>
##$ZL1= 120
##$ZL2= 120
##$ZL3= 120
##$ZL4= 120
##$ABSF1= 0
##$ABSF2= 0
##$ABSG= 0
##$ABSL= 0
##$ALPHA= 0
##$AQORDER= 0
##$ASSFAC= 0
##$ASSFACI= 0
##$ASSFACX= 0
##$ASSWID= 0
##$AUNMP= <proc_1d>
##$AZFE= 0.1
##$AZFW= 0.1
##$BCFW= 0
##$BC_mod= 2
##$BYTORDP= 0
##$COROFFS= 0
##$CY= -3
##$DATMOD= 1
##$DC= 0
##$DFILT= <>
##$DTYPP= 0
##$F1P= 0
##$F2P= 0
##$FCOR= 1
##$FTSIZE= 16384
##$FT_mod= 6
##$GAMMA= 0
##$GB= 0
##$INTBC= 1
##$INTSCL= 3.241238e-09
##$ISEN= 128
##$LB= 0.25
##$LEV0= 0
##$LPBIN= 0
##$MAXI= 10000
##$MC2= 0
##$MEAN= 0
##$ME_mod= 0
##$MI= 1.114404
##$NCOEF= 0
##$NC_proc= -7
##$NLEV= 6
##$NOISF1= 3.799351
##$NOISF2= 2.8
##$NSP= 0
##$NTH_PI= 0
##$NZP= 0
##$OFFSET= 15.37007
##$PC= 1
##$PHC0= -6900.219
##$PHC1= 13.42196
##$PH_mod= 1
##$PKNL= yes
##$PPARMOD= 0
##$PSCAL= 0
##$PSIGN= 0
##$REVERSE= no
##$SF= 200.130030345677
##$SI= 16384
##$SIGF1= 3
##$SIGF2= 2
##$SINO= 0.751879
##$SIOLD= 32768
##$SREGLST= <19F.Aceton>
##$SSB= 0
##$STSI= 16384
##$STSR= 0
##$SW_p= 3612.71676300578
##$SYMM= 0
##$S_DEV= 0
##$TDeff= 16384
##$TDoff= 0
##$TI= <>
##$TILT= no
##$TM1= 0
##$TM2= 0
##$TOPLEV= 0
##$USERP1= <user>
##$USERP2= <user>
##$USERP3= <user>
##$USERP4= <user>
##$USERP5= <user>
##$WDW= 1
##$XDIM= 16384
##$YMAX_p= 366960112
##$YMIN_p= -1599979
$$ End of Bruker specific parameters
$$ ---------------------------------
##NTUPLES= NMR SPECTRUM
##VAR_NAME=  FREQUENCY,     SPECTRUM/REAL,   SPECTRUM/IMAG
##SYMBOL=    X,             R,               I
##VAR_TYPE=  INDEPENDENT,   DEPENDENT,       DEPENDENT
##VAR_FORM=  AFFN,          ASDF,            ASDF
##VAR_DIM=   16384,         16384,           16384
##UNITS=     HZ,            ARBITRARY UNITS, ARBITRARY UNITS
##FACTOR=    0.220516191357247, 1,           1
##FIRST=     3076.01266706636, 0,            0
##LAST=      -536.704095939418, 0,           0
##MIN=       -536.704095939418, -1599979,    0
##MAX=       3076.01266706636, 366960112,    0
$$ Real data points
##PAGE= N=1
##DATA TABLE= (X++(R..R)), XYDATA
$$ [...]
8116 -110217 -207535 -239489 -218864 -149344 -173518 -196940 -158579 -116973 -103988 -190078 -173116 -84801
8104 -84801 -101803 -140173 -135060 -163301 -175775 -156550 -166833 -166177 -165636 -124898 -154924 -163311 -151572
8091 -151572 -142651 -146382 -122594 -184297 -217869 -238040 -256852 -130359 -203876 -211302 -142659 -197869
8079 -197869 -127983 -104018 -108463 -123308 -89135 -76552 -118450 -125250 -156391 -151149 -159080 -172331
8067 -172331 -220372 -213003 -245522 -222535 -247821 -172292 -183089 -181361 -213774 -227423 -240897 -261786
8055 -261786 -185231 -203326 -207769 -214837 -210834 -254397 -211084 -176005 -67245 -34198 -22178 -134910
8043 -134910 -227153 -229253 -188302 -163254 -153750 -144064 -118177 -156137 -165919 -145920 -134719 -135712 -86905
8030 -86905 -103099 -178429 -178467 -179324 -130869 -80980 -129973 -188072 -102700 -151612 -118457 17836 37074
8017 37074 -8853 -5214 -37900 -88234 -166045 -120577 -154618 -196953 -142429 -120112 -99177 -104081
8005 -104081 -158333 -198247 -182891 -231334 -167285 -97271 -142680 -170991 -173124 -124585 -121457 -114640
7993 -114640 -86729 -88705 -150232 -127680 -97498 -131437 -172209 -178823 -117532 -108665 -136827 -139602
7981 -139602 -103976 -187747 -189306 -159488 -124878 -104743 -72600 -112568 -171473 -174893 -193320 -245439
7969 -245439 -203256 -153512 -125968 -168312 -177740 -228081 -167394 -161527 -224604 -232858 -197072 -182028
7957 -182028 -193811 -143433 -180786 -157882 -156114 -163791 -133068 -143603 -188761 -164788 -187148 -156266
7945 -156266 -151594 -82735 -37454 -56040 -91124 -126454 -99832 -116856 -75714 -122262 -99757 -41824
7933 -41824 -158077 -221404 -250325 -153565 -132820 -113763 -212245 -262606 -145914 -125899 -113958
7922 -113958 -84167 -59135 -36785 -110872 -147630 -174077 -124681 -42061 -124621 -146500 -124210 -102674
7910 -102674 -79099 -55628 -101184 -120906 -132479 -126631 -139563 -88097 -72171 -170132 -92780 -50456
7898 -50456 -132224 -118845 -96088 -104827 -97874 -102579 -114425 -102098 -22387 -85898 -139377 -118845
7886 -118845 -109936 -86842 -76828 -44067 -96206 -134880 -119469 -141604 -140940 -186852 -150119 -116445
7874 -116445 -159846 -152377 -109446 -135571 -124123 -142720 -123861 -53523 -147838 -115684 -146816 -171891
7862 -171891 -131147 -79552 -89439 -124753 -156531 -160495 -83548 -160778 -144985 -149888 -123308 -171110
7850 -171110 -198165 -141739 -123132 -130331 -88213 -25539 -41567 -68979 -41793 -91853 -125779 -90592
7838 -90592 -72131 -78192 -100035 -150803 -115808 -27353 -50225 -59774 -81417 -83972 -88871 -116302 -65642
7825 -65642 -82356 -135487 -116484 -62167 -91092 -80452 4519 -43555 -115332 -140128 -75207 -100741
7813 -100741 -104990 -109257 -46922 -33101 47460 104308 252356 -483237 -542564 -302874 -301934 -141365
7801 -141365 -125643 -87473 -226558 -193263 -180257 -170255 -233217 -147870 -131939 -157486 -188829
7790 -188829 -148649 -124493 -106572 -179757 -135161 -81334 -84147 -112916 -88285 -160124 -202542 -202872
7778 -202872 -148093 -137906 -161593 -223947 -156244 -94833 -130855 -123693 -175215 -187302 -220208 -168175
7766 -168175 -64888 -163193 -218991 -180507 -168984 -209441 -176319 -146859 -135291 -133748 -136996 -136712
7754 -136712 -110291 -96603 -97159 -117200 -133297 -103375 -118860 -109119 -198654 -200436 -119048 -114958 -96960
7741 -96960 -42083 -82985 -127257 -63505 -123297 -182801 -164258 -130144 -110594 -168101 -128803 -133876
7729 -133876 -203714 -151251 -74701 -60187 -44497 -59633 6442 24242 -39987 -97940 -99631 -83058
7717 -83058 -74015 -90364 -84573 -68351 -96328 -163725 -136722 -151898 -207826 -143786 -120543 -138168
7705 -138168 -86376 -132466 -131086 -71746 -68067 -128539 -136397 -199078 -167936 -150003 -108000 -80024
7693 -80024 -171198 -246560 -161512 -100510 -106279 -74799 -54705 -1067 -60162 -67808 -56916 -71201
7681 -71201 -129902 -145338 -72577 72 -25125 -53838 -127722 -190438 -137661 -69906 -76465 -42706
7669 -42706 -83299 -84762 -141907 -143500 -81888 -57599 -75159 -91033 -17013 -67774 -107128 -139146
7657 -139146 -38613 -41627 -56854 -13160 -2811 -65445 -98092 -44387 -97641 -70276 -73477 -84798
7645 -84798 -148368 -160589 -176322 -161240 -98026 -92030 -69963 -39029 -44580 -83733 -113102 -113044 -72607
7632 -72607 -65682 -61593 -24215 22387 -17146 -51720 -111494 -107681 -54664 -83976 -44383 -54120 -62340
7619 -62340 -84555 12082 -31235 -42870 -55603 -25282 -8829 -96782 -81277 -117748 -145817 -188973
7607 -188973 -235086 -185873 -159430 -109760 -112210 -167965 -243425 -132833 -119637 -136848 -70162 7213
7595 7213 -9222 -51078 -34896 -39411 -25880 -47628 -1053 9310 -30258 -79751 -64704 -65497 -47655
7582 -47655 6034 57833 26752 5316 -15222 -14633 -36052 -74073 -53776 -71784 -137819 -113213
7570 -113213 -38612 -349 15474 11274 12242 -21073 -6247 36067 -22833 -11251 -2061 -6948 -58981
7557 -58981 -24800 -75033 -74074 -77290 -8547 64991 80852 43702 47435 9860 -38657 -31304 -62977
7544 -62977 -81065 -97766 -11015 -9752 -37726 -22138 -46735 -70447 -42599 -29955 -66150 -73915
7532 -73915 -97151 -40917 22813 25504 -12754 20109 57759 -50190 -123291 -142617 -101865 -37051
7520 -37051 -43560 -87115 -12858 -44208 -80486 -3831 -15016 -18185 27319 -19 -80496 -36915
7508 -36915 -109173 -129007 -81877 -74164 -67738 -40513 13805 49700 47337 62376 -83084 -91417
7496 -91417 -94643 -118878 -113870 -115380 -106406 -69612 -61633 -25200 -118853 -153059 -78841 -70838 -72734
7483 -72734 -134089 -133519 -118803 -99802 -137021 -88072 -95274 -87359 -89388 -90444 -86140 -78716 -99336
7470 -99336 -95540 -135389 -88832 -76911 -122918 -189405 -111360 -97531 -70914 -100758 -89663 -12972
7458 -12972 -5834 -31909 -31892 35909 74213 54084 21397 13115 75570 117 -20902 -51375 -62500
7445 -62500 -47204 -46692 -60364 -12874 28767 66444 67360 7042 49386 107700 131572 145872 149703
7432 149703 183554 176075 142830 72945 61966 89248 67660 81490 18028 68884 97116 23800
7420 23800 -21252 4488 16406 -45961 -56337 29446 23077 20614 78834 73945 38310 -1266
7408 -1266 50963 45056 1015 -49951 -48791 2936 89958 55665 -13146 -50840 -39027 -54042
7396 -54042 -83954 -125524 -114388 -71596 -95947 2351 87280 80419 -70629 -85480 -43219 -14658
7384 -14658 -48942 -31329 26811 -5235 -40942 -22749 -86594 -80405 -35631 -60075 -48255 -66186
7372 -66186 -85283 -35774 -46931 -54964 -82517 -57519 -77517 -91028 -72834 -108732 -48494 -14773
7360 -14773 -109071 -93507 -44408 -18146 -43747 -43241 -39131 -15168 11128 38852 50195 -9058
7348 -9058 -6315 43309 40322 8379 37984 -6149 -58241 -57578 -107142 -47499 -56782 -34281 14871
7335 14871 -16115 -92631 -114588 -73018 -52435 -77026 9535 15970 8091 -2781 35 31904
7323 31904 58326 -11609 -49238 -30268 13067 43324 16415 33238 25860 33256 -13159 -74581
7311 -74581 -102409 -45252 -40152 -45169 16921 -7332 -14848 22074 11537 -20210 2494 42650
7299 42650 37636 8912 11527 80548 44063 772 -59025 10259 -48135 -60645 -13219 3571
7287 3571 36547 -1968 20853 65218 16784 -33913 -10376 9138 -33158 -25643 2287 -22913
7275 -22913 -5079 1927 2677 -16781 38692 26447 -25971 16157 -13652 50588 51749 60914 -21498
7262 -21498 -61513 -6793 -11990 18715 1059 -11524 3911 18546 24641 -35266 -24221 -24366 14879
7249 14879 -14845 74550 93184 43011 2191 -17965 -1040 4341 -1736 48576 95184 89154
7237 89154 82716 130018 88233 32874 49767 -46790 10163 5942 -33176 -39080 -44945 18490 -40328
7224 -40328 -104978 -84935 -29174 39505 4691 -16412 6007 -60409 -46167 9325 -22297 -29398
7212 -29398 34425 5590 25997 47341 18267 14454 11653 16119 -16905 -6117 -12940 -11570 28187
7199 28187 2488 28794 50168 399 -21486 -6061 41854 25992 33902 846 28015 58821
7187 58821 38964 24615 28333 33682 75354 52115 129756 156957 103616 -5531 12261 -13729
7175 -13729 -20122 28907 76083 62248 51519 99560 145726 107262 126217 65049 84396 48096
7163 48096 47309 90762 28973 -34967 29131 66540 38736 87049 70420 114903 35410 32794
7151 32794 72647 48963 81526 97729 37425 54790 90797 55950 1378 21311 92012 115211
7139 115211 22053 40987 20612 50633 50474 65138 102258 36692 48163 45398 23769 23166 14702
7126 14702 2486 21471 53509 74246 -23566 -26097 74567 64261 75402 75593 113585 67194
7114 67194 86757 90977 73289 106158 48787 -4367 17175 59095 137696 144948 58616 51131
7102 51131 66392 63585 44484 2006 -5136 66098 155227 129341 88737 79413 130466 157656
7090 157656 94026 100934 99726 72745 51127 67681 74485 84753 120769 68868 122900 94913
7078 94913 44698 23573 85183 134509 65349 22048 -52280 -24602 -3119 69326 69194 106572
7066 106572 73341 69733 90671 77570 88084 89392 187862 148620 171617 176216 90967 62900
7054 62900 54730 34764 -10521 11797 78806 114221 85671 56314 125977 148866 114025 46496
7042 46496 70234 33361 15284 70530 52872 101640 90312 83556 102075 141530 153118 163058
7030 163058 90853 120319 113609 79064 133816 107742 113240 89061 108633 121003 109029 123269
7018 123269 87571 150396 137341 107080 64647 86637 107711 105838 105847 92367 109037 65190 33211
7005 33211 53613 20233 477 39442 61827 93762 110112 61055 45990 33089 143140 176243
6993 176243 68379 49027 97118 164347 108480 146446 152404 128644 71150 79726 77172 90995
6981 90995 116681 133704 122595 115831 98350 88172 53217 42969 25859 108585 54584 -22997
6969 -22997 50771 124602 185658 147969 85599 98726 132114 122474 154470 164813 144023 94364
6957 94364 136763 152265 112526 115416 143316 177017 98568 112582 164359 147537 99528 54734
6945 54734 13365 70818 31105 49047 89315 162342 160034 133638 142389 112467 137032 60215
6933 60215 81496 52198 70221 57156 77233 60803 11367 52723 105511 63322 70587 54587
6921 54587 67899 155753 177380 164382 105251 99267 150742 152458 123695 137976 196108 189606
6909 189606 246634 177845 163935 112846 160783 240582 157664 128664 177867 173381 142916 169242
6897 169242 164727 131130 157877 167133 105250 111953 92765 124275 83849 82649 111804 84960
6885 84960 88216 163894 190301 142633 121218 165366 191142 88407 162694 196642 153800 176640
6873 176640 179422 206477 181780 139165 174056 218994 134047 139825 167433 91006 114067 141144
6861 141144 168224 160796 164162 120863 136402 114255 133793 107041 96364 114833 135709 135963
6849 135963 138995 179602 171856 180136 129159 124527 135768 137844 94442 142487 138831 141692 126193
6836 126193 168546 166405 173062 131170 128837 179821 147790 111124 90513 174406 206134 179554
6824 179554 239640 200571 190095 192793 134404 108162 164409 110924 139808 116283 49018 92336
6812 92336 94779 155874 172651 110592 113131 166137 151689 151642 178025 179433 236120 258029 305716
6799 305716 283214 144254 170342 144945 204138 266898 161339 225923 196751 149053 204040
6788 204040 124849 95751 144287 243869 276249 240729 249535 248832 187283 162217 230078 234765
6776 234765 167873 131801 199615 198635 196674 233957 213106 211333 145224 181416 221467 204500
6764 204500 242269 304159 277676 199570 179814 197999 261146 246502 235177 267583 255392 257851
6752 257851 217068 220945 206975 182786 186853 233748 207664 238686 272037 245540 287304 280704
6740 280704 265368 218879 312064 393360 358495 311937 240571 236730 327055 278976 227487 196791
6728 196791 233717 299290 324271 348721 329372 307875 308120 276124 288219 326827 247664 236568
6716 236568 226233 253801 266636 302968 274754 271674 346983 332730 270405 283227 295105 310889
6704 310889 284434 285665 290559 285898 306510 329596 377380 392989 370461 389391 409917 435191
6692 435191 414379 372111 394169 354857 353744 429711 431940 457861 478502 465622 495173 497971
6680 497971 447559 449231 438400 411382 442084 500485 526263 568383 562029 502489 594897 647910
6668 647910 603846 613466 591812 566675 571026 616649 676158 727188 677860 667738 754154 826676
6656 826676 849641 871053 919396 872543 978068 1014438 1036868 1072470 1145390 1220490 1285674
6645 1285674 1329672 1412357 1515812 1527721 1570415 1575803 1646678 1738357 1742426 1701311 1667156 1672407
6633 1672407 1642371 1567812 1557543 1530399 1425317 1374022 1385744 1319327 1243037 1215924 1161871
6622 1161871 1171139 1099160 1012311 974718 919597 865049 852875 826145 809931 705989 739879
6611 739879 775437 703861 639597 601115 578750 664573 705315 598926 580650 555681 555352 549423
6599 549423 560923 595636 615376 579292 496594 475161 471883 441063 493156 489045 502911 584012
6587 584012 527547 493461 441447 427564 517460 492767 406655 396898 429844 423205 429900 491646
6575 491646 511413 524328 499241 523986 477295 390254 462600 465545 475705 441490 432278 423197
6563 423197 479346 483744 466416 473898 490413 464157 400848 421214 461379 442615 416235 435699
6551 435699 367454 352164 392325 387370 412838 396777 413805 465564 479705 517185 485929 465525
6539 465525 465124 373261 383724 516228 554105 531326 488058 453986 473555 506627 492435 485059
6527 485059 542594 555024 492924 399000 386943 363587 357542 361960 381981 415110 490878 497242
6515 497242 403082 384811 390017 376933 376676 400749 460715 426441 470544 488187 453413 494389
6503 494389 520687 498567 484817 473292 465074 471590 471755 503531 539297 549378 513754 449712
6491 449712 428270 515144 510935 437127 464325 483711 461039 540989 476029 472254 478142 507844
6479 507844 468567 444421 494859 508614 499686 564176 562221 593163 632080 609503 603043 630748
6467 630748 596842 502026 514766 576462 586683 545357 568209 595162 559730 568353 559801 532321
6455 532321 595662 576824 632593 651996 631921 679952 701968 641077 623211 630696 665312 660085
6443 660085 685379 635362 656443 673308 683089 624465 667083 716109 706185 700810 684967 693610
6431 693610 754902 846857 772472 806643 794080 775212 875629 846498 773058 804187 826139
6420 826139 831286 825255 780789 791918 791351 812060 841410 794069 848488 889042 917719 884583
6408 884583 915592 927629 965582 951023 968662 1019375 1037262 1055552 1017618 1015938 1039925 1076635
6396 1076635 1141349 1122990 1159786 1229652 1181548 1186325 1252518 1292463 1272106 1231856 1256670 1244250
6384 1244250 1295926 1262092 1161367 1145781 1190035 1233237 1190978 1209249 1256675 1279131 1235676
6373 1235676 1190011 1250950 1305155 1314049 1323614 1303838 1360492 1444751 1464703 1485186 1514038 1558169
6361 1558169 1499246 1501399 1505723 1466474 1451258 1432241 1431546 1387813 1405337 1476506 1497263 1444571
6349 1444571 1369286 1315253 1352135 1301205 1284080 1307937 1428944 1478406 1486008 1468008 1522181
6338 1522181 1645263 1684676 1724263 1843230 1938947 1969561 2027542 2078027 2132112 2159183 2097408
6327 2097408 2091237 2103184 2116996 2150108 2150912 2200919 2199782 2284528 2422960 2516265 2699267 2882967
6315 2882967 2964863 3063474 3176405 3190581 3254741 3277365 3371735 3498462 3511053 3608912 3711050
6304 3711050 3712054 3805606 3941191 4072740 4179918 4132907 4173783 4148513 4021402 3887962 3787780
6293 3787780 3709323 3631214 3505430 3394648 3382907 3428429 3446213 3481185 3570619 3686663 3805068
6282 3805068 3883794 3971721 4069418 4232768 4355586 4480290 4680750 4876001 4979811 5097582
6272 5097582 5115697 5090038 5066786 4998106 4864888 4732285 4619266 4555931 4377594 4251354
6262 4251354 4177617 4143514 4137121 4056061 4033894 4057241 4078330 4143161 4290852 4384314 4583254
6251 4583254 4753192 4930429 5218421 5552809 5961184 6242684 6433446 6651806 6621866 6527837
6241 6527837 6384866 6074055 5782355 5572137 5390530 5176447 4970804 4876508 4900721 4908983
6231 4908983 5000139 5187986 5379934 5432450 5353066 5222110 4997173 4800506 4602688 4423692
6221 4423692 4274249 4204483 4242885 4161616 4052625 4053695 4018135 3953444 3898693 3838888 3645967
6210 3645967 3605368 3607177 3593901 3535246 3549301 3606724 3638521 3634306 3620645 3573933 3591791 3559912
6198 3559912 3637405 3671880 3756608 3776517 3969841 4101073 4247548 4369108 4552621 4867604
6188 4867604 5276478 5725953 6139849 6533166 6781048 6841630 6755761 6575288 6232492 5949759
6178 5949759 5721934 5638495 5485854 5335613 5263601 5301956 5298695 5382571 5464172 5610357 5778640
6167 5778640 6005300 6141767 6300177 6427467 6613224 6792802 7020348 7291778 7789511 8320910
6157 8320910 8966764 9562783 10061246 10440654 10504923 10559457 10611144 10527380 10346770 10090194
6147 10090194 9828911 9529774 9239892 9011301 8908814 8808729 8707225 8729507 8886995 8984591
6137 8984591 9194896 9364822 9592668 9813324 10009211 10423533 10922842 11517830 12080005 12603646
6127 12603646 13085323 13499230 14054670 14796866 15816058 17256760 19058837 21023426 22739798
6118 22739798 23919789 24333853 24103274 23500367 22572679 21529728 20545860 19780007 19222351
6109 19222351 18782665 18632374 18701516 19007586 19530337 20251577 21399540 22919958 24728687
6100 24728687 26690545 28683606 30541041 32137347 33386024 34617176 36148254 38128515
6092 38128515 40849128 44288438 48289814 52521089 56564678 60181598 63339202 65912651
6084 65912651 68159981 70125426 71990428 73458168 74363745 74590977 74141076 73129386 71776519
6075 71776519 70168034 68549293 67107503 65885230 64944158 64187644 63574396 63169255 62975700
6066 62975700 63220597 64052051 65405749 67252976 69528320 72230071 75457723 79023038
6058 79023038 82895286 86938013 91035223 94820322 97700920 98812824 97779381 94290845
6050 94290845 88637509 81415103 73482955 65585463 58240627 51590289 45689036 40585497
6042 40585497 36320429 32886110 29950148 27531285 25607753 24145625 22923409 22018979
6034 22018979 21406341 21046470 20894798 20993296 21442347 22108958 22970998 23997598 25045499
6025 25045499 26043664 26784687 27317138 27672795 27825328 27769690 27594478 27230120 26586101 25766098
6015 25766098 24830015 23768444 22849505 22088904 21499775 21030768 20727406 20594824 20530355
6006 20530355 20638772 20918866 21336549 21813763 22384052 22865517 23171471 23290789 23180262
5997 23180262 22899887 22529647 22030757 21378701 20751904 20123173 19763245 19590480 19655976 20069751
5987 20069751 20705665 21431585 22069375 22482746 22628932 22476314 22136139 21668199 21211833
5978 21211833 20769667 20392249 20088265 19794092 19627920 19671568 19787701 20074978 20488714 21080805
5968 21080805 21750937 22368105 22955660 23390607 23729996 23954411 24166936 24414107 24677172
5959 24677172 24896442 25067138 25197914 25268511 25307694 25257128 25276812 25241730 25335448 25622380
5949 25622380 26109311 26659004 27247473 27758571 28217820 28530101 28656185 28723530 28576193 28432713
5939 28432713 28210389 28069997 28015818 27933079 27870959 27875303 27843752 27728791 27553660 27277068
5929 27277068 26905557 26589822 26206330 25997787 25878422 25692880 25517560 25284937 25092924
5920 25092924 24918259 24782468 24660699 24548403 24407939 24226950 23963302 23525838 23027573
5911 23027573 22584490 22232101 21857682 21524129 21241399 20838481 20323769 19689996 18976710
5902 18976710 18253520 17504584 16803872 16233889 15750575 15346955 15021645 14718873 14518703
5893 14518703 14341062 14095501 13941143 13818413 13662674 13491862 13128955 12755809 12335331
5884 12335331 11896019 11466279 11059011 10660516 10327691 9984453 9648060 9276764 8841108
5875 8841108 8342204 7850695 7305465 6871375 6424791 6068529 5834330 5631413 5456908 5275172
5865 5275172 5154222 5158701 5212354 5160521 5163361 5156514 5034667 4946382 4799108 4598215 4434055
5854 4434055 4220092 4132665 3939077 3773776 3577923 3389776 3306393 3221621 3088486 2938236
5844 2938236 2928039 3028844 2933595 2873456 2827056 2805838 2759613 2725913 2730583 2648687 2587185
5833 2587185 2580856 2602227 2531703 2461560 2459536 2481335 2462619 2530545 2561384 2546747 2567636 2559675
5821 2559675 2556324 2515116 2565830 2661020 2669313 2683803 2739312 2792790 2761866 2647740 2651599 2651761
5809 2651761 2649868 2635649 2500149 2465210 2421798 2365636 2397741 2468255 2482017 2398106 2325216
5798 2325216 2260950 2235820 2220559 2212118 2173536 2085208 2077480 2003568 2032354 2035685 1947235 1958172
5786 1958172 1953556 1912225 1832438 1832232 1855979 1950772 1967220 2002244 2026289 2093626 2126917 2154365
5774 2154365 2216401 2263220 2276682 2301907 2299672 2226131 2258745 2250487 2183965 2214248 2242976 2249687
5762 2249687 2154576 2069413 2047709 2019855 1975949 1951671 1934907 1998153 2108242 2095653 2081938
5751 2081938 2023908 2043626 2030118 2061211 2012051 1992788 1994418 1998705 1990289 2021103 2101261 2109651
5739 2109651 2023793 2067742 2065609 2047484 2019798 1988322 2000242 1876062 1818581 1796578 1695512
5728 1695512 1695038 1713089 1718819 1763667 1723778 1705526 1644984 1623686 1586370 1642585 1646523 1568464
5716 1568464 1670101 1749023 1776896 1750181 1760285 1717479 1655885 1711272 1729972 1704998 1633187
5705 1633187 1621058 1712055 1649140 1636019 1638015 1632233 1627272 1672153 1658538 1640695 1656335 1585133
5693 1585133 1575366 1635106 1663066 1675519 1698724 1668394 1755123 1808298 1836183 1862111 1863567 1859512
5681 1859512 1821009 1833884 1818125 1754332 1722826 1663130 1669133 1708184 1727841 1655740 1674365 1723809
5669 1723809 1743280 1682967 1625464 1634026 1667808 1629871 1623397 1639836 1684270 1663902 1607810 1660526
5657 1660526 1719867 1690473 1721472 1734327 1743749 1770601 1713093 1712013 1772996 1754626 1687948 1767493
5645 1767493 1817739 1733371 1678164 1700688 1658198 1649935 1658907 1715019 1789131 1790594 1731270 1703084
5633 1703084 1718836 1767624 1785232 1735204 1725405 1760376 1766269 1769071 1839136 1810977 1812297 1851401
5621 1851401 1853822 1865670 1867808 1836650 1879723 1893865 1889842 1870186 1872954 1968468 1949169 1931782
5609 1931782 1955641 1936765 1934615 1956361 1969505 1946025 1904368 1829242 1849798 1983630 2014887
5598 2014887 1983984 2008301 1984416 2001230 2075197 2009086 1956485 2034216 1999656 1994474 2044330 2056434
5586 2056434 2067181 2025220 2078723 2193609 2200808 2204540 2281301 2334838 2417113 2518236 2630654
5575 2630654 2720062 2738019 2720554 2742858 2715369 2800048 2863403 2953109 3080586 3189540 3203499
5564 3203499 3353188 3395709 3483147 3485021 3517485 3461216 3454718 3511769 3546099 3586212 3585306 3650616
5552 3650616 3641301 3613044 3540527 3506170 3557298 3616237 3631842 3613549 3672665 3662073 3631233 3642790
5540 3642790 3617921 3652905 3629031 3627895 3646219 3569914 3510895 3446349 3380068 3289884 3160343
5529 3160343 3107819 2965435 2911126 2914908 2914607 2941594 2939367 2895736 2935907 2966117 3072837 3159030
5517 3159030 3237952 3161871 3178793 3213867 3203708 3193781 3226800 3217608 3301622 3338300 3327818 3385509
5505 3385509 3349565 3244348 3198786 3100506 3090626 3129744 3201289 3241846 3262760 3256989 3245316 3238045
5493 3238045 3280354 3193383 3226100 3220056 3176996 3177870 3144010 3126253 3002105 2917925 2809951 2699942
5481 2699942 2685458 2662811 2522372 2487705 2430798 2395149 2326588 2353690 2293898 2288191 2234824
5470 2234824 2244616 2177459 2163604 2231294 2177773 2196004 2220472 2195678 2208862 2217401 2202304 2158092
5458 2158092 2117575 2136759 2158181 2122870 2140946 2195611 2178512 2070231 2064999 2170788 2177623
5447 2177623 2128827 2155077 2161680 2138086 2187950 2239957 2160659 2114072 2098537 2075223 2111453 2125068
5435 2125068 2094583 2119957 2157687 2192975 2175457 2160753 2173022 2156573 2217712 2249210 2235157
5424 2235157 2260032 2224320 2206832 2270041 2274806 2240273 2254734 2269890 2276944 2257562 2290035 2363274
5412 2363274 2390399 2356644 2355792 2421381 2362850 2378003 2394893 2432586 2429518 2413211 2413338 2421756 2386103
5399 2386103 2384068 2403252 2423681 2410215 2402118 2424717 2470432 2486313 2528657 2597333 2565590 2549363
5387 2549363 2672851 2671065 2582978 2565312 2560897 2606152 2598608 2626500 2517895 2451502 2490187 2560808
5375 2560808 2583882 2578599 2592765 2568974 2611117 2698716 2660622 2573945 2614424 2630684 2689679 2700640
5363 2700640 2728100 2692395 2674015 2688855 2712064 2694669 2659196 2696177 2755620 2769161 2741772
5352 2741772 2742839 2779078 2799390 2775313 2779828 2796762 2832573 2785109 2851871 2852521 2867624 2929204
5340 2929204 2930462 2976203 3089556 3138399 3202196 3220186 3204499 3241938 3260761 3233486 3227776 3267476
5328 3267476 3211842 3219421 3228099 3224457 3240713 3187727 3205262 3259981 3299901 3258477 3193245 3199511
5316 3199511 3183442 3214453 3218957 3279015 3277644 3320145 3384743 3380781 3371132 3354493 3411158 3363241
5304 3363241 3430395 3354330 3318471 3423187 3464374 3514973 3559316 3602887 3753062 3798127 3842062
5293 3842062 3937099 4031278 4137043 4256182 4238106 4175786 4110489 4072884 4068334 4046056 4084808
5282 4084808 4162364 4238593 4301827 4391089 4474275 4548648 4634483 4725547 4759063 4819889 4737333
5271 4737333 4646932 4601978 4611231 4573250 4420673 4362571 4308209 4257608 4308741 4331770 4437285
5260 4437285 4471825 4506663 4478383 4464197 4381590 4328822 4241738 4135328 4103854 4047303 4007865
5249 4007865 3889785 3778266 3790687 3767155 3800223 3891134 3983795 4001831 3988644 3938726 3887804
5238 3887804 3835926 3785816 3770486 3764649 3757886 3691324 3572010 3615663 3629255 3615553 3641450 3551293
5226 3551293 3582013 3603398 3649690 3684859 3676668 3699932 3688769 3719132 3769071 3801052 3847782 3844895
5214 3844895 3783289 3798628 3864575 3908546 3963751 3943778 3899806 3989454 4044390 3977806 3955391
5203 3955391 3991856 4022476 4128266 4146103 4153130 4170500 4172342 4184381 4156034 4107383 4108618 4123617
5191 4123617 4147730 4151131 4151968 4219074 4167832 4264224 4272471 4231405 4260142 4364285 4336165 4383677
5179 4383677 4412654 4404905 4391088 4423354 4441188 4346779 4394339 4479267 4512749 4611242 4569730 4530861
5167 4530861 4537630 4489499 4454578 4507055 4480856 4452751 4512680 4446720 4463656 4503239 4495794 4515819
5155 4515819 4511166 4473601 4424683 4497846 4560326 4574369 4557402 4562583 4600394 4638541 4620053 4565776
5143 4565776 4618824 4599049 4588755 4588165 4590076 4607585 4612810 4606102 4607447 4630382 4590540 4479199
5131 4479199 4539673 4530579 4556334 4633919 4586568 4587296 4571101 4606029 4633304 4601341 4607623 4604062
5119 4604062 4638571 4654795 4654952 4637162 4594463 4603161 4631086 4695162 4788430 4824376 4861090 4928125
5107 4928125 4998461 5072881 5117850 5143703 5086814 5114562 5196452 5265108 5268754 5306770 5399562 5402893
5095 5402893 5373794 5320996 5312809 5298194 5281333 5380214 5388959 5353233 5337425 5331310 5337333 5365379
5083 5365379 5483095 5503628 5544453 5553408 5584177 5596399 5654083 5672403 5623791 5598864 5598586 5592571
5071 5592571 5589442 5533702 5549968 5640333 5566775 5543526 5545388 5468209 5513821 5502351 5550139 5558767
5059 5558767 5598034 5629531 5591336 5664488 5706414 5686129 5747114 5809715 5840081 5870800 5894036
5048 5894036 5858461 5908518 5995262 6056342 6092469 6082449 6119141 6194962 6249958 6323788 6391325
5037 6391325 6449917 6468810 6530022 6599192 6608613 6678070 6728915 6844903 6862019 6918320 6970824
5026 6970824 7034901 7123280 7148417 7224008 7342618 7444353 7496002 7588246 7717447 7845862 7878594
5015 7878594 7924818 8081272 8219615 8397140 8528187 8634146 8724968 8840017 8957247 9110952
5005 9110952 9304811 9437224 9595551 9772194 9852016 9993981 10094215 10229131 10301071 10516248
4995 10516248 10651044 10762933 10843633 10914253 11074615 11344510 11538844 11695937 11885234 12068716
4985 12068716 12306689 12529070 12698313 12889130 13171942 13441984 13673797 13894487 14154312
4976 14154312 14291077 14467458 14645639 14859874 15101089 15217708 15339687 15550029 15706599
4967 15706599 15940874 16148678 16367297 16571769 16806352 17060709 17320121 17753657 18141867
4958 18141867 18556843 18994705 19484664 20039495 20589612 21201230 21944401 22674575 23537418
4949 23537418 24395627 25311834 26440395 27641314 29115396 30742073 32565488 34534486
4941 34534486 36414011 38262299 40093108 41789880 43505212 45041975 46494970 48114605
4933 48114605 49957706 51768913 53803886 55979424 58330539 61023043 63856867 67017327
4925 67017327 70389508 73920720 77558618 81171366 84888809 88719345 92621711 96534204
4917 96534204 100540910 104563714 108369759 112015390 115355875 118405080 121153152 123580373
4909 123580373 125774824 127719485 129443212 131046698 132661455 134276830 136076952 138152460
4901 138152460 140581701 143272060 146426333 150068245 154304809 159143589 164516649 170492994
4893 170492994 176878763 183410059 189679527 195267936 200000028 203482328 205683017 206706776
4885 206706776 206623574 205461614 203331168 200466325 196968108 193201053 189242764 185398321
4877 185398321 181920752 178833435 176411381 174586425 173339010 172665819 172586854 172925398 173532261
4868 173532261 174276363 174903666 175429463 175452559 174921285 173797428 172082352 169839524 167263980
4859 167263980 164260968 160819633 156714181 151900366 146607552 141192837 135996012 131385841
4851 131385841 127324013 123566977 119902475 116344863 112978911 109921248 107322847 105240315
4843 105240315 103793864 102745526 102037111 101515424 101069771 100777044 100742950 100937597 101332683
4834 101332683 101901608 102446347 102985987 103385655 103407539 102891868 101831118 100126053 97900572
4825 97900572 95411989 92829612 90349860 88025791 85815205 83921846 82538624 81548467
4817 81548467 81255134 81620601 82578500 84113692 85946776 87785683 89407536 90857114 92042230
4808 92042230 92955903 93604122 93876510 93645740 92744872 91177998 89102461 86623966 83957616
4799 83957616 81293738 78672571 76094007 73552286 71024216 68569591 66255420 64100938
4791 64100938 62165864 60660019 59613719 58936499 58342242 57801604 57055317 56095260 54968593
4782 54968593 53705595 52491483 51197528 49907859 48580683 47263598 45989888 44756235
4774 44756235 43393192 42051775 40614732 39117996 37626039 36090740 34635007 33217074
4766 33217074 31936541 30893746 30070908 29508413 29260838 29373837 29771813 30450584 31307713
4757 31307713 32071091 32483105 32410914 31944311 31148818 30113049 28994457 27880838 26915513
4748 26915513 26117816 25564115 25315865 25266337 25512209 26055246 26704782 27264977 27507290 27387326
4738 27387326 26893200 26000349 24919326 23807921 22744534 21758723 20992515 20416073 20044533
4729 20044533 19976128 20213278 20627524 21238586 21963772 22531139 22897359 22865753 22443109 21795986
4719 21795986 20953635 19988361 19052363 18255533 17560016 16872376 16362455 15970910 15644616
4710 15644616 15435598 15329889 15259530 15262110 15332887 15466928 15631568 15840755 16110406 16424664
4700 16424664 16796740 17289748 17794562 18340622 19107712 20020786 21231891 22833886 24832094
4691 24832094 27284512 30073151 32854450 35102072 36649301 37238065 36813758 35615592
4683 35615592 33968918 32062387 30152504 28400630 26983663 25820032 25128096 24940576
4675 24940576 25076270 25641429 26712369 27978894 29170104 30135160 30698282 30924132 30592102
4666 30592102 30051941 29498954 28975188 28553482 28256894 28059271 27978807 28026323 28241384 28514811
4656 28514811 29015994 29794229 30628768 31462494 32135156 32590525 32762301 32546168 32014311
4647 32014311 31173497 30245817 29474561 28989070 28788943 29075549 29818678 31232753 33203236
4638 33203236 35613988 38297774 40774582 42939255 44384214 45040364 44990772 44257746 43250298
4629 43250298 42009085 40854984 39861972 38936629 38096958 37242556 36309528 35390649 34411541
4620 34411541 33568840 32903551 32332980 31727285 30921033 30012359 28973244 27891215 26970863
4611 26970863 26172517 25638291 25574353 25859946 26460474 27213879 28246245 29445303 30885958
4602 30885958 32559237 34258889 35947281 37317776 38124371 38421617 38088304 37159019 35889705
4593 35889705 34472340 33077684 31620530 30456291 29508901 28692336 27969561 27383068 26907576
4584 26907576 26376276 25818616 25116660 24162707 23023038 21808801 20539087 19326422 18183258
4575 18183258 17300218 16493658 15924361 15523832 15340279 15342612 15502875 15842022 16329318 16866381
4565 16866381 17310225 17544455 17653560 17421778 16979821 16214417 15340464 14413678 13513956
4556 13513956 12632457 11914879 11277275 10721032 10257525 9772484 9414331 9012834 8711601
4547 8711601 8419421 8133386 7887769 7662767 7423000 7194039 6981246 6873693 6761196 6697841
4537 6697841 6583458 6489661 6357699 6281244 6135166 6093774 6059197 6071727 6133275 6031354 5979290
4526 5979290 5965079 5904521 5920438 5840714 5807681 5812018 5815150 5761157 5818735 5840541 5832225 5881113
4514 5881113 5855875 5902560 5892293 5887493 5852346 5832006 5804932 5793898 5810996 5757720 5759046 5763804
4502 5763804 5782511 5761440 5812402 5770011 5725984 5733353 5781455 5856402 5896299 5944976 5958773 6110156
4490 6110156 6107528 6092179 6109291 6084521 6130404 6157785 6103353 6161636 6176051 6239945 6317478 6550000
4478 6550000 6571580 6646633 6761441 6823983 6929806 7090178 7352265 7831827 8524113 9247859
4468 9247859 9836747 10078665 9970226 9611800 9071740 8538795 8104753 7740091 7474587 7300061
4458 7300061 7181541 7120964 7061574 6959727 6909061 6818789 6775046 6630016 6560034 6475042 6389565
4447 6389565 6462721 6450482 6430050 6465895 6490344 6492707 6521927 6425135 6415407 6390668 6259961 6204884
4435 6204884 6133273 6055791 6023646 5949232 5929789 5932249 5821603 5847134 5846425 5847336 5804560 5859763
4423 5859763 5900163 5918497 5903073 5946251 5964136 5978438 5998983 6029177 6062790 6083718 6182358
4412 6182358 6195693 6187243 6232965 6354977 6365986 6469345 6648349 6725167 6788116 6892085 7106220
4401 7106220 7260166 7432782 7563774 7595791 7629892 7660120 7658437 7721973 7737202 7712231 7789094
4390 7789094 7978862 8104823 8275873 8373686 8461868 8697088 8938990 9215758 9526637 9802842
4380 9802842 10068696 10344918 10612628 10842917 11077246 11199215 11248101 11134347 11045917 11051988
4370 11051988 11022428 11009003 11007793 11095082 11249639 11447434 11634985 11873215 12090879 12308312
4360 12308312 12406094 12516415 12607126 12621352 12703296 12736264 12731202 12672191 12531161 12293722 12080797
4349 12080797 11862319 11629629 11508206 11408343 11461612 11524367 11670906 11943031 12117261 12309875
4339 12309875 12481063 12536859 12692892 12690565 12687392 12703709 12680870 12801754 12961238 13047174 13104046
4328 13104046 13184870 13178149 13205706 13253980 13322630 13445124 13617496 13968102 14495534 15006282
4318 15006282 15544387 16014106 16405614 16752779 16900989 16950270 16944073 16861008 16871806 16947642
4308 16947642 17141662 17386833 17563202 17740741 17843566 17888132 17877861 17878160 17884620 17946679 18094147
4297 18094147 18302348 18501785 18676302 18673952 18447836 18092527 17696178 17264082 16891958 16477501
4287 16477501 16212412 16060895 15961413 15947369 15977890 16037157 16120317 16103897 16111846 15985448 15863861
4276 15863861 15893941 16005204 16041949 16082154 16200774 16167835 16006907 15921047 15838154 15643972
4266 15643972 15450242 15299306 15253036 15273834 15307079 15452494 15695761 15947865 16209743 16440671
4256 16440671 16611169 16755840 16829044 16943181 17024033 16990418 17006350 17028734 16972911 16781596
4246 16781596 16640820 16634989 16681990 16622777 16808661 17079122 17411608 17835637 18346864 18802642
4236 18802642 19150898 19504143 19756548 19957663 20276266 20404203 20581139 20729960 20961923
4227 20961923 21326216 21686893 22111054 22571086 23068607 23610314 24154516 24728948 25376579
4218 25376579 26021466 26693345 27364878 28110964 28736838 29452388 30221584 30938712 31659405
4209 31659405 32447504 33321098 33986873 34736835 35552249 36255017 36994033 37756768 38636701
4200 38636701 39444851 40233848 41103219 42156766 43186135 44154170 45201854 46300281 47487405
4191 47487405 48755772 50147815 51435632 52971202 54599050 56333069 58219938 60160757
4183 60160757 62093298 63784727 65361173 66700988 67868220 68868138 69816696 70810795 71831186
4174 71831186 72934008 74064526 75216461 76262858 77294857 78300433 79139936 79987993
4166 79987993 80757858 81443458 82220280 83137872 84321312 85793276 87666335 90060225 92962451
4157 92962451 96329189 100169575 104086438 107986910 111762529 115375455 118706942 121855577
4149 121855577 125042038 128328598 131722363 135064110 138291115 141137435 143569098 145466627
4141 145466627 146811795 147860993 148538702 149063732 149672674 150257054 151091746 152355404 154088004
4132 154088004 156762817 160462678 164585933 168638319 172873667 177939456 183019664 187805164
4124 187805164 191706527 194121754 194946997 194311655 193062298 191984930 191348438 191136824 191045237
4115 191045237 190916591 190515698 189826899 188684117 187040460 184904802 182341210 179323432
4107 179323432 175864900 172222418 168329451 164298458 160315459 156628234 153699566 151838537
4099 151838537 151185630 151554486 152037457 151742894 149961879 146531508 141806229 136393996 130879008
4090 130879008 125783416 121397723 117688420 114622979 111956989 109573254 107355407 105047518
4082 105047518 102658451 100082144 97482044 94880814 92325253 89660454 86966972 84243371
4074 84243371 81464215 78702705 75953892 73424220 71240569 69372021 67642440 65953523
4066 65953523 64333946 62633111 60926166 59228896 57512755 56001869 54626286 53406607
4058 53406607 52349950 51308045 50274870 49265940 48241887 47181679 46170444 45090169
4050 45090169 44075563 42986801 41808008 40728744 39512651 38318292 37091823 35958465
4042 35958465 35023981 34005116 33136785 32297288 31446242 30680918 29946999 29216430 28581435
4033 28581435 28053091 27540548 27003444 26366159 25806242 25192515 24662709 24120607 23618248
4024 23618248 23146855 22692249 22339461 22013557 21671072 21401416 21126937 20888292 20751920
4015 20751920 20553493 20283850 20127176 19837274 19560565 19370176 19242687 19209366 19104843 18991728
4005 18991728 19083669 19181997 19291185 19422329 19607832 19791655 19994225 20264729 20467292 20696513
3995 20696513 20905058 21043521 21108129 21227956 21288034 21246276 21201168 21272013 21396620 21593525
3985 21593525 21820638 22151381 22572928 22995533 23439579 23886363 24212297 24537316 24794741
3976 24794741 25003727 25100267 25254479 25279289 25321545 25330896 25386999 25523509 25679066 25880910
3966 25880910 26263033 26797071 27395436 28046637 28665676 29291331 29932832 30515752 31013325
3957 31013325 31524140 32040624 32642277 33251992 33988844 34852105 35789399 36830440 37988962
3948 37988962 39238878 40546909 41925245 43344102 44788071 46227147 47618096 49007536
3940 49007536 50126274 51183728 52010776 52737848 53347105 53797387 54112225 54451992 54810322
3931 54810322 55237964 55875434 56610715 57458944 58319210 58997576 59488902 59777981 59765869 59596187
3921 59596187 59071092 58341151 57413982 56514460 55683721 55006923 54620388 54446924 54325690
3912 54325690 54174779 53954531 53677366 53164460 52446324 51593379 50646671 49569999 48545653
3903 48545653 47537368 46668317 45973194 45405221 44945928 44434024 43846753 43245452 42639366
3894 42639366 42030519 41505104 41041570 40658882 40435351 40308718 40300006 40420922 40716301 41026281
3884 41026281 41406065 42011771 42492205 42955640 43476485 44028342 44521508 44941383 45425045
3875 45425045 45923703 46332328 46875389 47552988 48280770 48962826 49524067 49657947 49422577
3866 49422577 48844247 47903680 46839343 45629296 44484197 43643767 43018875 42707490 42668100
3857 42668100 42951126 43379994 44085172 45028626 46232880 47637939 49232511 50782208 52237488
3848 52237488 53373139 54118379 54272505 53817004 52826276 51444107 49893248 48208041 46622048
3839 46622048 45221345 44093064 43417067 43264353 43592680 44401403 45765937 47742797 50051253
3830 50051253 52610170 55139127 57488416 59360273 60605906 61050074 60715531 59756154 58370906
3821 58370906 56686723 54997570 53379804 52047094 51149597 50475208 50059688 49840472 49773158
3812 49773158 49713335 49559950 49379367 49263651 49134970 49076388 49235131 49691753 50480429 51528888
3802 51528888 52703862 54003123 55421264 56628327 57742790 58652446 59455750 60163100 60616551
3793 60616551 60975388 61336024 61529104 61471553 61275412 60906337 60431327 59719391 58738530 57647788
3783 57647788 56531065 55312003 54200442 53346154 52626328 52002207 51502852 50864152 50088855
3774 50088855 49047329 47726482 46111934 44376125 42814710 41291431 39892627 38697489
3766 38697489 37660037 36828636 36096015 35383972 34482116 33624664 32704925 31721080 30663478
3757 30663478 29493699 28373749 27163127 26053445 24921776 23936600 22970733 22144515 21420147
3748 21420147 20899403 20529976 20210306 19966522 19782093 19585457 19413242 19312939 19339455 19348751
3738 19348751 19333559 19392656 19399576 19406405 19313070 19065288 18797533 18396336 18137020 17892802 17662955
3727 17662955 17453049 17335202 17321001 17402633 17599795 17861713 18133776 18359411 18526430 18739040
3717 18739040 18880848 18875118 18798179 18656648 18421289 18140888 17813325 17333568 16872041 16301717
3707 16301717 15633888 15000966 14375075 13742540 13133277 12573421 12061785 11578877 11195878
3698 11195878 10904261 10646564 10365110 10160000 10004240 9762561 9601637 9481762 9349497
3689 9349497 9318668 9175854 9071664 9046786 8986894 8927609 8992693 9061790 9186356 9266183 9340298
3678 9340298 9378235 9570626 9684479 9679734 9705358 9819712 9947807 9970545 10018500 10039442 9943213
3667 9943213 9883290 9831633 9789718 9809298 9751261 9705532 9709924 9781698 9858198 9922191 9941609 9980854
3655 9980854 10076272 10148298 10194086 10161971 10164016 10097987 10059351 10007179 9973878 9942919 9965004 10025210
3643 10025210 10097067 10265643 10480568 10848662 11138644 11457279 11797602 12050400 12248451 12429335
3633 12429335 12505732 12702385 12919785 13125425 13405202 13483998 13662145 13895341 13979993 14046337
3623 14046337 14127169 14295412 14404980 14546846 14769943 14984323 15190804 15471572 15740050 16033365
3613 16033365 16411888 16703115 17006970 17319753 17716091 18104340 18508410 19007149 19493471
3604 19493471 19880711 20255611 20597321 21013146 21307366 21657926 22030637 22430647 22894141
3595 22894141 23375286 24034057 24726055 25732660 26981150 28336003 29877592 31639849 33393206
3586 33393206 35265293 37087700 38794447 40402510 41790127 42943741 43830570 44449904
3578 44449904 44795998 44839051 44767929 44584281 44187276 43735299 43106584 42128102 40751701 39129826
3568 39129826 37422399 35679305 33987856 32410157 30916472 29561989 28294812 27139852
3560 27139852 26083209 25226474 24458474 23653631 23003216 22470407 22032247 21695150 21457537
3551 21457537 21340610 21220095 21134498 21107741 21057282 21061612 20989126 21022535 21095222 21142142 21221968
3540 21221968 21381681 21480521 21513167 21517448 21556625 21583680 21507311 21471075 21406116 21434308 21522396
3529 21522396 21699350 21845104 22007144 22193981 22357753 22554769 22746022 22858199 22977533
3520 22977533 22919081 22648934 22355531 21914521 21387751 20784685 20138704 19482501 18843183 18178700
3510 18178700 17672793 17162842 16558354 15981440 15438936 14965022 14576938 14128302 13675138
3501 13675138 13305155 12935663 12696271 12522065 12384940 12219491 12172426 12283647 12289221 12451336
3491 12451336 12621791 12806869 12967978 13090973 13300384 13508881 13784341 14030152 14265908
3482 14265908 14480861 14673022 14862913 14988346 15124447 15189367 15186552 15228934 15210158 15189739
3472 15189739 15271452 15394265 15446167 15562199 15711508 15750676 15803220 15828337 15823874 15795021 15867993
3461 15867993 16035689 16290451 16589497 16911731 17235694 17548045 17787320 17840134 17820766 17737588
3451 17737588 17507276 17126578 16716211 16273543 15853045 15450885 15123376 14805719 14537268
3442 14537268 14409247 14255024 14245561 14487656 14675816 14882669 15238208 15592853 15911453 16212227
3432 16212227 16570746 16930935 17227904 17588433 17932867 18259578 18552066 18806926 19120374
3423 19120374 19401714 19606184 19828879 20034676 20291877 20539317 20803987 21148254 21547694
3414 21547694 21996548 22419186 22726721 22951367 23153407 23191697 23205099 23167431 23058825 23046250
3404 23046250 23052460 23118609 23208274 23202810 23172899 23218483 23110404 23034870 22856512 22794565 22655713
3393 22655713 22481332 22394490 22376635 22449283 22623495 22939455 23355982 23951728 24605894 25167797
3383 25167797 25647668 25968328 26193492 26453473 26650765 26984836 27538911 28329439 29287690
3374 29287690 30417389 31674476 33153385 34898113 36886196 39158863 41902478 45013629
3366 45013629 48515574 52121930 55637170 58812896 61242757 62915965 63641032 63364002
3358 63364002 62189051 60329294 57901684 55089699 52014129 48953835 45914875 42965111
3350 42965111 40238351 37767063 35597431 33760393 32180418 30934945 30085693 29503591
3342 29503591 29252020 29248137 29512807 30098399 30947451 31947077 33188975 34774803 36493624
3333 36493624 38308098 40389838 42519902 44768781 47069585 49282305 51328932 53056079
3325 53056079 54243647 54768181 54598745 53974281 52888866 51463015 50095798 48647964 47116563
3316 47116563 45477604 43685975 41894075 40065142 38222078 36518215 35069723 33849551
3308 33849551 32794407 31915696 31218785 30724755 30568700 30575289 30969479 31931749 33643461
3299 33643461 36245428 39559944 42846709 45448784 46732149 46528828 45034762 42901815
3291 42901815 40757053 38989951 37754032 36837020 36395726 36353467 36583335 37168524 38102572
3282 38102572 39427005 41105925 43157560 45588408 48407776 51793057 55990258 61070037
3274 61070037 67272351 75006825 84679706 96621203 110786540 126558502 142438797 156978005
3266 156978005 169013903 178004113 184466892 189535157 194208291 198571614 201843685 202717154
3258 202717154 199875972 192827118 181811947 168014842 152766344 137358237 122956363
3251 122956363 110235710 99651458 91261459 85252253 81372977 78937096 77417932 76250173
3243 76250173 75099681 73535580 71479905 69248431 67088826 65418707 64424894 63833831
3235 63833831 63456887 62799377 61577215 59951861 58312061 57053331 56614496 56979820 57948854
3226 57948854 59124131 60195591 60567020 60002373 58479929 56258392 53661043 50919028
3218 50919028 48377756 46188258 44415594 42961501 41753194 40864387 40285641 40066301 40065505
3209 40065505 40201020 40599358 41126276 41767686 42390952 42864938 43203771 43458411 43531513 43425051
3199 43425051 43391784 43475676 43502241 43668232 44035085 44476799 45050423 45935185 47114708 48527249
3189 48527249 50195012 52199866 54580072 57435065 60867762 65093688 70338370 76924337
3181 76924337 85303692 95523690 107625517 121380303 136069423 150868704 165497427
3174 165497427 180162457 195113198 210275951 224733142 236796630 244461897 246060274
3167 246060274 241366276 231655386 218723049 204757659 191728364 180810541 173157978
3160 173157978 169442915 170328151 176871525 190359866 211508050 239604707 272193769 305282117
3152 305282117 334415822 355919477 366960112 366767371 357207940 342067223 325991733
3145 325991733 313307694 307022183 306972818 310253247 312735371 311435735 305003135 294455096
3137 294455096 282191814 270428711 260657332 252514691 244686702 235614372 224181476 210178269
3129 210178269 194203709 177635023 161686129 147413656 135607466 126737819 121486581
3122 121486581 120533644 124086366 131410256 140231975 147288125 150082642 147340161 139539615
3114 139539615 128456496 116165002 104570097 94215164 85339519 77883188 71623694
3107 71623694 66532434 62269731 58769404 56122697 53978078 52328393 51175460 50376725
3099 50376725 49931746 49899075 50250488 50892538 51537202 52050015 52026354 51272964 49720261 47305691
3089 47305691 44623064 41861331 39233992 36891105 34953120 33466747 32155501 31047225
3081 31047225 29965520 28977075 27886234 26799123 25759495 24693365 23523372 22451977
3073 22451977 21567483 20783886 20096119 19370619 18784977 18239925 17824700 17458113 17095554
3064 17095554 16769803 16457261 16253428 16088758 15963193 15845633 15792992 15906588 15959054 16082174
3054 16082174 16337318 16648893 16996105 17416269 17891698 18534187 19376845 20744689 22746391
3045 22746391 25433020 28787278 32426348 35839656 38337596 39300372 38834294 37299822
3037 37299822 35110244 32634835 30110884 27831357 25776859 23924422 22366564 21143676
3029 21143676 20260789 19693870 19380894 19418824 19663595 19986047 20393441 20772811 21113053 21255811
3019 21255811 21025344 20563645 19882259 18873309 17738941 16483777 15309003 14177408 13126021
3010 13126021 12296641 11496550 10814920 10324168 9909642 9483529 9143354 8836136 8531110
3001 8531110 8337505 8133752 8051643 8004923 7992951 8027835 8174869 8269381 8266408 8328751 8293801
2990 8293801 8308999 8286226 8284948 8355048 8565354 8929972 9498758 10111170 10773367 11378755
2980 11378755 12006220 12444603 12638228 12616823 12309190 11872996 11336647 10814887 10234057 9672781
2970 9672781 9249258 8959435 8745069 8713605 8867103 9154576 9525546 9958718 10385601 10714337
2960 10714337 10880950 10730121 10302675 9829859 9111352 8500718 7895964 7315353 6772271
2951 6772271 6222635 5836591 5481889 5127115 4800717 4505231 4373190 4289730 4098272 4027269
2941 4027269 3995265 3970815 3849069 3691561 3611734 3510165 3395739 3308294 3272805 3193921 3076787
2930 3076787 2995965 2991331 2946601 2954710 2907266 2806635 2809711 2771136 2732344 2716977 2704871 2746610
2918 2746610 2753107 2747952 2696855 2648428 2628299 2585941 2552574 2544849 2601885 2535955 2486184 2449775
2906 2449775 2390317 2353652 2445710 2539320 2557143 2628204 2705993 2800669 2901804 2982765 3055126
2895 3055126 3121864 3205573 3136606 3146353 3165005 3243757 3252435 3358140 3488964 3516892 3512374 3489703
2883 3489703 3425114 3283197 3082696 2908141 2779981 2696833 2538130 2537412 2493679 2401327 2487627
2872 2487627 2662975 2803124 2944648 3045808 3119340 3212480 3175679 3190743 3192031 3048401 2952066
2861 2952066 2914847 2869073 2888668 2783359 2757432 2740858 2731625 2658201 2527903 2413705 2473886
2850 2473886 2438989 2324804 2237496 2154722 2114124 2019958 1984570 1901392 1805131 1706344 1763184
2839 1763184 1744139 1675936 1682830 1709433 1842125 1877074 1926003 1776822 1729866 1682505 1612275
2828 1612275 1520946 1512355 1459738 1326230 1287712 1240910 1218135 1221961 1198982 1152407 1125733 1159055
2816 1159055 1075517 975373 981569 1075919 1101119 1085244 1032733 1016202 1007800 1026720 971709 939722
2804 939722 993557 1003819 994192 969478 973966 900522 899772 860915 866288 853029 839433 897389 875343
2791 875343 794132 784840 882906 935654 903390 903021 817992 818563 828120 841338 862640 786291 782611
2778 782611 778608 816223 890172 855711 848397 808260 789703 751953 780495 803572 846454 913335
2766 913335 955322 909959 926376 945809 1002951 1047977 979303 953550 938696 929014 897665 878356
2754 878356 923014 877336 785814 816278 751954 753366 716603 698300 723811 773427 812882 790215
2742 790215 756232 700611 718021 764225 813306 827871 783605 735667 777791 748127 778177 734373
2730 734373 666665 663083 669314 645669 692914 712202 674237 607240 626481 722511 671810 707658
2718 707658 712633 614267 647567 664376 642068 674597 701839 686251 642931 607360 597220 581194
2706 581194 607145 635295 716213 647404 612231 666607 558371 555870 541231 570799 537796 484606
2694 484606 537985 553190 507921 583669 566669 509734 503117 560271 529438 499007 500535 494196
2682 494196 550397 520079 547014 548037 527044 537382 486459 490808 528682 523954 478410 443230
2670 443230 515701 492894 406995 483383 429455 433738 494767 496869 483025 438527 527005 578450
2658 578450 525817 511194 505587 476485 487149 481553 489777 530501 490560 434376 456908 483098
2646 483098 540009 488795 427141 442155 396243 400561 434609 425247 431035 436226 474104 500780
2634 500780 492875 506797 454133 451386 388240 373833 455638 510489 468513 443070 350380 376060
2622 376060 374959 379437 379169 463205 440151 336032 400677 426812 399650 446429 366569 339330
2610 339330 404550 402522 386134 413399 375331 258774 312280 326313 319707 330236 313639 336341
2598 336341 389499 403902 387891 338254 353062 307786 310693 298422 356308 326425 331648 373949
2586 373949 472812 393758 321215 308092 356345 414337 434221 361504 305536 369030 303298 330536
2574 330536 342751 326425 351110 356792 363126 392820 416267 387560 376888 375200 341263 326905
2562 326905 375376 298571 268266 311395 393642 355704 429267 431416 399194 364638 407645 411644
2550 411644 359082 419074 358397 339334 357762 385784 400563 362684 401745 335311 357299 337652
2538 337652 297151 350945 360919 386639 432275 454313 431974 494666 496716 472148 452161 500700
2526 500700 475113 474754 465489 467296 478493 440799 413538 512506 546989 458749 410379 424861
2514 424861 472815 575588 625457 577898 581972 623877 524388 538615 504445 490778 551975 502752
2502 502752 505899 515423 551302 546445 487446 464510 497369 563095 559015 544716 626250 631504 558014
2489 558014 587134 593593 577194 546868 593338 600012 673831 774512 768734 742953 774751 742291
2477 742291 711880 697100 742176 719431 795295 809903 839176 886573 886869 931590 973342 1007556
2465 1007556 1046685 1063125 1083126 1168405 1248222 1268922 1322843 1401185 1537856 1647283 1873810
2454 1873810 2072413 2282120 2698708 3045974 3282904 3525786 3684608 3886409 4035742 4227221
2444 4227221 4578914 5220835 6073163 7369546 9510311 13501245 19796187 27188555 33471902
2435 33471902 37196977 37277171 33589432 28673774 23028809 18623977 15332811 12415262
2427 12415262 9953630 8035605 6594728 5482063 4757074 4375947 4046748 3751794 3490703
2418 3490703 3174572 2894235 2600848 2408211 2157139 2011728 1963937 1922339 1808333 1730689
2408 1730689 1703597 1641317 1497721 1406885 1320216 1250291 1222856 1203529 1164044 1105381 1065883
2397 1065883 1060775 994263 977699 959189 942695 892388 947508 882879 855052 861783 791726 768262
2385 768262 741841 760503 751216 699135 767128 739731 678767 650985 622093 627290 522642 535698
2373 535698 523441 552603 576296 537712 538173 542952 527584 458409 375255 372684 437165 417436
2361 417436 338829 373951 332098 351164 326551 316161 293598 325272 374903 385229 346575 341016
2349 341016 311227 315074 324630 261242 304763 328854 279835 290438 306647 251587 260889 251551
2337 251551 274000 246221 214070 257796 314511 274771 280165 286351 228401 279831 275762 246709
2325 246709 303868 290852 268155 274450 221535 228142 243402 206835 241613 230581 186167 144487
2313 144487 232011 262072 149798 160130 172942 78250 104063 162840 205406 198657 186747 161932
2301 161932 178706 163200 204420 181609 160236 148005 166581 179426 116304 102482 123227 65093
2289 65093 109988 154243 136502 161504 161636 126504 84685 96552 109393 129345 106463 92388
2277 92388 87056 117845 173985 173372 164004 137595 87847 85128 92594 133395 125687 131807 171003
2264 171003 181592 153929 150039 169561 153077 127368 69344 32814 127010 61414 53337 -11375
2252 -11375 48909 96636 126396 168329 122638 112919 108355 99699 120027 155346 174439 134033
2240 134033 65643 66239 56467 18851 69658 52837 42383 -8712 9751 55412 24626 58731
2228 58731 48955 116884 117250 110413 56669 65711 53940 72726 73306 93684 -10615 -5514 -20048
2215 -20048 26338 108878 75757 75809 52386 63268 83718 55988 47333 14464 29944 69173 58482
2202 58482 70584 82932 64511 163842 170303 163540 101417 65328 72328 90253 73872 18739
2190 18739 44665 24997 58073 51932 100343 115339 19581 59611 83292 62411 119339 95535
2178 95535 74325 38277 93401 117539 124272 89917 105128 93248 131068 218462 237309 240788
2166 240788 325880 265390 199463 132912 99403 164319 190311 207683 92028 82864 60920 42429
2154 42429 117550 136354 142995 130525 108266 118214 151307 137963 45170 -4997 35472 27011
2142 27011 9253 43361 107868 111552 112633 121903 180103 138672 94394 49862 62355 65058 64947
2129 64947 62955 74895 108656 105677 83856 76987 48920 21933 -3130 44264 123265 11698
2117 11698 -332 4553 68972 128543 80193 49562 15127 17227 84857 103911 76268 82864
2105 82864 21298 19757 65546 91375 72459 66582 18570 -5640 16092 42311 23164 31101
2093 31101 20880 27990 98890 63542 50040 22837 33146 91566 3932 42763 107138 58755
2081 58755 36107 4502 34796 10772 49889 43912 46518 25998 6717 72745 31240 -48942
2069 -48942 -93392 16804 57385 31968 15045 -97756 -81054 -19404 17873 -41354 -46623 -58575
2057 -58575 -41252 29395 16621 8490 24344 -15255 -20624 48453 111843 93882 65573 55273
2045 55273 30284 6620 124571 148448 141141 122337 155108 184895 170627 132012 114978 192262
2033 192262 258864 232135 164214 131433 81725 90545 85414 73389 50923 55146 102882 38092
2021 38092 75799 13987 29647 32601 12899 31753 19643 32156 -31313 -37642 45387 42381
2009 42381 -16754 -11903 35524 25737 86267 54820 6298 59503 27196 47782 12649 -222
1997 -222 25489 45076 76096 69509 32770 18299 -18660 56346 53010 9772 11887 7165 -32964
1984 -32964 -15201 90969 189826 57223 -12525 43910 66920 89387 54053 50888 35458 -16932
1972 -16932 3700 58187 57584 59143 -3935 -1129 10431 -51885 -65829 -15424 25819 -28414 -46048
1959 -46048 -52717 -26401 9525 50978 97803 108401 83635 93984 40979 34995 -5 12570
1947 12570 -1032 6500 299 18685 45182 62103 34435 49291 11804 -4460 -3035 -11310 18141
1934 18141 -22249 -55853 -21405 -41851 -68591 -39292 -41478 -8866 55338 32923 47263 24281
1922 24281 78103 105260 78980 98989 72468 41835 -36436 -54264 -19100 -10210 2306 -19378
1910 -19378 -45795 -48912 -57027 -8648 -20624 -52603 -47478 -56024 -69961 -65285 -97529 -63146 -100328
1897 -100328 -96514 -74945 24992 27459 15498 -51578 -48498 -29825 17620 9642 52547 45934 121
1884 121 -56268 -34881 39642 14700 -19169 16302 38756 7682 -41630 -24362 51137 49189
1872 49189 -3205 -25289 -44629 -62888 -41813 -16134 -50925 -30330 -11085 -92497 -65891 -50937
1860 -50937 -27679 36916 26781 11954 36978 12010 7432 -25539 4701 21545 -15835 -29454
1848 -29454 13281 -16021 -48370 -33602 -10476 -31321 -37975 7142 -21634 -39493 19931 65977
1836 65977 104868 25500 33397 44030 34225 -23568 -12755 -7248 8381 13185 -14644 -12420 -16209
1823 -16209 -2565 -12798 -190 9893 40981 47233 90736 28185 25622 -4634 -54870 -17666
1811 -17666 -72065 -53639 -62966 -87362 -28357 -30070 -49051 -18909 -13670 806 -4752 -20737 -2496
1798 -2496 -34354 13588 16010 19394 -43006 27212 105505 51497 -44680 -83947 -38723 33860
1786 33860 36271 63190 -5348 -50441 19137 -29723 25245 44738 42358 -9750 25304 20283
1774 20283 -34481 -71921 -105978 -93993 -74249 -26318 -36907 -67802 -53285 -16736 -18944 -72211
1762 -72211 -72541 -30055 -86763 -107369 -24954 -38261 -33547 -17621 -21549 -46382 -57932 3013 23752
1749 23752 55798 -35368 -1826 46900 -11463 -50058 -76725 -103519 -67116 27020 -10565 44483
1737 44483 33272 -10843 62744 25133 5143 44685 18646 -71362 -9390 7133 -7757 24042
1725 24042 20936 3286 10963 20995 25170 -43170 -28296 -51038 5799 1944 -39196 -42360 38824
1712 38824 49964 -11656 10889 -30450 -4197 -5287 22927 -14367 -42376 -94651 -10281 434
1700 434 -5366 -43428 -8934 24893 32217 -22454 -14256 -8666 -4365 -22592 -15788 -52291 -32890
1687 -32890 -11983 79278 62061 4647 16095 9366 -13074 -19859 -31269 -100497 -49686 -28036
1675 -28036 18244 14055 -1153 -40509 -78394 -28877 -41717 -39225 -18724 6535 18798 -10784
1663 -10784 -76354 -34161 -17804 -37508 -95281 -151240 -100692 -112552 -30220 -59601 -131727 -71037
1651 -71037 -68164 -44213 -26787 -45513 -27487 -55626 -12573 -25895 -10604 -32525 -14982 21939
1639 21939 22525 -31704 -71102 -61869 7717 39144 -13365 -37388 -47792 -88004 -59651 -1744
1627 -1744 70896 24068 -56506 -61555 -27894 -30122 -31501 -62510 -45459 -76313 -41737 -58572 -83174
1614 -83174 -53435 -69662 -86113 8837 49353 -21967 -54139 -92137 -77985 -32284 -49936 -54527
1602 -54527 18795 -21078 -52849 -41956 19398 34238 11886 -9104 -41962 4741 34861 -1586
1590 -1586 -12208 -15113 -42961 5308 43507 26948 8378 -33446 -36049 -70688 -77266 36614
1578 36614 63521 -14228 49009 66444 -11694 -34820 -73487 -74700 -67744 -67147 -58292 -124234 -102878
1565 -102878 -69985 -68139 -46167 -81623 -89538 -149870 -119469 -64658 -60212 -23304 -63268 -27864
1553 -27864 -32539 -21360 -55666 -62809 9549 7701 -36345 -70847 -61926 -14974 -42877 -60627 -74516
1540 -74516 -26287 -14802 -49550 -3944 22247 -50328 -115489 -133063 -52170 2902 -5599 -30656
1528 -30656 -89439 -104208 8927 37674 -2472 -5053 -12905 12638 4097 16435 60899 1020
1516 1020 52766 25607 -31419 -49881 -47869 -413 -46569 -31313 -58680 -71255 -44082 -39959
1504 -39959 -67037 -12508 -50041 -76080 -65470 -27323 -32036 -6240 -21835 -6041 12250 -47987
1492 -47987 -69204 -75841 -43908 -10862 8784 48208 -16887 -58674 -61402 -40586 42762 67434
1480 67434 -50753 -120101 -103529 -85929 -56608 -70206 -13489 9809 -29782 -110654 -91123 -52645
1468 -52645 -47955 -110070 -107083 -84939 -70490 4092 -23105 -49000 -58877 -143150 -49011 -34335
1456 -34335 -76602 -95664 -61863 -17795 -38437 -44493 -48251 -9448 -41849 -62723 -99083 -28542
1444 -28542 -178 13413 -35071 -115471 -150225 -122609 -82677 -62921 -35130 12610 -9376 -6411
1432 -6411 -7311 -9049 -39349 -17011 -33830 -17499 50256 15071 -31546 -23928 11555 -65788 -7763
1419 -7763 1878 -2124 -18669 -42501 -54962 -47490 -13766 -5213 -43706 -106664 -85958 -22819 18117
1406 18117 -3845 -44489 -20022 -60417 -24577 20888 15354 -73853 -79349 -60587 -90807 -91618 -66040
1393 -66040 14307 -12474 -8999 860 17041 36298 -14139 -76643 -28943 29916 -22366 -81429
1381 -81429 -110851 -122110 -136167 -136885 -116098 -41693 -49419 -107544 -85880 -64911 -56715 -123016 -131961
1368 -131961 7014 35016 19059 9433 -8897 -46530 -76498 -85504 -129431 -63225 -63099 -83461
1356 -83461 -72052 -63211 -138492 -130812 -44827 -92401 -103917 -88501 -149124 -148870 -105679 -99814 3581
1343 3581 -21745 -109040 -151654 -153425 -91468 -140005 -96189 -71129 -63250 -63855 -88581 -153826 -149390
1330 -149390 -128979 -102413 -77467 -144638 -100355 -80982 -19062 -5257 18290 4453 -6278 -50935
1318 -50935 -59686 -64013 -65486 12374 -8945 -16178 822 -18287 -66058 11818 -3660 40431 34819
1305 34819 -41306 -1000 -11373 -21759 -4460 -51209 -33669 -6709 -83363 -1996 18027 -11821
1293 -11821 8175 -33844 -69020 -109964 -62269 -4214 -20572 -41204 -73712 -88664 -122134 -169635
1281 -169635 -107474 -78055 -78156 -76540 -40113 -64056 -47147 -20448 -38655 16311 46912 -17423
1269 -17423 -58422 -29776 -24038 -24365 -81413 -54099 1165 -52258 -16090 -52563 -92024 -102848
1257 -102848 -44890 29022 4693 15025 5421 -25716 20396 -61684 -105948 -64494 -59455 -62902
1245 -62902 -77921 -29285 -17335 -18628 1873 18100 6467 -34483 -39956 -44931 -54719 29729 37028
1232 37028 -6482 -33087 -58789 -53939 -25804 -72908 -88164 -131490 -75124 -49328 -11440 -3684
1220 -3684 -17156 -18295 -15632 -29179 51816 -13181 -6761 -16149 -32738 -21321 24110 38671 10819
1207 10819 50852 42883 -7075 -18280 29746 6441 8871 -17659 25345 14777 -10320 13959
1195 13959 -22687 3062 -22570 -70505 -31850 -29267 -35005 34706 42131 -6987 -35370 -124528
1183 -124528 -128859 -91935 -92243 -50563 -66963 -100004 -116163 -43718 38334 -21185 -15465 -17130 -29292
1170 -29292 -25687 -14648 -9196 2514 -6827 -25520 -1744 -13643 -35780 -18554 -28589 -17872
1158 -17872 -45321 -42455 -44826 -23708 -29778 -43006 -84368 -108993 -105012 -75840 -62517 -11407 -32357
1145 -32357 -63577 -147280 -136941 -89408 -64488 -44484 -17467 8715 -1848 -64579 -69164 -81237
1133 -81237 -90761 -27208 -80634 -91704 -111504 -118095 -97157 -65656 -31621 -46107 5103 -12223
1121 -12223 -48442 -78922 -110410 -116046 -110950 -82333 -114787 -104105 -149974 -77102 -56912 -82137
1109 -82137 -78425 -30775 -88614 -104739 -75658 -81784 -91199 -44571 4480 -68206 -142440 -119140
1097 -119140 -72114 -41579 -72532 -149660 -102722 -71707 -41237 -53537 34136 25025 -4883 1155
1085 1155 -5118 349 -28280 -55357 -63940 -33475 -28850 34688 36657 35489 20736 -32034 -44196
1072 -44196 -41411 -42447 -81193 -72872 -108296 -113559 -9331 -14008 -72677 -109448 -92186 -86776 -85730
1059 -85730 -2312 -19628 -41397 -137441 -78143 -86283 -38340 -42275 -37013 -9670 -20494 -7819
1047 -7819 -62302 -76072 -73021 -109286 -124335 -78461 -91236 -61732 -81928 -95819 -106055 -71239
1035 -71239 -79476 -57483 -23100 -16951 -25806 -5514 -72333 -22958 -74981 -113952 -48355 -24292
1023 -24292 -108476 -93537 -64944 -32089 -18365 -48438 -58255 -58456 -35443 -44548 -31357 -81065 -101051
1010 -101051 -115700 -60619 -470 -45806 -26016 -54577 -39835 -6777 -49142 -37365 -35834 -18191
998 -18191 -48293 28653 -26226 -66959 -46807 -107624 -96941 -67448 -55951 -105061 -48107 -67080
986 -67080 -161027 -146721 -104525 -109531 -115419 -93930 -55975 -62656 -103517 -110366 -95553 -78182 -61089
973 -61089 -54729 -25610 -41189 -33964 -6356 43164 -33247 -23342 -43730 -58733 -66778 -70946 -29927
960 -29927 -96767 -74664 -51745 -13597 -34017 -47193 -74660 -110829 -94636 -62837 -31930 -77884
948 -77884 -50883 -51955 -82859 -87492 -127447 -125109 -128707 -153191 -158983 -118278 -86753 -91458 -40714
935 -40714 -69730 -82323 -14649 -19048 -51530 -57735 -39674 -62024 -57299 -71189 -114887 -115148 -92386
922 -92386 -92293 -77112 -108566 -73322 -10952 -70392 -170756 -79728 -136884 -138775 -14423 56483
910 56483 -5588 -8070 -110912 -77424 -17473 -66766 -58367 -19323 -1626 -49656 -106765 -153494
898 -153494 -181243 -142934 -96275 -61751 -9301 -3578 -88071 -115869 -114499 -109316 -122811 -118192 -27177
885 -27177 -9541 -5231 -66438 -99617 -54351 -54660 -66279 -91552 -165174 -99490 19011 -17686
873 -17686 -93323 -88193 -145263 -168204 -61326 -24273 -84870 -133222 -107964 -97398 -123792 -79743
861 -79743 -85995 -51572 -44679 -2370 -60587 -94351 -60573 -36060 -51214 -52517 -14017 -24835 26654
848 26654 26396 -10922 4070 9570 -16165 2824 -18375 3612 33225 -32999 -83605 -44171 -27123
835 -27123 -40872 -69917 -52443 -46989 -90205 -67715 -77698 -49924 -8882 -21484 -36754 -8819
823 -8819 21085 -8001 3311 -21156 -19784 -5352 -62960 -53718 -70728 -86291 -91463 -91135 -89397
810 -89397 -33460 -18216 -69934 -88140 -55541 -86426 -92402 -134373 -138164 -93407 -72558 -120482
798 -120482 -79930 -58417 -85906 -86942 -88899 -99732 -102022 -38221 -38792 -86341 -23165 -62779 -86526
785 -86526 -72924 -6622 15216 -11370 -73675 -48304 -64865 -15353 48589 5110 -74727 -112648
773 -112648 -91598 -39140 3825 5026 57802 -21705 -83416 -39149 16510 -57155 -40111 -95703
761 -95703 -132545 -121301 -129334 -123422 -62739 -17492 -1664 -34423 -86522 -130400 -116626 -84283
749 -84283 -79533 -59635 -51830 -51653 -29876 -30346 -78560 -105433 -141214 -122543 -91208 -92272 -96328 -64739
735 -64739 -84302 -61789 -31664 -81911 -43677 -124408 -100554 -69145 -59431 -72339 -94472 -83473
723 -83473 -11183 -54465 -40421 -26559 -6580 -13045 -72505 -46793 -11907 42585 17163 -9941
711 -9941 -41953 -113556 -78116 -47856 -61356 -82220 -140493 -106001 -80830 -66403 -65226 -56257 -104457
698 -104457 -146689 -67098 -13798 -25909 -24213 -78619 -55224 -40782 -61240 -77385 -104794 -79696
686 -79696 -81160 -99774 -138059 -117940 -89282 -109731 -87515 -89054 -144185 -141506 -113404 -140008 -55358
673 -55358 -70808 -85400 -78043 -118446 -89594 -56716 46785 13025 -6483 -53417 -77129 -76545
661 -76545 -83085 -101722 -87224 -41657 -17440 -69819 -66568 -63481 -145432 -144601 -134598 -73285 -46448
648 -46448 -51642 -24499 -105385 -86631 -83206 -94611 -70706 -99647 -109864 -114891 -102465 -73027 -24982
635 -24982 8644 -38493 -91621 -77217 -75828 -40945 -65765 -76020 -76235 -17517 -2131 -53892 -57795
622 -57795 -52709 -73159 -68519 -124791 -120764 -148909 -202664 -154107 -128712 -128958 -128011 -51265 -19580
609 -19580 -92702 -94080 -65353 -59497 -64409 -73917 -62145 -62092 -119201 -77353 -94051 -13877 45703
596 45703 -13480 -51136 -12810 4886 17452 -4478 -9893 -46039 -77313 -71291 -27229 -57611
584 -57611 -95920 -125423 -153517 -73263 -68721 -100573 -101489 -115306 -100583 -107583 -101105 -63886 -89175
571 -89175 -33329 -71981 -129451 -45332 -26844 -31887 -31970 7642 2649 -36176 -16478 -44899 -68489
558 -68489 -54506 -65566 -53200 -100100 -69502 -41499 -7962 -29395 -103995 -92308 -66701 -31120
546 -31120 -84874 -87345 -80442 -46511 6318 -4828 -55661 22384 21963 13343 6179 -46550 6611
533 6611 -8797 -85193 -122891 -99104 -84240 -144760 -145179 -118466 -79725 -118243 -65964 -82207 -60594
520 -60594 -37608 -20146 -73952 -38133 4644 -18506 -48150 -12779 316 -11943 -80431 -121265
508 -121265 -64867 -103225 -91131 -51546 -11038 -22551 -80422 -47984 -35290 -46591 -22600 -20140
496 -20140 -86878 -117718 -47406 -63790 -138008 -212154 -155062 -1797 17845 10832 -17930 -17093
484 -17093 -25376 -70305 -42771 7164 -10936 -5715 18414 -38492 -77005 -19928 -30386 -53980
472 -53980 -69231 -111302 -121014 -174727 -153715 -69105 -41923 -102645 -105541 -112058 -122992 -126764 -49064
459 -49064 -119887 -65614 -6548 15265 -12760 -43509 -104573 -152299 -148281 -136367 -93622 -92039
447 -92039 -62041 -60910 -83692 -122857 -92627 -101546 -54047 -75628 -87659 -47137 -57162 17351
435 17351 43519 5066 -69713 -108132 -81194 -120572 -79213 -41976 -64181 -41530 -58904 -39744
423 -39744 -71541 -118549 -140473 -126835 -81794 -46493 -21363 1421 -28607 -25350 -30710 -48373
411 -48373 -84591 -80747 -112395 -95856 -128753 -98390 -73917 -29457 -67394 -89343 -63927 -87740
399 -87740 -108993 -105583 -39309 -62910 -102321 -57236 -86574 -156847 -116042 -53414 -1254 -23838
387 -23838 -26636 -32687 -10040 -28600 5858 -24899 -32429 -104796 -101987 -142376 -102764 -95013 -96175
374 -96175 -85169 -45774 -69713 -62531 -52944 -8429 -35012 -93519 -56971 -105370 -40280 -19393
362 -19393 -65363 -33736 -63761 -122721 -104850 -102364 -78542 -111868 -74216 -38659 8706 63983
350 63983 50300 31993 -29638 -40457 13315 -56939 -60840 -139760 -148287 -45975 38068 23558
338 23558 -83499 -104639 -47068 23651 27656 -6409 20682 66371 -21054 -99825 -94190 -52130
326 -52130 -75874 -120975 -130869 -122646 -54696 -6714 -60276 -101954 -69285 -39887 -71507 -101799
314 -101799 -41210 -34764 -75794 -72326 -63600 10926 25312 52117 -46681 -67502 -44425 -58311
302 -58311 -72135 -22290 22027 -16280 -9213 -65030 -64614 -93507 -125029 -182019 -147474 -80070 -31993
289 -31993 -66930 -81241 -70257 -77649 -98214 -105119 -35689 -62209 -89728 -58635 -66326 -120784 -97511
276 -97511 -50447 -107840 -115877 -122585 -139092 -91733 -100035 -106740 -84672 -39240 -42746 -75343 -144048
263 -144048 -156050 -73667 -62189 -34532 12795 -7683 -35505 -16592 -56360 -51246 -116938 -130348
251 -130348 -148498 -132342 -108891 -145268 -111390 -89315 -10414 -69369 -163157 -119392 -104165 -56732
239 -56732 -51813 -85978 -121897 -106722 -68281 -142293 -178721 -156943 -199869 -150492 -87632 -48391
227 -48391 -66359 -148714 -128877 -96843 -136383 -76397 -117589 -224557 -167058 -122035 -51686 -33720
215 -33720 -100630 -102764 -75904 -89388 -60407 -84402 -72371 -138294 -167146 -134841 -144730 -147161 -99191
202 -99191 -34478 -68575 -106283 -125198 -156592 -124755 -69462 -76887 -129036 -156263 -111756 -135153
190 -135153 -190467 -159613 -152017 -168655 -243339 -195433 -131548 -121887 -97452 -142306 -126940 -73917
178 -73917 -170509 -194710 -137972 -86230 -131497 -140772 -122755 -168404 -137849 -140691 -172416 -146387
166 -146387 -177058 -201929 -200747 -246297 -228658 -208049 -195180 -163279 -161218 -169280 -221169 -226812 -195401
153 -195401 -165115 -151407 -193081 -210182 -215451 -257076 -218838 -229388 -229162 -223706 -219387 -167519 -184454
140 -184454 -157673 -200862 -237330 -270974 -294590 -268968 -251151 -248976 -230643 -233125 -236263 -215836
128 -215836 -224238 -263944 -259903 -351568 -365549 -268545 -273465 -283623 -288591 -264193 -233552 -216378 -248719
115 -248719 -314394 -278248 -237058 -298991 -326339 -249301 -301505 -302722 -239783 -263977 -244643 -268332
103 -268332 -309983 -266455 -263362 -297769 -300223 -295090 -267920 -327656 -372670 -388494 -411850 -368569
91 -368569 -339227 -339191 -365695 -358541 -357569 -375071 -382084 -382023 -395736 -360058 -393682 -429684 -408940 -402906
77 -402906 -418405 -405900 -417126 -461891 -450972 -427496 -441731 -456583 -493582 -485508 -463112 -472105
65 -472105 -487027 -432567 -431890 -420694 -470512 -476177 -518918 -532291 -476753 -487095 -460270 -483059 -496295
52 -496295 -482218 -449991 -503989 -554418 -530870 -548379 -553359 -515816 -489500 -517191 -501275 -535091
40 -535091 -522921 -554230 -605700 -568045 -555902 -564616 -574687 -554577 -596417 -550150 -581103 -590753
28 -590753 -611500 -615917 -626349 -588604 -591189 -570160 -553283 -601175 -639548 -624128 -637395 -595981
16 -595981 -579685 -620415 -621930 -637225 -687645 -700953 -728075 -721257 -715696 -713301 -686869 -742505 -698428
3 -698428 -692435 -692684 -702665
0 -702665
$$ Imaginary data points
##PAGE= N=2
##DATA TABLE= (X++(I..I)), XYDATA
16383 -2538497 -2538270 -2479453 -2445425 -2401396 -2384884 -2334492 -2319968 -2288477 -2219558 -2194042 -2160000 -2113648
16371 -2113648 -2019650 -1987893 -1980488 -1939091 -1857949 -1825192 -1777676 -1721276 -1721368 -1690655 -1607464 -1531516
16359 -1531516 -1518211 -1517278 -1483316 -1443404 -1384488 -1334398 -1268044 -1212057 -1199900 -1163615 -1121389 -1115757
16347 -1115757 -1062709 -986094 -954285 -971261 -899522 -893161 -831933 -776641 -714588 -642511 -635067 -648175
16335 -648175 -611760 -546572 -511976 -460134 -418586 -401343 -373161 -343422 -284832 -214374 -217231 -200829
16323 -200829 -161124 -98788 -31023 -13641 29514 82932 128961 130585 146291 209359 185990 192625
16311 192625 239424 305681 354675 388026 446116 484052 526547 520615 547599 574045 578877 579271
16299 579271 636325 713652 737367 756809 740429 780181 899256 949836 975008 971256 1004654
16288 1004654 1130969 1142611 1122331 1182699 1190134 1210406 1225122 1190979 1229839 1231147 1311526
16277 1311526 1402300 1376677 1398187 1427390 1490987 1525256 1618780 1677198 1711144 1745269 1777325
16266 1777325 1766494 1704378 1689323 1756787 1772303 1814083 1870763 1867313 1955045 1970013 1953462
16255 1953462 1978821 2009980 2052959 2065991 2078959 2122476 2074566 2139476 2179658 2246646 2299395
16244 2299395 2325408 2312856 2249264 2183579 2281167 2342203 2388347 2393862 2425460 2437849 2441029 2461075
16232 2461075 2485966 2547358 2599544 2599945 2558297 2669736 2672669 2609854 2588940 2643254 2697683 2671860
16220 2671860 2644994 2718896 2757554 2765789 2790109 2903526 2847997 2785775 2855163 2953337 2919014
16209 2919014 2896136 2935892 2896632 2887001 2940208 3040555 3084119 3061137 3007115 3045411 3082143
16198 3082143 3070529 3024792 3058015 3073600 3083254 3099874 3095202 3168334 3230290 3299036 3332551 3325692
16186 3325692 3346561 3375076 3372872 3369573 3386033 3380898 3393646 3317714 3284591 3282115 3359464 3427669
16174 3427669 3434022 3377379 3405118 3402676 3461202 3487476 3490395 3445704 3427485 3458251 3509062 3504975
16162 3504975 3545513 3538728 3511412 3579875 3575959 3612666 3644412 3695419 3664463 3627029 3616223 3654694
16150 3654694 3647234 3637526 3678723 3735492 3706598 3708894 3683299 3691792 3698740 3736342 3782228 3750627
16138 3750627 3744264 3691430 3732975 3736209 3779769 3778796 3710930 3786847 3796059 3814678 3750639 3724631
16126 3724631 3682651 3720833 3744393 3732063 3749068 3767558 3781098 3869541 3883660 3876031 3829329
16115 3829329 3830540 3798358 3832313 3888927 3880558 3849605 3835137 3876374 3843768 3784529 3830152 3818166
16103 3818166 3833839 3870345 3840244 3781610 3844345 3894769 3886605 3921569 3918836 3852800 3841324 3885176
16091 3885176 3895254 3994954 3966426 3923539 3959528 3935921 3886837 3888193 3884788 3863625 3880372 3952134
16079 3952134 3959654 4003097 3962426 3915539 3891687 3875816 3889215 3889148 3884385 3923344 3892122 3970112
16067 3970112 4034928 3981358 3909275 3909128 3931374 3951360 3959316 3974741 4032187 4021406 3943576 3920265
16055 3920265 3931025 3930746 3950530 3961473 3887481 3936420 3988284 3984005 4025601 3993721 3988197 3997150
16043 3997150 3987961 3964995 3982875 3987470 3989097 3968580 3985454 4026672 3996135 3968542 3950175 4048080
16031 4048080 4043879 4010151 4013116 3998227 4030824 4046590 4006304 3944966 3982962 4039649 4049305 4043375
16019 4043375 3997968 4037034 4024706 4029341 3990399 3937968 4027273 4038553 4032685 4019910 4028746 4065189
16007 4065189 4087273 4063614 4065627 4118171 4090687 4032341 3986591 4018533 4059099 4023888 3983046
15996 3983046 3976295 4002906 4061595 4050594 4023220 3987769 4006540 3969189 4006925 4094076 4051859
15985 4051859 4009579 4000799 4009275 3997505 4031094 4014525 4021257 3953256 4008955 4060393 4042489 3976440
15973 3976440 3958607 3958053 3972784 4018287 4027169 4040548 4061707 4061271 4068708 4078031 4097675 4050242 3987982
15960 3987982 4012677 4044584 4080176 4129443 4035829 4022457 4077337 4015410 3991409 3985637 4010549
15949 4010549 4026087 4008674 4061896 4030675 4029375 4060076 4034092 4006045 4001606 3991298 4012943 4010442
15937 4010442 4009176 4019122 3984680 4000273 3996743 4042251 4016368 4082974 4029739 3985568 4039286 4086904
15925 4086904 4122855 4070412 4079753 4122641 4082784 4073296 4087055 4142582 4145305 4140308 4114047 4083233
15913 4083233 4095859 4052075 4059097 4131970 4115000 4043170 4074602 4080782 4068775 4041457 4054188 4102093
15901 4102093 4086026 4105978 4084184 4082168 4120998 4128043 4130248 4059962 4021580 4016290 4002737 4017680
15889 4017680 4009697 4019999 4017768 4076903 4063958 4017667 4054335 4076288 4059236 4066059 4068548 4149796
15877 4149796 4156363 4044000 4101592 4160557 4159376 4039793 4032024 4095286 4069181 4022620 4073207
15866 4073207 4100664 4110824 4069182 4108244 4095286 4159809 4160303 4083482 4120304 4087904 4055871 4059697
15854 4059697 4113896 4112727 4097284 4123973 4078824 4112270 4142016 4015577 4037044 4069302 4132475
15843 4132475 4180388 4187628 4137145 4053486 4094686 4093444 4062906 4085724 4104987 4091998 4099534 4114595
15831 4114595 4116878 4134925 4072119 4076474 4087112 4093840 4078277 4101382 4104526 4107216 4075471 4019962
15819 4019962 4018734 4034767 4088633 4142227 4103153 4129069 4110908 4058613 4114498 4118354 4094001 4062989
15807 4062989 3993933 4007342 4061165 4109433 4126552 4054085 4057396 4081797 4125214 4129427 4100598 4103534
15795 4103534 4096043 4069277 4081951 4110299 4040559 4017292 4063701 4060718 4127526 4038554 4061112 4161295
15783 4161295 4132732 4183277 4100405 4075824 4093722 4104580 4188373 4158784 4138479 4099127 4168114
15772 4168114 4180271 4230104 4213548 4181489 4121444 4042842 4132258 4133654 4120567 4128070 4130198 4082399
15760 4082399 4112159 4103096 4123431 4159685 4101495 4089811 4073969 4084372 4081491 4085804 4077271 4088935
15748 4088935 4069414 4035056 4107788 4161642 4112294 4113645 4105570 4112620 4082763 4077887 4017844 4009825
15736 4009825 4060604 4073508 4080788 4114257 4145530 4114283 4141389 4125872 4171752 4161674 4189328
15725 4189328 4190112 4166852 4144563 4159797 4165123 4237149 4200126 4150420 4127620 4129782 4125725 4158101
15713 4158101 4157139 4161343 4186303 4122713 4120191 4116492 4119432 4188518 4153446 4188001 4221716 4124466
15701 4124466 4068967 4130952 4088669 4052118 4163007 4185859 4152625 4190000 4132123 4122016 4182059
15690 4182059 4187696 4234421 4241991 4145884 4125736 4202773 4167350 4166095 4155080 4251363 4237024 4208361
15678 4208361 4199152 4113137 4062799 4100014 4083570 4087620 4130011 4117541 4079851 4080922 4115960 4142760
15666 4142760 4133090 4073918 4157040 4200613 4183915 4117896 4140378 4175742 4123574 4179743 4179750 4197577
15654 4197577 4138700 4120874 4103564 4029384 4018200 4121999 4150498 4158347 4153420 4203421 4245117
15643 4245117 4205417 4227591 4184547 4185406 4186582 4145599 4114516 4091707 4140198 4181370 4160933 4145179
15631 4145179 4138749 4127628 4158165 4169532 4163013 4175060 4160526 4160526 4210309 4171156 4151977 4099978
15619 4099978 4169909 4206602 4165236 4135179 4152541 4193757 4182895 4183864 4114267 4194327 4184846 4141308
15607 4141308 4132825 4135824 4139245 4179792 4218181 4225974 4185025 4163291 4185874 4164516 4155284 4186416
15595 4186416 4131016 4134372 4215698 4206488 4199961 4187887 4193092 4192363 4211197 4228228 4194703 4229131
15583 4229131 4202681 4210073 4209031 4114777 4170184 4157563 4204603 4217743 4173056 4146935 4167749 4273316
15571 4273316 4243301 4155313 4158985 4180155 4142913 4191249 4214231 4264288 4236954 4221218 4229230 4155292
15559 4155292 4162230 4244949 4208694 4253143 4237252 4154973 4176494 4118276 4177383 4186929 4160272 4169090
15547 4169090 4236112 4290755 4224363 4231194 4182747 4208938 4196801 4206196 4274095 4284690 4297320 4280138
15535 4280138 4246797 4232865 4210665 4247733 4334431 4310803 4319775 4229640 4198509 4134239 4191134
15524 4191134 4194819 4142675 4184819 4187863 4250615 4256822 4228352 4181416 4216020 4262752 4276042 4261100
15512 4261100 4236960 4248083 4223365 4160543 4169059 4187275 4290729 4244336 4202834 4203464 4181112 4180716
15500 4180716 4240970 4290807 4294120 4282105 4272985 4289109 4248664 4249432 4246661 4273737 4283461 4269061
15488 4269061 4171087 4151510 4183237 4200614 4244895 4220237 4250455 4309354 4291197 4254119 4269109
15477 4269109 4263398 4305818 4300245 4278577 4296783 4324684 4293993 4271407 4221783 4226532 4232635 4181039
15465 4181039 4249005 4308271 4330944 4352274 4246476 4193103 4194683 4207327 4206381 4161396 4207400 4209074
15453 4209074 4199332 4241857 4288813 4292475 4225602 4205849 4225437 4175552 4196236 4225031 4224528 4225382
15441 4225382 4244896 4294841 4320109 4312085 4330724 4260620 4318235 4259184 4208819 4270638 4255886
15430 4255886 4247856 4261992 4241029 4281609 4302802 4381701 4331717 4298227 4314298 4315047 4306692 4286609
15418 4286609 4264359 4199412 4187842 4266200 4291698 4226244 4245668 4245881 4202660 4194019 4213956 4233286
15406 4233286 4185137 4247202 4237930 4169472 4248631 4262547 4206603 4274470 4294992 4271916 4228530
15395 4228530 4193846 4281766 4349718 4335564 4326851 4294990 4267382 4310718 4336269 4358092 4325779
15384 4325779 4255555 4246567 4272944 4273506 4328791 4310174 4315456 4342758 4365847 4333070 4337842 4337120 4332523
15371 4332523 4302717 4352790 4293024 4224070 4305353 4396716 4316566 4271824 4230642 4255181 4287305
15360 4287305 4249444 4325869 4311356 4244127 4344869 4362464 4349593 4351128 4307557 4323759 4309383
15349 4309383 4292398 4305754 4266352 4271418 4327254 4316848 4270715 4235026 4255595 4327045 4288505
15338 4288505 4311102 4302656 4289201 4263285 4301340 4334075 4355505 4392018 4428263 4401969 4322937
15327 4322937 4342743 4341232 4320377 4255305 4279186 4273178 4304011 4339883 4252655 4222517 4262926 4239184
15315 4239184 4244174 4305359 4298006 4293815 4306251 4373180 4381600 4346851 4417428 4377283 4371024 4369199
15303 4369199 4308577 4266421 4293734 4335545 4327921 4367006 4365363 4239969 4266662 4293832 4248466
15292 4248466 4258026 4320238 4383743 4335820 4353658 4365980 4341445 4317020 4246880 4279487 4347135
15281 4347135 4379695 4362633 4381432 4332430 4342475 4341484 4274751 4274044 4283145 4266201 4314555 4300721
15269 4300721 4321830 4334768 4317581 4340143 4285156 4296463 4400843 4295472 4322179 4327525 4275148
15258 4275148 4252307 4294970 4365961 4359573 4386387 4378654 4363490 4355200 4365604 4378603 4399459 4381145
15246 4381145 4339636 4314995 4303086 4377620 4417860 4390293 4362461 4327304 4403795 4381279 4366301
15235 4366301 4398932 4362740 4369421 4398802 4421013 4393961 4407690 4447408 4369387 4416894 4407895 4421983
15223 4421983 4520796 4490261 4410758 4354215 4327065 4286480 4317116 4322584 4305540 4354479 4352391 4358125
15211 4358125 4286927 4286409 4295905 4346871 4364507 4340752 4385216 4461607 4450950 4415924 4393182 4412001
15199 4412001 4426544 4386119 4375270 4414918 4444195 4447287 4438641 4422546 4446189 4487189 4489586 4432499
15187 4432499 4362920 4322267 4306829 4357296 4378044 4387596 4403732 4354288 4369606 4313692 4350074
15176 4350074 4364902 4361844 4415684 4419425 4381467 4353167 4379533 4368078 4430489 4372851 4377481 4399073
15164 4399073 4426287 4435633 4470635 4532668 4449557 4391866 4389019 4422580 4392517 4366205 4385677 4414869
15152 4414869 4393030 4340710 4393257 4378021 4377722 4426767 4386487 4409064 4486737 4490820 4370070 4390236
15140 4390236 4434966 4387946 4351662 4385286 4394058 4424950 4384645 4387230 4446787 4404872 4365538 4400615
15128 4400615 4411842 4445670 4475921 4449301 4433948 4427543 4392277 4343787 4385747 4463453 4459432 4461794
15116 4461794 4423934 4413932 4451833 4434063 4451377 4465804 4417300 4386031 4476007 4504632 4475265
15105 4475265 4471875 4457320 4420543 4406988 4421012 4394739 4372087 4390663 4370718 4408504 4392249
15094 4392249 4418024 4484016 4471968 4430186 4460698 4465077 4403366 4431131 4389067 4359904 4396188
15083 4396188 4432948 4358802 4364361 4370504 4401150 4446693 4427702 4435817 4435359 4427668 4419728 4466575 4456626
15070 4456626 4471995 4463964 4440185 4404685 4431507 4439930 4448075 4429134 4352310 4452562 4463205 4388316
15058 4388316 4380726 4385047 4394764 4366302 4387651 4482967 4409598 4409785 4506467 4485067 4479056 4485165 4505467
15045 4505467 4476141 4469609 4451087 4479601 4445403 4414665 4397604 4407750 4448203 4364450 4411909
15034 4411909 4433439 4485181 4437222 4387749 4381068 4411505 4417234 4391403 4396384 4406552 4435316 4404909
15022 4404909 4381838 4402502 4417212 4397322 4448840 4445007 4432712 4462380 4476337 4396662 4406136 4424826
15010 4424826 4488833 4497019 4503530 4422078 4413065 4447581 4457612 4474869 4446996 4409207 4426611 4448386
14998 4448386 4471549 4484885 4421258 4457313 4487322 4451856 4478652 4539967 4530506 4454243 4472465
14987 4472465 4507586 4454293 4399857 4445469 4450884 4482494 4489233 4475352 4502241 4493477 4543236 4492799
14975 4492799 4475876 4446907 4499515 4499858 4493056 4450013 4434843 4416922 4443870 4462093 4546178 4526853
14963 4526853 4496901 4509628 4521149 4509679 4509327 4483603 4478302 4483558 4419910 4456898 4456981 4417307 4420738
14950 4420738 4485860 4534776 4540928 4568342 4544688 4496713 4491036 4421673 4481306 4498012 4461742 4518628
14938 4518628 4549340 4512001 4446730 4465238 4429940 4446661 4450862 4378079 4439499 4550394 4559492
14927 4559492 4560811 4523544 4557144 4490565 4482156 4541930 4471126 4452117 4475661 4525260 4455269 4491017
14915 4491017 4566264 4594933 4552695 4460787 4464764 4536611 4526149 4516840 4524923 4561229 4548407 4536615
14903 4536615 4546365 4551817 4455189 4466953 4536628 4509473 4568632 4597869 4559390 4541184 4527871 4528601
14891 4528601 4525052 4552493 4488703 4516699 4555474 4563833 4586602 4599378 4545829 4479202 4492541 4510829
14879 4510829 4492172 4528231 4551136 4546949 4506195 4502154 4517849 4501172 4568886 4606835 4572922 4588653
14867 4588653 4542717 4524414 4535875 4526388 4553998 4479347 4501854 4499788 4485590 4580515 4623490 4591696
14855 4591696 4539118 4558117 4579891 4593033 4556291 4526960 4534491 4553634 4571139 4576829 4612071 4596934
14843 4596934 4582005 4603025 4582562 4586361 4654760 4609261 4617233 4520415 4569692 4626012 4554725 4535465
14831 4535465 4566836 4585606 4602050 4582201 4586348 4575844 4597110 4552121 4528880 4557622 4519815
14820 4519815 4542076 4591589 4552020 4581911 4554725 4551597 4608802 4618123 4633495 4610748 4627956 4620198
14808 4620198 4631996 4565383 4535192 4563588 4534812 4535925 4548572 4567520 4556989 4578645 4567216
14797 4567216 4488109 4534841 4522408 4515881 4524891 4487526 4524354 4553004 4527824 4548810 4586156 4593483
14785 4593483 4622942 4630287 4624114 4656845 4641136 4627669 4566351 4441231 4528648 4630180 4670647
14774 4670647 4648627 4589157 4524500 4557320 4551270 4534187 4600980 4597317 4582523 4542728 4564514 4526781
14762 4526781 4526560 4547705 4616952 4595436 4520479 4537264 4555817 4529011 4505989 4575236 4646360 4563244
14750 4563244 4544031 4542836 4592389 4573153 4539338 4561895 4531622 4559300 4578879 4638843 4663260
14739 4663260 4559950 4550934 4577206 4588961 4572149 4568903 4582291 4569161 4582629 4582458 4581046 4559011
14727 4559011 4618017 4662231 4624078 4626336 4608906 4597809 4636986 4614677 4581218 4574090 4606918 4625702
14715 4625702 4580969 4592961 4579121 4662553 4693863 4716791 4692920 4628225 4688271 4696803 4665611
14704 4665611 4664749 4615328 4631806 4641581 4539426 4610344 4597217 4561932 4539621 4577103 4645198 4665381
14692 4665381 4678048 4652399 4583061 4572813 4576154 4596913 4613114 4598141 4562466 4578570 4604508
14681 4604508 4696434 4709199 4627571 4651929 4607059 4611728 4599064 4565219 4561285 4529195 4597695 4632684
14669 4632684 4625605 4604772 4582626 4508655 4511335 4559898 4576736 4589432 4611733 4635164 4689526 4636850
14657 4636850 4594752 4616270 4567023 4621930 4704198 4660936 4583392 4610183 4639562 4651321 4697168
14646 4697168 4690380 4680726 4644221 4591529 4620266 4611794 4641796 4644025 4624844 4605695 4610870 4583695
14634 4583695 4583078 4597366 4615754 4645675 4603683 4624204 4608622 4580859 4679708 4681628 4664283 4670901
14622 4670901 4648825 4689437 4676106 4666996 4712522 4684127 4701337 4662083 4669944 4631416 4672807 4783969
14610 4783969 4767090 4661950 4669873 4758876 4772532 4687576 4659412 4673602 4657411 4635000 4646347
14599 4646347 4667676 4659063 4698313 4647177 4678654 4644514 4680599 4748529 4716178 4661615 4652708 4676694
14587 4676694 4666896 4710663 4739114 4680937 4674658 4744237 4749112 4683067 4653190 4623084 4711687 4739734
14575 4739734 4750986 4769838 4663273 4637433 4631268 4662413 4705310 4743366 4774677 4773720 4776456 4819868
14563 4819868 4801016 4712006 4760692 4765385 4784246 4747229 4695593 4683723 4653785 4697387 4619669
14552 4619669 4656345 4697920 4672854 4721564 4694003 4721762 4668002 4597315 4631852 4632610 4644436 4671889
14540 4671889 4739376 4722168 4661795 4682164 4708612 4723859 4751883 4711622 4749345 4721537 4701062
14529 4701062 4733566 4730059 4754516 4751361 4786681 4754481 4786819 4761590 4739515 4741223 4792563 4775317
14517 4775317 4731286 4720662 4711005 4689470 4685537 4726158 4674666 4682105 4748951 4783187 4764062 4677517
14505 4677517 4664935 4766630 4793670 4778121 4747779 4752869 4750968 4764949 4774188 4794363 4767357 4770444
14493 4770444 4760474 4734262 4771763 4806554 4810738 4847863 4739995 4734093 4746242 4708655 4680260 4699069
14481 4699069 4737279 4721818 4699737 4733804 4765027 4763931 4740467 4681959 4696988 4716584 4738621
14470 4738621 4740567 4742357 4778671 4712344 4721542 4812668 4829706 4866533 4788503 4858143 4785004 4750203
14458 4750203 4776185 4814851 4806966 4787997 4792402 4697751 4686644 4687925 4660017 4746478 4718913 4718767
14446 4718767 4744187 4763729 4789582 4873290 4857249 4759173 4814875 4803965 4755913 4716639 4776341
14435 4776341 4761762 4722927 4676079 4692315 4721054 4787545 4805229 4776743 4767758 4752278 4776848
14424 4776848 4791025 4750068 4757057 4784790 4737945 4732406 4697227 4698252 4692597 4635978 4732928 4777502
14412 4777502 4818256 4793612 4789941 4840457 4799727 4772076 4762659 4727035 4768462 4762118 4713935 4763989
14400 4763989 4759784 4813522 4843416 4891854 4820056 4798243 4809896 4792543 4789942 4781353 4832256 4820498
14388 4820498 4832514 4765518 4709966 4723898 4805644 4792118 4830626 4843917 4836615 4750403 4792235
14377 4792235 4818752 4764695 4772018 4748395 4821319 4829044 4799612 4815352 4860706 4826417 4790990 4808046
14365 4808046 4826436 4814005 4854206 4856936 4886332 4824502 4871697 4832748 4809461 4789678 4768845
14354 4768845 4801572 4818079 4832017 4794861 4802594 4800292 4789533 4824118 4896372 4818113 4753076 4761459
14342 4761459 4812792 4845043 4849226 4853419 4854304 4852020 4866726 4869134 4796252 4765824 4829492 4808270
14330 4808270 4782663 4785384 4771165 4820649 4867677 4826191 4811247 4839915 4894072 4891415 4891794 4946770
14318 4946770 4873592 4842915 4837733 4860000 4843420 4888779 4949010 4840037 4784556 4824862 4795719
14307 4795719 4827515 4756971 4780615 4898582 4852000 4805110 4830091 4819709 4805744 4804862 4810793 4854388
14295 4854388 4873755 4857225 4864639 4870587 4828585 4896398 4918922 4888870 4886704 4866840 4842023 4893137
14283 4893137 4906711 4949512 4913780 4913046 4875216 4792231 4855639 4957222 4915103 4866678 4894461
14272 4894461 4933591 4878311 4901789 4860783 4944440 4955781 4883643 4873520 4862791 4884543 4885741
14261 4885741 4880738 4876069 4892730 4884796 4841529 4850550 4919610 4942672 4895519 4882803 4935955 4869743
14249 4869743 4789371 4757195 4790999 4818663 4894061 4921990 4952679 4924658 4908590 4883720 4820724
14238 4820724 4890835 4947848 4969418 4976496 4912760 4908974 4979383 4914921 4852278 4899433 4906514 4845455
14226 4845455 4818005 4833101 4849305 4927668 4914621 4957474 5008607 4982665 4916379 4929458 4926627
14215 4926627 4940965 4886792 4882723 4940334 4927698 4870899 4870652 4930879 4907266 4945248 4973470 4868262
14203 4868262 4870920 4891566 4863982 4873045 4916982 4929796 4915955 4894461 4915607 4900376 4860703 4892519
14191 4892519 4907960 4928151 4957960 4916361 4941230 4958818 4950444 4905234 4891373 4962378 4929771
14180 4929771 4903521 4885998 4886637 4936143 4942528 4934834 4906016 4910502 4878711 4828168 4865285 4846379
14168 4846379 4911920 4861653 4872455 4893389 4945071 4926953 4845374 4864090 4763669 4815672 4921478
14157 4921478 4923282 4911771 4949254 4904171 4905521 4968935 4979307 4937147 4947769 4897455 4926178 5023564
14145 5023564 4950461 4880357 4871460 4948449 4930812 4893170 4902493 4970050 4905536 4858790 4925121 4958076
14133 4958076 4915247 4927883 4866665 4882840 4928090 4948380 5004938 4991617 4967934 4934283 4912990
14122 4912990 5009938 4991498 4876587 4953165 4963658 4918209 4999009 5069245 5073581 5021145 5012801
14111 5012801 4923253 4914112 4959756 4953972 4977361 5036885 5076483 5017049 4865800 4947284 5004756
14100 5004756 5020384 5051644 5006659 4889695 4914932 4975992 5030497 5011790 4919371 4979949 4976259
14089 4976259 4991029 4946405 4923093 4879393 4849697 4913179 4928110 4911237 4963153 4922742 4988223
14078 4988223 5016393 5046061 4997776 4956162 4966027 5007129 5027916 5011190 4947013 4960684 4955630 4950066
14066 4950066 5011671 5037379 5044419 5061691 5043860 4967136 4949943 4954070 4989645 4971582 5012759 4973967
14054 4973967 4935002 5018817 4996541 4955281 4973971 4927384 4902162 4918304 4978043 4994436 5010974
14043 5010974 4979360 4884788 4922717 4992299 5025651 5012809 5033929 5022302 4993639 5012506 5044078
14032 5044078 4995876 5021855 5010293 5034020 5059417 5083514 5064845 5000788 5019426 5021517 5007705
14021 5007705 4976695 4928907 5004273 5014860 5005356 5003057 5029016 4981272 5032464 5019539 4992263 5017116
14009 5017116 4968620 4954788 5011804 5006696 5015273 5013717 5005585 4974686 5020153 5043726 5034194 5069858
13997 5069858 4994535 4972236 4973430 4989935 4951556 5005309 4974079 4985693 4957773 4962357 5019340 5057981
$$ [...]
##END NTUPLES=NMR SPECTRUM
##END=
