##TITLE=1H_DE-80H_X3
 200.13MHz, d2o
 8 sc
 
 19ns.26.2.2025
##JCAMPDX= 6.0         $$ Bruker NMR JCAMP-DX V2.0
##DATA TYPE= NMR SPECTRUM
##DATA CLASS= NTUPLES
##ORIGIN= UXNMR, Bruker Analytische Messtechnik GmbH
##OWNER= pz
$$ XWIN-NMR		Version 3.5
$$ Tue Jun  2 16:31:50 2026 Russian Standard Time (UT+4h)  Yarkov@DPX200
##.OBSERVE FREQUENCY= 200.1313
##.OBSERVE NUCLEUS= ^1H
##.ACQUISITION MODE= SIMULTANEOUS
##.ACQUISITION SCHEME= undefined
##.AVERAGES= 8
##.DIGITISER RES= 18
##SPECTROMETER/DATA SYSTEM= spect
##.PULSE SEQUENCE= zg30
##.SOLVENT NAME= CDCl3
##.SHIFT REFERENCE= (INTERNAL, CDCl3, 0, 15.4119)
##AUDIT TRAIL= $$ (NUMBER, WHEN, WHO, WHERE, WHAT)
$$ ##TITLE= Audit trail, XWIN-NMR		Version 3.5
$$ ##JCAMPDX= 5.01
$$ ##ORIGIN= Bruker BioSpin GmbH
$$ ##OWNER= Yarkov
$$ C:/Bruker/XWIN-NMR/data/yarkov2/nmr/H-C/1/pdata/1/auditp.txt
$$ ##AUDIT TRAIL=  $$ (NUMBER, WHEN, WHO, WHERE, WHAT)
(   1,<2026-06-02 16:30:39.59 +0400>,<Yarkov>,<DPX200>,
      <created by zg, POWCHK disabled, PULCHK disabled
       configuration hash MD5:
       00 E9 B6 7A A2 85 ED C7 34 08 36 98 17 FE 4E 26
       data hash MD5: 16K
       6D 54 01 1D DF B8 46 04 2E 39 89 96 69 DC 67 E3>)
(   2,<2026-06-02 16:30:51.20 +0400>,<Yarkov>,<DPX200>,
      <Start of raw data processing
       efp BC_mod = 2 LB = 0.25 FT_mod = 6 PKNL = 1 PHC0 = -6385.696 PHC1 = 21.22195 SI = 16K 
       data hash MD5: 16K
       A4 4F B6 44 BE 6F F3 61 B0 C5 F7 8D DE 37 ED 9A>)
(   3,<2026-06-02 16:31:00.25 +0400>,<Yarkov>,<DPX200>,
      <abs ABSG = 5 
       data hash MD5: 16K
       8B E9 7D 38 EB A6 B8 F5 64 DB 28 75 ED 22 53 D8>)
(   4,<2026-06-02 16:31:14.92 +0400>,<Yarkov>,<DPX200>,
      <pk PHC0 = 3.199999 PHC1 = 0 
       data hash MD5: 16K
       94 07 01 99 85 D9 9E 21 B2 FB 2A D7 4A 21 A1 57>)
$$ ##END=
$$ 
$$ hash MD5
$$ EE A4 A9 9C CF 0D 21 23 68 72 F3 04 82 B5 A9 2F
##$RELAX= 
##$RELAX= 
##$RELAX= 
##$RELAX= 
##$RELAX= 
##$RELAX= 
$$ Bruker specific parameters
$$ --------------------------
##$DU= <C:/Bruker/XWIN-NMR>
##$EXPNO= 1
##$NAME= <H-C>
##$PROCNO= 1
##$TYPE= <nmr>
##$USER= <yarkov2>
##$AMP= (0..31)
100 100 100 100 100 100 100 100 100 100 100 100 100 100 100 100 100 100 
100 100 100 100 100 100 100 100 100 100 100 100 100 100 
##$AQSEQ= 0
##$AQ_mod= 1
##$AUNM= <au_zg>
##$AUTOPOS= <>
##$BF1= 200.13
##$BF2= 200.13
##$BF3= 200.13
##$BF4= 200.13
##$BF5= 200.13
##$BF6= 200.13
##$BF7= 200.13
##$BF8= 200.13
##$BYTORDA= 1
##$CFDGTYP= 0
##$CFRGTYP= 5
##$CHEMSTR= <none>
##$CNST= (0..31)
1 1 145 1 1 1 1 1 1 1 1 1 1 1 1 1 1 1 1 1 1 1 1 1 1 1 1 1 1 1 1 1 
##$CPDPRG= <>
##$CPDPRG1= <>
##$CPDPRG2= <>
##$CPDPRG3= <>
##$CPDPRG4= <mlev>
##$CPDPRG5= <mlev>
##$CPDPRG6= <mlev>
##$CPDPRG7= <mlev>
##$CPDPRG8= <mlev>
##$CPDPRGB= <>
##$CPDPRGT= <>
##$D= (0..31)
0 0.7 0 0 0 0 0 0 0 0 0 0.03 0 0 0 0 0 0 0 0 0 0 0 0 0 0 0 0 0 0 0 0 
##$DATE= 1780403439
##$DBL= (0..7)
120 120 120 120 120 120 120 120 
##$DBP= (0..7)
150 150 150 150 150 150 150 150 
##$DBP07= 0
##$DBPNAM0= <>
##$DBPNAM1= <>
##$DBPNAM2= <>
$$ [...]
##$SUBNAM3= <"">
##$SUBNAM4= <"">
##$SUBNAM5= <"">
##$SUBNAM6= <"">
##$SUBNAM7= <"">
##$SUBNAM8= <"">
##$SUBNAM9= <"">
##$SW= 18.0517328524113
##$SWIBOX= (0..15)
0 0 2 0 0 0 0 0 0 0 0 0 0 0 0 0 
##$SW_h= 3612.71676300578
##$TD= 16384
##$TD0= 1
##$TE= 0
##$TE2= 300
##$TE3= 300
##$TEG= 300
##$TL= (0..7)
0 120 120 120 120 120 120 120 
##$TP= (0..7)
150 150 150 150 150 150 150 150 
##$TP07= 0
##$TPNAME0= <>
##$TPNAME1= <>
##$TPNAME2= <>
##$TPNAME3= <>
##$TPNAME4= <>
##$TPNAME5= <>
##$TPNAME6= <>
##$TPNAME7= <>
##$TPOAL= (0..7)
0.5 0.5 0.5 0.5 0.5 0.5 0.5 0.5 
##$TPOFFS= (0..7)
0 0 0 0 0 0 0 0 
##$TUNHIN= 0
##$TUNHOUT= 0
##$TUNXOUT= 0
##$USERA1= <user>
##$USERA2= <user>
##$USERA3= <user>
##$USERA4= <user>
##$USERA5= <user>
##$V9= 5
##$VALIST= <valist>
##$VCLIST= <CCCCCCCCCCCCCCC>
##$VD= 0
##$VDLIST= <DDDDDDDDDDDDDDD>
##$VPLIST= <PPPPPPPPPPPPPPP>
##$VTLIST= <TTTTTTTTTTTTTTT>
##$WBST= 1024
##$WBSW= 4
##$XGAIN= (0..3)
0 0 0 0 
##$XL= 0
##$YL= 0
##$YMAX_a= 429291
##$YMIN_a= -368828
##$ZGOPTNS= <>
##$ZL1= 120
##$ZL2= 120
##$ZL3= 120
##$ZL4= 120
##$ABSF1= 15.45491
##$ABSF2= -2.596939
##$ABSG= 5
##$ABSL= 3
##$ALPHA= 0
##$AQORDER= 0
##$ASSFAC= 0
##$ASSFACI= 0
##$ASSFACX= 0
##$ASSWID= 0
##$AUNMP= <proc_1d>
##$AZFE= 0.1
##$AZFW= 0.1
##$BCFW= 0
##$BC_mod= 2
##$BYTORDP= 0
##$COROFFS= 0
##$CY= -3
##$DATMOD= 1
##$DC= 0
##$DFILT= <>
##$DTYPP= 0
##$F1P= 0
##$F2P= 0
##$FCOR= 1
##$FTSIZE= 16384
##$FT_mod= 6
##$GAMMA= 0
##$GB= 0
##$INTBC= 1
##$INTSCL= 3.241238e-09
##$ISEN= 128
##$LB= 0.25
##$LEV0= 0
##$LPBIN= 0
##$MAXI= 10000
##$MC2= 0
##$MEAN= 0
##$ME_mod= 0
##$MI= 1.114404
##$NCOEF= 0
##$NC_proc= -6
##$NLEV= 6
##$NOISF1= 3.799351
##$NOISF2= 2.8
##$NSP= 0
##$NTH_PI= 0
##$NZP= 0
##$OFFSET= 15.41194
##$PC= 1
##$PHC0= -6382.496
##$PHC1= 21.22195
##$PH_mod= 1
##$PKNL= yes
##$PPARMOD= 0
##$PSCAL= 0
##$PSIGN= 0
##$REVERSE= no
##$SF= 200.130021966368
##$SI= 16384
##$SIGF1= 3
##$SIGF2= 2
##$SINO= 0.751879
##$SIOLD= 32768
##$SREGLST= <19F.Aceton>
##$SSB= 0
##$STSI= 16384
##$STSR= 0
##$SW_p= 3612.71676300578
##$SYMM= 0
##$S_DEV= 0
##$TDeff= 16384
##$TDoff= 0
##$TI= <>
##$TILT= no
##$TM1= 0
##$TM2= 0
##$TOPLEV= 0
##$USERP1= <user>
##$USERP2= <user>
##$USERP3= <user>
##$USERP4= <user>
##$USERP5= <user>
##$WDW= 1
##$XDIM= 16384
##$YMAX_p= 346270111
##$YMIN_p= -2532757
$$ End of Bruker specific parameters
$$ ---------------------------------
##NTUPLES= NMR SPECTRUM
##VAR_NAME=  FREQUENCY,     SPECTRUM/REAL,   SPECTRUM/IMAG
##SYMBOL=    X,             R,               I
##VAR_TYPE=  INDEPENDENT,   DEPENDENT,       DEPENDENT
##VAR_FORM=  AFFN,          ASDF,            ASDF
##VAR_DIM=   16384,         16384,           16384
##UNITS=     HZ,            ARBITRARY UNITS, ARBITRARY UNITS
##FACTOR=    0.220516191357247, 1,           1
##FIRST=     3084.3918148894, 0,             0
##LAST=      -528.324948116381, 0,           0
##MIN=       -528.324948116381, -2532757,    0
##MAX=       3084.3918148894, 346270111,     0
$$ Real data points
##PAGE= N=1
##DATA TABLE= (X++(R..R)), XYDATA
$$ [...]
7896b47806n4685O7646r8410j45273J08566J762N8658J38837n078k19666J22411
7885b73038j6921r4139j4716j10148M8611K34949Q3229q6931M6717m7337o9484
7874b99208n927j38933m3575N5303P9725L8138L5300J9830K6744n9152o7485j35224
7862d94464J06754R0940k1184o7300m6142O9429J30163j4082k5351p6160J5328
7851c32069N5105l0745j2419J6058O8152M5571k7551K9001k5018p6058n2811R9598
7839b43186o896r2385m1855L8333N5047L2920l1225n9254J52677j38461k5726
7828c60011k6512K0564O2228L3177q2105m642P225R3117O4524r5996j15989R6682
7816c07738M9919j32842J1563m0540J9016J72670P925j4194n6927J57280L0866
$$ y = [-247806, -302491, -234845, -333255, -478528, -369962, -368200, -309542, -170705, -175783, -395449, -273038, -289959, -384098, -398814, -508962, -460351, -225402, -142173, -229104, -182387, -229724, -299208, -305135, -444068, -487643, -432340, -352615, -314477, -279177, -259347, -232603, -291755, -359240, -494464, -387710, -296770, -317954, -385254, -431396, -361967, -231804, -245886, -271237, -347397, -332069, -276964, -307709, -320128, -304070, -235918, -190347, -217898, -188897, -213915, -289973, -342784, -243186, -250082, -342467, -384322, -345989, -290942, -258022, -289247, -348501, -195824, -334285, -360011, -386523, -365959, -303731, -270554, -352659, -357301, -350076, -256959, -192435, -288431, -404420, -307738, -257819, -390661, -379098, -419638, -400622, -227952, -220027, -234221, -291148, -133868, -103002]
7805a03002j76307j19578R4650k3599j3231J39520K3833J6311J0772j08516O8457
7794a90690o5864k4350m4358p7627l5488J41117j0766j4526K7680N9396j3293
7783b48769J3019q7261j7388N9598R547l6937l0969o0667K38259J35578j88008
7772b13998m6457p6707j13213N2935o367p375J63845k8463o5062P1084R6842o686
7760a79622o2263j11149m2935N7734l9448J20491M5104j03277K6592M063o5775
7749c50485n9598J26041J3953K7393r9398n2087j14590N9684M7608M1065p807
7738c68221J5882l0090J04287J6704J443j5532j0874r087O461p2123J13654P3861
7726a73635L205j31168l7325O4252O863r8974L3917n172o748J02664K8522j0243
$$ y = [-103002, -279309, -398887, -304237, -327836, -341067, -201547, -177714, -161403, -150631, -259147, -190690, -256554, -280904, -325262, -402889, -438377, -297260, -308026, -322552, -294872, -235476, -248769, -235750, -323011, -340399, -280801, -271254, -308191, -339160, -399827, -161568, -25990, -213998, -260455, -337162, -450375, -397440, -403807, -411182, -247337, -275800, -340862, -269778, -172936, -179622, -241885, -353034, -395969, -338235, -377683, -257192, -212088, -315365, -288773, -284710, -350485, -410083, -284042, -270089, -242696, -342094, -394181, -508771, -449087, -401479, -360414, -368221, -352339, -382429, -278142, -261438, -259995, -275527, -286401, -295488, -289027, -361150, -247496, -173635, -170430, -301598, -338923, -274671, -267808, -366782, -332865, -338037, -344785, -242121, -213599, -223842]
7714b23842M8397p178j00233k0075o9967l9726l3481m992l9130P1989Q6682L4220
7702b97336J47649n9545r5061q8440O225k5142M0127J12203L5501P8066p7573
7691b23326m8208N7786j6360j25886j40565p0216K27103M9553o485L5888n3423
7680c14139K0832o3606J7015k7315n307P3706q8293J4121Q9022J03782J8262j09205
7668b71125j12181j5117P7676j6018l0404J09305J05449l1846j14815j9000j5307
7657c33383L6022L0207P2895j32836j29512N8671J1577R8068n1006m5696M6132
7646c38861J27396r0054r4275J3292M5927N240N3497P2695j3912R457K1762l5076
7634b22912l4780L6059J7426L5767j00236n5802o6885N6177O6419J9588j24091
$$ y = [-223842, -175445, -182623, -282856, -302931, -372898, -412624, -446105, -451097, -490227, -418238, -331556, -297336, -149687, -209232, -304293, -392733, -386508, -411650, -371523, -259320, -223819, -145753, -223326, -271534, -213748, -230108, -355994, -496559, -566775, -339672, -290119, -296604, -260716, -314139, -293307, -356913, -339898, -367213, -372520, -298814, -387107, -372986, -283964, -180182, -161920, -271125, -383306, -398423, -320747, -336765, -367169, -257864, -152415, -184261, -299076, -318076, -333383, -297361, -267154, -194259, -327095, -456607, -397936, -386359, -288291, -339297, -384993, -338861, -211465, -301519, -395794, -382502, -336575, -331335, -277838, -205143, -219055, -209598, -187836, -222912, -257692, -221633, -204207, -168440, -268676, -324478, -391363, -335186, -268767, -249179, -373270]
7623c73270J2898O2827J9949o6317O204Q2485j08764j03703l0849K5479J28150
7612c44911N2924M3264M9501r486r076m1675j4886k18r8246N9288L2768L8146
7600b42607J21735K6825m8265l0852p9323n8365p9570Q9969j8479M6009Q1537
7589a91386l9899L1847l6034j02722M750n2634P685M6142J04387O2900O3443j26031
7577b27552o9347J32251p1918j66321P9571N5193q4361L2554P6782m206Q2340
7566a65014j8980r5475J37134j19316j77883l7011N5127N6143O2011J86757k597
7555a19104r9157P5004j4816n2003j09554m733O6840J8454k8956J46406P4877
7544d6742K1187n6672p6682j010Q2069k7250j66987J8371J12533J904N0326q6565
$$ y = [-373270, -360372, -297545, -277596, -343913, -337709, -255224, -363988, -467691, -498540, -473061, -344911, -291987, -248723, -199222, -208708, -217784, -259459, -274345, -274563, -372809, -313521, -280753, -242607, -120872, -94047, -142312, -173164, -252487, -310852, -390422, -300453, -318932, -272923, -191386, -231285, -199438, -235472, -338194, -333444, -386078, -378393, -332251, -227864, -164964, -101521, -227552, -296899, -164648, -236566, -402887, -323316, -268123, -352484, -319930, -243148, -247354, -165014, -183994, -279469, -142335, -261651, -439534, -476545, -421418, -365275, -303264, -116507, -119104, -218261, -143257, -158073, -210076, -319630, -324363, -257523, -239069, -268025, -121619, -46742, -25555, -82227, -158909, -159919, -77850, -105100, -272087, -253716, -141183, -139279, -88953, -175518]
7532a75518j27119J37490r0233j02429k3132q985J62847M8624q3225L5849L4109
7521a91722J4282o4907q4975J8567L0151O3602k7343j6348m7701P8631k5825m8978
7509c02566k3908M7788P6529J2127k4686m026N266M8185j46766J7035J00771r37
7497a95188M9905n5897j19640n1290J20688l0868n6275o5022k9618J42027j06246
7486c97424j5940J008J96294J08120m604j70318q2450j0675Q7481n4226L1189
7475c11545n7734J05055k4423q6067j3637J3530J12612n1669k2357k8099J38504
7464b25830L6778j0778K2390p4286p6972J32380j06189q4566K3334K9061Q9188
7453b45490p7440r4646J07059Q0832r9897j05737l7819P8204J88699n598n8164
$$ y = [-175518, -302637, -165147, -255380, -357809, -380941, -389926, -227079, -178455, -261680, -225831, -191722, -177440, -242347, -327322, -308755, -278604, -215002, -242345, -258693, -306394, -227763, -253588, -302566, -326474, -278686, -202157, -190030, -214716, -218742, -213476, -165291, -312057, -295022, -194251, -195188, -145283, -201180, -320820, -372110, -251422, -282290, -338565, -403587, -433205, -291178, -397424, -413364, -412356, -216062, -107942, -112546, -282864, -365314, -375989, -288508, -342734, -311545, -369279, -264224, -288647, -374714, -388351, -374821, -262209, -313878, -336235, -364334, -225830, -189052, -199830, -177440, -251726, -328698, -196318, -302507, -387073, -363739, -334678, -245490, -322930, -417576, -310517, -229685, -329582, -435319, -473138, -394934, -206235, -211833, -269997]
7442b69997q7155J20359P7224j33299j40579J14998j9748j5145J46374K8059O4807
7431a14102J19191j68267p8546r3298j9854Q2436R4764p4429k5610K3048l597
7420b58264J2047P916K9327Q3408j7323j81145j3638O421Q3834O0751o5557M7126
7408b05097K987j7375o3064m6938j23465J20477L1695P5437n09J7576J11461q0850
7396a77665j64556N4841M8505O3672j28285M4545k0669O0239N2113M2252j25412
7385b50420j26518j5808J3727j0621j13119J03385J66701N3518J0011k7148r9508
7374b95800J09703O9166k4642j72621K8791P0978O7531P029j64245j5851J05953
7363b14008P460R0286n4085J2759L2690j4120j08047o8746n8013P1476N0260n8165
$$ y = [-269997, -357152, -236793, -159569, -292868, -433447, -318449, -338197, -353342, -206968, -178909, -114102, 5089, -163178, -241724, -335022, -354876, -272440, -177676, -252105, -277715, -254667, -258264, -246217, -238301, -208974, -125566, -142889, -324034, -337672, -331251, -247417, -186666, -252223, -205097, -202110, -219485, -282549, -329487, -452952, -332475, -300780, -225343, -225852, -208276, -96815, -177665, -342221, -287380, -238875, -175203, -303488, -258943, -279612, -219373, -167260, -125008, -250420, -376938, -392746, -379019, -389640, -502759, -399374, -232673, -179155, -169144, -196292, -295800, -186097, -116931, -141573, -314194, -285403, -214425, -146894, -139865, -304110, -319961, -214008, -206548, -116262, -170347, -157588, -124898, -139018, -247065, -315811, -373824, -302348, -252088, -310253]
7351c10253m6796M9319l3419J0915k418k002l4426R3553j12452J4366R8109Q5740
7339a89764O0205J2064r8881L7401J2153n8733O834J30733m5802j12481j095L1166
7327b16200K3502J4266o8820o5273j9843Q4423Q046q5967P1057P9583p8720N3654
7315b00292Q9839p9721j55524j35938L1598R8629L1768K5066J16516Q4M5612L6450
7303i5913p9419J9266j16863p7834n7584J9663K83442J99880K122j77653r8490
7292a79383p2850r4951K4848N5425q8909P7340O8591l9408O1442K5819j5741m0105
7280b17882j26156l1361K3890R4396q562L1913j0562M3405J2910l275P6491l8712
7268a53505j3951N5674p3276j7751R4654o3770M9396J19525k5180o2879k5598
$$ y = [-310253, -357049, -307730, -341149, -330234, -332652, -334654, -369080, -275527, -387979, -373613, -275504, -189764, -129559, -117495, -216376, -178975, -166822, -225555, -218721, -87988, -133790, -246271, -247366, -216200, -192698, -178432, -247252, -312525, -332368, -247945, -239899, -325866, -254809, -175226, -253946, -200292, -110453, -190174, -345698, -481636, -450038, -351409, -319641, -294575, -178059, -177975, -132363, -95913, -175332, -156066, -272929, -350763, -408347, -388684, -105242, 94638, 96760, -80893, -179383, -252233, -347184, -322336, -266911, -355820, -278480, -209889, -249297, -187855, -162036, -177777, -217882, -344038, -375399, -351509, -257113, -265675, -233762, -244324, -200919, -188009, -191284, -114793, -153505, -167456, -111782, -185058, -202809, -108155, -171925, -122529, -3004, -28184, -91063, -116661]
7257a16661N2640r0944J3698j42965j9302O0834K2564J29911q8803l8409j7091
7246b34528J02689O2214j5809r6719r5554j6462j36674P4579N7724N7271k6888
7235b68157J05465o8715O151J4803k2343K2753j07715p642O1882o9997J0152J51042
7223a72321O5915K3946m1581j02916j3686r4204j0014R7033J49831l910j09629
7212b11536O3959M4476r8969m7769n1271M989m3592L0298P3653K1568P5845j1938
7200a50287j242j33200p6533o1343M1197m5207K2055J13406j8254j72623J85262
7189b96769R9379M8013J1737j21312j38746J06800N1094p4025N1428O6341J10333
7178h5727j02431q9290k0148L972M0269l6608r6196l0843K27026l6311N5829O6049
$$ y = [-116661, -64021, -154965, -141267, -284232, -303534, -242700, -220136, -90225, -179028, -217437, -234528, -131839, -69625, -85434, -182153, -277707, -294169, -430843, -356264, -298540, -241269, -268157, -162692, -231407, -225256, -210453, -232796, -210043, -317758, -325400, -263518, -333515, -323363, -172321, -106406, -82460, -124041, -226957, -240643, -334847, -344861, -247828, -97997, -101907, -211536, -147577, -103101, -202070, -249839, -301110, -296121, -339713, -309415, -235762, -214194, -138349, -150287, -151529, -284729, -361262, -422605, -381408, -426615, -404560, -291154, -309408, -482031, -296769, -197390, -149377, -137640, -258952, -397698, -290898, -239804, -313829, -262401, -196060, -85727, -188158, -277448, -297596, -293624, -253355, -289963, -386159, -417002, -189976, -226287, -170458, -104409]
7166a04409p8901r3814m1160m0234M8526P6399Q152l6957N4287L0026M0894K433
7154a34758l1371Q1912O0433l8175L9815J2762O988N1673j17767j67261P7064
7143a58685o3717o5730O3164j35588J29483J29106L6287p8854K4349J3853o7701
7132a74033K3697J705M3265K9530n8327p069o297O8524l4883Q1065k7454o2563
7120a22840k2546K0431Q155n6869M9250J11159k3822j3401K202j645l1326L0818
7108e0434q7661k4217O0933N5031k3794P5392n3889o0617n2484K6152N0352q7445
7096a72681J727j0858p9542J15382p4372l3245M2325K3029M7784K7804m8356j30784
7084b91787J09010Q753J9557R29j85063J0892P4451k9653J8804N6130R107k33172
$$ y = [-104409, -183310, -277124, -318284, -358518, -309992, -233593, -225441, -262398, -208111, -178085, -137191, -134758, -166129, -84217, -23784, -61959, -22144, -9382, -2394, 49279, -68488, -235749, -158685, -222402, -288132, -224968, -360556, -231073, -101967, -65680, -144534, -120185, -106332, -174033, -150336, -148631, -105366, -75836, -134163, -141232, -147529, -79005, -113888, -32823, -60277, -122840, -145386, -124955, -116800, -173669, -124419, -13260, -37082, -50483, -48281, -49926, -81252, -50434, -138095, -162312, -101379, -46348, -70142, 5250, -48639, -109256, -161740, -135588, -85236, -172681, -170954, -181812, -261354, -145972, -220344, -253589, -211264, -188235, -140451, -112647, -161003, -291787, -182777, -174024, -154467, -153538, -338601, -327709, -253258, -282911, -264107, -207977, -198870, -432042]
7072d32042R9673R7505J26177P415o515M5223j3511q9335J2302n9347l0334M8341
7060a94448m6758J4811P7640l9482M1180n351k8525J6939j59675O0789L9209L1933
7048a91738M1771o8103N824o3461o6473l2353J25266O6088P336k0936M1155J609
7036a54015K4752o2836j04096j28695j4469J31292J78686J695K1141p149n9560
7025a73254J77644q4959n3945r4606N90O1248p97l0576K2121R1239j9469l373
7013a08137J7175p6835N221J1280m6235n2623l184o6185M4377J25901Q658N9825
7001h0762m716k8693j69763O2406n6244J9414l8700P6440R9429n2883K7364J09223
6989c7485l1653r7380j3946r8186J00476Q4388L4831k645j12102m8785N8769n4595
$$ y = [-432042, -332369, -234864, -108687, -101272, -107787, -62564, -76075, -165410, -153108, -212455, -242789, -194448, -241206, -226395, -148755, -188237, -147057, -152408, -180933, -163994, -323669, -262880, -223671, -191738, -149967, -218070, -212246, -275707, -342180, -374533, -249267, -183179, -175843, -196779, -155624, -154015, -129263, -192099, -296195, -424890, -439359, -308067, -129381, -127686, -106545, -113694, -173254, 4390, -80569, -134514, -229120, -228530, -167282, -168079, -198655, -176534, -85295, -104764, -108137, -90962, -167797, -162576, -151296, -197531, -250154, -253338, -319523, -275146, -149245, -140587, -80762, -85478, -114171, -283934, -221528, -277772, -258358, -297058, -220618, -121189, -174072, -146708, -37485, -69138, -166518, -180464, -278650, -178174, -93786, -58955, -61600, -173702, -222487, -163718, -218313]
6977b18313R3795J4925n2275m5756p56k7074q3101j06132J25865L0795L0221k560
6965b40366J06982L879n4921j33286j00102Q8304J62411J78816j40540j3935J01969
6954d0789l7964k4465l6580J8016J4723r5667r0473N0201J13629J82501m2948
6943A0184j65754L9493K6850l7407j16212M1051J4121j22339P7851l5788K2419
6932b45531J13727j4485j59285j60382n3498K20978J23153j20884r5987K8243
6922c63951J18674N2823l2673j19343J3328j6642Q2786n9269K030P8425p546L3301
6910b18057j6165M4739j2631L1153r2816j37401J26076k6561q640n148k35J4191
6898c01495J1150P2826j53765l6621P1305J46671R85j03519K5724O1334O5974
$$ y = [-218313, -124518, -109593, -161868, -207624, -208380, -235454, -318555, -424687, -298822, -268027, -237806, -240366, -133384, -129505, -184426, -317712, -417814, -329510, -167099, 11717, -128823, -142758, -40789, -78753, -103218, -139798, -121782, -107059, -202726, -293199, -242998, -129369, 53132, 10184, -155570, -116077, -89227, -126634, -242846, -201795, -187674, -310013, -232162, -267950, -245531, -131804, -146289, -305574, -465956, -519454, -298476, -175323, -296207, -392194, -363951, -245277, -192454, -225127, -344470, -331142, -347784, -264998, -324267, -322237, -243812, -251358, -218057, -234222, -189483, -202114, -170961, -263777, -401178, -275102, -301663, -310303, -315451, -315686, -301495, -290345, -217519, -371284, -407905, -336600, -189929, -188944, -292463, -266739, -205405, -139431]
6887a39431j8097p1622o6324P5778J5351O2347M2540n4732k4087P8242p6049k9884
6875b05968Q5232N4951j27196j33814o4557N1085J15629O3286j2850n1540p292
6864b33034k9430J6533L986j810J8005j21754K1076j3967J39879K00711q1623
6853h1428j69072j1123O742J30372J00656j02624p1546J4520M4968j07812n9376
6842c05723m4869Q7422m959p0491o9734L2549P1801O8770K715o1043M5611J22271
6830a25680p8795k7690O0154o9973m8429Q7150M6690L1392o74K4715m9875n6597
6818b07612M2547K7588K2387j26213k2685L2445J68707R2167j18944l5972j30475
6807b56060K4829P5765n018j25861M9764r1750j01929P2372J38182J23272M0713
$$ y = [-139431, -157528, -229150, -295474, -219696, -204345, -141998, -99458, -154190, -178277, -100035, -176084, -205968, -120736, -65785, -192981, -326795, -391352, -340267, -224638, -161352, -174202, -225742, -233034, -262464, -245931, -241945, -243755, -225750, -347504, -326428, -340395, -200516, 195, -81428, -250500, -261623, -254881, -124509, -23853, -126477, -198023, -183503, -138535, -246347, -305723, -350592, -263170, -268129, -338620, -408354, -375805, -304004, -235234, -232519, -293562, -247951, -125680, -204475, -232165, -172011, -241984, -290413, -203263, -156573, -125181, -125855, -101140, -151015, -207612, -165065, -137477, -115090, -241303, -263988, -231543, -62836, 29331, -89613, -125585, -256060, -231231, -155466, -160484, -286345, -236581, -328331, -430260, -357888, -219706, -96434, -55721]
6796e5721n7924k4829K1729o9655n0048q690P2439N3636R0222k2067k0825J09091
6784C7358J1211j54351j74890k7531l5256N5318P5287r4843K13719J14500L9631
6773F0153j37056k04599k0178J03626n6769j25881J3683J83228P2963J40211j58453
6762a29072o4641P6910L1104j15957L9487n9796n998J42713l4191J8461k490O3845
6750c9625n3464j13628m1011k5436j5764r0673l5998J6721J03457J89905L5228
6739g0288l0221o6100j74203k0720j08379n1461J47497P4059J0772O4923j550
6728b25671p1863Q1975Q7730K3763j02508n8583K4328k4963J00549m9134j44742
6717c59119Q4757Q818K4808J0180J62663r9188p7047j40534J80499j931m4326
$$ y = [-55721, -113645, -138474, -116745, -186400, -236448, -245138, -172699, -119063, -28841, -50908, -71733, 37358, 48569, -105782, -280672, -308203, -343459, -288141, -212854, -307697, -93978, 20522, 60153, -76903, -281502, -301680, -198054, -254823, -380704, -367021, -183793, -110830, 29381, -129072, -193713, -116803, -85699, -201656, -162169, -221965, -227963, -85250, -119441, -100980, -103470, -39625, -93089, -206717, -247728, -273164, -288928, -379601, -415599, -398878, -295421, -105516, -70288, -100509, -166609, -340812, -361532, -469911, -521372, -373875, -299816, -289044, -224121, -225671, -297534, -215559, -127829, -104066, -206574, -265157, -240829, -265792, -165243, -214377, -359119, -274362, -265544, -240736, -230556, -67893, -167081, -244128, -384662, -204163, -206094, -250420]
6706b50420K7257K5602J02859J22840n3739o0565j76952j39366M2601J42619L4973
6695a82291J09749J10059j4931j32989j0411n510J3417K5151q9549j52399l010
6684c32714O2032J15253J37884r1079q2350J827j08545J2575r738Q426N7920J0697
6672b17812p8068P9315J08186o2093Q595K697J4227q8309n8447m5733J63117O3796
6660a10529j1895q032O0359L4195l0778q3764k7952r957j22643q074J28991J03582
6648h6497K2744k3612k4076l3785K362N7198J5222j42230j0048O2985J6545J1642
6636a31550Q2842j5498j6354j44378Q5271P9130O0929n3613j10280M261L5916
6625a23324L6215J73286j8472M5018L6870p4871k16383K0334O3142J8179k1857
$$ y = [-250420, -223163, -197561, -94702, 28138, -25601, -86166, -263118, -402484, -359883, -217264, -182291, -72542, 37517, 22586, -110403, -120814, -126324, -112907, -87756, -177305, -329704, -332714, -270682, -155429, -17545, -108624, -190974, -189147, -297692, -285117, -294855, -286429, -228509, -217812, -295880, -216565, -108379, -170472, -161877, -159180, -144953, -233262, -291709, -337442, -174325, -110529, -122424, -130456, -70097, -35902, -66680, -150444, -178396, -188353, -310996, -319070, -190079, -86497, -63753, -87365, -111441, -145226, -142864, -85666, -70444, -212674, -222722, -159737, -143192, -131550, -48708, -64206, -80560, -224938, -139667, -60537, 392, -53221, -163501, -159240, -123324, -87109, 86177, 67705, 112723, 149593, 74722, -141661, -121327, -58185, -40006, -61863]
6614f1863J0832K5923N6000R3115o4995j3754n4008M7749J01814j78259o7877
6603a05323J36953P307K2020r4603o1950J57058q3314j29954m4938N9123O6932
6592g0689m7914O1770J7614k7278K2329j6265L4337L9725l996o4787L9487L4714
6580A9047l9519n4054P1640o7142k3879O312N3492R030M3739J19433j05206k6282
6568F611L749j24214N4282N7941j23450J5979L8572k2795K3979J32502O1314K02329
6556C26799K8410o8142N7907J2136j18034j47469N2083Q5699m4648j4600m943
6545A65198O3018j24280K4479q45J71407P2533k5931m6795r4994O7625k6476L3304
6533B78243r810q7497M7505j02856L1527q0651r1215q823j9769j39132p995J05451
$$ y = [-61863, -51031, -25108, 30892, 124007, 59012, 45258, -8750, 38999, 140813, -37446, -105323, 31630, 38937, 60957, -33646, -95596, 61462, -21852, -151806, -196744, -137621, -70689, -118603, -56833, -39219, -66497, -44168, -60433, -26096, 13629, 9633, -55154, -15667, 19047, -20472, -74526, -2886, -70028, -93907, -87595, -34103, -25073, 18666, 138099, 32893, 6611, 10360, -113854, -59572, -1631, -125081, -109102, -70530, -93325, -69346, 63156, 124470, 326799, 355209, 287067, 344974, 357110, 239076, 91607, 143690, 229389, 184741, 170141, 165198, 228216, 103936, 128415, 127570, 298977, 371510, 345579, 298784, 203790, 271415, 244939, 278243, 268433, 180936, 228441, 125585, 157112, 76461, -14754, -23577, -43346, -182478, -190473, -85022]
6521h5022J17573J7308j7966p6002M8398n8233n1599q5952J80906O0412q0688
6510c0865J8233J41693j8985k2920j14202n2280o1103k0129J00094R1113O8175
6499I8824M4932O5509q9546j21836J03836K5605j9562n1626N9943N6668j0869
6488A61878l4250k7821k533p3654m7891n1466J88785j245p8227k340J10885Q7061
6476B29182P2367l8140J39584p4618j07339q7718l7793N0000P9648q852K4738
6465B41059O1436J52762J10754n3918j67504J68440J14728j15908j35562j20277
6455B56010J487K22271j33875o6624l3046Q9076J2120L0060m2272O0116N2691
6444D48014N0077m9211j5379P7424l4135J5026J11362l1939M756l0803p7791j45127
$$ y = [-85022, 32551, 49859, 31893, -44109, 4289, -53944, -105543, -191495, -10589, 49823, -30865, -12632, 129061, 110076, 87156, -27046, -79326, -140429, -160558, -60464, 30649, 98824, 143756, 209265, 119719, -2117, 101719, 127324, 107762, 56136, 116079, 172747, 161878, 127628, 99807, 97274, 23620, -24271, -75737, 113048, 111803, 33576, 31236, 142121, 229182, 301549, 263409, 402993, 328375, 221036, 133318, 95525, 145525, 225173, 216321, 241059, 302495, 455257, 566011, 512093, 344589, 513029, 627757, 511849, 376287, 256010, 257497, 479768, 345893, 279269, 246223, 335299, 347419, 377479, 335207, 395323, 448014, 498091, 448880, 433501, 510925, 476790, 491816, 603178, 571239, 575995, 545192, 467401, 322274]
6432C22274k1965L5797r1428K6210p502N1748J07392m3740r1165K1119J36271
6421D45011m2350p5618j26683n4246Q8780j3095j7966Q9543J16938j1392l3306
6410C65616N0458m445j46792q6452Q3545K11777l0946K8185L7068N1254m8779
6399E10489n3903j35379J06473J20942J5842O5715Q3749O5250M9015p4798n2729
6388G00666M5759J10395l6424k3570J42069R5855k3857O8427L0390n9647j8483
6377A031580m2126j22062J50313J95448M956j6993J5691J4713J97104O8632j61980
6366A335276M5611J17090n6019m6855j44399j06047K15507N8901m2434O8464K8413
6355A473508J28513l1220q0389J9883J86977J08509J10608J04710K7057Q6775
$$ y = [322274, 300309, 336106, 244678, 270888, 263386, 315134, 422526, 378786, 287621, 308740, 445011, 402661, 327043, 200360, 146114, 234894, 221799, 203833, 293376, 410314, 398922, 365616, 416074, 411629, 264837, 178385, 261930, 473707, 442761, 470946, 508014, 559268, 510489, 456586, 321207, 427680, 548622, 564464, 630179, 713928, 779178, 828193, 753395, 700666, 746425, 856820, 820396, 796826, 938895, 1034750, 1010893, 1079320, 1109710, 1050063, 1031580, 989454, 867392, 1017705, 1213153, 1218109, 1201116, 1216807, 1231520, 1428624, 1497256, 1335276, 1380887, 1497977, 1441958, 1395103, 1250704, 1144657, 1360164, 1419065, 1376631, 1445095, 1473508, 1602021, 1570801, 1490412, 1510295, 1697272, 1805781, 1916389, 2021099, 2048156, 2134931]
6345B134931J88407M28m9591J75580J41080M3791L3994J46716K74202J56082L3083
6334C278703P8774K49995L19486L07896J13982M38803N81663N85772O72063Q34813
6324G461950J261079J724362K553422L552278M342741M486121L784989K245532
6316C1412474N48920j030658k177338k701201k957237k627246k200141j556255
6308A6711318o68296K72628J634590K809397M004477M267227L556993J859266
6300C4447600k6136j613864k795683l506122l736023l432696k777520k430951
6292A4128605j981427j450970j099146q64264n65727n54632n48488l78090k88975
6283F396886k96181j31682j13320k07846N3500P5417r281P3816R4220J72110Q0085
$$ y = [2134931, 2323338, 2323766, 2274175, 2449755, 2590835, 2634626, 2668620, 2815336, 3089538, 3245620, 3278703, 3357477, 3607472, 3926958, 4234854, 4348836, 4787639, 5369302, 5955074, 6627137, 7461950, 8723029, 10447391, 13000813, 16553091, 20895832, 25381953, 29166942, 31412474, 31961394, 30930736, 28753398, 26052197, 23094960, 20467714, 18267573, 16711318, 16043022, 16315650, 17950240, 20759637, 24764114, 29031341, 32588334, 34447600, 34421464, 32807600, 30011917, 26505795, 22769772, 19337076, 16559556, 14128605, 12147178, 10696208, 9597062, 8732798, 8167071, 7612439, 7063951, 6685861, 6396886, 6100705, 5969023, 5855703, 5647857, 5701357, 5776774, 5767493, 5841309, 5935529, 6107639, 6187724]
6272F187724O7994l021J85683K38291J29940J66699K97259K84303K44370K71992
6262H071234L51972L79557M76145M86789P06028J056557J313891J546223K084630
6253A6473026K846957M279363O406359Q541882J0514860J0862747Q791848N408293
6245G4125335J275520k638859n183322o723865p119647o565902n337654l745488
6237C8086118j732540N17818L495683O559752Q914938R370326P653816M240095
6229G7106006N785l844198o728508q221326q507264p927323o935997n942401m921351
6220B4083423l765334k759938k258021j663132j373931j302413j009648o65411
6212I285595o51504o17214l84799k18366k60729k48180k47322j52712k25444n7489
$$ y = [6187724, 6255718, 6252697, 6438380, 6676671, 6806611, 6973310, 7270569, 7554872, 7799242, 8071234, 8423206, 8802763, 9278908, 9765697, 10471725, 11528282, 12842173, 14388396, 16473026, 19319983, 23599346, 30005705, 38547587, 49062447, 59925194, 68717042, 74125335, 75400855, 72761996, 67578674, 60854809, 53735162, 47169260, 41831606, 38086118, 36353578, 36871396, 40367079, 46926831, 55841769, 65212095, 72865911, 77106006, 77111791, 73267593, 66539085, 58317759, 49810495, 41883172, 34947175, 29004774, 24083423, 20318089, 17558151, 15300130, 13636998, 12263067, 10960654, 9951006, 9285595, 8634091, 8016877, 7632078, 7413712, 7152983, 6904803, 6657481, 6504769, 6279325, 6221836]
6202F221836j42512k52719j48608l4054m6609j09139j32118J4434J03105r1168
6192E382448l4904j32761j19471O5086n0906r5824j50336R9743k7324m5642N1367
6181D941476j03497J35099J34115R0450J11364J15819K31639K10926Q8453K68429
6171F224273L01239J24288K10417L65235L80460N03599O06990P44797R47334J141219
6161A1549851J384439J905663K662511L838806N525177P760096R642896J0260830
6153E4530269R029362O016922K172602j238729m197758o227441p169643p135363
6145D5780221o532212n435220m416495l030359j799875q19097O2230J008065K546125
6136B7363383M653453P027900R162503J0045554R238844O423828K282627j678094
$$ y = [6221836, 6079324, 5826605, 5677997, 5643943, 5597334, 5488195, 5356077, 5370511, 5473616, 5382448, 5347544, 5214783, 5095312, 5160398, 5109492, 5013668, 4863332, 4963075, 4935751, 4890109, 4941476, 4837979, 4973078, 5107193, 5197643, 5309007, 5424826, 5656465, 5867391, 5955844, 6224273, 6525512, 6649800, 6860217, 7225452, 7605912, 8109511, 8716501, 9461298, 10408632, 11549851, 12934290, 14839953, 17502464, 21341270, 26866447, 34626543, 44269439, 54530269, 63559631, 69576553, 71749155, 70510426, 66312668, 60085227, 52915584, 45780221, 39248009, 33812789, 29396294, 26365935, 24566060, 23746963, 23809193, 24817258, 27363383, 32016836, 39044736, 48207239, 58252793, 67491637, 73915465, 76198092, 74519998]
6128G4519998m707067o836752p995503q221559p706552o746751n437228m282209
6120B2586377l281311k538735j870856j504152j352770j238758j041076n90697
6112I168022n60082m96314l60898l23241k02175p4933j34255k30356k7622k7157
6102F730989r6807J22719n9166R7311R2495M7746M7963J60660J30186J43861K70560
6091G688517L00421M20208P01919Q70495J379951K166854L039677L949349M419590
6082B4936981L789833K517264Q65471o58663j669477k407933k895520k907376
6074B1570580k514087k066192j570530q66246k25350K85120P80331J182960J606332
6065A8182918K383679K959768L613068M127884L550239K150918N35526j229579
$$ y = [74519998, 69812931, 62976179, 54980676, 46759117, 39052565, 32305814, 26868586, 22586377, 19305066, 16766331, 14895475, 13391323, 12038553, 10799795, 9758719, 9168022, 8607940, 8111626, 7750728, 7427487, 7225312, 7150379, 7016124, 6785768, 6758146, 6730989, 6634182, 6756901, 6697735, 6795046, 6887541, 6935287, 6983250, 7143910, 7274096, 7417957, 7688517, 7988938, 8409146, 9111065, 9981560, 11361511, 13528365, 16568042, 20517391, 24936981, 28726814, 31244078, 32109549, 31450886, 29781409, 27373476, 24477956, 21570580, 19056493, 16990301, 15419771, 14553525, 14328175, 14613295, 15393626, 16576586, 18182918, 20566597, 23526365, 27139433, 31267317, 34817556, 36968474, 37504000, 36274421]
6057C6274421k449100k986430l449697l729073l340044l010911k305297j708794
6049A3295075j244236q85478m97545j42670O3759K19416K36277N10613K97636
6040A1852847J93311l5140p2729o5702r3257j80238j55616p7379k04247l20472
6030A0841378m21377o40796o61732m07215n90076l77567k08512k07462L3405L5004
6020G395050N7841K41452K47261K3732N4253p8446l27104k42446m40234n88992
6010F342367l82859m84855m51374l91068k70183k92818k36179k10446j77952k37439
6000C207194j34388j29940r6568j37714j30019r520p1460j19980p4050M7695L2498
5989B383748m3344j72110K982o4276j19780q862o1536k6746j2357K6102J8333
$$ y = [36274421, 33825321, 30838891, 27389194, 23660121, 20320077, 17309166, 15003869, 13295075, 12050839, 11165361, 10667816, 10525146, 10588905, 10808321, 11044598, 11555211, 11852847, 12046158, 12011018, 11938289, 11872587, 11779330, 11599092, 11443476, 11366097, 11161850, 10841378, 10420001, 9779205, 9117473, 8710258, 8120182, 7742615, 7534103, 7326641, 7360046, 7395050, 7452891, 7694343, 7941604, 7965336, 8019589, 7941143, 7614039, 7371593, 6931359, 6342367, 5959508, 5474653, 5023279, 4632211, 4362028, 4069210, 3833031, 3622585, 3444633, 3207194, 3072806, 2942866, 2846298, 2708584, 2578565, 2569045, 2497585, 2377605, 2303555, 2351250, 2383748, 2340404, 2168294, 2171276, 2107000, 1987220, 1978358, 1916822, 1890076, 1877719, 1903821, 1922154]
5978A922154J04559J50637L4689J36118K44826o9019j67759p1755r6406q1267
5968B106777q9071k00377r1075j38786r0173L3284n7167l8914p6419o8488j28733
5957A160858K4273k9540l7768P4775R9265J88448N0988n2122n9091K1904k4272
5946A417718n3072j83214n172J9652J13332M550r0076j3354K5425j934r7568l1064
5934A105223N1865Q2603k1831j07367l278l2942J1982j21770j80409l1598R9378
5923H51856j37015l0983L263k6974J48982R7020n9432p4535j8136o9119N8962
5912G43889o7596j17650N0109M5126p4377J9903l3267o444J9160n0106j3119J66350
5900F81978j5992K4065L9773j15931o0770L3427j04734Q4388j1982l384k9344
$$ y = [1922154, 2026713, 2177350, 2212039, 2348157, 2592983, 2523964, 2356205, 2284450, 2188044, 2106777, 2017706, 1817329, 1726254, 1587468, 1497295, 1530579, 1473412, 1434498, 1358079, 1289591, 1160858, 1185131, 1155591, 1117823, 1192598, 1291863, 1480311, 1531299, 1479177, 1420086, 1441990, 1417718, 1364646, 1181432, 1176260, 1195912, 1309244, 1313794, 1223718, 1210364, 1235789, 1233855, 1136287, 1105223, 1157088, 1239691, 1217860, 1110493, 1107215, 1074273, 1086255, 964485, 784076, 752478, 851856, 714841, 683858, 687121, 660147, 809129, 906149, 846717, 772182, 754046, 684927, 743889, 676293, 558643, 608752, 653878, 579501, 599404, 566137, 559693, 578853, 528747, 515628, 681978, 665986, 690051, 729824, 613893, 553123, 586550, 481816, 566204, 554222, 550838, 521494]
5889E21494M0222r1702J5729m3861M070L942n5773l7118J4196j82673n7590N5197
5877A86133J08169O5052R8893q5075n2173R7825M0295m0656j3720j7752J62179
5866E49170R8010j16562q920j2887k9917p2200J2564j06452O5776L0153l1233
5855C77502j3334o3590o534J11992P6670l9073J6579m556N7996L7469n4639J22159
5843F18641q30J34437N6045p7996n200J47707r3798m9732j15757q1363r0879q2654
5831C58621J08675N9757l1907l3420k3894N7561j27900P1571r5568k7859J80584
5820D96221O5718K8242R2779N0563j47303k4975L7697p0588M7474j024r2958m3909
5808D37937k9201j18464J05399O1847p2948O1447p3324l5714n3200O2696k5463
$$ y = [521494, 561716, 470014, 485743, 441882, 445952, 449894, 394121, 357003, 371199, 188526, 130936, 186133, 294302, 359354, 458247, 373172, 320999, 418824, 459119, 418463, 404743, 386991, 549170, 647180, 530618, 521698, 508811, 478894, 406694, 419258, 312806, 378582, 408735, 377502, 364168, 300578, 294044, 406036, 482706, 443633, 460212, 455656, 513652, 551121, 496482, 618641, 617811, 752248, 808293, 730297, 725097, 872804, 779006, 729274, 613517, 532154, 441275, 358621, 467296, 527053, 495146, 461726, 437832, 495393, 367493, 439064, 343496, 315637, 496221, 561939, 590181, 682960, 733523, 586220, 561245, 598942, 528354, 575828, 574804, 481846, 437937, 408736, 290272, 395671, 457518, 384570, 446017, 372693, 336979, 283779, 346475, 321012]
5797C21012n7234L8485j29186J3129J7362j08701J8444R7286j839M3271k0104
5786B31925J8739L3863L7372k5222L1001R0919Q4169o0607j27030J175K0380J62375
5774D99059r8265j37986M8050O3665j1023p061j86614J33283J02346p8953r8192
5763B28309M3528r9125l7616J01068n81N5261M7393m4596l7501J0319J9978m0258
5751B46179p5879R9376k1938O4629m560J951m8902o9549l5587n3755K7823m915
5739A24873k1358Q9966P8078J7381k7142M0742n6623n8187J1119m4078M1697o2736
5727A33732L7675o3383J06890J24487J261n0407j06609m2512j9570Q8840P5402
5716B85806j42658J9439J49582Q6276j01079k0937o0620n0746p3217j2349J09319
$$ y = [321012, 263778, 302263, 173077, 186206, 203568, 94867, 113311, 210597, 208758, 252029, 231925, 250664, 284527, 321899, 296677, 327678, 418597, 502766, 442159, 315129, 316304, 336684, 499059, 400794, 262808, 310858, 374523, 363500, 356439, 169825, 303108, 405454, 326501, 228309, 271837, 172712, 135096, 236164, 235583, 290844, 338237, 293641, 256140, 266459, 286437, 246179, 170300, 269676, 247738, 312367, 307807, 309758, 260856, 191307, 155720, 101965, 129788, 124873, 103515, 193481, 271559, 288940, 261798, 302540, 245917, 187730, 198849, 154771, 196468, 133732, 171407, 108024, 214914, 339401, 340662, 290255, 183646, 141134, 121564, 210404, 285806, 143148, 162587, 312169, 398445, 297366, 276429, 215809, 165063, 91846, 79497, 188816]
5705A88816J06325o3605p4122P650L188L0837q3124j29513P2963J10982J39128
5694C09525O1032n7454L1636J31516K2332k2186q1503K700Q7117M8384j2112j01646
5682D19341R2644L9713m2968r9421p3694J0709L64R1468J02533j876O2529L1759
5670F33101M6591q2485l2760j0722N1027k2280J6064P3497m9674n5828k8135n2438
5658D85958M0760K402N1063L6486L5841J9162n96n7416j18821j4991R4693K2361
5646E96902J42274o7091n6122O7942J93639M4834j05888m8138L3828k2400j09630
5635F70150L86p952N3352J20703l7764n1207J00633J82815o2094l9208j1614J76436
5623A094636J87215J19720J59887L88722O29263O96672Q98629J386466J521497
$$ y = [188816, 295141, 231536, 157414, 165064, 168252, 199089, 115965, -13548, 59415, 170397, 309525, 370557, 313103, 344739, 476255, 498587, 476401, 394898, 397598, 484715, 533099, 520987, 419341, 511985, 551698, 508730, 409309, 335615, 346324, 346688, 438156, 540689, 538813, 601342, 633101, 679692, 597207, 564447, 553725, 604752, 582472, 598536, 672033, 622359, 566531, 538396, 485958, 526718, 529120, 580183, 616669, 652510, 671672, 671076, 613660, 494839, 479848, 574541, 596902, 739176, 672085, 615963, 683905, 877544, 922378, 816490, 768352, 802180, 779780, 670150, 670536, 662584, 715936, 836639, 798875, 747668, 848301, 1031116, 969022, 929814, 918200, 1094636, 1281851, 1401571, 1561458, 1950180, 2579443, 3276115, 4174744, 5561210, 7082707]
5614G082707J423654J196909P98748M16059l1169o88567j023166j121213j277828
5605F776134j273969j066959p53667n67712r8504k63119j7120j0775R255k3084
5595B710480L09194N40988J028527J478902J767020J824802J518767J069685N39934
5586A2788299j31224q38417j247373j291772j478895j374532j128926j056539
5578D240621p35078n20113m86258l52511k29958l31393k40051j69679n5241o4901
5568A055438p6595o2866j4519J0565k4144k1088j56749O0290l0531j41478q4944
5557E13379K2142m2244O7293J0956M1223r0086q4431p4087L2321j6579L6234Q049
5545D24170j9733P6393M76n7732j13295m8465N546J02351J16587R7123O5530R082
$$ y = [7082707, 8506361, 9703270, 10502018, 10918077, 10886908, 10198341, 9175175, 8053962, 6776134, 5502165, 4435206, 3681539, 3113827, 3015323, 2752204, 2735084, 2724309, 2733564, 2710480, 3019674, 3560662, 4589189, 6068091, 7835111, 9659913, 11178680, 12248365, 12788299, 12657075, 11818658, 10571285, 9279513, 7800618, 6426086, 5297160, 4240621, 3505543, 2985430, 2499172, 2146661, 1916703, 1585310, 1345259, 1175580, 1120339, 1055438, 978843, 915977, 901458, 912023, 887879, 866791, 710042, 770332, 739801, 598323, 513379, 535521, 493277, 560570, 571526, 612749, 522663, 438232, 364145, 396466, 379887, 416121, 424170, 404437, 480830, 481306, 423574, 310279, 261814, 267360, 369711, 486298, 583421, 648951, 658033]
5533F58033q1450n6468o3150j07651n266L3210n9841l4493Q5811m5895q0598N3002
5521B95244n5461j06467m6884Q774K4614K3861o166L9876j63632N78J7304j4093
5509A7548k4609L4210j29291q384J03314J43369o466l8637l8095l9257j18333
5498a04631K1353r3887L8974K8579J49244J16578J8104k26165K3161R6951M3677
5487A11938n3375J2509K0454N5077Q9850p6690o370P1131l7692j20557r4936o6668
5475i5329k4826P9415n0257M1219J29796m0971j0452L6033j5028o032J4358r9544
5463d1618L7547l7031L4028k7081J28585Q5049o3033o7561p5258O6434O3630o7849
5451C5842L8871o9318M2638M6824M1656J866M4151O2323q8976L2051J40724K7073
$$ y = [658033, 576583, 520115, 456965, 349314, 344048, 377258, 317417, 282924, 368735, 322840, 242242, 295244, 239783, 133316, 86432, 95206, 119820, 143681, 137515, 177391, 13759, 14337, 31641, 17548, -7061, 27149, -102142, -110526, -7212, 136157, 129691, 91054, 52959, 13702, -104631, -83278, -177165, -138191, -109612, 39632, 156210, 174314, -51851, -28690, 68261, 111938, 58563, 71072, 91526, 146603, 236453, 159763, 153393, 224524, 186832, 66275, -28661, -95329, -120155, -40740, -90997, -49778, 80018, 39047, 28595, 64628, 49600, 43568, 57926, -41618, -4071, -41102, -7074, -34155, 94430, 179479, 116446, 48885, -26373, 40061, 103691, 35842, 74713, 5395, 48033, 94857, 136513, 138379, 182530, 244853, 155877, 187928, 328652, 355725]
5439C55725p3289p9209J0329j46937N2413j0653J3930J23708M5122j76824j26800
5428a2485P7323P5542R4660k6134j22534J07623j734p0564L0646J19506J03100
5417C74949O7996p9074n7144J3815L6061K9216l1584n191P7561P3223J6611k9894
5405D86545L9972n1590K9059k1830k6949N8771O4933M082k6406L7572K7238J3709
5393F35106O8175n0968m6578l0033l0596M4642M2088M9932Q6458o407j39248m9550
5381E73021P9524J75627N2058J308n4249j0230J6232K2074k7018M866n9035P7201
5369H51379O3034l9401k3126p398N1780M2805R7085k0932R6328J6738n2061J7543
5357A093774L25L3083j12001Q9016L3401J13963R5261J08069o1530J13925R8542
$$ y = [355725, 282436, 203227, 213556, 66619, 119032, 108379, 122309, 246017, 291139, 114315, -12485, 64838, 140380, 235040, 208906, 86372, 193995, 192261, 121697, 152343, 271849, 374949, 442945, 363871, 306727, 320542, 356603, 385819, 354235, 349044, 426605, 499828, 516439, 486545, 526517, 474927, 503986, 482156, 455207, 513978, 578911, 582993, 556587, 594159, 621397, 635106, 703281, 652313, 605735, 575702, 545106, 589748, 631836, 681768, 768226, 761819, 622571, 573021, 652545, 828172, 880230, 881538, 827289, 817059, 833291, 855365, 828347, 833213, 774178, 851379, 914413, 875012, 851886, 844488, 896268, 939073, 1036158, 1015226, 1111554, 1128292, 1076231, 1093774, 1094099, 1127182, 1015181, 1104197, 1137598, 1251561, 1346822, 1454891, 1393361, 1507286, 1605828]
5346A605828P2722Q8148K16424K41707J74296L2533J25995J7492r797O3368l6769
5335B591947P6982q146K18107K57344O0779N7547J24967J62455J66911K11169
5325C920062K47981J89797P8732K13597J32070J96867L80450K97231K69403L66748
5315F292938M34902M72971P78544J172850J688087K063441K271886J900417Q91015
5306A7967051K60004o0555n95182p61944n41705J37468O54315J296220K093988
5297B0449660K823449K764678K703103L217723L516784L175355K683700J896160
5289D3230612Q94031J93791o98265k091761k022276j435341o72833O67763J963651
5280D0029372K467758K744628L056314L090388K948809K196488N06235j96921
$$ y = [1605828, 1678550, 1766698, 1983122, 2224829, 2399125, 2431658, 2557653, 2575145, 2565348, 2628716, 2591947, 2668929, 2660783, 2878890, 3136234, 3197013, 3254560, 3379527, 3541982, 3708893, 3920062, 4168043, 4357840, 4436572, 4650169, 4782239, 4979106, 5359556, 5656787, 5926190, 6292938, 6727840, 7200811, 7979355, 9152205, 10840292, 12903733, 15175619, 17076036, 17967051, 18227055, 18166500, 17571318, 16809374, 16267669, 16405137, 17059452, 18355672, 20449660, 23273109, 26037787, 28740890, 31958613, 35475397, 38650752, 41334452, 43230612, 44124643, 44318434, 43620169, 41528408, 39506132, 38070791, 37397958, 38065721, 40029372, 42497130, 45241758, 48298072, 51388460, 54337269, 56533757, 57039992, 56843071]
5272E6843071j69014r29393j793976k573204l178958l132170k685819k065618
5264D0314919r36174Q1342P21090Q96536J683516J476602P13692j81561j191469
5255D3578493j539735j774516k645748l339538l420476l161218l411920k907822
5247B1377520k284881j472864p26844J78629R19197R50693M06738k98474p33317
5238A8316397j134879j991140j857766j569793j485093j338490j119646q24215
5230F995375n99814m44617n06400l13941k33433j58764k78665k42805j54402q2179
5220C980355p4840r1880j48678j01072M821j27093j06518q3120p3262k16943k49787
5209B711983n6826j52179r1281R879m4528r9312O7495n8417m4398l2729p3778
$$ y = [56843071, 56674057, 55744664, 53950688, 51377484, 48198526, 45066356, 42380537, 40314919, 39378745, 39460087, 40181177, 41077713, 42761229, 44237831, 44951523, 44769962, 43578493, 42038758, 40264242, 37618494, 34278956, 30858480, 27697262, 24285342, 21377520, 19092639, 17619775, 16892931, 17071560, 17990757, 18941450, 19348188, 19049714, 18316397, 17181518, 15190378, 13332612, 11762819, 10277726, 8939236, 7819590, 6995375, 6395561, 5950944, 5444544, 5130603, 4897170, 4738406, 4459741, 4216936, 4062534, 3980355, 3905515, 3813635, 3664957, 3563885, 3568706, 3441613, 3335095, 3251975, 3178713, 2961770, 2711983, 2655157, 2502978, 2411697, 2421576, 2377048, 2277736, 2345231, 2286814, 2242416, 2209687, 2135909]
5198B135909j71807q2783q3408p0232J4580Q7422O2637N0557j60484j6550j12156
5187A653685j27896M0025L5068j22235N2234J96104Q5500n8809j19345p5564O7321
5176A626088j19861r2697j9936Q2904L4906R6028o6546l6268J98674N6446r6556
5165A663182P4374K0469R269L7425R836n6062O4616K5223O3569K1388m9131J03864
5153A988022O6973r2369q5991J2851N6690o1132J8731n3087j6342J25442P6907
5142B036695n284j6074M4757o4005M3877m7383J31737P5879j04928k4231K7209
5131B098249j31369O0431L7189q5579q9660p7493o8996p8962J14305J11563m220
5120A885458J0699K9121N5609m4127j03008j03576N5286o9779R674j2495M0736
$$ y = [2135909, 1964102, 1881319, 1797911, 1727679, 1742259, 1829681, 1892318, 1942875, 1782391, 1765841, 1653685, 1525789, 1565814, 1600882, 1478647, 1530881, 1726985, 1812485, 1753676, 1634331, 1558767, 1626088, 1506227, 1413530, 1393594, 1476498, 1511404, 1607432, 1540886, 1504618, 1703292, 1759738, 1663182, 1737556, 1758025, 1767294, 1804719, 1814555, 1758493, 1823109, 1848332, 1911901, 1933289, 1884158, 1988022, 2054995, 1962626, 1876635, 1889486, 1946176, 1885044, 1903775, 1850688, 1834346, 1959788, 2036695, 2031411, 2015337, 2060094, 1996089, 2039966, 1992583, 2124320, 2200199, 2095271, 2071040, 2098249, 1966880, 2027311, 2064500, 1978921, 1889261, 1811768, 1742772, 1663810, 1778115, 1889678, 1885458, 1896157, 1925278, 1980887, 1936760, 1833752, 1730176, 1785462, 1715683, 1725357, 1712862, 1753598]
5109A753598P8372j25390k9969j06441j2491O3476j37162Q315L9988J23409M3586
5098A699291j03111J3023r16k7067n1325j49699o5689J27827j13562j41495J66366
5087A353643k3224R3228j11633m4794R2526K0353K839L1441j64410K203M2174
5076A294346j03546K4273J61598k8130L9907M8691j61061n8905J06761N0989Q047
5065A382970p250Q2126J8831P2769J5769j5677j01065M722m4710m7162K8596N8659
5053A448578K8686j29062J15555r778j56831J13993p9406P8249R8620J7717p5985
5042A450336J20666Q5543n5566Q0360J62658m344j9022J04647m5656L12357K73936
5031B465915k6364j1539P1539N258L2831J294o8505j2176O2570J9388R946q4139
$$ y = [1753598, 1831970, 1706580, 1676611, 1570170, 1557679, 1621155, 1483993, 1492308, 1532296, 1655705, 1699291, 1596180, 1609203, 1608287, 1581220, 1529895, 1380196, 1314507, 1442334, 1328772, 1187277, 1353643, 1330419, 1423647, 1312014, 1267220, 1359746, 1380099, 1382938, 1414379, 1249969, 1252172, 1294346, 1190800, 1215073, 1376671, 1348541, 1388448, 1437139, 1276078, 1217173, 1323934, 1374923, 1382970, 1375720, 1457846, 1476677, 1549446, 1565215, 1549538, 1448473, 1453195, 1408485, 1361323, 1389919, 1448578, 1477264, 1348202, 1463757, 1453979, 1297148, 1411141, 1331735, 1409984, 1508604, 1526321, 1450336, 1571002, 1656545, 1600979, 1681339, 1843997, 1839653, 1820631, 1925278, 1879622, 2191979, 2465915, 2439551, 2428012, 2499551, 2504809, 2537640, 2538934, 2470429, 2458253, 2520823, 2540211, 2550157, 2466018]
5019B466018k3624J64552K54799J59219K61061K55373K20983K79891M92083M86895
5009E017250O22537L93983J51777J3233r4876l04802l63187l11357j98754j86429
4999D739375q1462R7554K12730J42456J75398L38796N35304N14338O69854N68962
4989G913305O20298M27772M30956K36920j6226m43232n51445m52889o40073o37184
4979F888202l74360l18332l05414j50644R4744J28759L26148L27192N65543O01379
4969G783217N18459K59689P3290j01157j67617l37646l56979m65180m06973j69679
4959F629424k31406k93650q1940J64371P0989K07010L6114O1421J05597O8675
4949F736605N7991J40225J87620J10275K87907R3297J38787K06615J56320O4242
$$ y = [2466018, 2442394, 2606946, 2861745, 3020964, 3282025, 3537398, 3758381, 4038272, 4530355, 5017250, 5639787, 6033770, 6185547, 6198780, 6103904, 5799102, 5435915, 5124558, 4925804, 4739375, 4657913, 4755467, 4968197, 5110653, 5286051, 5624847, 6160151, 6674489, 7344343, 7913305, 8533603, 8961375, 9392331, 9629251, 9613025, 9169793, 8618348, 8165459, 7525386, 6888202, 6513842, 6195510, 5890096, 5739452, 5834196, 5962955, 6289103, 6616295, 7181838, 7783217, 8301676, 8561365, 8634655, 8533498, 8365881, 8028235, 7671256, 7206076, 6799103, 6629424, 6398018, 6104368, 6022428, 6186799, 6257788, 6464798, 6500912, 6562333, 6667930, 6736605, 6794596, 6934821, 7122441, 7232716, 7520623, 7613920, 7752707, 7959322, 8115642, 8179884]
4939H179884P6466K17153J47079L73124K31175K07254K46378K68473K25820J59440
4929A0332246K25978K10495K46291J88059J05044J90878J18913K83929K82186
4920A2184019L29694J95260L94204K73329L94774J91994K13367L14205L42506
4911A4833352M67356N07078M53046N35180O10001P01961P07151P69393P19124
4902B0303642R25815R18993J030187J245877J427641J473888J853704K495349
4894C1675096L096440L914319N331372P145197R581584J1542868J2490064J1205657
4886I5982597Q228042N761529M293824L350713L105609L628350M121751M024422
4878A32496837K989654K284914K358701K684559L601542N571595P926845J0495002
$$ y = [8179884, 8256350, 8473503, 8620582, 8993706, 9224881, 9432135, 9678513, 9946986, 10172806, 10332246, 10558224, 10768719, 11015010, 11203069, 11308113, 11498991, 11617904, 11901833, 12184019, 12513713, 12708973, 13103177, 13376506, 13771280, 13963274, 14176641, 14490846, 14833352, 15300708, 15807786, 16260832, 16796012, 17406013, 18107974, 18815125, 19584518, 20303642, 21229457, 22148450, 23178637, 24424514, 25852155, 27326043, 29179747, 31675096, 34771536, 38685855, 44017227, 51162424, 60744008, 72286876, 84776940, 95982597, 104210639, 109972168, 114265992, 117616705, 120722314, 124350664, 128472415, 132496837, 135486491, 137771405, 140130106, 142814665, 146416207, 151987802, 159914647, 170409649]
4870A70409649J2175487J2177387J0951035R872691Q003492M040385n23536l280036
4862B23826554m402228n370881n122690l562620o40719K803410O486628J0446276
4854B24463730J4340771J7304726J9534074K0706411J9647778J6214077J0673322
4847C42884889L385222m511306j0621900j4790997j7297345j7763342j6804856
4840B64480365j5063384j3340693j1432242r004152o711695m517640k800143j648351
4832A99962065q20299k60724L58295P85294Q20189L41271m61383j121010j333007
4823A98270691j297105j349546j619867k103848k878598m039054n343509o313903
4815A73325261o648255o893574o790925o615390o461159o368614o296285o201689
$$ y = [170409649, 182585136, 194762523, 205713558, 215586249, 223589741, 227630126, 227106590, 223826554, 219424326, 214053445, 208930755, 205368135, 204727416, 207530826, 214017454, 224463730, 238804501, 256109227, 275643301, 296349712, 315997490, 332211567, 342884889, 346270111, 341758805, 331136905, 316345908, 299048563, 281285221, 264480365, 249416981, 236076288, 224644046, 215639894, 208928199, 204410559, 201610416, 199962065, 199141766, 198881042, 199239337, 200024631, 200844820, 201186091, 200724708, 199603698, 198270691, 196973586, 195624040, 194004173, 191900325, 189021727, 184982673, 179639164, 173325261, 166677006, 159783432, 152992507, 146377117, 139915958, 133547344, 127251059, 121049370]
4807A21049370n750725n514891n118072m837085m661778m484965m552803m679679
4799H1449372m679243m533961m105327l635212l056105k507262j835578j630453
4791E5466231j384363j105028j013531r15883q81280q92420n78596o03260o04226
4782D7487644o69965q24152j154032j386215j615376j552699j641451j570608
4774C7073146j691404j689599j593189j570680j422758j236863j085503q85727
4766B5897423r18246p33375q52299o91801n26874n19725o26625o31455n65033
4757A9831990l90941n46116o14098n88201n64971m86700m72469m32376k73095
4748A5463023l14970l89726k98877k71979k19870l17287k49260j77459j78631
$$ y = [121049370, 115298645, 109783754, 104665682, 99828597, 95166819, 90681854, 86129051, 81449372, 76770129, 72236168, 68130841, 64495629, 61439524, 58932262, 57096684, 55466231, 54081868, 52976840, 51963309, 51047426, 50166146, 49273726, 48695130, 48091870, 47487644, 46817679, 45993527, 44839495, 43453280, 41837904, 40285205, 38643754, 37073146, 35381742, 33692143, 32098954, 30528274, 29105516, 27868653, 26783150, 25897423, 24979177, 24245802, 23393503, 22701702, 22174828, 21655103, 21028478, 20397023, 19831990, 19441049, 18894933, 18280835, 17692634, 17127663, 16640963, 16168494, 15736118, 15463023, 15148053, 14758327, 14459450, 14187471, 13967601, 13650314, 13401054, 13223595, 13044964]
4739A3044964j16879j87568k17465j12546k05778j69755j40823j77989k67315
4730A1448846j45337j69761j57145k50534j36117L6306m9693l48591j88576k46383
4720I793015j75002k12681r1889j39789q3174j42312n9042j28207q9997j61296
4710H509626j01216l18761k17037j06729j00137n3181p2744j25506Q529J13652
4700G536496P4279n4227L3097j3794k8782j64830j27855j43802R6842R1689M2717
4689G341830j0121N7037j2951J0731o0760J1909J21m9221j43381j63948j07530
4678F873716m0556O8471j4733q0660O6367K643j5469O3397r7696j08881P3328
4667F789927k6122l4053M8221R2053K21353j2620q018P710j17463m9968j08223
$$ y = [13044964, 12928085, 12740517, 12523052, 12410506, 12204728, 12034973, 11894150, 11716161, 11448846, 11303509, 11133748, 10976603, 10726069, 10589952, 10626258, 10576565, 10227974, 10039398, 9793015, 9618013, 9405332, 9313443, 9173654, 9090480, 8948168, 8889126, 8760919, 8670922, 8509626, 8408410, 8089649, 7872612, 7765883, 7665746, 7612565, 7539821, 7414315, 7422844, 7536496, 7610775, 7556548, 7589645, 7575851, 7547069, 7382239, 7254384, 7110582, 7207424, 7299113, 7341830, 7331709, 7388746, 7375795, 7386526, 7325766, 7337675, 7337796, 7288575, 7145194, 6981246, 6873716, 6833160, 6901631, 6886898, 6806238, 6872605, 6875248, 6859779, 6923176, 6825480, 6716599, 6789927, 6763805, 6729752, 6777973, 6870026, 7091379, 7078759, 7070741, 7078451, 6960988, 6911020, 6802797]
4656F802797J0431j11644j11810J09484q1867j01742k5148J09861r1135o4279
4646F444948k386j3769J3469J1739J826q1934o4197J62827J36551K02594J89811
4635G001479J35149K27779K42208Q3877K10534K60577L64031L38583L17496N16237
4625I697950Q03356P49556R74941J294308J691674K466708L915731N867967Q214719
4616C5676910J0020269R764050P184330L284130j64872k701979m586263n160729
4608E3315846m230789j927463R81038M049947O465458O883945M734664J616477
4600G1889123j370924l520781m560450m001011j771581J221448L287424L876262
4592F5049510K420054j0798k221897m119275n451259n352349m241664k330935
$$ y = [6802797, 6813228, 6701584, 6589774, 6699258, 6617391, 6515649, 6490501, 6600362, 6509227, 6444948, 6442562, 6428793, 6442262, 6454001, 6455827, 6373893, 6309696, 6472523, 6609074, 6811668, 7001479, 7136628, 7364407, 7606615, 7690492, 7901026, 8161603, 8525634, 8864217, 9181713, 9697950, 10501306, 11250862, 12225803, 13520111, 15211785, 17678493, 21594224, 27462191, 35676910, 45697179, 55461229, 62645559, 65929689, 65764817, 63062838, 58476575, 53315846, 49085057, 47157594, 48138632, 52188579, 58654037, 65537982, 70272646, 71889123, 70518199, 66997418, 62436968, 58435957, 56664376, 57885824, 61173248, 65049510, 67469564, 67458766, 65236869, 61117594, 55666335, 50313986, 46072322, 43741387]
4584D3741387L50491L049985N111080N117351K922731q1049k436286m519308o109248
4575D7147134o444706o088204n212206m492336l535828k729984k062769j542782
4567A5038319j059233q46208o86199o10294l78491l67874k68866k96482j71472
4558A0353200k90149k94391k53437l12038k18822k83205k38833j87666l42073
4549G932586k81827l11889j41373k38410j76307n3391r5823o7864n2241j28079
4539F385382k9016j8649j61688k29222k58464j77533j21878j24822q8287n1467
4529E124356p5697O986j89854K3922p3388n7201k76904k41887j98619j3650j1931
4518D016133o7825r2393m6219o0070k671k18916o3801j63900M0643q0933Q555
$$ y = [43741387, 44091878, 47141863, 52252943, 57370294, 60293025, 60211976, 57775690, 53256382, 47147134, 40702428, 34614224, 29402018, 24909682, 21373854, 18643870, 16581101, 15038319, 13979086, 13132878, 12446679, 11836385, 11457894, 11090020, 10821154, 10524672, 10353200, 10063051, 9768660, 9515223, 9203185, 8984363, 8701158, 8462325, 8274659, 7932586, 7650759, 7338870, 7197497, 6959087, 6782780, 6729389, 6633566, 6565702, 6513461, 6385382, 6356366, 6337717, 6176029, 5946807, 5688343, 5510810, 5388932, 5264110, 5175823, 5124356, 5048659, 5055645, 4865791, 4889713, 4816325, 4759124, 4482220, 4240333, 4041714, 4028064, 4016133, 3948308, 3855915, 3809696, 3749626, 3746955, 3528039, 3464238, 3300338, 3340981, 3260048, 3268603]
4507C268603J24580J2870r7269p7839r9633l2312r9418p1377j59949J25714j9519
4496B874451R4594J14343m8047q3834o666o0499J33916j33216J57N007P9964J08473
4484C078643L2804j28984J5993L4266j9409j54987l6051j89690l6930o394J0749
4473B600010Q8567J50128k524q2189Q9864j0709J41838J22625m963q4455O8191
4462C076383Q1451R2828n5146j03944j33340J36870j22518j64381p7100J50199
4452B881302q3514J1259l1808J9095J17844J6409m8620J27222k1212P4472Q0475
4441C142924O9826l7409J41101j7860j02569l6541J09778l3284O7278j37022p6321
4430C089901j57610J9051j21556j06569J8359P6707P0287L7978O4415l8056k6448
$$ y = [3268603, 3393183, 3406053, 3308784, 3230945, 3131312, 3099000, 2999582, 2928205, 2768256, 2893970, 2874451, 2969045, 3083388, 3035341, 2951507, 2944841, 2884342, 3018258, 2885042, 2885199, 2890206, 2970170, 3078643, 3111447, 2982463, 2998456, 3032722, 3013313, 2858326, 2822275, 2632585, 2595655, 2589261, 2600010, 2688577, 2838705, 2836181, 2753992, 2843856, 2833147, 2974985, 3097610, 3092647, 3008192, 3076383, 3157834, 3250662, 3195516, 3091572, 2958232, 3095102, 2972584, 2808203, 2731103, 2881302, 2797788, 2809047, 2777239, 2796334, 2914178, 2930587, 2881967, 3009189, 2987977, 3062449, 3142924, 3212750, 3175341, 3316442, 3298582, 3196013, 3159472, 3269250, 3235966, 3303244, 3166222, 3089901, 2932291, 2951342, 2829786, 2723217, 2741576, 2818283, 2888570, 2926548, 2990963, 2952907, 2926459]
4419B926459j14593L5771R4147j09364Q3871O2462p5614J37648J08341J0793J05472
4408C265393r9795j15472o4798P5078R1354R3376k2499K8050J12984K2010l4096
4397C351585k1854P5849j3883q0203j8517J3736J33426J65689l5330j3294R0308
4386C647512J34557n2620K1472j13041m9955R8931J71905J5991K5589P0081N8523
4375D028945o0611j78115n9459P2142N4630L3330j5692K247J3736N7111m6284
4364C901980K9609O4715m2058N3257N9631K9899J24591q4341j08692j1427j1201
4353D005963r0473R3657j2298o9095r0760L372o182m3246m62Q2076J9352j10645
4341C781259q4276K3292O4190J09287M0290j8454p238m5896J54304p2763o3397
$$ y = [2926459, 2811866, 2847637, 2941784, 2832420, 2916291, 2978753, 2903139, 3040787, 3149128, 3159921, 3265393, 3165598, 3050126, 2985328, 3060406, 3151760, 3245136, 3222637, 3250687, 3363671, 3385681, 3351585, 3329731, 3405580, 3391697, 3311494, 3292977, 3306713, 3440139, 3605828, 3570498, 3557204, 3647512, 3782069, 3729449, 3750921, 3637880, 3587925, 3686856, 3858761, 3874752, 3900341, 3970422, 4028945, 3968334, 3790219, 3730760, 3802902, 3857532, 3890862, 3875170, 3877417, 3891153, 3948264, 3901980, 3931589, 3996304, 3954246, 4007503, 4067134, 4097033, 4221624, 4137283, 4028591, 4017164, 4005963, 3915490, 4009147, 3996849, 3927754, 3836994, 3840366, 3834184, 3790938, 3790476, 3872552, 3891904, 3781259, 3696983, 3720275, 3784465, 3893752, 3934042, 3915588, 3908350, 3862454, 4016758, 3943995, 3880598]
4330C880598K3147M9990m6584j11577O5005m349r835O308J6579Q9402o3290q2185
4318C813209P988J46981N298M741K235N1946j1501K8171N4901J15572Q1047N9128
4306D359716J47344K8862l1769p2520m8278l1395l1990k9713o978K4467Q6474
4295D394220J19851r2522j32391L3680q7315J7969r6379L2623Q6422N1467P8289
4284D405914k585k13982j4179j624j32974K9749N9215N7977O2994o4744Q2977
4273D268738Q2544n259k9714n5171k6187r0073o282l930q9640J51222K8592J326
4261D226166r0254n8858r9873k256O1025R0579J52001M8975N4082P7480N9367
4250D518434j41204j47774j7186M997O6969O7397j9638M9340j2168J19633J82237
$$ y = [3880598, 3903745, 3953735, 3907151, 3795574, 3860579, 3856230, 3846395, 3852703, 3869282, 3958684, 3895394, 3813209, 3821197, 3968178, 3973476, 3978217, 3980452, 4032398, 4020897, 4049068, 4103969, 4219541, 4300588, 4359716, 4507060, 4535922, 4504153, 4431633, 4383355, 4351960, 4319970, 4290257, 4283279, 4307746, 4394220, 4514071, 4421549, 4289158, 4322838, 4235523, 4253492, 4157113, 4189736, 4276158, 4327625, 4405914, 4403329, 4189347, 4175168, 4173544, 4040570, 4070319, 4129534, 4187511, 4250505, 4185761, 4268738, 4351282, 4346023, 4316309, 4261138, 4234951, 4144878, 4138596, 4134666, 4045026, 4196248, 4224840, 4226166, 4135912, 4077054, 3977181, 3974925, 4035950, 4126529, 4278530, 4327505, 4381587, 4459067, 4518434, 4377230, 4229456, 4212270, 4217267, 4284236, 4351633, 4331995, 4381335, 4369167, 4488800, 4671037]
4239D671037j3015P360M1116R2158R0719L4179P5583J5838O7210K0677J7053O6953
4227E186868P8189J76076O9424J02154J66620J42808K13693K99060K17724J20955
4217F773571J88226K98023M13406K68375K24123L72172L45638M54886O36462O52508
4207A0627390R81425R47406J033259J044361J223571J321632J265735J265239
4199A9710018J086598O86373N24325L57102M070j15439R1832K23724M82902O54208
4189B3705713R81073J165721R32213Q54545Q45179O12879N97551Q71227R23443
4180C1489544J073554J360931J188477J308669J383935J473608J833745J982014
4172D3094477K149773K312128J915635J069986N89731J45142k71594K14635R23059
$$ y = [4671037, 4658022, 4665382, 4706498, 4798656, 4889375, 4923554, 4999137, 5014975, 5082185, 5102862, 5119915, 5186868, 5265057, 5441133, 5510557, 5612711, 5779331, 5922139, 6135832, 6434892, 6652616, 6773571, 6961797, 7259820, 7673226, 7941601, 8165724, 8537896, 8883534, 9338420, 9974882, 10627390, 11608815, 12556221, 13589480, 14633841, 15857412, 17179044, 18444779, 19710018, 20796616, 21482989, 22007314, 22364416, 22368486, 22253047, 22344879, 22568603, 23051505, 23705713, 24686786, 25852507, 26784720, 27639265, 28484444, 29097323, 29694874, 30566101, 31489544, 32563098, 33924029, 35112506, 36421175, 37805110, 39278718, 41112463, 43094477, 45244250, 47556378, 49472013, 50541999, 51131730, 51276872, 51005278, 51219913, 52142972]
4163E2142972J897999K727380K965125K519720J869436J172916N25545K11238
4155F6032331J64669K87378N52431O76175P48724J131251J512173J473834J706450
4146G4285416J708768J495666J290191Q16177K01145j38648m19378m76422M9943
4137G8812858N21657J431071K376026L144009L461580L266901L041747K771570
4129I8827419K699521L121382L451476L581995L180324K863642K824545K714017
4121A23264321K908486K446177J394554P45740N47459L09654K48625N12899N08993
4112A32886908P14930Q57217J011594J239826J757626K197663K667452L071764
4104A46404980L249741K897503K259249J770358J854374J798111J988795K330067
$$ y = [52142972, 54040971, 56768351, 59733476, 62253196, 64122632, 65295548, 65821093, 66032331, 66197000, 66484378, 67036809, 67712984, 68461708, 69592959, 71105132, 72578966, 74285416, 75994184, 77489850, 78780041, 79596218, 79797363, 79658715, 79239337, 78762915, 78812858, 79334515, 80765586, 83141612, 86285621, 89747201, 93014102, 96055849, 98827419, 101526940, 104648322, 108099798, 111681793, 114862117, 117725759, 120550304, 123264321, 126172807, 128618984, 130013538, 130759278, 131306737, 131616391, 131865016, 132377915, 132886908, 133601838, 134459055, 135470649, 136710475, 138468101, 140665764, 143333216, 146404980, 149654721, 152552224, 154811473, 156581831, 158436205, 160234316, 162223111, 164553178]
4096A64553178K341719K263437J914024J123466K37887p88090j457781j296010
4088A68891830q13727q51815j094290j484415j452452j374633j571285k130405
4080A58118808l013550l622236m027519l861718l073934k336162k085783j873298
4072A34224608j413374j294837j373589j779859k013762k287010k592997k725749
4064A18743431k779478k871623k851813k900517k968233k721645k329286j895048
4056I7425788j174258m37393j51319n77649j553096k769930l619915m147763l922396
4047G9072069l238710k184104j120718k49895k11552m13712p00758j376286j858279
4038F7718055k274615k607813k592964k439976k494738k388882k044394j749949
$$ y = [164553178, 166894897, 169158334, 171072358, 172195824, 172433711, 171645621, 170187840, 168891830, 168078103, 167226288, 166131998, 164647583, 163195131, 161820498, 160249213, 158118808, 155105258, 151483022, 147455503, 143593785, 140519851, 138183689, 136097906, 134224608, 132811234, 131516397, 130142808, 128362949, 126349187, 124062177, 121469180, 118743431, 115963953, 113092330, 110240517, 107340000, 104371767, 101650122, 99320836, 97425788, 96251530, 95814137, 95662818, 95085169, 93532073, 90762143, 87142228, 82994465, 79072069, 75833359, 73649255, 72528537, 72278642, 72067090, 71653378, 70952620, 69576334, 67718055, 65443440, 62835627, 60242663, 57802687, 55307949, 52919067, 50874673, 49124724]
4030D9124724j607257j038421p95899o11085n56882q20424j339567j280906j729096
4021C9345187j678084j418667j115313o74865l01728l46383m81188n77075p97580
4012C1954304r10361q93051j050975q90161j029128j014661j182935j157120j216429
4003B2609483j192492j076755j014617r78596q29476p12713o72852n88344m69469
3994A5074169l35509m23611n53344l57611k85203k97048l68342k75002k49835
3985A1928664k36767k85039m12541k14338k66882j77256q0766n2913q7880j33147
3975I981135j89310j90152k37764q6545j82119l06796p6805j0323r6144K8799
3965H633976m6834j66329k06926j34360k71176j85430j01696j69004q3655O318
$$ y = [49124724, 47517467, 46479046, 45683147, 45072062, 44515180, 43694756, 42355189, 41074283, 39345187, 37667103, 36248436, 35133123, 34458258, 34156530, 33810147, 33328959, 32751884, 31954304, 31043943, 30150892, 29099917, 28209756, 27180628, 26165967, 24983032, 23825912, 22609483, 21416991, 20340236, 19325619, 18347023, 17517547, 16804834, 16131982, 15543638, 15074169, 14738660, 14315049, 13761705, 13404094, 13118891, 12821843, 12453501, 12178499, 11928664, 11691897, 11406858, 10994317, 10779979, 10513097, 10335841, 10255075, 10202162, 10114282, 9981135, 9791825, 9601673, 9363909, 9277364, 9095245, 8788449, 8711644, 8701321, 8605177, 8633976, 8587142, 8420813, 8213887, 8079527, 7808351, 7622921, 7521225, 7352221, 7268566, 7274884]
3955G274884l7100l180K368n2719k8183j88680k07991j62668p2688n9162l3631
3944F431250J84854k7094j29496J36854Q3291j14558k08486j94418n9761j7362
3934F085074n808L5669J33113J16216K9127p1347l9447n9738n7044j59460l786
3923F002569J5947m3435L9577J09344k3840N8937r6513j07476r4077j2873k0958
3912E827202k3693N1415l0670J38288N7186j00913J28913L3770j08215p712p8849
3901E886722q1272M9168J31529K4023K07452K21334j05960O25r416n1719j07692
3890F164794j14562m6525n2699j5900m5354J77171J47060Q5722M2696Q6068o4932
3879F363539j9566M8089L6294p167R9314L9390l1170R2803k1471K3074k9216r3251
$$ y = [7274884, 7237784, 7234604, 7236972, 7184253, 7156070, 6967390, 6759399, 6596731, 6524043, 6464881, 6431250, 6616104, 6589010, 6459514, 6596368, 6679659, 6565101, 6356615, 6162197, 6102436, 6085074, 6079266, 6114935, 6248048, 6364264, 6393391, 6322044, 6282597, 6222859, 6165815, 6006355, 6002569, 6018516, 5975081, 6014658, 6124002, 6100162, 6159099, 6062586, 5955110, 5861033, 5848160, 5827202, 5803509, 5854924, 5824254, 5962542, 6019728, 5918815, 6047728, 6081498, 5973283, 5965571, 5886722, 5805450, 5854618, 5986147, 6010170, 6217622, 6438956, 6332996, 6333621, 6324205, 6272486, 6164794, 6050232, 6003707, 5951008, 5935108, 5889754, 6066925, 6213985, 6299707, 6342403, 6428471, 6363539, 6343973, 6392062, 6428356, 6421189, 6520503, 6559893, 6528723, 6621526, 6600055, 6623129, 6593913, 6500662]
3867F500662l0478j02442L3417J04656O6992M1496O9635j13O9918Q2998j64511
3856F672230M007M6372k09L9989M6667J15394J88427J68650K41484L6126J13384
3845G672521J2684J96034J02493J3787J89740K46455K25100J51922O6895Q5312
3835H962943J54135j60581k7032p5139m138J86258M4770k1807Q1778P3442K8830
3824I243459J18804J17300K37243K66359L81614M68962N10423N52969N66179N54465
3814A3017777L74502M07178K97670p62k53597k58583n10166n46112l84503m72356
3804A1671048n59048q16779q64482p64332n92184m30980n10527k50211l62777
3795F519728k09673j890o9042k67180r9095k57153j80100j09708l3424n7494j01935
$$ y = [6500662, 6470184, 6367742, 6401159, 6505815, 6572807, 6614303, 6683938, 6683825, 6753743, 6836741, 6672230, 6676237, 6722609, 6722400, 6762389, 6809056, 6924450, 7112877, 7281527, 7523011, 7559137, 7672521, 7685205, 7881239, 7983732, 7997519, 8187259, 8433714, 8658814, 8810736, 8877631, 8962943, 9117078, 8956497, 8929465, 8854326, 8850188, 9036446, 9081216, 9059409, 9141187, 9214629, 9243459, 9362263, 9479563, 9716806, 9983165, 10364779, 10833741, 11344164, 11897133, 12463312, 13017777, 13392279, 13799457, 14097127, 14096365, 13842768, 13584185, 13074019, 12527907, 12143404, 11671048, 11112000, 10295221, 9430739, 8666407, 8074223, 7643243, 7132716, 6882505, 6519728, 6310055, 6308165, 6239123, 5971943, 5872848, 5615695, 5435595, 5325887, 5292463, 5234969, 5133034]
3784E133034m2138o6733j52858p6931P5648N686J6664J0422j94991k02380l9667
3773D465756m7090o6161N7344j3671j18945m4206q0799K4379l7525r6998j07947
3762C934137K3384j52625q1812N103J32118N720O897r8098q5896o7399O3209K1600
3750C706338j28435k2547Q580R4730J6131O4112l5207j82167r4228j46724o187
3739C274396J38393L7516R0755L938r1160k2632j9185M6379o3426j10385L909
3728C288498l1181J57317M1919m9978J02367J8423O9078n7659j59383m5253N1379
3717C385527n2551m6227O5291Q5870J16366m7644j31261l0229M9922J42449q1729
3706C455784j44368R3594L6302P1666j0583p1750K160K7086q900Q8536l889Q7114
$$ y = [5133034, 5090896, 5024163, 4871305, 4794374, 4870022, 4875708, 4892372, 4902794, 4707803, 4505423, 4465756, 4418666, 4352505, 4409849, 4396178, 4277233, 4233027, 4152228, 4176607, 4139082, 4042084, 3934137, 3957521, 3804896, 3723084, 3728187, 3860305, 3866025, 3872922, 3774824, 3688928, 3621529, 3684738, 3706338, 3577903, 3555356, 3563936, 3658666, 3674797, 3738909, 3703702, 3521535, 3427307, 3280583, 3274396, 3412789, 3450305, 3541060, 3544998, 3453838, 3431206, 3412021, 3458400, 3394974, 3284589, 3288498, 3257317, 3414634, 3456553, 3406575, 3508942, 3527365, 3596443, 3538784, 3379401, 3334148, 3385527, 3332976, 3286749, 3352040, 3437910, 3554276, 3506632, 3375371, 3345142, 3395064, 3537513, 3455784, 3311416, 3405010, 3441312, 3512978, 3502395, 3430645, 3432805, 3459891, 3450991, 3539527, 3535638, 3622752]
3694C622752K8594p4723l8561k5531k9247k870N9034j13634o2378N7980j7994
3683C403422n8620L5264n0956j4942O2312p7141K4369J23447o6706o7633j910
3672C310906m7657K6348n1207m2051j32790o7323J40440J15100L2677l0939K0727
3661C274231m4544p8545J7686o4170K945n333j0981O9202N162m4806N373O6068
3649C192288n4540n7968J0526N7437J39901Q2070o9083K00882N9619k7598K0435
3638C553969O4647J08338o207l5121J0060r9535R4682M2741j79859j37604J27781
3627C543892J56698n8448j03316q4781J29660J80949O4462J723n3046J5427j19870
3616C673350k9296r6621L3585K6818J0743j02428r5904o3367O9874K4401k07198
$$ y = [3622752, 3651346, 3576623, 3538062, 3512531, 3483284, 3480414, 3539448, 3425814, 3363436, 3421416, 3403422, 3344802, 3380066, 3329110, 3314168, 3376480, 3299339, 3323708, 3447155, 3380449, 3312816, 3310906, 3263249, 3289597, 3238390, 3196339, 3063549, 2996226, 3136666, 3251766, 3284443, 3253504, 3274231, 3229687, 3151142, 3168828, 3104658, 3107603, 3102270, 3091289, 3160491, 3165653, 3120847, 3126220, 3192288, 3137748, 3079780, 3090306, 3147743, 3287644, 3369714, 3300631, 3501513, 3561132, 3533534, 3553969, 3618616, 3726954, 3720747, 3685626, 3695686, 3596151, 3690833, 3733574, 3553715, 3416111, 3543892, 3700590, 3642142, 3538826, 3454045, 3583705, 3764654, 3829116, 3830839, 3777793, 3793220, 3673350, 3644054, 3547433, 3581018, 3607836, 3618579, 3516151, 3420247, 3356880, 3426754, 3451155, 3243957]
3605C243957l1815P3503M9373J8672m6442j6759n9129K3419K6366K4939P1121
3594C377205R7113j6954J01327J15107O5564N5929l7416N2893J6097q068m3552
3583C775245J68543l9373Q9640K07782R2768j6487J34884J8742L1226J30209J61400
3572D754579J299J29664J07448J70752N2973J29732K3626J16704J31540n0733
3562E567584j3223N0743N1594J27779J53098j9842J63208K86984J23817M01135
3552F892877K76941M01164N30684M95036M82582M13182M76974N37494L19788J57681
3542A0984403J18001K92601P7790k48571j53328r0831M117k47645l73002k27280
3532A0136255k21596l78897m26411n27860m13969j58491l85579l47647l81245
$$ y = [3243957, 3212142, 3285645, 3335018, 3353690, 3307248, 3290489, 3231360, 3254779, 3281145, 3306084, 3377205, 3474318, 3457364, 3558691, 3673798, 3739362, 3795291, 3757875, 3810768, 3826865, 3818797, 3775245, 3943788, 3904415, 3994055, 4201837, 4294605, 4278118, 4413002, 4431744, 4462970, 4593179, 4754579, 4755878, 4885542, 4992990, 5163742, 5216715, 5346447, 5370073, 5486777, 5618317, 5567584, 5554361, 5605104, 5656698, 5784477, 5937575, 5917733, 6080941, 6367925, 6491742, 6892877, 7169818, 7570982, 8101666, 8596702, 9079284, 9492466, 9969440, 10506934, 10826722, 10984403, 11102404, 11395005, 11472795, 11224224, 11070896, 10980065, 10984182, 10736537, 10363535, 10136255, 9914659, 9535762, 9109351, 8581491, 8167522, 8009031, 7623452, 7275805, 6894560]
3523F894560l77217l19001k26502k72913k86965j18451j29701q6664j29277k12714
3513D735155k02850j50865r8570n8041k09821p4070O5523M7042j00552p8369j02240
3502C772342q5749j27061q1372j25547j01893k3973n1412P802R061N1479O4003
3491C307680q6103p6031j07933J18983m4328m837l3259M1937P0606J17317j41601
3480C162431j09705J0985J18963o9804n5535J1183O0621k9055n2121p9476K1507
3469B989994O7214o6772j53363j31718m9190O730o581j0756n38J14072M9169l9259
3457B769002k5856R7057R4134q5737n7687k32507p8366J25593o5100q0992j15564
3446B343977m339M6458k9557j21483q6566J8752p1405k7696n5792Q156M0096k6913
$$ y = [6894560, 6517343, 6198342, 5971840, 5698927, 5411962, 5293511, 5163810, 5077146, 4947869, 4735155, 4532305, 4381440, 4282870, 4224829, 4015008, 3940938, 4006461, 4053503, 3952951, 3874582, 3772342, 3686593, 3559532, 3478160, 3352613, 3250720, 3226747, 3175335, 3183137, 3192198, 3243677, 3307680, 3221577, 3145546, 3037613, 3156596, 3112268, 3107431, 3074172, 3116109, 3186715, 3304032, 3162431, 3052726, 3063711, 3182674, 3112870, 3057335, 3068518, 3129139, 3100084, 3047963, 2968487, 2989994, 3057208, 2990436, 2837073, 2705355, 2656165, 2662895, 2656314, 2645558, 2645020, 2759092, 2808261, 2769002, 2743146, 2840203, 2934337, 2848600, 2790913, 2558406, 2480040, 2605633, 2540533, 2459541, 2343977, 2339638, 2386096, 2356539, 2235056, 2148490, 2167242, 2095837, 2068141, 2012349, 2020505, 2060601, 2033688]
3434B033688q471q3824q9373k18570q600R9011j08962J54327l5246Q5558M6395
3423A865933Q0272J30712L302j88390j16452P1016K7991N7620J14929R3685j1334
3412B129284m699j0997n4832n3090o5716r757P8703J3967r6314K3115J43508M3739
3400B136911j49596j02625J0971K3998n4376m3621J9859Q9098O9048L3766p9124
3389A954309J7295j2570m4661k04782q6244m6099J91705L7535j00728p5051L5778
3378A666487R2299k08733o4041J76173l098o3699j25417m7917q207J18674J54930
3367A687451K5637r5382L6802o1720p2348j15142N86m0588p189M1363K3130k5159
3355A397441R1702L5839o2440J6873j69124P4062R0399k3775l4869p1294J4258
$$ y = [2033688, 2025217, 1941393, 1852020, 1633450, 1624850, 1723861, 1614899, 1769226, 1733980, 1819538, 1865933, 1946205, 2076917, 2080219, 1891829, 1775377, 1846393, 1874384, 1932004, 2046933, 2140618, 2129284, 2124585, 2113588, 2058756, 2005666, 1939950, 1930193, 2008896, 2022863, 1926549, 1949664, 2093172, 2136911, 1987315, 1884690, 1895661, 1919659, 1865283, 1821662, 1841521, 1930619, 1999667, 2033433, 1954309, 1971604, 1959034, 1914373, 1709591, 1623347, 1577248, 1768953, 1806488, 1705760, 1630709, 1666487, 1758786, 1550053, 1486012, 1662185, 1659087, 1595388, 1469971, 1422054, 1413847, 1532521, 1687451, 1713088, 1617706, 1654508, 1592788, 1520440, 1405298, 1405884, 1365296, 1358107, 1399470, 1422600, 1397441, 1489143, 1524982, 1462542, 1479415, 1310291, 1384353, 1474752, 1450977, 1416108, 1344814, 1359072]
3344A359072O8267j6226n9553k1568m9022m9149l9425j1661J79926J43894l5944
3333A468611k2787J19926n3240M6846l8987j67285j4221m4679k7607M1605L5103
3322A343285L7346J51988m7883k95983L668P3352J15894p2242p0267j15490J4856
3311A138524J36148J03247o8125j3774J5895K5567j50711m8455J15113J31583
3301A385012k2567o670n9192L4716J12833j09610j32166m825p714O6182J221j6830
3289A240390J4273K0292M5301N2516m4944j5613O4179q2955q7538l0015J2777
3278A188663J42516J04892M9076o5971k3420J00737j21700j21126L4101P9125
3268A366893K5834l0859q1467j3407K21946N2645j02371j40789k3177L0054P6770
$$ y = [1359072, 1427339, 1411113, 1351560, 1329992, 1280970, 1231821, 1192396, 1180735, 1360661, 1504555, 1468611, 1445824, 1565750, 1512510, 1559356, 1520369, 1353084, 1338863, 1294184, 1266577, 1308182, 1343285, 1380631, 1532619, 1484736, 1188753, 1192421, 1265773, 1381667, 1309425, 1239158, 1123668, 1138524, 1274672, 1377919, 1309794, 1296020, 1311915, 1337482, 1186771, 1138316, 1253429, 1385012, 1362445, 1355775, 1296583, 1331299, 1444132, 1334522, 1202356, 1197531, 1189817, 1255999, 1257220, 1240390, 1254663, 1274955, 1320256, 1372772, 1327828, 1312215, 1376394, 1293439, 1205901, 1175886, 1188663, 1331179, 1436071, 1485147, 1419176, 1395756, 1496493, 1374793, 1253667, 1287768, 1366893, 1392727, 1361868, 1280401, 1266994, 1488940, 1541585, 1439214, 1298425, 1275248, 1305302, 1382072]
3257A382072j04502L4968J29567m2710L0332K2780J4701p8685L5593j089R278
3246A432305R5618J46893J8130j66372J26795Q9378O5481N5373j9607O5900l365
3235A906529P9345j5748K06927J91336J39769K47505R9741Q741K10990J19566
3225C194701N4315O3683M5655o227M7058k4465l9119J59174n8370j05413Q0380
3214C411372L1475n74N4865l6370m2579P2966k0748J08409J51572O8288n613K38578
3202D031641K14709K30737M77024N84581O80957P47112K63977L9739k27127l92472
3192F650878l70829m33967n15225m87639l98435l13334l21817j51640j18330j37364
3182C402298l0075o9721N9651L0953j39258K1515L9617K8618J11067Q9436J4825
$$ y = [1382072, 1277570, 1312538, 1442105, 1399395, 1429727, 1452507, 1467208, 1388523, 1424116, 1423027, 1432305, 1527923, 1674816, 1692946, 1526574, 1653369, 1742747, 1808228, 1863601, 1843994, 1909894, 1906529, 1985874, 1970126, 2177053, 2368389, 2508158, 2755663, 2855404, 2864145, 3075135, 3194701, 3249016, 3312699, 3358354, 3352127, 3399185, 3374720, 3335601, 3494775, 3436405, 3330992, 3411372, 3442847, 3442273, 3497138, 3460768, 3418189, 3491155, 3470407, 3578816, 3730388, 3798676, 3793063, 4031641, 4246350, 4477087, 4954111, 5538692, 6219649, 6966761, 7230738, 7270477, 7043350, 6650878, 6280049, 5846082, 5330857, 4843218, 4444783, 4131449, 3809632, 3657992, 3539662, 3402298, 3372223, 3302502, 3362153, 3393106, 3253848, 3275363, 3314980, 3343598, 3454665, 3544101, 3558926]
3171C558926J29481R4168O1017J26789J18754R4324J450r1463j95110q6161j48861
3160C663314j22928r4412k15794j79456j45329r3622q7840k25441p7659o9818
3150B351015J5964q3087q1126M757J2768j22396o3487k0380k3433n7498j01214
3139A831883r6099P9210J908j8894k1176k4554M8037k4413o1953k34046q180J7103
3127A488826n1053q1011k7094L7342O9455j74186J9690M6328k2274L075j45615
3116A163483M6551M7242k2644J3567k4038p0532K8966m465l8223o0024l325J5827
3104A092385n5559M8513j0207l0359K0910M6555M3223q3990n3247j1633M0184
3093A046775j06600M4760L4576j08534o9039o985J6906N2351j5829n7274L0710
$$ y = [3558926, 3688407, 3782575, 3843592, 3970381, 4089135, 4183459, 4184909, 4093446, 3898336, 3812175, 3663314, 3540386, 3445974, 3230180, 3050724, 2905395, 2811773, 2723933, 2498492, 2420833, 2351015, 2366979, 2283892, 2202766, 2207523, 2220291, 2097895, 2034408, 2014028, 1990595, 1933097, 1831883, 1735784, 1814994, 1816902, 1798008, 1776832, 1752278, 1800315, 1775902, 1713949, 1479903, 1471723, 1488826, 1437773, 1356762, 1329668, 1367010, 1436465, 1262279, 1281969, 1328297, 1306023, 1309098, 1163483, 1210034, 1257276, 1234632, 1248199, 1224161, 1153629, 1182595, 1178130, 1139907, 1079883, 1076558, 1092385, 1036826, 1085339, 1075132, 1044773, 1065683, 1112238, 1155461, 1071471, 1018224, 1006591, 1046775, 940175, 984935, 1019511, 910977, 841938, 834953, 851859, 904210, 888381, 831107, 861817]
3082H61817n0174j2609J76238j0439k4883j7887J00177K1841M4538R914j34112
3071I64421k1393R0694j60219Q6817o0369M254r436N5988k0696j23099K5182l9877
3059G92267L5637k4069P6091j13463j49160j1211L7338P7299O603m7032R2433
3048G72733R028m6714J3909p2985J51069P7472k00424N443P7126J3782L9453J580
3036H41472j31289L5244m7266q454L322J05746n2289J63808J7019r9001J0912
3025H39224q106m2884j11085k9421Q8222L0647J8972j4188n8675R106K196q2832
3013F41176M0592p7227k2133O4089J7365J332L0489l3846l0713J116J64941M9023
3001H46204j10438m1565j11434n6416J39409J28160n008L7283j0646q5075l5125
$$ y = [861817, 811643, 799034, 975272, 964833, 939950, 922063, 1022240, 1044081, 1088619, 1098533, 964421, 943028, 1033722, 873503, 960320, 899951, 904205, 894769, 950757, 930061, 806962, 832144, 792267, 827904, 803835, 879926, 766463, 617303, 606092, 643430, 720729, 727332, 680300, 772733, 781761, 735047, 748956, 675971, 827040, 904512, 704088, 709531, 786657, 800439, 839892, 841472, 710183, 745427, 698161, 689707, 693029, 798775, 746486, 910294, 927313, 828312, 839224, 831118, 788234, 677149, 647728, 735950, 766597, 785569, 771381, 712706, 721812, 724008, 641176, 681768, 604541, 582408, 646497, 663862, 665194, 695683, 661837, 631124, 632240, 797181, 846204, 735766, 694201, 582767, 526351, 665760, 793920, 788912, 826195, 815549, 730474, 695349]
2990F95349N1027k9601j4124q1819L5034J27824l8584j94236Q7775M1223k0611
2979F59257m0503k3431K0395J05899J2048q6354j03685K2280J71760M233j36379
2968F05520M5343p4726M8418k1644m5592Q7748N6965j33594P472K8915j15982
2957D88843l4469L4513P926j6105M1073m9099R9226J03571j9450K6870q3686j06840
2945D92373J4065P2846K7271p9759Q3497O4353n550r5999q6715m3629J10358j30334
2933D22777L0402k8318R7611L387m0868O4107l4286L4213O0194l4281n9759J0068
2921E25247N0654r4346O5214O9067R6426m8636j36717J1029J698n5279j6150N2562
2909E20769N3651Q4119J06977j01315l2165M0363p7721o6458Q053j5049J3489
$$ y = [695349, 746376, 716775, 702651, 620832, 655866, 783690, 745106, 550870, 638645, 679868, 659257, 618754, 595323, 615718, 721617, 733665, 647311, 543626, 565906, 737666, 741899, 605520, 650863, 576137, 624555, 602911, 557319, 645067, 702032, 568438, 575910, 604825, 488843, 454374, 488887, 496813, 480708, 521781, 472682, 571908, 675479, 656029, 682899, 599213, 492373, 506438, 579284, 606555, 526796, 610293, 674646, 669096, 573097, 486382, 442753, 553111, 422777, 453179, 424861, 522472, 525859, 484991, 549098, 514812, 549025, 609219, 574938, 515179, 525247, 575901, 481555, 546769, 615836, 712262, 663626, 526909, 537938, 539636, 484357, 468207, 520769, 574420, 658539, 765516, 664201, 632036, 672399, 594678, 528220, 536273, 521224, 534713]
2898E34713k877l081l1772k8207Q639K1834J11216k7984L7137j12621k7669m9590
2886D29738n032N7928R6356J1121L2370j29453k4424K3223M2884n1643Q3493l4347
2874E32214m288m6037J1735K6580K7446q2223N9258L3261k2959p5696Q9090n3138
2862D95243q4778M7645K9158J31072l428l2521o6242l8746Q651m0636k6857K0477
2850D39038k4401L3956N679o1427O052R7545K0221R3223n762n2696j0733K7440
2838E68135j04966O0751N4524j09251J0123k6702L0242O4236M0966r2701J16881
2827F12238J32491k30406j07823M7909R597M7880n766j63100Q6302N739J38M7434
2815D82633Q3769k30500R0932J4570n3520J12332R0272r6787o7861j04840Q3857
$$ y = [534713, 531836, 528755, 496983, 468776, 477415, 499249, 610465, 582481, 619618, 506997, 479328, 429738, 424706, 482634, 578990, 590111, 622481, 493028, 468604, 491827, 534711, 483068, 566561, 532214, 527926, 481889, 493624, 520204, 547650, 465427, 524685, 557946, 534987, 459291, 548381, 495243, 410465, 458110, 487268, 618340, 614912, 582391, 516149, 477403, 486054, 445418, 418561, 439038, 414637, 448593, 454272, 392845, 398897, 496442, 516663, 609886, 604124, 551428, 540695, 568135, 463169, 523920, 578444, 469193, 479316, 452614, 482856, 547092, 588058, 495357, 612238, 744729, 514323, 406500, 454409, 464006, 511886, 506120, 343020, 429322, 435061, 435199, 482633, 566402, 335902, 426834, 441404, 387884, 500216, 590488, 493701, 425840, 321000, 404857]
2804D04857J27301m286j77058L6487O3473k3814k140o0659P9760P9295p7931J7092
2792D62377J20520m1238k2680J7434l6454K2142n551j07922J809N4835L5262M0736
2780E41270q7827L2359P6313j18231j04997J2784J02518l6073J4382m8201L3341
2769D17638m0187J5824r4239J52887m1711K6585j03984j5595J79257K1977q6217
2758D32235l7663j11898P9714N9771P011j8294N7770R3181n5812q5290q78K1805
2746D41652P6163l1206q5073j6262K07063Q5940o9934j41133P4950l3174j14829
2735C94157o6647l3609J70090Q7863o6215j72485R1425J01404K7976p6901N4412
2724E11470l8944k9740l5978k7735J9473P1849K2565l8371l829l4278q7072P3382
$$ y = [404857, 532158, 527872, 350814, 387301, 450774, 426960, 424820, 364161, 443921, 523216, 445285, 462377, 582897, 541659, 518979, 536413, 499959, 522101, 516550, 408628, 410437, 465272, 500534, 541270, 453443, 485802, 562115, 443884, 338887, 351671, 454189, 418116, 432498, 384297, 417638, 377451, 393275, 299036, 451923, 410212, 436797, 332813, 317218, 496475, 518452, 432235, 394572, 282674, 362388, 422159, 429170, 410876, 468646, 561827, 506015, 420725, 419847, 441652, 517815, 486609, 401536, 385274, 592337, 678277, 608343, 467210, 542160, 508986, 394157, 327510, 293901, 463991, 551854, 485639, 313154, 404579, 505983, 533959, 457058, 511470, 472526, 442786, 406808, 379073, 398546, 470395, 492960, 454589, 450760, 416482, 329410, 402792]
2712D02792J5449L1298P3293L6590j04298J40172p9381j61970Q5082r507L6227
2701D65747J06619j72525j1269J17541K6763n8443M8496j04782j1545j4585M7379
2690D39396J21173o2163p4748j0249j650m926l4877m362j5014P1372P6900O6365
2678E67217J6372k1634j04816N8894m6683p7048j3538P2215P4935O8722O4961
2667F59597N4421L3301n217J8158j24493K805P1267Q6598q5937o8078m1706p898
2655E92818P416o8337P058o6800J8645k4499l2149J26472k3346q7566R703J14854
2643E74269n2433j3886k9695L8871m4250K2070j30406M7785R7854o1718O821Q3903
2631E39185M7968Q667j04680q2181N245R0243k3910O9394M7800k26354j7981J01060
$$ y = [402792, 418241, 449539, 522832, 559422, 455124, 595296, 515915, 353945, 439027, 429520, 465747, 572366, 399841, 388572, 506113, 532876, 474433, 522929, 418147, 406602, 392017, 439396, 560569, 498406, 423658, 413409, 411759, 406833, 371956, 367594, 352580, 423952, 500852, 567217, 583589, 561955, 457139, 516033, 469350, 392302, 378764, 450979, 525914, 594636, 659597, 714018, 747319, 742102, 760260, 635767, 638572, 709839, 796437, 710500, 642422, 600716, 592818, 600234, 531897, 538955, 472155, 490800, 466301, 434152, 560624, 537278, 449712, 459415, 574269, 521836, 507950, 478255, 517126, 472876, 494946, 364540, 412325, 510179, 448461, 455282, 539185, 587153, 595820, 491140, 408959, 414204, 504447, 480537, 549931, 597731, 371377, 353396, 454456]
2619D54456J6783M5667P1095P7567M882r786o0179J5523n9590l4213L2505R3596
2607F48306j8830k5233r8194p4664j7295n683r8020J0385j2249k245N5856K8626
2595C90760K7733M5877j3643l3461j33638J7657R9794j4910O3816J41186M6946
2584F38117K4623n7303j07784p0895O861k3547O5688L6892k3200L0264o5215J3254
2572D67755P3440l1465j37768p3995l4068Q1589Q4478N1126j2745J11887K1311
2561F01545o7153r7857J2782o2801L2273j18872N7661Q6350l784K7563L2484m3490
2549D56701P2545J6641k18285M1114Q4140k1616K6369J00468q569J0457m5889
2538E14076j24150Q494M8470j6178O1207m0881l0648m6414m0120J10997m6006
$$ y = [454456, 471239, 516906, 588001, 665568, 670450, 660664, 600485, 616008, 556418, 522205, 554710, 648306, 629476, 604243, 506049, 431385, 414090, 408407, 310387, 320772, 308523, 306278, 362134, 390760, 418493, 464370, 450727, 417266, 283628, 301285, 401079, 386169, 449985, 591171, 638117, 662740, 605437, 497653, 426758, 433619, 410072, 475760, 512652, 489452, 519716, 454501, 467755, 541195, 509730, 371962, 297967, 263899, 345488, 429966, 481092, 468347, 580234, 601545, 534392, 436535, 449317, 386516, 418789, 299917, 357578, 443928, 440144, 467707, 500191, 456701, 529246, 545887, 327602, 368716, 452856, 431240, 457609, 558077, 549508, 559965, 514076, 389926, 398420, 446890, 430712, 491919, 451038, 420390, 373976, 333856, 444853, 398847]
2527C98847K4490j6334K1701j9136Q1561j07209j1571J4350L175O060m5918K117
2515C52133R0882p6047R5024J13563O647k3897n513M7768q0665n2849l8544N5610
2503D84112J34608j51771j7457O7539Q0001o169r3836k8J4574L0404L9161n1513
2491E29625O4041P0041L828M7334j12433O8041Q8125o7984r2529l396k6479J1502
2479E79716Q01j8204L0544j8209m0076m5042J03289J03580r1325j6215j1551o4222
2467E13086M068J5768L0751J03365m228J4051L6890J31017j03626m2591j8188
2456F80363j55203J40283J54136q1318Q1636M7110K0779j910j4576M981Q6253
2445I62534k7608j18641J2465P3266N0112J8676K7918M7673j2166p4281j40433
$$ y = [398847, 423337, 407003, 428704, 409568, 491129, 383920, 372349, 386699, 389874, 395934, 350016, 352133, 443015, 366968, 461992, 575555, 582202, 558305, 552792, 600560, 519895, 467046, 428502, 484112, 618720, 466949, 449492, 517031, 597032, 590863, 497027, 496999, 511573, 541977, 581138, 529625, 593666, 663707, 667535, 714869, 602436, 670477, 758602, 690618, 598089, 594693, 568214, 579716, 580517, 562313, 592857, 574648, 534572, 489530, 592819, 696399, 605074, 588859, 577308, 513086, 517154, 532922, 563673, 667038, 662810, 676861, 713751, 844768, 741142, 698551, 680363, 525160, 665443, 819579, 738261, 819897, 867007, 887786, 885876, 871300, 876281, 962534, 934926, 816285, 828750, 902016, 952128, 970804, 998722, 1046395, 1034229, 959948, 819515]
2434H19515J11517J61393q07P2198Q624J67201J55090k1073q0067M7082J2688
2423A453361q1625N2008J0099J60962K21657K42587J53783K67733L67393M09680
2413C257638N32841M73119K78542K04041J48286J88062L32031M29252N20356J129771
2403G493939J423275K596144N067037R275470J1821546J5872329J3436971L669866
2395G0656577k593157p172239q477747q134620p632199p147787o085538m956360
2387A8456930l575816k336686j441402j034242p10683n01165m42100o50706p19844
2378G044286m86650n14469m96902m02588l42781l12930l47415j16436j57474k2918
2368C843723j97044j15873o4916k12308j02902p6327q8786j30923j9501P73k5721
$$ y = [819515, 931032, 1092425, 1091618, 1163816, 1172440, 1339641, 1494731, 1473658, 1393591, 1440673, 1453361, 1371736, 1423744, 1433843, 1594805, 1816462, 2059049, 2212832, 2480565, 2847958, 3257638, 3790479, 4263598, 4542140, 4746181, 4894467, 5082529, 5414560, 5843812, 6364168, 7493939, 8917214, 11513358, 16580395, 25855865, 37677411, 53549740, 66986711, 70656577, 68063420, 60891181, 52413434, 44278814, 36646615, 29498828, 23413290, 18456930, 14881114, 12544428, 11103026, 10068784, 9358101, 8856936, 8414836, 7764130, 7044286, 6557636, 6043167, 5546265, 5143677, 4800896, 4487966, 4140551, 4024115, 3866641, 3843723, 3646679, 3530806, 3465890, 3253582, 3150680, 3074353, 2985567, 2854644, 2835143, 2835916, 2810195]
2357B810195j7852n7826k0630k45680k28899m5979j64340k4164r1395L1479Q9707
2346B034616o2715l7873o9245J21558M7713n3410j13316j49094p0912r6500j3169
2335A537653K6409R0205n6206L2540j10653M1922J40784J9742j88525r9312j9557
2324A415002m2505Q0979J6211K5625M044m6366j30819j66354k3479j42782r563
2313I79993J15165J8080Q1822P852R8708k13042j52694K035J20693m9206j10868
2302H98538j8275m3492J04586L9461M7480m6760r8688M3463J3805J785q5163Q6783
2290I43523P7336M2462r6757j26028Q1633L3489q8951l2052K3386K9521j0730
2279H76832M8158n3207l5132K7453q708j33752K7406n7586Q2683j2304P4032q7196
$$ y = [2810195, 2792343, 2734517, 2713887, 2468207, 2239308, 2193329, 2028989, 2004825, 1913430, 1944909, 2034616, 1971901, 1934028, 1864783, 1986341, 2034054, 1980644, 1867328, 1718234, 1647322, 1550822, 1537653, 1564062, 1654267, 1598061, 1630601, 1519948, 1561870, 1702654, 1722396, 1533871, 1434559, 1415002, 1372497, 1453476, 1469687, 1495312, 1499356, 1452990, 1322171, 1155817, 1132338, 989556, 979993, 1095158, 1113238, 1195060, 1202912, 1301620, 1088578, 935884, 937919, 1058612, 1009406, 898538, 880263, 836771, 941357, 980818, 1028298, 981538, 882850, 926313, 940118, 941903, 856740, 943523, 1020859, 1063321, 966564, 840536, 922169, 955658, 866707, 834655, 858041, 887562, 876832, 924990, 871783, 836651, 864104, 855396, 721644, 749050, 691464, 774147, 761843, 835875, 748679]
2267G48679O3651R4978L1685j01619k26930P0976m7276n319L5989J07210Q8162
2256H60186J99064j20984j61874l1681Q6061k13979k6971L6586j1746J97735N4358
2245H66755k8322n2380j29929q3940L2471m3818p2710J58764K8093p7697m282
2234E93005M4212n1996j20771Q4727O0654L9348R6264j15241j13957Q0383L2546
2223F29174o7357M3887L340l0063O0370O721l3112k6429n8309J13076L0395j434
2211F70259j63560N0698O0833q7117q7220j45578Q8966J55341O4867J1036O695
2200F25220N1098Q174n1978j26186L4264j3470R6894Q9337j02256q7560J25002
2189F48539q4403O017J5680q3637P6928l697j31556O3513R9093m7221p6712n0211
$$ y = [748679, 812330, 907308, 938993, 837374, 610444, 681420, 634144, 628825, 664814, 772024, 860186, 1059250, 938266, 776392, 744711, 830772, 616793, 589822, 626408, 614662, 812397, 866755, 838433, 786053, 656124, 572184, 604655, 560837, 488127, 646891, 674984, 597287, 593005, 637217, 585221, 464450, 549177, 609831, 649179, 745443, 630202, 516245, 596628, 629174, 561817, 605704, 609044, 578981, 639351, 646072, 612960, 586531, 528222, 641298, 671693, 670259, 506699, 557397, 618230, 531113, 443893, 298315, 387281, 542622, 607489, 618525, 625220, 676318, 684492, 632514, 506328, 540592, 527122, 624016, 713353, 611097, 523537, 648539, 564136, 570153, 585833, 502196, 579124, 575427, 443871, 507384, 606477, 559256, 482544, 432333]
2177D32333Q0731Q4362L8489L5586j44148p8347O0063r6783M1507M7233L5132
2166E36158J25627j3451j33929M7499O4840j30337r2678n9853J08935R191R3896
2155E55898K9546j0872M9088j77964o9314N8091J0107j0452P1878N9683K229L4910
2143F02828j2439n6802J0897q3481J15078j3131o9266M2160K0201p4706Q3103
2132E64442J6638L9374M0493J21826P8433k495r1673p4583j1406M7463q8242j88356
2120D51914m8454J62468L823l2809q7193N1997Q5247J34105j51725l7169J04911
2109F37115M8317o0467j63373m9682Q1229l8296o0115Q4093J09931O6186l3535
2098F21403j87960q350Q8034k0523o8726N3718J5983R9152N2230j27004p0671
$$ y = [432333, 513064, 597426, 635915, 671501, 527353, 449006, 509069, 412286, 453793, 501026, 536158, 661785, 648334, 514405, 561904, 626744, 496407, 403729, 343876, 452811, 462002, 555898, 585444, 574572, 623660, 445696, 376382, 434473, 444580, 434128, 506006, 565689, 567918, 602828, 590389, 533587, 544484, 461003, 576081, 562950, 493684, 535844, 556045, 481339, 564442, 581080, 620454, 660947, 782773, 861206, 858711, 767038, 692455, 681049, 728512, 640270, 451914, 403460, 565928, 569751, 536942, 449749, 501746, 586993, 721098, 569373, 532204, 637115, 685432, 624965, 461592, 411910, 493139, 454843, 394728, 478821, 588752, 654938, 621403, 433443, 425093, 513127, 492604, 423878, 477596, 493579, 592731, 644961, 517957, 447286]
2087D47286J9873K6142o2062M1752M3112M4349j5806j09297P6189O0574r9833
2076D72279M9475Q589J0305J8070k7774r6679o6133j55810O4348J07350J02629
2065D86649p2088J0708O5549n5898M1253R1277k04482l2241L4975Q059m4244J00163
2053D29680Q9496j8200Q4065j11129n8515N7049P6131r3730o7324q964l6839Q9217
2041D30937M2253N5750j8337P985l4266k8484j69178L9154R8048l8969o0104L9489
2029C64278M3572J00983m8380m9018l3115P8718k3436p0362R2459M2173L8536
2018E36408k2987q1870O6070J69r8011l81q2068o169J08358J81172q5618Q4558
2006E99631J03436j33008p7104o0793m1263O253N825o7907j4321J25312q727L1621
$$ y = [447286, 467159, 493301, 431239, 472991, 516103, 560452, 544646, 435349, 511538, 572112, 472279, 521754, 530343, 540648, 558718, 530944, 434265, 368132, 212322, 276670, 384020, 486649, 414561, 425269, 490818, 434920, 476173, 567450, 362968, 330727, 365702, 373761, 329517, 429680, 519176, 500976, 585041, 473912, 415397, 472446, 548577, 454847, 387523, 378559, 341720, 430937, 473190, 528940, 510603, 518588, 484322, 455838, 286660, 325814, 423862, 384893, 324789, 364278, 407850, 508833, 460453, 411435, 378320, 457038, 433602, 363240, 455699, 497872, 536408, 513421, 431551, 497621, 497790, 399779, 399398, 317330, 311161, 419519, 600691, 515073, 599631, 703067, 570059, 492955, 432162, 390899, 397152, 402977, 335070, 320749, 446061, 437334, 468955]
1994D68955L1308n6211k4709K0048j41126M3907O3107m1013p462J1278L3952m5588
1982C56446N3665J42120q1956q419l6200j56142K5050J2840m423J14817N9380
1971D77178l6585J27964m3736j00243k3266N788o434N6509n9330O290P0252K0230
1959D94617L1316l4532j9784j31282Q5401o612Q505M9231j92958K8116K36209
1948E48227m8923K1741K5760j00407k9860Q9305j31299o0423l773l1644Q9919
1937C68623O7361K0471n2179P7989K5896o1126r6626q2974J4829J25276M6931
1926D54471j4150r0211P0356O2089N2475m6614r4692q0141o4720J27427O2527
1915D38817L829j390k752N8977o1712n2098l3918r5650L9839J23294R653L4346
$$ y = [468955, 500263, 444052, 419343, 439391, 298265, 342172, 405279, 364266, 356804, 368082, 402034, 356446, 410111, 552231, 470275, 461856, 425656, 269514, 294564, 307404, 302981, 417798, 477178, 440593, 568557, 524821, 424578, 401312, 407100, 400666, 457175, 397845, 404135, 474387, 494617, 525933, 491401, 471617, 340335, 425736, 419124, 427629, 476860, 283902, 312018, 548227, 499304, 521045, 546805, 446398, 416538, 505843, 374544, 314121, 310348, 278704, 368623, 435984, 456455, 404276, 482265, 508161, 447035, 350409, 267435, 282264, 407540, 454471, 440321, 350110, 420466, 482555, 535030, 488416, 393724, 313583, 248863, 376290, 438817, 442646, 441256, 438504, 497481, 435769, 383671, 349753, 254103, 293942, 417236, 426889, 461235]
1903D61235J5691j6271N2450J1978l4166j11419l8033q905N1227Q3282j3122j37948
1891C15999K3717J59180m229j67775R852J30749L694n5051L3062N5667J04867
1880F09732l5044j11789l6043M2071l1166L173m8371m4214K1140J51812k5262
1869D96039j03783N2183j4436Q0684j00120o0088r7943n0757J42107j18567K8503
1858B53822J23996P7467o2789j34371N9265J10036J05951j28879p5165J16540
1848D45873p7693k8001M498O1877Q3715k0085o9841L4147J241q8552J6526k2623
1836C41082L6448J1061J3313k3493N7961o5506j06490L5458K4734p6364N0206
$$ y = [461235, 476926, 460655, 513105, 525083, 490917, 379498, 341465, 332560, 383787, 467069, 453947, 315999, 339716, 498896, 494667, 326892, 336744, 467493, 471187, 416136, 449198, 504865, 609732, 574688, 462899, 426856, 468927, 437761, 440934, 392563, 348349, 369489, 521301, 496039, 392256, 444439, 430003, 510687, 410567, 350479, 252536, 201779, 343886, 225319, 253822, 377818, 455285, 392496, 258125, 317390, 427426, 533377, 404498, 329333, 445873, 368180, 340179, 344677, 406554, 490269, 470184, 400343, 434490, 435731, 347179, 363705, 341082, 377530, 388591, 401904, 378411, 436372, 370866, 264376, 299834, 324568, 248204, 298410]
$$ [...]
##END NTUPLES=NMR SPECTRUM
##END=
