##TITLE=1H_DE-80H_X3
 200.13MHz, d2o
 8 sc
 
 19ns.26.2.2025
##JCAMPDX= 6.0         $$ Bruker NMR JCAMP-DX V2.0
##DATA TYPE= NMR SPECTRUM
##DATA CLASS= NTUPLES
##ORIGIN= UXNMR, Bruker Analytische Messtechnik GmbH
##OWNER= pz
$$ XWIN-NMR		Version 3.5
$$ Wed Jun  3 10:09:38 2026 Russian Standard Time (UT+4h)  Yarkov@DPX200
##.OBSERVE FREQUENCY= 200.1313
##.OBSERVE NUCLEUS= ^1H
##.ACQUISITION MODE= SIMULTANEOUS
##.ACQUISITION SCHEME= undefined
##.AVERAGES= 8
##.DIGITISER RES= 18
##SPECTROMETER/DATA SYSTEM= spect
##.PULSE SEQUENCE= zg30
##.SOLVENT NAME= CDCl3
##.SHIFT REFERENCE= (INTERNAL, CDCl3, 0, 15.4097)
##AUDIT TRAIL= $$ (NUMBER, WHEN, WHO, WHERE, WHAT)
$$ ##TITLE= Audit trail, XWIN-NMR		Version 3.5
$$ ##JCAMPDX= 5.01
$$ ##ORIGIN= Bruker BioSpin GmbH
$$ ##OWNER= Yarkov
$$ C:/Bruker/XWIN-NMR/data/yarkov2/nmr/H-C/1/pdata/1/auditp.txt
$$ ##AUDIT TRAIL=  $$ (NUMBER, WHEN, WHO, WHERE, WHAT)
(   1,<2026-06-03 10:08:30.06 +0400>,<Yarkov>,<DPX200>,
      <created by zg, POWCHK disabled, PULCHK disabled
       configuration hash MD5:
       00 E9 B6 7A A2 85 ED C7 34 08 36 98 17 FE 4E 26
       data hash MD5: 16K
       00 CD 29 70 4F B1 ED DE 6E B5 73 4E 31 BE 05 5F>)
(   2,<2026-06-03 10:08:56.71 +0400>,<Yarkov>,<DPX200>,
      <Start of raw data processing
       efp BC_mod = 2 LB = 0.25 FT_mod = 6 PKNL = 1 PHC0 = -6382.496 PHC1 = 21.22195 SI = 16K 
       data hash MD5: 16K
       2B 56 6F 66 2A 80 BF CC 10 08 6C E3 B3 32 0D 43>)
(   3,<2026-06-03 10:09:01.01 +0400>,<Yarkov>,<DPX200>,
      <abs ABSG = 5 
       data hash MD5: 16K
       34 EA 02 11 B4 54 64 95 8E AB 2D 4F B2 6E 1C 1D>)
$$ ##END=
$$ 
$$ hash MD5
$$ 89 FE BB 9D 05 4E FD 67 21 9E 10 C5 F9 3C 45 35
##$RELAX= 
##$RELAX= 
##$RELAX= 
##$RELAX= 
##$RELAX= 
##$RELAX= 
$$ Bruker specific parameters
$$ --------------------------
##$DU= <C:/Bruker/XWIN-NMR>
##$EXPNO= 1
##$NAME= <H-C>
##$PROCNO= 1
##$TYPE= <nmr>
##$USER= <yarkov2>
##$AMP= (0..31)
100 100 100 100 100 100 100 100 100 100 100 100 100 100 100 100 100 100 
100 100 100 100 100 100 100 100 100 100 100 100 100 100 
##$AQSEQ= 0
##$AQ_mod= 1
##$AUNM= <au_zg>
##$AUTOPOS= <>
##$BF1= 200.13
##$BF2= 200.13
##$BF3= 200.13
##$BF4= 200.13
##$BF5= 200.13
##$BF6= 200.13
##$BF7= 200.13
##$BF8= 200.13
##$BYTORDA= 1
##$CFDGTYP= 0
##$CFRGTYP= 5
##$CHEMSTR= <none>
##$CNST= (0..31)
1 1 145 1 1 1 1 1 1 1 1 1 1 1 1 1 1 1 1 1 1 1 1 1 1 1 1 1 1 1 1 1 
##$CPDPRG= <>
##$CPDPRG1= <>
##$CPDPRG2= <>
##$CPDPRG3= <>
##$CPDPRG4= <mlev>
##$CPDPRG5= <mlev>
##$CPDPRG6= <mlev>
##$CPDPRG7= <mlev>
##$CPDPRG8= <mlev>
##$CPDPRGB= <>
##$CPDPRGT= <>
##$D= (0..31)
0 0.7 0 0 0 0 0 0 0 0 0 0.03 0 0 0 0 0 0 0 0 0 0 0 0 0 0 0 0 0 0 0 0 
##$DATE= 1780466909
##$DBL= (0..7)
120 120 120 120 120 120 120 120 
##$DBP= (0..7)
150 150 150 150 150 150 150 150 
##$DBP07= 0
##$DBPNAM0= <>
##$DBPNAM1= <>
##$DBPNAM2= <>
##$DBPNAM3= <>
##$DBPNAM4= <>
##$DBPNAM5= <>
##$DBPNAM6= <>
##$DBPNAM7= <>
##$DBPOAL= (0..7)
0.5 0.5 0.5 0.5 0.5 0.5 0.5 0.5 
##$DBPOFFS= (0..7)
0 0 0 0 0 0 0 0 
##$DE= 6
$$ [...]
##$SUBNAM3= <"">
##$SUBNAM4= <"">
##$SUBNAM5= <"">
##$SUBNAM6= <"">
##$SUBNAM7= <"">
##$SUBNAM8= <"">
##$SUBNAM9= <"">
##$SW= 18.0517328524113
##$SWIBOX= (0..15)
0 0 2 0 0 0 0 0 0 0 0 0 0 0 0 0 
##$SW_h= 3612.71676300578
##$TD= 16384
##$TD0= 1
##$TE= 0
##$TE2= 300
##$TE3= 300
##$TEG= 300
##$TL= (0..7)
0 120 120 120 120 120 120 120 
##$TP= (0..7)
150 150 150 150 150 150 150 150 
##$TP07= 0
##$TPNAME0= <>
##$TPNAME1= <>
##$TPNAME2= <>
##$TPNAME3= <>
##$TPNAME4= <>
##$TPNAME5= <>
##$TPNAME6= <>
##$TPNAME7= <>
##$TPOAL= (0..7)
0.5 0.5 0.5 0.5 0.5 0.5 0.5 0.5 
##$TPOFFS= (0..7)
0 0 0 0 0 0 0 0 
##$TUNHIN= 0
##$TUNHOUT= 0
##$TUNXOUT= 0
##$USERA1= <user>
##$USERA2= <user>
##$USERA3= <user>
##$USERA4= <user>
##$USERA5= <user>
##$V9= 5
##$VALIST= <valist>
##$VCLIST= <CCCCCCCCCCCCCCC>
##$VD= 0
##$VDLIST= <DDDDDDDDDDDDDDD>
##$VPLIST= <PPPPPPPPPPPPPPP>
##$VTLIST= <TTTTTTTTTTTTTTT>
##$WBST= 1024
##$WBSW= 4
##$XGAIN= (0..3)
0 0 0 0 
##$XL= 0
##$YL= 0
##$YMAX_a= 445115
##$YMIN_a= -376964
##$ZGOPTNS= <>
##$ZL1= 120
##$ZL2= 120
##$ZL3= 120
##$ZL4= 120
##$ABSF1= 15.50011
##$ABSF2= -2.55174
##$ABSG= 5
##$ABSL= 3
##$ALPHA= 0
##$AQORDER= 0
##$ASSFAC= 0
##$ASSFACI= 0
##$ASSFACX= 0
##$ASSWID= 0
##$AUNMP= <proc_1d>
##$AZFE= 0.1
##$AZFW= 0.1
##$BCFW= 0
##$BC_mod= 2
##$BYTORDP= 0
##$COROFFS= 0
##$CY= -3
##$DATMOD= 1
##$DC= 0
##$DFILT= <>
##$DTYPP= 0
##$F1P= 0
##$F2P= 0
##$FCOR= 1
##$FTSIZE= 16384
##$FT_mod= 6
##$GAMMA= 0
##$GB= 0
##$INTBC= 1
##$INTSCL= 3.241238e-09
##$ISEN= 128
##$LB= 0.25
##$LEV0= 0
##$LPBIN= 0
##$MAXI= 10000
##$MC2= 0
##$MEAN= 0
##$ME_mod= 0
##$MI= 1.114404
##$NCOEF= 0
##$NC_proc= -6
##$NLEV= 6
##$NOISF1= 3.799351
##$NOISF2= 2.8
##$NSP= 0
##$NTH_PI= 0
##$NZP= 0
##$OFFSET= 15.40974
##$PC= 1
##$PHC0= -6382.496
##$PHC1= 21.22195
##$PH_mod= 1
##$PKNL= yes
##$PPARMOD= 0
##$PSCAL= 0
##$PSIGN= 0
##$REVERSE= no
##$SF= 200.130022407869
##$SI= 16384
##$SIGF1= 3
##$SIGF2= 2
##$SINO= 0.751879
##$SIOLD= 32768
##$SREGLST= <19F.Aceton>
##$SSB= 0
##$STSI= 16384
##$STSR= 0
##$SW_p= 3612.71676300578
##$SYMM= 0
##$S_DEV= 0
##$TDeff= 16384
##$TDoff= 0
##$TI= <>
##$TILT= no
##$TM1= 0
##$TM2= 0
##$TOPLEV= 0
##$USERP1= <user>
##$USERP2= <user>
##$USERP3= <user>
##$USERP4= <user>
##$USERP5= <user>
##$WDW= 1
##$XDIM= 16384
##$YMAX_p= 380455977
##$YMIN_p= -708003
$$ End of Bruker specific parameters
$$ ---------------------------------
##NTUPLES= NMR SPECTRUM
##VAR_NAME=  FREQUENCY,     SPECTRUM/REAL,   SPECTRUM/IMAG
##SYMBOL=    X,             R,               I
##VAR_TYPE=  INDEPENDENT,   DEPENDENT,       DEPENDENT
##VAR_FORM=  AFFN,          ASDF,            ASDF
##VAR_DIM=   16384,         16384,           16384
##UNITS=     HZ,            ARBITRARY UNITS, ARBITRARY UNITS
##FACTOR=    0.220516191357247, 1,           1
##FIRST=     3083.95170115729, 0,            0
##LAST=      -528.765061848486, 0,           0
##MIN=       -528.765061848486, -708003,     0
##MAX=       3083.95170115729, 380455977,    0
$$ Real data points
##PAGE= N=1
##DATA TABLE= (X++(R..R)), XYDATA
$$ [...]
7894B2084m24o806r6102j17019m1531k2894l3006q2416J21832m334O4789K20415
7882B4588r1473k69195J06087L9888l5153J08742K107j60155j54293j06133O4011
7871d70979J95530M42J570R0743j07323k3906P6898m7960r078P5394K45947M4696
7859G1974j57397m10816K0710J73248J48799k30289O7472J06653n9065J977J40108
7848a26626j81482M2288K03521K05119l4926j93124k1992Q9225j37487M8610K16085
7837A09211j29272k70393L8033J08950j06456j2313P8785J54895q8629R0409l7345
7826f4125m7237k81071r000L08909J98660k00411P7637J27149r8985j87721l5464
7815b11659R9316O59r9012K5550J8127j13481j82858L15707L29679j47794j45714
$$ plain form
7894 22084 21660 14854 -81248 -198267 -239798 -262692 -295698 -378114 -256282 -260616 -195827 24588
7882 24588 -66885 -336080 -229993 -190105 -225258 -116516 -114409 -274564 -428857 -534990 -470979
7871 -470979 -275449 -275007 -273437 -182694 -290017 -313923 -237025 -284985 -294063 -218669 27278 71974
7859 71974 -85423 -496239 -475529 -302281 -153482 -383771 -316299 -209646 -268711 -266734 -126626
7848 -126626 -308108 -265820 -62299 142820 107894 -85230 -107222 -17997 -155484 -106874 109211
7837 109211 -20061 -290454 -252421 -143471 -249927 -262240 -183455 -28560 -117189 -26780 -64125
7826 -64125 -111362 -392433 -401433 -92524 106136 -94275 -16638 110511 11526 -176195 -211659
7815 -211659 -112343 -111684 -210696 -185146 -167019 -280500 -463358 -147651 182028 34234 -111480
7804a11480J02358Q0323l10118J04855K00933j02481l01049K28845R1489j50613
7794a66938O28J59144l0802r1383R9819J26472q8451j04938J43743n8141N6037
7783D5190o3300n6904J53369K1596j08250k61721K8281N901J23439N7142j35333
7772a90590l9316p223N1970N6789n0933O1459R4976J33442j77958N6757K1541
7761A0914j43478j18237P1696j4819Q864j5718K387R2412L4004J01058m9277l0091
7749e0285k2305J31442j6660q6554k77477n8967J05661q019n6214N1353k5352
7738c13377R0237q7880J37548J03539Q292j48926K00758J01383o4572j28713q6310
7727a88021m7060Q849r8366O7405K49663p6789j41190Q7718R2989j61050r589
$$ plain form
7804 -111480 -9122 71201 -238917 -134062 66871 -35610 -336659 -107814 -16325 -166938
7794 -166938 -166310 -7166 -37968 -129351 -29532 96940 8489 -96449 47294 -10847 45190
7783 45190 -18110 -75014 78355 99951 -8299 -270020 -241739 -235838 -112399 -55257 -190590
7772 -190590 -229906 -237129 -185159 -128370 -179303 -117844 -22868 110574 -67384 -10627 10914
7761 10914 -132564 -250801 -179105 -193924 -185060 -200778 -198391 -105979 -71975 29083 -20194 -50285
7749 -50285 -72590 58852 42192 -44362 -321839 -380806 -275145 -283164 -339378 -288025 -313377
7738 -313377 -223140 -311020 -173472 -69933 -61641 -210567 -9809 91574 27002 -101711 -188021
7727 -188021 -235081 -226232 -324598 -257193 -7530 -84319 -225509 -137791 -44802 -205852 -215441
7716b15441J45929J01882k20137o3689O1486o2082J5089K68320j8617n6829k30322
7705b74411j01942J67872R4156J6758K5564J04148q5817j16262N1816m9977j50598
7694c18693O0608L7567J37514q6723K6784p6563j89812O8088K48033l747l8391
7683a35335L5938p0927r3665j84594j9641K31759J31218l7727O3679J0685j75066
7672b43676p8265K08768J00454L3013j3331j10427k41864j38062P1260K91315
7662a20815q4154n0294P3040J58550j43963k20263Q1222J91761J11015j37978
7652a41879J41920L4214k22426j57595J33112J62660q7720P5682m5618n5938J8286
7641a45302r7941J31095J00988j07848l1099R4190r2178k11218m0503K15159Q6378
$$ plain form
7716 -215441 -69512 32370 -187767 -251456 -189970 -252052 -236963 31357 12740 -44089 -274411
7705 -274411 -376353 -208481 -114325 -97567 -72003 32145 -53672 -169934 -118118 -168095 -318693
7694 -318693 -258085 -220518 -83004 -169727 -142943 -219506 -409318 -341230 -93197 -96944 -135335
7683 -135335 -99397 -170324 -263989 -448583 -468224 -236465 -105247 -142974 -79295 -68610 -243676
7672 -243676 -321941 -113173 -12719 20294 6963 -103464 -345328 -483390 -412130 -120815
7662 -120815 -204969 -255263 -182223 -23673 -167636 -387899 -306677 -114916 -3901 -141879
7652 -141879 41 34255 -188171 -345766 -212654 -49994 -137714 -62032 -107650 -163588 -145302
7641 -145302 -243243 -112148 -11160 -119008 -150107 -55917 -148095 -359313 -399816 -184657 -98279
7630i8279m8542p4963n457M0233j17438n5709J53203P9595N1306L6083r5635m6902
7618a82505J10156k8650p57J17793o7740p2905L171k2763j32206J18083K39131
7607H0808l9350j73670N5581R9127J8082k5200m8372M4869m1337o3796p96J4658
7595g9396l4991N0118K8796r9706J17417N647K9953K7871j7153j56359J21055
7584f748J40906j17639j63482o7272J21529P7005R666O895p760p897K8879o9522
7572e5440J6056R8082o0839k6513l9585O3147n4467m6755j3436J38377j7300j45927
7560a44600L6577j3582N6856N9605N9353j49534j19532p4219J94749Q1311r6618
7549a09634q1025P3475M656j24011p1516R9297N9521m1624J50529K08148j69550
$$ plain form
7630 -98279 -146821 -221784 -227241 -187008 -304446 -360155 -206952 -127357 -76051 -39968 -135603 -182505
7618 -182505 -72349 -100999 -101756 16037 -51703 -124608 -121437 -144200 -276406 -158323 80808
7607 80808 41458 -132212 -76631 22496 40578 15378 -32994 11875 -29462 -93258 -94054 -79396
7595 -79396 -114387 -64269 -35473 -135179 -17762 -12115 17838 45709 28556 -127803 -6748
7584 -6748 134158 16519 -146963 -214235 -92706 -15701 -6035 860 -6900 -14797 14082 -55440
7572 -55440 -39384 58698 -2141 -28654 -68239 -5092 -59559 -106314 -119750 18627 1327 -144600
7560 -144600 -108023 -121605 -64749 -5144 54209 -95325 -214857 -289076 -94327 -13016 -109634
7549 -109634 -190659 -117184 -112528 -236539 -308055 -208758 -149237 -190861 -40332 167816 -1734
7538a734j68026R803P0363l1152Q6891Q9417J37054k51734j38838J45366n3790
7527a06380j11941J35226J6973r5022M8818j03859P962J08400n9461O5346O5170
7516b8768L918L4137j33084m7703R8042J69412j00683J10026L7949j81495K4567
7505a3682L5422p3537J26643j3835j7827R3656j46667j84496M4946l6790J00877
7494h5290R522j33023R5509p3846j11725Q6837K52116l1671j06300J9171j65236
7483b43936J01140K4877J16361Q873j7997q9248n3373n5103j3789k9136M2094
7472b09237M5932o3208N4899M4520p5969J2142p5637N0014J60682J60715o5254
7461C9599n8679j12020j48453M208o5605O5439J42143K8729j29388K9300o6801
$$ plain form
7538 -1734 -169760 -159957 -89594 -120746 -33855 55562 192616 -59118 -197956 -52590 -106380
7527 -106380 -218321 -83095 -66122 -161144 -112326 -216185 -208223 -99823 -159284 -93938 -28768
7516 -28768 -24850 9287 -123797 -171500 -73458 95954 -4729 105297 143246 -38249 -13682
7505 -13682 21740 -51797 74846 61011 43184 136840 -9827 -194323 -149377 -186167 -85290
7494 -85290 -75768 -208791 -113282 -187128 -298853 -212016 40100 8429 -97871 -78700 -243936
7483 -243936 -142796 -117919 -1558 7315 -10682 -99930 -153303 -208406 -222195 -251331 -209237
7472 -209237 -163305 -226513 -171614 -127094 -203063 -190921 -266558 -216544 -55862 104853 39599
7461 39599 -19080 -131100 -279553 -275345 -340950 -275511 -133368 -104639 -234027 -204727 -271528
7450b71528J20041M7280J0462j5475j9253j23379J28571p7470r5852M3756J09766
7439a43081k2045J41439J2844j68311k8554Q0877p5624J11215L2967o5705M2995
7428h0983l6757M2756P2365p7321K8988J6162m9480o2647O5512K1761L2146J36157
7416A08659k857p205j53985p6265J49103Q2377P7928N5772k12197o6541J21698
7405G6487k355l7943J21211o6255j34612J24603J19212q875l2816j47615J06938
7394A17980L2972K0238L2188M305j62723N4958k1784k4309J13068M8254k04136
7383A1011o7259l9105J56041K4081K8186o6713l0377p9843j19776J14063r4534
7372a64225Q0343J68428l1670j44578o6705m3355m8771L0376J27378j00533j46861
$$ plain form
7450 -271528 -151487 -104207 -93745 -109220 -128473 -251852 -123281 -200751 -296603 -252847 -143081
7439 -143081 -165126 -23687 -10843 -179154 -207708 -126831 -202455 -91240 -58273 -123978 -80983
7428 -80983 -117740 -74984 -2619 -79940 -50952 -34790 -84270 -146917 -81405 -59644 -27498 108659
7416 108659 105802 98597 -55388 -131653 17450 99827 177755 233527 21330 -45211 76487
7405 76487 74132 36189 157400 91145 -43467 81136 200348 191473 158657 11042 117980
7394 117980 150952 171190 203378 207683 44960 99918 78134 53825 166893 215147 11011
7383 11011 -56248 -95353 60688 84769 112955 46242 15865 -63978 -183754 -69691 -164225
7372 -164225 -83882 84546 52876 -91702 -158407 -201762 -250533 -220157 -92779 -193312 -340173
7361c40173K22672k4181j71397l6370J02847p2205P7856J58420j51252k8979j24853
7350c87615P5753J26694m0969J5336R5124j37530j51058J42622O5073p4211J35023
7339a35758K4529j1343l0570P3783j77623o1513R8879K46936J53797P2944k02104
7328E1957j11312j06314J79715o0987q9220Q4904L5544k19523J7590J96248n2823
7317g4221j26226J13825J37193r9693m2770Q151L8598l4416L9429N4532K03501
7306B17903q9946n4974j0398k1916r4553J1282o8683O4068k9030j01649j88994
7295c66890J52336J21199o0272J68522J09381j01982q0156q8835O3910J14259
7285C1472k1970l1857j9935j42900J07717M8430j26809J38522L6217j51477K10626
$$ plain form
7361 -340173 -117501 -141682 -313079 -349449 -246602 -318807 -240951 -82531 -233783 -262762 -387615
7350 -387615 -311862 -185168 -226137 -210801 -115677 -253207 -404265 -261643 -196570 -270781 -135758
7339 -135758 -111229 -122572 -153142 -79359 -256982 -318495 -219616 27320 181117 254061 51957
7328 51957 -59355 -165669 14046 -46941 -136161 -51257 -15713 -235236 -217646 -21398 -74221
7317 -74221 -200447 -86622 50571 -49122 -91892 -83741 -45143 -79559 -40130 14402 217903
7306 217903 127957 72983 62585 40669 -53884 -42602 -111285 -47217 -76247 -177896 -366890
7295 -366890 -214554 -93355 -153627 14895 124276 22294 -57862 -146697 -82787 31472
7285 31472 9502 -22355 -42290 -185190 -77473 -29043 -155852 -17330 18887 -132590 78036
7274G8036Q4471j22491j2030O3778l0207m9876J18750J7235j09461j35792m7156
7263a44743J27068J23114M4770j4076q0197J15326o230Q6390L5091R4082j15994
7252B64601j29699K408j53676R1186J6309J1310r1799l2838p0656J17537R7080
7241A21763n1242J09897O5304j65944j25696K3078Q2123j7120p9763n7791Q5148
7230a0243M2971j43193j17478J69603j3904K2475k9051J12166J3985j88472J63189
7219B2048Q7930q4217j04666l8247L26q2265p4758J28354L4814k738j6761J14167
7207a6013l5778n2295j26782N7034K7673J53584J67814j38137k61174Q0558j80153
7196c23669J34829K683R918J44025R50j01274r8323J32200q9051r5328K31684
$$ plain form
7274 78036 162507 40016 27986 91764 61557 11681 130431 147666 38205 -97587 -144743
7263 -144743 -17675 105439 150209 136133 55936 171262 165032 251422 286513 380595 264601
7252 264601 134902 137310 -16366 74820 91129 102439 10640 -22198 -92854 24683 121763
7241 121763 70521 180418 245722 79778 -45918 -22840 59283 42163 -37600 -95391 -10243
7230 -10243 32728 -110465 -227943 -58340 -72244 -49769 -78820 33346 47331 -141141 22048
7219 22048 109978 25761 -78905 -117152 -116826 -199091 -273849 -145495 -110681 -113419 -130180 -16013
7207 -16013 -51791 -104086 -230868 -173834 -146161 7423 175237 37100 -224074 -143516 -323669
7196 -323669 -188840 -186157 -176239 -32214 -31264 -132538 -230861 -98661 -187712 -283040 -51356
7185e1356m1586j5814j13023k1384N0167j11949o040K08727M6352k20606J62304
7174a14208J73616j92720j86369K09394j06310J20921J29872n0161j28287m3137
7164a87389P6553K29890k4994k15329M9997j00848O3150L9558J21919J27925j25668
7153E4764p9332O0337J2751L5774n1962p4501O687O2297m9352j22886J03809n9042
7141a00656o3818K50618n2322N2991q491N8900N5227o7430P6407j40956j20253
7130e9783J7145K34960j18315n9731R2188k6538j0880K3512j33076R1142O0665
7119A11289K1544J7120j9412q7866j81901J44366Q8623K2065j38856k02523O9355
7108a56196Q5115p4537J6062M4815K606N0476O2908o7953n5019j39752K6290L18566
$$ plain form
7185 -51356 -92942 -108756 -221779 -243163 -192996 -304945 -310985 -102258 -55906 -276512 -114208
7174 -114208 59408 -133312 -319681 -110287 -216597 -95676 34196 -15965 -144252 -187389
7164 -187389 -110836 119054 94060 -121269 -71272 -172120 -108970 -69412 52507 180432 54764
7153 54764 -24568 35769 48520 84294 32332 -42169 -35482 26815 -22537 -145423 -41614 -100656
7141 -100656 -164474 86144 33822 86813 78322 137222 192449 125019 201426 60470 -59783
7130 -59783 -42638 192322 74007 14276 106464 79926 69046 92558 -40518 50624 111289
7119 111289 132833 149953 130541 42675 -139226 5140 93763 115828 -23028 -225551 -156196
7108 -156196 -71081 -145618 -129556 -84741 -82135 -31659 31249 -36704 -91723 -231475 -205185 113381
7096A13381j24104p4069K6842L1431k7555K337N3950J64086j06728r0443M131
7085b6741J23404j63244J9604M5479Q1119M2736r8296O584q4201j4197J74479
7074A06726q4426Q1404K5238r1660J8902J23294p2697j26108R8229L6605J02227
7063B17734J5394j61320j20723j42716J19731J81054o0489n3868l5796k4066j44248
7052b09313J81762L4761j50774J6942k3378J352L8326m8612J49726k33617R4316
7041a48509Q3084n6445j71258K31307R6846r6991k28108L7676J94995N6937j34105
7030a34571J03476O0514k80155M2577L3363N721R0223P7430j10189M6765o2203
7019a27049j67788J16439J08678N4183J68795m0125j3577k26296n7896O9846J36126
$$ plain form
7096 113381 -10723 -84792 -57950 -26519 -54074 -51737 2213 166299 59571 -30872 -26741
7085 -26741 96663 -66581 -46977 -1498 79621 122357 24061 30645 -53556 -67753 106726
7074 106726 22300 103704 128942 37282 56184 179478 106781 -19327 78902 115507 217734
7063 217734 233128 71808 -48915 -191631 -71900 109154 48665 -5203 -40999 -65065 -209313
7052 -209313 -27551 7210 -143564 -126622 -150000 -148648 -110322 -158934 -9208 -242825 -148509
7041 -148509 -65425 -121870 -293128 -61821 35025 -61966 -290074 -252398 -57403 -466 -134571
7030 -134571 -31095 29419 -250736 -208159 -174796 -169075 -78852 -1422 -111611 -64846 -127049
7019 -127049 -294837 -178398 -69720 -15537 153258 113133 99556 -126740 -184636 -114790 21336
7008B1336j68407J50165K30502j67206j62979j23247q92J35297J84492J1175p6489
6997C3747q5555j6083L1267l0520j4786K43279p4550j59394k306j24635J11875
6986h7661J21455n7516K17071L177j01860K761m5967j53386J13854J51387m1598
6975A21717j45721j74823O3064R7902j94520r166J74909j72745m8146K7886R1467
6964a68176l06556R1067L42818L4725j82813L0435O0456r4168l1997M8139J0558
6953a65512k0869J54431r9987q7061n3242J03479j01980Q6728J58506O3689j52690
6942a14508J30391o1223J61479r7353p1131L3612r0064j00806J04071L7358j54993
6931b23167L7331R7770j1743J61523r1296j91498j2955K15848R0343j08042m7779
$$ plain form
7008 21336 -147071 3094 233596 66390 -96589 -219836 -220728 -85431 99061 110236 33747
6997 33747 -51808 -67891 -36624 -67144 -81930 161349 86799 -72595 -74901 -199536 -87661
6986 -87661 33794 -23722 193349 196526 94666 97427 51460 -101926 11928 163315 121717
6975 121717 -24004 -198827 -135763 -37861 -232381 -241547 -66638 -239383 -287529 -259643 -168176
6964 -168176 -474732 -383665 -40847 -6122 -188935 -158500 -98044 -192212 -224209 -176070 -165512
6953 -165512 -186381 -31950 -131937 -218998 -272240 -168761 -270741 -184013 -25507 38182 -114508
6942 -114508 15883 -45340 116139 18786 -52345 -18733 -108797 -209603 -105532 -68174 -223167
6931 -223167 -185836 -88066 -99809 61714 -29582 -221080 -234035 -18187 72156 -35886 -83665
6920h3665J42798l1915r0122J5099j590q833L697K76623l05021M965m1221r9215
6908b18400P6136K04743N6525j20541j79189l3411N5660J64586J01334n288j95282
6897i3127J8287J64025N9215l10737K4892P0930m0461r5256R1496M8888j23294
6886a85142o0078K84342N3891j86701R6712R8600O4924k49899n86R6092k24599
6875b12444Q3463L06459j05517j35105n8701n4149K28859J39215k03697m7554
6865e9171k8919L4377J33811n6661Q2692k9364n4824P9686J3151l29514J36813
6854g7923L3167J8677J564J00094q4057N5578l0848J22828P4115j71107Q619J49744
6842B00451k72326j2927J37004r4457l7093k4237J07223J11457r1985k29894K2756
$$ plain form
6920 -83665 59133 27218 -62904 -47805 -49395 -58228 -54531 222092 -82929 -77964 -119185 -218400
6908 -218400 -142264 62479 119004 -1537 -180726 -214137 -158477 6109 107443 102155 -93127
6897 -93127 -74840 89185 148400 -162337 -137445 -66515 -106976 -202232 -110736 -61848 -185142
6886 -185142 -245220 39122 93013 -93688 3024 101624 166548 -83351 -83937 12155 -212444
6875 -212444 -128981 177478 71961 -63144 -121845 -175994 52865 192080 -11617 -59171
6865 -59171 -88090 -53713 80098 23437 106129 76765 21941 101627 114778 -214736 -77923
6854 -77923 -44756 -26079 -24515 75579 -8478 47100 16252 139080 213195 42088 50707 200451
6842 200451 -71875 -84802 52202 -42255 -79348 -103585 3638 115095 23110 -206784 -184028
6831a84028m7286m425K44018J46694l15995L9074m2933J21100o3838l5232M2187
6820a00664J14592k24860p8040J23624M0940Q1368J25069j2059n2668p7790r6230
6809a56718J07407J17721o6767j54k7033j5946L8508j8200Q5236O5466j61945
6798c2425o9532J19510r8770j72899M6945J30281j2152o0184J26606N7774r1124
6787e5970r1964J97146j54848M1464n7642J59655k18439m4453o3997R8595p3717
6776b64170M3778O2386j07357j32917N3635M1134J35513J25415m4963J0906j23304
6765a99944K08663K4087r4218j39255J47662l00197M2797K76375k63832p101K80179
6754b4784j96896q3101L2747L09531r2419n935M4826P0343j93531J2649J97925
$$ plain form
6831 -184028 -231314 -235739 8279 154973 -161022 -121948 -164881 -43781 -107619 -142851 -100664
6820 -100664 13928 -210932 -288972 -165348 -124408 -43040 82029 69970 17302 -60488 -156718
6809 -156718 -49311 68410 1643 1489 -25544 -41490 -2982 -21182 64054 129520 -32425
6798 -32425 -101957 17553 -81217 -254116 -207171 -76890 -89042 -149226 -22620 35154 -55970
6787 -55970 -147934 49212 -105636 -64172 -121814 37841 -180598 -225051 -289048 -190453 -264170
6776 -264170 -220392 -158006 -265363 -398280 -344645 -303511 -167998 -42583 -87546 -76640 -199944
6765 -199944 8719 32806 -61412 -200667 -53005 -353202 -310405 -34030 -297862 -304963 -24784
6754 -24784 -221680 -304781 -272034 37497 -54922 -60857 -16031 54312 -139219 -126570 71355
6743G1355j85033r4270J69159J5426j39826J86590J84278q2655j41695J21292
6733A04621N5669L8159j05467L9459k1659j45941J17689Q9643k86612Q3736J46588
6722A15885r7887j4244R9968n1197j32608J34694R8654J44723q2938P4496o8234
6711B21312j00702J06136J41982j56345k60804K3294J36240j9242J25938J6278
6701B34087R0302j11234r0718Q9266J3485p8009n1171P7248k6030j60862K6078
6690A2442J40163q4139p9216j57775O8630L1297J40433j07194L3084K8934j52264
6679a25605M5815J02584q9838J1460J08855r5372j61961L7635K31158J32713j38509
6668E8935k55770K88834q8624j17815J91559J14870m4210k21354L5797O3061p8527
$$ plain form
6743 71355 -113678 -207948 -38789 -23363 -163189 23401 207679 125024 -16671 104621
6733 104621 160290 198449 92982 132441 110782 -35159 82530 172173 -114439 -30703 115885
6722 115885 17998 3754 103722 52525 -80083 54611 153265 297988 215050 289546 221312
6711 221312 120610 226746 368728 212383 -48421 -25127 111113 91871 217809 234087
6701 234087 324389 213155 122437 211703 225188 147179 96008 173256 147226 -13636 12442
6690 12442 152605 68466 -10750 -168525 -99895 -68598 71835 -35359 -2275 26659 -125605
6679 -125605 -79790 22794 -67044 -55584 53271 -42101 -204062 -166427 64731 197444 58935
6668 58935 -196835 91999 3375 -114440 77119 191989 147779 -73575 -37778 25283 -53244
6657e3244k14825M5122O3021j30194J80411J85896k04522k8137n778L5765P1622
6646e4863o6042J32628j13949p3636o8825L8626q7970O6293P3885q9101J12828
6635a30126J40891O6969L6385j22711K9698J6413J67140r1332j34145o1420P7719
6624d519J15606n7862j72530k819J5383J01884P4661r0128J2620q0265J44752
6613E6783M3461K4547O0783R3898j45872o2953J35576j20281m7572Q0130l7359
6602H1141J56856M6335j72378N5803J60872K4330J06342j9767p7384j07304K4702
6591B79548j00785P7671k79946K5149J48964R3030R1954n8621M7316q392m1654
6580B74234Q3616J14860K25715l41831k74758J17202M7439j32138O6616J85715
$$ plain form
6657 -53244 -268069 -222947 -159926 -290120 -109709 76187 -128335 -156472 -162250 -126485 -54863
6646 -54863 -120905 11723 -102226 -175862 -244687 -206061 -294031 -227738 -153853 -242954 -130126
6635 -130126 10765 77734 114119 -8592 21106 37519 204659 113327 -20818 -82238 -4519
6624 -4519 111087 53225 -119305 -122124 -106741 -4857 69804 -20324 -7704 -87969 56783
6613 56783 100244 124791 185574 279472 133600 70647 206223 85942 38370 118500 81141
6602 81141 237997 284332 111954 167757 328629 352959 459301 439534 362150 254846 279548
6591 279548 178763 256434 -23512 1637 150601 243631 335585 276964 324280 315888 274234
6580 274234 357850 472710 698425 356594 81836 199038 246477 114339 180955 366670
6570C66670q3264l02414R3121K03704R356M9293R5727M7362l06128m4996K35879
6559C64310P9649p1864J57068J25162r2910j00378j174p3991q2357q1498K16208
6548D38225j8730o3958j30976q0345O0202K03685k9683Q0739K19881R8994l58538
6537D19496l358M0540r4919N0085L2932p9180k73046N2384l8625K5295l7658K21777
6525C15723J58512j20685j5802J36583r3162m8599R3003O2893j23530L7861l0455
6514C72342k64004r7467J89158J59210L5339k17499J29403J33774j9629J7334
6504D37961q807n5976p8516J60864M0851l3401j83208p7261l1576M2588Q2902
6493B96421j12244O2350N4662j39972P5901J23358K04255k52386j41309J91761
$$ plain form
6570 366670 283406 -19008 74113 277817 287173 336466 432193 479555 173427 128431 364310
6559 364310 443959 372095 529163 654325 561415 461037 459863 385872 303515 222017 438225
6548 438225 419495 355537 224561 144216 204418 408103 378420 459159 679040 778034 419496
6537 419496 416138 456678 361759 411844 444776 365596 92550 144934 106309 131604 93946 315723
6525 315723 474235 353550 337748 474331 381169 332570 425573 488466 364936 402797 372342
6514 372342 108338 10871 200029 359239 394578 177079 306482 440256 420627 437961
6504 437961 429154 373178 294662 455526 496377 462976 279768 202507 170931 213519 296421
6493 296421 184177 246527 301189 161217 237118 360476 564731 312345 171036 362797
6483C62797O9062j77415M5767N5211o7748R9183j69647l6726M0090L967Q44R1726
6471C17111k2301k26L3544P9449N9404r6571J52040J06630J27219n3447n7700
6460F45152o7255l9714j57604J2761K28032L336o2079k2144j1137M8738Q367j0135
6448E76318N3977o9782n9103P9641Q1346Q9790N3725l729m0266m6591j28005p4838
6436E12483J96023n4697p419O3503m4722k04303j13693L0494J17142K07184p6641
6425F25354j51010j06976J44079O2003j02576j6787J66355L1548j68486M2293
6415E25797O0759j5769j04250J49530J60396j60532J6256M0874R1916q8701n2149
6404F24127K35465K18980k06573M4372O8296j91753R178M2224K6959L11642L1692
$$ plain form
6483 362797 431859 254444 300211 355422 287674 386857 217210 180484 220574 224541 225385 317111
6471 317111 294810 294584 328128 407577 466981 370410 522450 629080 756299 702852 645152
6460 645152 577897 538183 380579 393340 621372 624708 562629 540485 529348 578086 586453 576318
6448 576318 630295 560513 501410 581051 662397 752187 805912 802183 761917 715326 587321 512483
6436 512483 708506 653809 646390 709893 665171 460868 347175 377669 494811 701995 625354
6425 625354 474344 367368 511447 573450 470874 454087 620442 651990 483504 525797
6415 525797 586556 570787 466537 616067 776463 615931 632187 673061 764977 676276 624127
6404 624127 859592 1078572 871999 916371 984667 792914 802092 844316 871275 1182917 1214609
6393A214609j43127J03956Q2908j62701N3775J76518J08304j23070L9840j5051
6383A335961q8402n5237K42582J35820k55428O0364j2848J48887J4255J97984
6373A723938K18961J01737p1041K01598M4538j0975j62448N8031L240R488j36714
6362A980353K7079r6426R6938o87P0080J31391R7661l1844m7130J99218J36431
6351B563064k6105M0047P5651Q574J73954l9479J73611n7916P4921M3047K51349
6340C280718n3294N4276L19986J88318J65328K19396J44231M73404M88059M07716
6330E688138M60933P07111N91461O87390R91814J681609K682594L790858M973252
6321B2255160N725582N098280L316370J138186j581690k902205l706619l424102
$$ plain form
6393 1214609 1071482 1175438 1258346 1095645 1149420 1325938 1434242 1311172 1351012 1335961
6383 1335961 1247559 1192322 1434904 1570724 1315296 1375660 1362812 1511699 1525954 1723938
6373 1723938 1942899 2044636 1973595 2175193 2219731 2208756 2046308 2104339 2107579 2117067 1980353
6362 1980353 2007432 1911006 2007944 2007257 2077337 2208728 2306389 2274545 2227415 2426633 2563064
6351 2563064 2536959 2577006 2652657 2661231 2835185 2795706 2969317 2911401 2986322 3029369 3280718
6340 3280718 3227424 3281700 3601686 3790004 3955332 4174728 4318959 4792363 5280422 5688138
6330 5688138 6149071 6856182 7447643 8135033 9126847 10808456 13491050 17281908 22255160
6321 22255160 27980742 33079022 36395392 37533578 35951888 33049683 29343064 25918962
6313B5918962l089233k525613k020269j082422J43905J402979L079472M710393
6305B6538174N302565M756321K875713N45255j915408l659802m136368m302551
6297B6003899l958080l385595k846778k146999j682228j196898q51042q35174
6289I101105o63607m64951l44581l42973j88866q3768o4393J27332j19499j69546
6279F786253j831k1470K15876K57594K48627J32638J5527k70175j01349K70006
6269G531696J16560K85764M01451J71928L08426M46414N01908O86730R04621R95378
6259A2350876J261818J361118J370785J873652K477121L668322O360561R268487
6251C9992740J2274576J3655106J2167956P705176K272324l268794o992975q778119
$$ plain form
6313 25918962 22829729 20304116 18283847 17201425 17345330 18748309 21827781 26538174
6305 26538174 31840739 36597060 39472773 40018028 38102620 34442818 30306450 26003899
6297 26003899 22045819 18660224 15813446 13666447 11984219 10787321 9936279 9101105
6289 9101105 8437498 7972547 7627966 7284993 7096127 7012359 6947966 7075298 6955799 6786253
6279 6786253 6784422 6762952 6978828 7236422 7485049 7617687 7633214 7363039 7261690 7531696
6269 7531696 7648256 7934020 8335471 8507399 8815825 9262239 9764147 10450877 11355498 12350876
6259 12350876 13612694 14973812 16344597 18218249 20695370 24363692 30724253 39992740
6251 39992740 52267316 65922422 78090378 85795554 88067878 84799084 77806109 69027990
6243F9027990q856995p607147o250215m740491k643670j28829L257915O961447
6235D9020005J0265257J1867264J0776325O655998Q84146m439688q227394j0304564
6227F6497349j0435970r209101p847066o910940n522458l863700l171652k639807
6219A6896655k043235j444057j180030j003248o96183l91819l74006m23684k85506
6210I054887j00992m57842j40304k85854k1292k04046k49422n7416q5548l20777
6200G131394j70109r419j01501j35969J60784J12755n0069j23889j56438L454
6190F660993p2680P9527j52772j92542r0478R332J12049k49828J03933K08101
6180F415635m5001J29303Q0808J70834K0241J58022K11044L27045J08959K79164
$$ plain form
6243 69027990 60170995 52563848 46313633 41573142 38929472 38800643 42058558 49020005
6235 49020005 59285262 71152526 81928851 88584849 89468995 85029307 76801913 66497349
6227 66497349 56061379 46852278 39005212 32094272 26571814 22708114 19536462 16896655
6219 16896655 14853420 13409363 12229333 11226085 10529902 10138083 9764077 9340393 9054887
6210 9054887 8953895 8496053 8355749 8069895 8048603 7844557 7595135 7537719 7452171 7131394
6200 7131394 6961285 6951866 6850365 6714396 6875180 6987935 6937866 6813977 6657539 6660993
6190 6660993 6588313 6667840 6515068 6322526 6232048 6241380 6353429 6103601 6207534 6415635
6180 6415635 6370634 6499937 6580745 6751579 6771820 6929842 7140886 7467931 7576890 7856054
6170G856054N12168N06311L98861O55363Q01553J049198J053370J499356K001853
6161A6334087K349181L023523N105783P847780J0916360J3045546J2758876R585215
6153H0966351M225634j621954n949991q652832r648148q912097p335339n790167
6145C7281457n094105l620453k134735j146659m09559Q96410J956908M101918
6137C1831182O863926J0235016J2956539J3358062R927648M844486j334128o541645
6129H2141086r583787j0684535j0092902q626125p361492o098671m740849l653336
6121B1299389l068817k334328j684757j383688j028604r23665n07663o74653m24691
6112I268523l95113p6406k39555k94564O2933k9118k91652n113p2788j27890r5328
$$ plain form
6170 7856054 8368222 8874533 9273394 9928757 10730310 11779508 12832878 14332234 16334087
6161 16334087 18683268 21706791 26812574 34660354 45576714 58622260 71381136 80966351
6153 80966351 85191985 83570031 77620040 68967208 59319060 50406963 43071624 37281457
6145 37281457 32187352 28566899 26432164 25285505 24875946 25772356 27729264 31831182
6137 31831182 38695108 48930124 61886663 75244725 85172373 90016859 88682731 82141086
6129 82141086 72557299 61872764 51779862 43153737 35792245 29693574 24952725 21299389
6121 21299389 18230572 15896244 14211487 12827799 11799195 10875530 10367867 9693214 9268523
6112 9268523 8873410 8797004 8557449 8262885 8325818 8296700 8005048 7999935 7927147 7799257 7703929
6101G703929J32235J8354M1506J30570O7303K78058J53170J47019M06848N32889
6091I611881P19793Q45060J220157J954845K805920M475521N541162N504287L820839
6082C6499465J767981o49933k728932l840079l806208l307488l179350k404649
6074A8350807j692400j143878o86868j62654O85680J044063J136599J999588L108754
6065B2639691M109251M905953N275872M133490J561992r81001l096129m289313
6057C4259806m636618m561478l549669l059090k631476k038180j366117j017569
6049A1399609j019944l50135j3072J44602K20938M32291L36026p1831r9257j11905
6039A0867322j64664k04029l04495p1560o9067k12352k45763m78383m30332o00673
$$ plain form
6101 7703929 7836164 7854518 7896024 8026594 8093897 8371955 8525125 8672144 9078992 9611881
6091 9611881 10331674 11176734 12396891 14351736 17157656 21633177 27174339 32678626 36499465
6082 36499465 38267446 37617513 34888581 31048502 27242294 23934806 20755456 18350807
6074 18350807 16658407 15514529 14827661 14665007 15350687 16394750 17531349 19530937 22639691
6065 22639691 26748942 31654895 36930767 41064257 42626249 41645248 38549119 34259806
6057 34259806 29623188 25061710 21512041 18452951 15821475 13783295 12417178 11399609
6049 11399609 10379665 10029530 10016458 10161060 10381998 10814289 11150315 11078484 10979227 10867322
6039 10867322 10702658 10498629 10194134 10122574 10053507 9841155 9595392 9117009 8686677 8086004
6029H086004m76024k57144n28717n86706j65518K67838J19866R6185J37922l4507
6019F659199J50359j16190j00829k50078k91121l62342k98562m75322l94591l31016
6009D189507k59285j53784l53394j08640L6836l61884k47683J84655k39194J04590
5999B791724j34534k20892p3662o0067j56797L3157j13426J09619p1651Q2556
5989B186027j08581j47653k16933Q4193Q6612p7161J77301J054q7348j47672k4255
5978A725584J73911K67751K6307j72024r4245J06941k50137j63419j009l7273
5968A582387n1658j58514Q769j41581k72174J60864K8769k2168j8510J09711j29925
5957A095970J3597j45665N5572M5998N7488Q5650J34094l64917r010P0149j53451
$$ plain form
6029 8086004 7609980 7352836 6824119 6237413 6071895 6339733 6459599 6555784 6693706 6659199
6019 6659199 6809558 6693368 6592539 6342461 6051340 5688998 5390436 4915114 4520523 4189507
6009 4189507 3930222 3776438 3423044 3314404 3351240 2989356 2741673 2926328 2687134 2791724
5999 2791724 2657190 2436298 2362636 2302569 2145772 2178929 2065503 2175122 2103471 2186027
5989 2186027 2077446 1929793 1712860 1797053 1883665 1806504 1983805 1984859 1897511 1749839 1725584
5978 1725584 1899495 2167246 2193553 2021529 1927284 2034225 1784088 1620669 1619660 1582387
5968 1582387 1530729 1372215 1380984 1239403 967229 1128093 1156862 1134694 1116184 1225895 1095970
5957 1095970 1109567 963902 1019474 1065472 1122960 1208610 1342704 977787 968777 1038926 885475
5946H85475J2887J35683M9480j08241m5394j52758R7693P1431L3504J30765L3837
5935A144362K9103p972j31717j31162m6518p9566M9693J11420k75298j44020J3060
5924E31385J17812o2657P5701K90198J9640l70266k0023K06030j54510N5137K2068
5913G10515n8463m5197o5199o4234R7743j39140r5272K99246o6010j99593m5986
5902C28410n0743J63282J03231j13061O0460K68221j07038k12833p6668J59424
5892E22685O642n0728j29997P1800J04134j51214P0117j19403n4542J57384J37176
5881E64054q4296N4795j44073m410J56332J31332j11102J13842J17540m23J01888
5870H95479n9991j11001j7260m2506j4720p6543O2078k3265L6408o8268J09911
$$ plain form
5946 885475 898362 1034045 1083525 975284 929890 777132 874825 946256 979760 1110525 1144362
5935 1144362 1173465 1165493 1033776 902614 856096 776530 826223 937643 662345 518325 531385
5924 531385 649197 586540 662241 952439 972079 601813 581790 787820 633310 688447 710515
5913 710515 652052 606855 541656 477422 575165 436025 340753 639999 573989 374396 328410
5902 328410 277667 440949 544180 431119 491579 759800 652762 439929 363261 522685
5892 522685 529327 478599 348602 420402 524536 373322 443439 324036 269494 426878 564054
5881 564054 479758 534553 390480 386070 542402 673734 562632 676474 794014 793591 895479
5870 895479 835488 724487 707227 664721 650001 573458 635536 612271 648679 580411 690322
5859F90322j0111o5295j93517M4540n613r2395j651L2268j07950Q2373J17827
5848D90798N3671K8562o2648J35264K09365m8433j65043J37559O1665j08997K7058
5837G58821o1033p2100p7933j42098L0550J04409j75928N6355J02282L200n6664
5826D69861R5628K14211p6493l6338J64739K27774j82052j44299m5531n5630k0382
5815F11488M7479l4099j07963j74481m2720J49365J221Q985K4012p2384Q706p3744
5803C45865p5331o8071J52860N5620j17529n0385J16119n6174J0103l2840O9135
5792C49372L1966p8865O0381J90604j77274O4015p1573j38246O8806L12084j13235
5781D98035j99748j42993k8896J24908J22173r7276o8050j43414Q8531J0193N496
$$ plain form
5859 690322 680211 614916 421399 465939 460326 367931 366280 398548 290598 372971 490798
5848 490798 544469 573031 510383 645647 855012 806579 641536 779095 840760 731763 758821
5837 758821 697788 625688 547755 405657 436207 540616 364688 421043 523325 526525 469861
5826 469861 565489 779700 703207 666869 831608 1059382 877330 733031 687500 631870 611488
5815 611488 658967 624868 516905 342424 299704 449069 450290 459275 483287 410903 419609 345865
5803 345865 270534 202463 355323 410943 293414 243029 359148 302974 313077 280237 349372
5792 349372 381338 302473 362854 553458 376184 440199 368626 230380 299186 611270 498035
5781 498035 298287 155294 126398 251306 373479 276203 208153 64739 153270 163463 168959
5770A68959O6494P3808n3324n0565J6514k1063J5231m0678m3905l1074P0766Q4344
5758B55507r5237n5778K8372p553j63488J15825J82752K02886j2329j34536j8432
5747B97989K8380N1785J43441J16537j17707j14503K5127j55522l423N8169q0336
5736B49937J07873j00134j76498J6662J56821J0253k6998l4346J72159J8499Q3431
5725D77659r6933p9367j98931J99212o5417J90021j10083M2743j56680k0852L292
5714A84664J00438N8838J26680j58463j65180P5095J50138r8884j28587O1414
5704B06153l8105k3757m183m0637m4259O9945L8306J9259m3264J23291Q7095M447
5692C54291j47413l2291K71715r9251j29258J16680j32833K0469K77896j39759
$$ plain form
5770 168959 235453 309261 255937 205372 221886 200823 216054 175376 131471 100397 171163 255507
5758 255507 160270 104492 132864 125311 -38177 77648 260400 463286 450957 316421 297989
5747 297989 326369 378154 521595 638132 520425 405922 431049 275527 272104 330273 249937
5736 249937 357810 257676 81178 97840 254661 264914 237916 203570 375729 394228 477659
5725 477659 380726 301359 102428 301640 236223 426244 316161 358904 202224 181372 184664
5714 184664 285102 343940 470620 312157 146977 222072 372210 273326 144739 206153
5704 206153 168048 144291 140108 99471 55212 125157 163463 182722 139458 262749 349844 354291
5692 354291 206878 174587 446302 347051 217793 334473 201640 222109 500005 360246
5682C60246m2916O9335k7307r2790N1509n0853J87418N381j85569n4824Q789K69942
5670D98361p3412j45989j11657J41044q7771l1911J42270R9054j23417k9646N3886
5659C30812m1254j61113K39648J1692j34210k01133J79733Q9003j0397l24619
5649b1838J15785l8917K1403P5625J44196j02780l5754j83399k9910K8038N605
5638b1946J57984k5232j37647q3060o1262J73446L12019j03541q2175M882K5283
5627A58751k14283J32316L5120J43045O7021n4123o2920J99525K06587L34514
5617I45553K61738L46488K67227M04263J55362j4909l53183k45426j78638j99263
5607A389212k41989r9850j09989q6454j73124N131Q2124q2405k9872L5359J37428
$$ plain form
5682 360246 317330 386665 359358 266568 318077 267224 454642 460023 274454 219630 228419 498361
5670 498361 424949 278960 167303 308347 220576 188665 330935 429989 306572 276926 330812
5659 330812 289558 128445 368093 379785 245575 44442 224175 313178 302781 -21838
5649 -21838 93947 55030 76433 152058 296254 193474 157720 -25679 -55589 -27551 -21946
5638 -21946 136038 110806 -26841 -109901 -171163 2283 314302 210761 128586 133468 158751
5627 158751 -55532 76784 111904 254949 321970 267847 204927 404452 611039 945553
5617 945553 1207291 1553779 1821006 2225269 2380631 2365722 2012539 1767113 1588475 1389212
5607 1389212 1147223 1047373 937384 850930 677806 682937 765061 682656 652784 688143 825571
5596H25571k6477J74711M20284L33278K43681M99944K75661n9376k16497r7609
5586B373171k24445k21535l43976k11532l29713k30002q3817k0313j58618n3390
5576D95830J95059N4157k25084p7140N5537R5949j09366r2937k296J07009q0070
5565D16648r1904J05312n1017n1638n0104J78552p5614l8241M7294J01908j87751
5554C03445l29865J49715K00697k04254m3563n7444M8992N1938n6066J69519j48879
5543H4235j32836P7661o760m6340M0754K3387l4437P5953j10526O4771O6825n8319
5531D4368o0977m6792p0799J7426l3111j21916J57410j1126j28506k8613M7413
5520b35223M0024J34183m1853j13733l3352L541R8590p8239j7O758j15120p2450
$$ plain form
5596 825571 799094 973805 1394089 1727367 1971048 2470992 2746653 2687277 2470780 2373171
5586 2373171 2148726 1927191 1583215 1371683 1041970 811968 728151 707838 549220 495830
5576 495830 690889 745046 519962 442822 498359 594308 484942 392005 389709 496718 416648
5565 416648 324744 430056 379039 327401 277297 455849 380235 341994 389288 491196 303445
5554 303445 -26420 123295 323992 119738 76175 18731 67723 119661 63595 233114 84235
5543 84235 -48601 29060 22300 -24040 16714 40101 5664 81617 -28909 35862 102687 44368
5531 44368 -16609 -63401 -134200 -116774 -149885 -271801 -114391 -125517 -254023 -282636 -235223
5520 -235223 -195199 -61016 -102869 -216602 -249954 -246413 -147823 -226062 -226079 -219321 -334441 -406891
5508d06891J28250O8411j57766J83646R6867m0035j36526J42461P2100j03268
5498a52751O0130J11034j57803N3480P5914j50048j44081R9287J04459o0383N0569
5487a10193J17904M5689j04275m4715J49829q4514j9645K66781j43648p6705P0541
5476F7049R8143j82797R5399q091J20506J85961p0196j68043J03801J3913q9336
5465A66309m447J54769K7130m7034q3603J24643n4725j25455J05430J98245j36873
5454C24389q0078j2972O7097j7140J5602L78869j69265l34872j3086J69190j51838
5443A75896N3046K52201P772j35909K399J36602q7223q7757J28147m8489P6856
5432D73541J34532m9135l21902P9742L6227K151J44981J04574j35052P1706n846
$$ plain form
5508 -406891 -278641 -210230 -367996 -184350 -87483 -127518 -264044 -121583 -49483 -152751
5498 -152751 -92621 18413 -139390 -85910 -9996 -160044 -304125 -204838 -100379 -160762 -110193
5487 -110193 7711 53400 -50875 -95590 54239 -30275 -49920 216861 73213 -3492 67049
5476 67049 165192 -17605 77794 69703 190209 376170 305974 137931 241732 255645 166309
5465 166309 161862 316631 343761 296727 213124 337767 283042 157587 263017 461262 324389
5454 324389 244311 231339 298436 281296 296898 675767 506502 171630 158544 327734 175896
5443 175896 228942 481143 488915 353006 355405 492007 404784 317027 445174 396685 473541
5432 473541 608073 558938 237036 316778 353005 355156 500137 604711 469659 541365 535519
5421E35519J61571N1633q2382N8262M1069Q2177k5932j43596m2388J838J95364
5410H33135k5028J9476n1864r8426K4698K4580J63561j04640M0996J38502j75356
5399G89634j54891K57864j48279k57318j319J73558R3047O9214r2775O4378J6030
5388H09143l1011J12285j9744q4858J7855Q6676N342k67562j28078J9890K46236
5377G66174q2369q4069J43878k03016J07436J54153J15212n2881J903M0672p6006
5366H31087q9249K3800O5746q749k08289J7428J55385N0228N5953j5841K38437
5355A115936J38842N1763J50650m792J3382J77881m5684q0341J634P5132K2900
5344A617303J89524N2691l2383K03813L6417J80312J0978l2565K19308Q7231Q6456
$$ plain form
5421 535519 697090 748723 666341 724603 765672 847849 821917 678321 635933 637771 833135
5410 833135 808107 827583 775719 677293 701991 726571 890132 785492 826488 964990 789634
5399 789634 634743 892607 744328 487010 485691 659249 752296 821510 728735 793113 809143
5388 809143 778132 890417 870673 785815 803670 890346 895688 628126 500048 519938 766174
5377 766174 683805 599736 743614 540598 648034 802187 917399 864518 866421 907093 831087
5366 831087 741838 765638 831384 822635 614346 631774 787159 837387 893340 877499 1115936
5355 1115936 1254778 1306541 1457191 1452399 1465781 1643662 1597978 1517637 1519271 1594403 1617303
5344 1617303 1806827 1859518 1827135 2030948 2067365 2247677 2258655 2226090 2445398 2532629 2619085
5333B619085K19476J41487p7238n0409N2188J24851L31324K88582J12740J94575
5323C956661J52856K51868L67687M91268K91492K65030L92033N18295R64045J400857
5313I052092K034034K770488K965194J897775P02419L7103r23603j131426p30801
5304A6673275n06253J22128J070164K009912K796806L311898L324661L409820
5296C2212411L472263L807208L414919K775617J917674Q54095k92342j393197
5288D6768648k396106k501884j872717o45859J380043L144797L692289L353461
5280E0922672L381526L435062L021819K003946O48523l89749n26671j251862k030756
5271E9214510k844169l667227m328239l828509k329932l95738R84297J501492
$$ plain form
5333 2619085 2838561 2980048 2902810 2852401 2904589 3029440 3360764 3649346 3762086 3956661
5323 3956661 4109517 4361385 4729072 5220340 5511832 5776862 6168895 6687190 7651235 9052092
5313 9052092 11086126 13856614 16821808 18719583 19422002 19459105 18535502 17404076 16673275
5304 16673275 16167022 16289150 17359314 19369226 22166032 25477930 28802591 32212411
5296 32212411 35684674 39491882 42906801 45682418 47600092 48454187 48161845 46768648
5288 46768648 44372542 41870658 39997941 39352082 40732125 43876922 47569211 50922672
5280 50922672 54304198 57739260 60761079 62765025 63413548 63023799 62497128 61245266 59214510
5271 59214510 56370341 52703114 48374875 44546366 42216434 41820696 42804993 44306485
5263D4306485J712871J920046J603112O98427l92834j356024j967906k506393
5255D4017784l061741l683159m034339m081928l859600l191518k256635j442794
5247A8406070k96354N87250J454650J302350O58395l40337j042119j941767k465167
5238A6322971k196860j677493j432694j309755j041899r38501o23073m22985m79443
5229F200268n35570j53077j49356q1416k32565j97792k28826j71883p4059o9437
5219D306287j69296j16199k67574j71684r8300j79972k75993j51721k36310o8225
5209B571013K9059j9413j48561q2480k13173N5909P3988q4527q5516j61738L9976
5198A974537p0503j58494l02581K23492q3752k34990M9753M1619O3173P8570j80828
$$ plain form
5263 44306485 46019356 47939402 49542514 50240941 49848107 48492083 46524177 44017784
5255 44017784 40956043 37272884 33238545 29156617 25297017 22105499 19848864 18406070
5247 18406070 18109716 18696966 20151616 21453966 22112361 21772024 20729905 18788138 16322971
5238 16322971 14126111 12448618 11015924 9706169 8664270 7725769 7102696 6679711 6200268
5229 6200268 5664698 5511621 5362265 5280849 5048284 4850492 4621666 4449783 4375724 4306287
5219 4306287 4136991 4020792 3753218 3581534 3483234 3303262 3027269 2875548 2639238 2571013
5209 2571013 2600072 2580659 2432098 2349618 2136445 2192354 2266342 2181815 2096299 1934561 1974537
5198 1974537 1904034 1745540 1442959 1666451 1582699 1347709 1397462 1439081 1502254 1580824 1399996
5187A399996o489l6996n2072j11313O3157k06047m5883J5749P6213k7841j828
5176A066646J11069K98424j8393m4405O9981R9498J43462r5250J4731R1522j03177
5165A634108j5268J58270n8145j09901K10280J18300j06885k2233J55360J02830
5155B066716N7750o0370K4177J11686r9776n4068l2352j37639J01621J67370j5949
5144B129166J07029K5512J52142p043L2988J48162J54050j11900J7704j99187
5134B448623m8148q7234o7809k00680n613J9550J82453k7010p7452j31983J11299
5123B115996J43371R0339j78452j11750J14828j3078k68636R7290J01964j77625
5113A914247j13102p7968R0070J33101j04817K9345K64153N333o9034j12688q4421
$$ plain form
5187 1399996 1393507 1356511 1304439 1193126 1256283 1050236 1004353 1020102 1096315 1068474 1066646
5176 1066646 1177715 1476139 1457746 1413341 1483322 1582820 1726282 1631032 1645763 1737285 1634108
5165 1634108 1618840 1777110 1718965 1609064 1819344 1937644 1830759 1808526 1963886 2066716
5155 2066716 2124466 2064096 2088273 2199959 2100183 2046115 2013763 1876124 1977745 2145115 2129166
5144 2129166 2236195 2261707 2413849 2406806 2439794 2587956 2742006 2630106 2647810 2448623
5134 2448623 2400475 2313241 2245432 2044752 2039139 2058689 2241142 2214132 2136680 2004697 2115996
5123 2115996 2259367 2349706 2171254 2059504 2174332 2161254 1892618 1989908 2091872 1914247
5113 1914247 1801145 1723177 1813247 1946348 1841531 1870876 2135029 2140362 2071328 1958640 1874219
5102A874219j75951P9132k11519j6225j11342j07338j10285J76179j76368j47536
5092A072966L2943K08788J67340J4394o5356P7865J04321j09879M0416M3745n9277
5081A528266l25202l0483n18j10641K7902J34999L5685n1036j5189K52564n2912
5070A393435l5285J794K74823j46331j96921n8728r9230M022R0615J66129N0996
5059A445319j39563o5627J88662K42595J33448k4052K29651p1696L2741j36977
5049A834501j5123j94642L8961J05398M8363m2575M4745j64735Q12J80660L03844
5038B140209R155J34569P2830J66431J43560j81782l9303L2023n2333j04866P752
5027B328245r1702j12192j13378L92449J54695J80649o2984J89923P7080M4982
$$ plain form
5102 1874219 1698268 1777400 1565881 1549656 1438314 1330976 1220691 1396870 1220502 1072966
5092 1072966 1105909 1314697 1482037 1496431 1431075 1508940 1613261 1503382 1543798 1587543 1528266
5081 1528266 1203064 1172581 1172063 1061422 1089324 1224323 1260008 1208972 1193783 1446347 1393435
5070 1393435 1358150 1359944 1634767 1488436 1291515 1232787 1133557 1137579 1228194 1394323 1445319
5059 1445319 1305756 1240129 1428791 1671386 1804834 1780782 2010433 1938737 1971478 1834501
5049 1834501 1819378 1624736 1663697 1769095 1817458 1774883 1819628 1654893 1655705 1836365 2140209
5038 2140209 2149364 2283933 2356763 2523194 2666754 2484972 2445669 2477692 2425359 2320493 2328245
5027 2328245 2236543 2124351 2010973 2403422 2558117 2738766 2675782 2865705 2942785 2987767
5017B987767J76626K69686K52913O9242n0911o8759k7486P0707Q8420k7621k4802
5006C715782k07082p6907l6529k23779l1274K01263P3093J24382K05467J3464
4996C757880J2975K50452J35791J12020K07619K38242K0526j00390m868r1968
4986D538279o290k36772m1063M9010k05329l8450R0797P2247Q7591J09077K72685
4975D691782K20750K5780J90791L55987O9330M7377K80940k15618j36869p1282
4965E458968q0246P6845J62793j6616P7746J32324N5984R5342J94708J20575J31690
4954F410113K89181K31584O4406P6111M00782K91120J79246K01775J51586O5997
4944H361901L13582K53771K22776L00221J77692K64151N45555K19959J898L23677
$$ plain form
5017 2987767 3164393 3434079 3686992 3756234 3705323 3636564 3609078 3679785 3768205 3740584 3715782
5006 3715782 3508700 3431793 3395264 3171485 3140211 3341474 3414567 3538949 3744416 3757880
4996 3757880 3770855 4021307 4157098 4269118 4476737 4714979 4735505 4635115 4630247 4538279
4986 4538279 4531989 4295217 4254154 4303164 4097835 4059385 4150182 4222429 4310020 4419097 4691782
4975 4691782 4912532 4938312 5129103 5485090 5554420 5601797 5882737 5667119 5530250 5458968
4965 5458968 5378722 5455567 5618360 5601744 5679490 5811814 5867798 5963140 6157848 6278423 6410113
4954 6410113 6699294 6930878 6995284 7071395 7472177 7763297 7942543 8144318 8295904 8361901
4944 8361901 8675483 8929254 9152030 9452251 9629943 9894094 10439649 10659608 10661506 10985183
4934A0985183K05340K00468K09580M47935J16866Q7160L24175M55633L34515M61728
4924A3828583N29026M43396K18435M94089L74019L86131M20745M77626M09657
4915A7581707M57154N49439L97450O44079N27079N79373P44653P69598N61452
4906B2811984Q31767J081795J255489J139943J458074J469885J601415J899039
4898C3549391K618375K786246L645410M525642O163555Q581515J1719526J4344990
4890H7934650J5366738J3164459Q689191M414101K084486J325884K257453M094182
4882A39331144N292894M691741L353856K628034K249738K512340L914395O261986
4874A70236128R592202J2841114J4326112J3945064J2509429J0436689P219041
$$ plain form
4934 10985183 11190523 11390991 11600571 12048506 12165372 12252532 12576707 13032340 13366855 13828583
4924 13828583 14357609 14801005 15019440 15513529 15887548 16273679 16694424 17172050 17581707
4915 17581707 18038861 18588300 18985750 19629829 20156908 20736281 21480934 22250532 22811984
4906 22811984 23643751 24725546 25981035 27120978 28579052 30048937 31650352 33549391
4898 33549391 36167766 38954012 42599422 47125064 53288619 61870134 73589660 87934650
4890 87934650 103301388 116465847 125155038 129569139 131653625 132979509 135236962 139331144
4882 139331144 144624038 149315779 152669635 155297669 157547407 160059747 163974142 170236128
4874 170236128 179828330 192669444 206995556 220940620 233450049 243886738 251105779
4867B51105779K853257k191138n467096p274737p972806o707774l453143K60281
4859B21152623L967979Q395877J2771205J6826193K0007018K2164947K3037680
4852C28323522K1887695J7903142J0909748J431870q361562j6050115k1029407
4845C35014893k2600008k1607751j8925518j6713198j4248544j2504177j0129577
4838B18286120p336016m753766k736761j256448n32903J98407O81058J119512
4830B03669203J301987J175993M6074o86049j222873j622045j947068k665339
4822A98049883l404665m700990o261862p471429q098520q527761q122636p342923
4814A44119097p009045o553897o243606o198853n957814n717535n520696n306300
$$ plain form
4867 251105779 253959036 251767898 246300802 239026065 231053259 224345485 220892342 221152623
4859 221152623 225120602 233516479 246287684 263113877 283120895 305285842 328323522
4852 328323522 350211217 368114359 379024107 380455977 372094415 356044300 335014893
4845 335014893 312414885 290807134 271881616 255168418 240919874 228415697 218286120
4838 218286120 210950104 206196338 203459577 202203129 201670226 201868633 202549691 203669203
4830 203669203 204971190 206147183 206193257 205507208 204284335 202662290 200715222 198049883
4822 198049883 194645218 189944228 183682366 176210937 168112417 159584656 151462020 144119097
4814 144119097 137110052 130556155 124312549 118113696 112155882 106438347 100917651 95611351
4806I5611351m775426m212583l839370l664026l507831l731097l935275l952393
4798F3993350l471286l111153k901079k401267k105076j849693j535060j059160
4790D5559576q37803o83486n87552o85145n49052m29069p63479p42505q82770
4781C9398715r88148j229542j184864j130176j027755j175162j332574j332319
4773B9998175j193169j436704j057781j139649j252238r13290o64574o74013q19192
4764B0847565m55049o94282o87212p18225m94902o58902m50572m73070m66610
4755A5748741q29450m44358o07315l11983k80963k81325m44936l49442m67229
4746A1731740j25743M600p4329m77380j69469r3785k72494l48215k13822j32335
$$ plain form
4806 95611351 90835925 86623342 82783972 79119946 75612115 71881018 67945743 63993350
4798 63993350 60522064 57410911 54509832 52108565 50003489 48153796 46618736 45559576
4790 45559576 44721773 44038287 43450735 42765590 42216538 41787469 41023990 40281485 39398715
4781 39398715 38410567 37181025 35996161 34865985 33838230 32663068 31330494 29998175
4773 29998175 28805006 27368302 26310521 25170872 23918634 23005344 22340770 21666757 20847565
4764 20847565 20392516 19698234 19011022 18292797 17797895 17138993 16688421 16215351 15748741
4755 15748741 14919291 14474933 13867618 13555635 13274672 12993347 12548411 12198969 11731740
4746 11731740 11605997 11610597 11536268 11058888 10889419 10795634 10523140 10174925 9961103 9828768
4736I828768k74060j62420l5576k02764k70174j21455j30393o3970j49095j68239
4726H250622j78295J058k99640p3227k8602p7311j50202j20948q8927j66807j54539
4715F913182r8901j29584J66685o4255j17375k27075l0883r4622K5911p7004m5607
4704F220472j55134J11163O0512K5966Q18N4285R4897o2244k8581K4706m3632
4693F303228l4651J31526K08173l7548K04998j25586k03155R9819l7876j30901
4683F378027j454m4505j60658J45392R1059R7033o7477p4202J25396O3983m14440
4672F138154m4922J4022m2381O954J36368K3424l7770J57383J51589l4294j4471
4661F454056N3098K10527j15289r1478K1356J3415j49068J3397J35952J99565
$$ plain form
4736 9828768 9554708 9392288 9356712 9153948 8883774 8762319 8631926 8567956 8418861 8250622
4726 8250622 8072327 8073385 7773745 7700518 7671916 7594605 7444403 7323455 7234528 7067721 6913182
4715 6913182 6814281 6684697 6851382 6787127 6669752 6442677 6411794 6317172 6343083 6266079 6220472
4704 6220472 6065338 6176501 6237013 6262979 6263797 6318082 6412979 6350735 6322154 6346860 6303228
4693 6303228 6268577 6400103 6608276 6570728 6775726 6650140 6446985 6546804 6508928 6378027
4683 6378027 6376573 6332068 6171410 6316802 6407861 6504894 6437417 6363215 6488611 6552594 6138154
4672 6138154 6093232 6107254 6064873 6071827 6208195 6231619 6193849 6351232 6502821 6468527 6454056
4661 6454056 6507154 6717681 6602392 6510914 6532270 6545685 6396617 6410014 6545966 6745531
4651F745531j22813r3252l5771l2212K49678J38080j11812O1762k14077p5901
4641F509213J00974j7183j3607K76556K05161J65318J78903J24456K29793L34654
4631H094238N49573M94880O62778L67374O68733P61591J061223J433620J878627
4622A5972637K645105M125266O673444R958368J2197004J2171762R216992M016298
4614G6976876j408730n189773p335352p174748n009404k080953J518676N694344
4606E5990936Q644353R119754O463164J498396k810512n953791o874510n247056
4598F0830734j690914K341526N321041N973436L664793O4603l512328o243764
4590F6749127p263482o811853n088549k259423Q48505M636074P068501P068170
$$ plain form
4651 6745531 6622718 6529466 6493695 6461483 6711161 6849241 6737429 6799191 6585114 6509213
4641 6509213 6610187 6593004 6579397 6855953 7061114 7226432 7405335 7529791 7759584 8094238
4631 8094238 8643811 9138691 9801469 10168843 10837576 11599167 12660390 14094010 15972637
4622 15972637 18617742 22743008 29416452 39374820 51571824 63743586 72960578 76976876
4614 76976876 75568146 70378373 63043021 55868273 50858869 48777916 50296592 55990936
4606 55990936 64635289 73755043 80218207 81716603 78906091 72952300 66077790 60830734
4598 60830734 59139820 61481346 66802387 72775823 76440616 76505219 72992891 66749127
4590 66749127 59485645 52673792 47585243 45325820 46174325 50810399 57878900 64947070
4582F4947070M161095j03701m327194o799170q222336p486098o224505n292373
4574C0652788m912974l860840k820806k146490j605968r89096q15149o14826n08173
4565A2378466m10281l91642k48718j63032k61390l2542l24197k97798m97745l60048
4555I391073m36856j63303l12108l96482k96796p9643m14935j90882j65619j67564
4545F766885j66113p19m6805m7905l08772j51640q6545q4290j79415k01402j43018
4534E350261k17921j97473k06178k28110j66924q6958k0025m6335j38012k03716
4524C838609j76489j64510k3031L4713J6547o4527k36767k65030J5008l4255M5898
4513B986166n8148L9360j59662k56121K8263J25141p6862j21509q3225o696M5188
$$ plain form
4582 64947070 69108165 69004464 64677270 57878100 49655764 42169666 35945161 30652788
4574 30652788 25739814 21878974 19058168 16911678 15305710 14316614 13501465 12886639 12378466
4565 12378466 11968185 11576543 11327825 11164793 10903403 10870861 10546664 10248866 9751121 9391073
4555 9391073 8954217 8790914 8478806 8082324 7785528 7705885 7290950 7100068 6934449 6766885
4545 6766885 6600772 6600053 6553248 6505343 6196571 6044931 5958386 5874096 5694681 5493279 5350261
4534 5350261 5132340 4934867 4728689 4500579 4333655 4246697 4226672 4180337 4042325 3838609
4524 3838609 3662120 3497610 3474579 3509292 3525839 3461312 3224545 2959515 2974523 2940268 2986166
4513 2986166 2928018 2967378 2807716 2551595 2579858 2704999 2628137 2506628 2423403 2416707 2461895
4502B461895M7226j50496J1498j38862j67768J17039K8501j61330m6948J00475
4492B101230j07637J39798Q6022J99665l7124j2582j07431R4625n3407q722q8116
4481B206321j34222j58012k6127o777L4594R5509O762J02426N6945m003J2032
4470B185448J00730K9526N7239j3739J39962J10256q5350l9979J12876o285j83559
4459B407125j62342J21384j54235l1337l5662J6401q1532N4035K12560R8185P3510
4448B518092J4797K60806J14805J61824J40918K76057K42241J88384K4199j8707
4438C923416r5600j34867m83532j25471j06288j61925m4349J9736q1237J5246
4428B725129p3937J08171K5186j12230N5323P4804n4486q7111J05694P9384o6013
$$ plain form
4502 2461895 2509121 2358625 2370123 2231261 2063493 2180532 2209033 2047703 2000755 2101230
4492 2101230 1993593 2133391 2219413 2419078 2381954 2369372 2261941 2356566 2303159 2294437 2206321
4481 2206321 2072099 1914087 1887960 1881183 1915777 2011286 2018048 2120474 2177419 2173416 2185448
4470 2185448 2286178 2315704 2372943 2359204 2499166 2609422 2524072 2484093 2596969 2590684 2407125
4459 2407125 2244783 2366167 2211932 2180595 2144933 2161334 2079802 2133837 2346397 2444582 2518092
4448 2518092 2532889 2793695 2908500 3070324 3211242 3487299 3729540 3917924 3942123 3923416
4438 3923416 3827816 3692949 3209417 3083946 2977658 2815733 2771384 2791120 2709883 2725129
4428 2725129 2651192 2759363 2784549 2672319 2727642 2802446 2747960 2660849 2766543 2845927 2779914
4417B779914l1563J26200J7896P8464m4495Q7185o975K8822n7993Q8636N7759
4406C123850q0703j31026J86171N8219j42717O5108J90009l7087k15496P8796
4396C095124J25026J2062J4618r2199l0689R1469J40445J44490R833n8797J25637
4385C577019J58435m7757k70554m2023K6537k20440o6231K8214j78592q8984Q1335
4374B956959N1127j18779j25857O3900J4311l0225k2475J15612j24015k1799j34590
4363B624169J48472N4675p5317k61700K611J2408o148o6406O4263L8842J04302
4352B640171J2247j19236k68884R5351N7520P2784o8523p8479k1225j23961P8628
4341B276393o8303J68665N6778K41528j46420p4854Q4639J58527k08994J58643
$$ plain form
4417 2779914 2748351 2874551 2892447 2970911 2926416 3013601 3006626 3035448 2977455 3066091 3123850
4406 3123850 3043147 2912121 3098292 3156511 3013794 3078902 3268911 3231824 3016328 3095124
4396 3095124 3220150 3232212 3246830 3154631 3123942 3215411 3355856 3500346 3510179 3451382 3577019
4385 3577019 3735454 3687697 3417143 3375120 3401657 3181217 3114986 3143200 2964608 2875624 2956959
4374 2956959 3008086 2889307 2763450 2827350 2841661 2811436 2788961 2904573 2780558 2758759 2624169
4363 2624169 2772641 2827316 2751999 2490299 2492910 2505318 2499170 2432764 2497027 2535869 2640171
4352 2640171 2652418 2533182 2264298 2359649 2417169 2489953 2421430 2342951 2321726 2197765 2276393
4341 2276393 2208090 2376755 2433533 2675061 2528641 2453787 2538426 2696953 2487959 2646602
4331B646602J45187Q9648l78886o3317M1781J21573J7707P7748K8557q1472o0004
4320B585124N3680J55587j57281p6548K09936K10768n2119L570J01785J71375
4310C205877K7423J63565J66663J87055k28527j09504j7089j73542m7612K06724
4300C381033o92J51256J64131m241l2474j84249L1910N0086K53663N5539M0600
4289C906562P6382Q4069J78344K54591r5279j94928n8919N5729k0690k7554l4997
4278D123310J60328K59451J73705K59395K58651K5764k41784N4146L9217N61j10440
4267E002304j53012j19654p6072j37663j5598J1352J0885K06520K54134l9749
4257D943447j07604J36198k2662j25257m9461j23355q026j06366j36564j41207
$$ plain form
4331 2646602 2791789 2881437 2502551 2439234 2481015 2602588 2620295 2698043 2726600 2645128 2585124
4320 2585124 2638804 2794391 2637110 2560562 2770498 2981266 2929147 2932717 3034502 3205877
4310 3205877 3233300 3396865 3563528 3750583 3522056 3412552 3395463 3221921 3174309 3381033
4300 3381033 3380341 3531597 3695728 3691487 3659013 3474764 3506674 3556760 3810423 3865962 3906562
4289 3906562 3982944 4067013 4245357 4499948 4404669 4209741 4150822 4206551 4185861 4158307 4123310
4278 4123310 4283638 4543089 4716794 4976189 5234840 5260604 5018820 5072966 5112183 5112744 5002304
4267 5002304 4849292 4729638 4653566 4515903 4500305 4511657 4522542 4729062 4983196 4943447
4257 4943447 4835843 4972041 4949379 4824122 4774661 4651306 4643280 4536914 4400350 4259143
4247D259143J4904J0254j46734N3308P8042Q0124k5980j4720J49971j32410O1834
4236D387736J87969K49804j19668o3342K91956J30119j04501J73867K19961J58010
4226E511911M6932J52924Q8205K63222M25924K89292J40299K49066M73137K89051
4216G929963M46756K46388L41055M59939P43758O43208P63318R16446J320939
4207A3811770J174994J261453J383793J461769J431620J493283J334775R19506
4199B4272963M00997P8932j56440j74786j15021M08522O10732P07589J134290
4190B7167778J438655J211834R50311Q69082N55899P73402Q23348J320072J220228
4181C6330609J475514J475690J684860J546238J489030J881173K399407K438431
$$ plain form
4247 4259143 4274047 4284301 4137567 4190875 4268917 4349041 4323061 4308341 4458312 4325902 4387736
4236 4387736 4575705 4825509 4705841 4642499 4934455 5064574 4960073 5133940 5353901 5511911
4226 5511911 5558843 5711767 5799972 6063194 6489118 6778410 6918709 7167775 7640912 7929963
4216 7929963 8376719 8623107 8964162 9424101 10167859 10811067 11574385 12490831 13811770
4207 13811770 14986764 16248217 17632010 19093779 20525399 22018682 23353457 24272963
4199 24272963 24673960 24752892 24596452 24421666 24306645 24715167 25325899 26033488 27167778
4190 27167778 28606433 29818267 30768578 31637660 32193559 32966961 33790309 35110381 36330609
4181 36330609 37806123 39281813 40966673 42512911 44001941 45883114 48282521 50720952
4173E0720952K483678K115667J285010N18865j59419k41104J87956J132861J979865
4164F0024331K919389L523460L097106K102367J088366J97962j43731l9748N66014
4155G3335516P01239O11603O94674J164693J553683J810428J899148K013742J707033
4146H5491759J185021Q53646K51548j50387p73323o38057l67345M92538J410447
4137H7755847K726686L561846L857126L694446L342034K766860K688892L154756
4129A13548493L697093L834815L398332K673433K584374K966914L026742K245382
4121A37975578J434698P01856Q0238j21396k40156K08690K30531N21656N14322
4112A41306017Q87191Q58655J243873J623569K211646K614619K994994K694782
$$ plain form
4173 50720952 53204630 55320297 56605307 57124172 56964753 56723649 56911605 58044466 60024331
4164 60024331 62943720 66467180 69564286 71666653 72755019 72952981 72809250 72769502 73335516
4155 73335516 74036755 74648358 75343032 76507725 78061408 79871836 81770984 83784726 85491759
4146 85491759 86676780 87530426 87781974 87631587 86858264 86220207 85852862 86345400 87755847
4137 87755847 90482533 94044379 97901505 101595951 104937985 107704845 110393737 113548493
4129 113548493 117245586 121080401 124478733 127152166 129736540 132703454 135730196 137975578
4121 137975578 139410276 140112132 140192370 140070974 139830818 140039508 140270039 140791695 141306017
4112 141306017 142193208 143051863 144295736 145919305 148130951 150745570 153740564 156435346
4104A56435346K212873J709604J543868J638523J902983K104174K270744K063174
4096A71881289J744040R82049k58740j137172j763180j657941j355707r43420
4088A67491218j154493j455998j757506j528613j694991k298356l516671m389174
4080A49695416m891631m481355l498819k314967j430721j210139r71339r40763
4072A29955682j078759j569814j973639k228446k366187k625945k539002k596013
4064A12977877k644860k899181l075254k902160k541744j935207p52081n2294
4056I6175096K25625k64100j389574k982014l883108m657720m325302l229214
4048G5669689k025459q68939l2715K45350J88972m75200j700105k276272k616567
$$ plain form
4104 156435346 158648219 160357823 161901691 163540214 165443197 167547371 169818115 171881289
4096 171881289 173625329 174607378 174348638 173211466 171448286 169790345 168434638 167491218
4088 167491218 166336725 164880727 163123221 161594608 159899617 157601261 154084590 149695416
4080 149695416 144803785 140322430 136823611 134508644 133077923 131867784 130896445 129955682
4072 129955682 128876923 127307109 125333470 123105024 120738837 118112892 115573890 112977877
4064 112977877 110333017 107433836 104358582 101456422 98914678 96979471 96227390 96175096
4056 96175096 96400721 96136621 94747047 91765033 87881925 83224205 78898903 75669689
4048 75669689 73644230 72775291 72742576 72987926 73176898 72701698 71001593 68725321 66108754
4039F6108754k774682k854731k748047k526465k444213k099260j949906j514836
4031D7196614j023383q26587n68071o06396p64234j548745j597628j747376j730656
4022C6783538j478197q64998n08261l78581m46333n21752p13758q28816j080684
4013B9962158j094690q94919r90556j272945r72686j099183j108668j220757j275491
4004B0032263j168213j023346j223511r33077n80658o14965n51691k39671l92367
3995A3304764n85569o20683k26653k34418m21460k92102k52478l38054l97220
3986I936127k40915l64117O083j37356p2447k05236j32277n59504k85455M4392
3976G989295J62473j98535k25701o5689k51867l54052j5501K1428j47869k10318
$$ plain form
4039 66108754 63334072 60479341 57731294 55204829 52760616 50661356 48711450 47196614
4031 47196614 46173231 45346644 44778573 44172177 43407943 41859198 40261570 38514194 36783538
4022 36783538 35305341 34440343 33932082 33553501 33107168 32585416 31871658 31042842 29962158
4013 29962158 28867468 27972549 26981993 25709048 24736362 23637179 22528511 21307754 20032263
4004 20032263 18864050 17840704 16617193 15684116 15103458 14488493 13936802 13697131 13304764
3995 13304764 12719195 12098512 11871859 11637441 11215981 10923879 10671401 10333347 9936127
3986 9936127 9695212 9331095 9337178 9199822 9127375 8922139 8789862 8230358 7944903 7989295
3976 7989295 8151768 7953233 7727532 7661843 7409976 7055924 7040423 7061851 6913982 6703664
3966F703664K582j26172j73001k32831j32787L6970p4797N8927k147k69343k77368
3955E513697R5450k09047p1624K7187J86870r1916j77862j80509l7744j45295
3945D909207k5281N6921m4303j30653j38277j0491l5486p053J25779J31812J28615
3934D960790j17993j56610K43104l4491j19900L7430J50194L9319j34337m4827
3924D822679J7289l33171n2185J35003J3450j38196j11114l3070m3805j2069k5255
3913D239556J12668N5737j09935j07241j3362j72139j10K9359N7613L6085K5804
3902D154035j1391P9123Q9466Q8396O1123j07222K2682J23822j69398k3164p8598
3891D228874n0275J06394j05R7293j24381j17284m7617J73378q138r591j9210
$$ plain form
3966 6703664 6706246 6580074 6407073 6174242 6041455 6078425 6003628 6062555 6060408 5791065 5513697
3955 5513697 5609147 5400100 5328476 5355663 5542533 5450617 5272755 5092246 5054502 4909207
3945 4909207 4883926 4940847 4896544 4765891 4627614 4617123 4581637 4574584 4700363 4832175 4960790
3934 4960790 4842797 4686187 4929291 4894800 4774900 4812330 4962524 5001843 4867506 4822679
3924 4822679 4839968 4506797 4454612 4589615 4603065 4464869 4353755 4320685 4276880 4264811 4239556
3913 4239556 4352224 4407961 4298026 4190785 4177423 4005284 4005174 4034533 4092146 4128231 4154035
3902 4154035 4142644 4221767 4311233 4399629 4460752 4353530 4376212 4500034 4330636 4307472 4228874
3891 4228874 4178599 4284993 4284888 4382181 4257800 4140516 4092899 4266277 4258139 4248548 4229338
3880D229338J07689l8048l1128M5909l5742p8663L1003J28778j29264j45665K07913
3869D292120J73513j55687r9015N9283j30128N4931J07274l2849j11246k01239
3859C956957K49611N2990K0757L6443J05995k85566r9691J09445L7277O6139k4720
3848D225637O1396J01249L3677j22211J53181m308J2861k1237M4124M8220N7684
3837D590273k10009J10620J53076k38460J07061L33722j1193m2838J19869J45665
3827E057786J31410J98614L17024K59280N0681K00870O12865M22226O50686R41233
3817H842675J096657J444851J721495J875281K083013J811582J528803R98203
3809B1402560j20533q59554j375288j585514j580662j654269j686195j416109
$$ plain form
3880 4229338 4337027 4298979 4267851 4313760 4278018 4199355 4230358 4359136 4229872 4084207 4292120
3869 4292120 4465633 4309946 4210931 4270214 4140086 4195017 4302291 4269442 4158196 3956957
3859 3956957 4206568 4259558 4280315 4316758 4422753 4137187 4037496 4146941 4184218 4250357 4225637
3848 4225637 4287033 4388282 4421959 4299748 4452929 4448621 4461482 4440245 4484369 4532589 4590273
3837 4590273 4380264 4490884 4643960 4405500 4512561 4846283 4835090 4792252 4912121 5057786
3827 5057786 5189196 5387810 5704834 5964114 6014795 6215665 6828530 7250756 7901442 8842675
3817 8842675 9939332 11384183 13105678 14980959 17063972 18875554 20404357 21402560
3809 21402560 21282027 20422473 19047185 17461671 15881009 14226740 12540545 11124436
3801A1124436j260523j122236p99568q44367o43778l41360k64436l41713k75967
3792E230488k29005k84102n8737k09177n3857j13687j30655m0769M8861j65220
3782C994140p4279J06824m8651n8026J7748K0404j80951o5742j78838K2696q0948
3771C474377j02815o9305j33015n2254J7000q9216N9184k5726O8811j92205N8831
3760C013667j31865o3535K830O826n2960m0787J49572j29684m1501j3127M1019
3749B740455K7606j13286k285q700r8323L3333q0787o8983r7195l0230J68311
3738B469916j11728j73795J44179n9508l3568N4088K27449k16367J37326P0799
3728B508791j6600j08140J20788N7025k01444m8205O9255r0267j92578O2364O2442
$$ plain form
3801 11124436 9863913 8741677 7942109 7097742 6453964 6112604 5848168 5506455 5230488
3792 5230488 5001483 4717381 4658644 4449467 4395610 4281923 4151268 4110499 4159360 3994140
3782 3994140 3919861 4026685 3978034 3920008 3937756 3958160 3777209 3711467 3532629 3555325 3474377
3771 3474377 3371562 3302257 3169242 3116988 3133988 3044772 3103956 3078230 3147041 2954836 3013667
3760 3013667 2881802 2818267 2821097 2827923 2774963 2734176 2883748 2754064 2712563 2699436 2740455
3749 2740455 2768061 2654775 2652490 2643790 2545467 2578800 2498013 2429030 2331835 2301605 2469916
3738 2469916 2358188 2184393 2328572 2269064 2235496 2289584 2517033 2300666 2437992 2508791
3728 2508791 2492191 2384051 2504839 2561864 2360420 2312215 2381470 2291203 2098625 2160989 2223431
3717B223431K19328n7554J34367j22385k1325J79683J47525q028O0692Q2439m8222
3706B789951m6371l1158k00936j4960j21490p7798L1403R5412O2735j94292J8662
3695B311158J06621J53592j7946l1092r8327m066k9529L5229L9944o0352L3818
3684B439050R8158j15565j84661J33618j1466J06053O0691j08433m27N5801k2752
3673B450067k3159N2582l8623N5552N026j40224p9161P1798J45040k58921k03901
3662B036076L0093J61488m7589j80350N3861M1917R2440Q7435J18437k77881J77644
3651B293571M7976K8945K1911J37929M2768P3160l319r301k7522p8385k5736j0607
3639B491390K0588j3943o4602K1127k05654K02386K13676j00701q8710N6836j39964
$$ plain form
3717 2223431 2442759 2385205 2519572 2397187 2375862 2555545 2703070 2695042 2755734 2838173 2789951
3706 2789951 2743580 2712422 2511486 2496526 2375036 2297238 2328641 2424053 2486788 2292496 2311158
3695 2311158 2417779 2571371 2553425 2522333 2424006 2419940 2390411 2425640 2465584 2405232 2439050
3684 2439050 2537208 2421643 2236982 2370600 2359134 2465187 2525878 2417445 2417018 2472819 2450067
3673 2450067 2426908 2479490 2440867 2496419 2501445 2361221 2282060 2353858 2498898 2239977 2036076
3662 2036076 2066169 2227657 2180068 1999718 2053579 2095496 2187936 2275371 2393808 2115927 2293571
3651 2293571 2341547 2370492 2392403 2530332 2573100 2646260 2642941 2633640 2606118 2527733 2501997 2491390
3639 2491390 2511978 2498035 2433433 2454560 2248906 2451292 2664968 2564267 2475557 2532393 2392429
3628B392429l6175K86535O1512n0557m1280K03514j26794o6406r1863L17463O9816
3617B918194r3522K8404m0246K6545j12683j60653J0356K15075j54426j06495
3607B530549O0192k41309O5502K40471J79710M7261J2276K3303M29252r1014j09036
3596C147157L34919J92304m4180J3687M2865P5444j5746N320L53625J60803P909
3585D274107J60303j59935K8049J74181K05043J88583J7887J3351J03727J10352
3575E115648k7604K9578Q7130L42931K03185Q5413J40943J19805J18655K09025
3565F424709K54615J45143M20504L5385q1343M59806L72574K43139M27862N04609
3555I207003M86817Q08350P76153O92367Q16895Q22376J183081J029510N63711
$$ plain form
3628 2392429 2356254 2642789 2704301 2653744 2612464 2815978 2689184 2622778 2530915 2848378 2918194
3617 2918194 2824672 2853076 2812830 2839375 2726692 2566039 2576395 2791470 2637044 2530549
3607 2530549 2590741 2349432 2414934 2655405 2835115 2882376 2894652 2917955 3347207 3256193 3147157
3596 3147157 3482076 3674380 3630200 3643887 3686752 3762196 3746450 3751770 4105395 4266198 4274107
3585 4274107 4434410 4274475 4302524 4476705 4681748 4870331 4888218 4901569 5005296 5115648
3575 5115648 5088044 5117622 5204752 5547683 5750868 5836281 5977224 6097029 6215684 6424709
3565 6424709 6679324 6824467 7244971 7280356 7199013 7658819 8031393 8274532 8702394 9207003
3555 9207003 9693820 10502170 11278323 11970690 12787585 13609961 14793042 15822552 16386263
3546A6386263N27893L29175n4826k9265j18319m78995o56489p42502o67988n95809
3536A3899138n92233m82521l27940o83992q22042l48929m06787n94158n90581
3527I049955l32011l62268n14861l89067l60801l84071l36937k73479l04312k40438
3517E551710k70422j14729j82008k61146k71455j33795P9963j20055l31991k10865
3507C735207p2811k33409j21527M5694k7942q4384j26779p719p0098J21236Q3482
3496C240950J35965j97424j14702M801M3175j34814j02278q581K4659k0975L1890
3485B902666j20860j25663L9810R0206l3315p1942k0441N7334k06837k48252r3026
3474B169680q711L8582J1224M8696r9764j07436k72668Q4235K49401Q0931l6146
$$ plain form
3546 16386263 16914156 17243331 17188505 17159240 17040921 16561926 15905437 15162935 14494947 13899138
3536 13899138 13306905 12824384 12496444 11812452 10990410 10641481 10234694 9640536 9049955
3527 9049955 8717944 8355676 7840815 7451748 7090947 6706876 6369939 6096460 5792148 5551710
3517 5551710 5281288 5166559 4984551 4723405 4451950 4318155 4398118 4278063 3946072 3735207
3507 3735207 3662396 3428987 3307460 3353154 3325212 3240828 3114049 3106330 3036232 3157468 3240950
3496 3240950 3376915 3179491 3064789 3069590 3112765 2977951 2875673 2867092 2891751 2870776 2902666
3485 2902666 2781806 2656143 2695953 2786159 2752844 2680902 2660461 2717795 2510958 2262706 2169680
3474 2169680 2160969 2199551 2210775 2259471 2159707 2052271 1779603 1863838 2113239 2194170 2158024
3463B158024m4441j33453r9422N4766L1925k2906k13574l8356o7087k29890N6384
3452A451970J9949j3418J06143N3457r2911j6916n0201j70808r6282P4436J50524
3441A415943M9738j49244o8126j24238j81958r3989J33479J66963J77790j30123
3431A196235k25494j6762J09045l1935J71977J41647j18292j29381l6004M242
3421A065278j0660J40658Q7461J62188L7057l57318j6879m63m4645L4555J66969
3410A264201K7833j80824Q486J39745P6471o2262n3530P8304n77o4391j24431
3399A109025j36127k8677J72842n5504M5259O1005j41761k13177k3702L6924J18690
3388I44797M1657l7567O0098l4961r1281p691R7488j616k2090O8367L1968j56977
$$ plain form
3463 2158024 2113583 1980130 1880708 1935474 1967399 1944493 1730919 1692563 1625476 1395586 1451970
3452 1451970 1471919 1458501 1564644 1618101 1525190 1508274 1458073 1287265 1190983 1265419 1415943
3441 1415943 1465681 1316437 1248311 1124073 942115 848126 981605 1148568 1326358 1196235
3431 1196235 970741 953979 1063024 1031089 1203066 1344713 1226421 1097040 1061036 1065278
3421 1065278 1054618 1195276 1282737 1444925 1481982 1124664 1107785 1107322 1062677 1097232 1264201
3410 1264201 1292034 1111210 1119696 1259441 1335912 1273650 1220120 1298424 1297847 1233456 1109025
3399 1109025 972898 944221 1117063 1061559 1106818 1167823 1026062 812885 789183 826107 944797
3388 944797 986454 948887 1008985 974024 882743 875052 972540 970924 948834 1017201 1049169 892192
3376H92192r8937j53856K11806J24869l5081j24958n6202j9043K1789N7646K1472
3365H41697J4661q0554j58128J97623p6557m6626J79193J43527j03113K7370j19268
3354H19825q7014J20646J21834p5931L8233j9873r2743Q0356J02560k9957j41823
3343H36113r7364r729K01878Q3891j22971j38526Q545q3612J19058J01489K8982
3332I27754m7147j76723J50407j2896k36846J36620K9245j04494r1932R0036J83911
3321H47935Q4628M9004j14184J4853m175n2656N7829J15010j05318j52388J23384
3310H63922J03353p9799N789j04623j41217m6766j8835J31408M2335p0118j21638
3299E63811R3004R1680j16387m6105J84158j53207L2083R1326J46972m7388R4481
$$ plain form
3376 892192 793255 639399 851205 976074 940993 816035 759833 740790 762579 820225 841697
3365 841697 856358 775804 617676 815299 738742 692116 871309 1014836 911723 939093 819825
3354 819825 732811 853457 975291 899360 937593 917720 824977 905333 1007893 977936 836113
3343 836113 738749 729020 930898 1014789 891818 753292 761837 678225 797283 898772 927754
3332 927754 880607 703884 854291 841395 604549 741169 770414 665920 573988 664024 847935
3321 847935 932563 981567 867383 882236 878061 825405 883234 998244 892926 740538 863922
3310 863922 967275 887476 893265 788642 647425 600659 581824 713232 755567 685449 563811
3299 563811 656815 748495 632108 586003 770161 616954 649037 740363 887335 839947 934428
3288I34428N8806j52416r8184J78647k6178J08654k9704k08965L564j08J9337
3277G87881J02949K6074j86279N6267J65712J0719k2158q275m1620j04232q357
3266G78681K07809J2181r2660p5575n8961n9643J16153J32783m5433O9350p6992
3255I07693N8880Q0383J88397k4589k2258N0358K0767J02055N872R5757p7449
3244A385866K3343L3970K09104J46540Q8489q4925L34617J27466J61944L40725
3234B767139L75356K12637L08944J01261M08101L77562L76216J62428J84610j70424
3224E103830l3312k1418J59902J06460k01435n8334R3252l8989k1088q664O9081
3213E149285j06337j44612J37095O4942K51733j39322J68135R3255L42754N06919
$$ plain form
3288 934428 993234 840818 742634 921281 895103 1003757 974053 765088 768652 768544 787881
3277 787881 890830 916904 730625 786892 952604 963323 941165 932890 891270 787038 778681
3266 778681 986490 998671 906011 830436 771475 711832 827985 960768 915335 984685 907693
3255 907693 966573 1046956 1235353 1210764 1188506 1238864 1259631 1361686 1367558 1463315 1385866
3244 1385866 1409209 1443179 1652283 1798823 1887312 1802387 2137004 2264470 2426414 2767139
3234 2767139 3142495 3355132 3664076 3765337 4173438 4551000 4927216 5089644 5274254 5103830
3224 5103830 5070518 5049100 5209002 5315462 5114027 5055693 5148945 5109956 5088868 5080204 5149285
3213 5149285 5042948 4898336 5035431 5100373 5352106 5212784 5380919 5474174 5816928 6323847
3203F323847R66328R99006J276137J329189J322569O72606l4276p03096r89606
3194A1162704j434275j136223p64239p16652n60547m70867n43172k97525j46168
3185E093036j90981j72182q2382p5272j17999M413O1753j8366j21652K9892J60402
3174D570662K15975K09383J97061K65038J14990J80583K28222j64273j64708j00824
3164E552109j61178n32715n69247k74059m11545l32677j40664j6187l70114k99002
3154B444721J9657o4634q5241o5520j20973l51364M8695R5364j45044o3506j66094
3143A546061j98720J48828J89699J5821l32535k01267J24379R2995j85901J71297
3133A370657r1504k54645m5537J76272r6817k27669L616O3885m988J00893N2333
$$ plain form
3203 6323847 7290175 8289181 9565318 10894507 12217076 12889682 12855406 12152310 11162704
3194 11162704 9728429 8592206 7827967 7111315 6550768 6079901 5536729 5239204 5093036
3185 5093036 4902055 4729873 4647491 4572219 4454220 4458633 4520386 4502020 4380368 4410260 4570662
3174 4570662 4786637 4996020 5193081 5458119 5573109 5753692 5981914 5817641 5652933 5552109
3164 5552109 5390931 4858216 4288969 4014910 3603365 3270688 3130024 3113837 2743723 2444721
3154 2444721 2464378 2399744 2314503 2248983 2128010 1776646 1825341 1920705 1775661 1712155 1546061
3143 1546061 1347341 1496169 1685868 1701689 1369154 1167887 1292266 1385261 1199360 1370657
3133 1370657 1279153 1024508 978971 1155243 1058426 830757 834373 898258 893270 994163 1046496
3122A046496j9548k48807j28246J77135J78092j06247j34490j54684j15737M6960
3112E40924J25035M0484P8857l5127o484p8932K3192q9109q1330L17898O0553
3101H95961j29080j51548L0143j89071j09621K42676P5243r5686r7653J18565
3091E89929P6279r8613L4749j85293Q2447P8993Q3240R456j28121k47594J24622
3080D20094N6039k938k03226N7138q8612R9618J07862j4052J24026m5362j2984
3069D97603J01729q8066k6338l617j04600j57574R2097j6684J0917O6637j56235
3058B15869Q4222p806l9915J3410K7744P1855P8244J4786r2018q3948O4919j8092
3046C29270J33947o7913j95645L6608L7348k8070p535o7055K00869k0273j19068
$$ plain form
3122 1046496 1026948 778141 649895 827030 1005122 898875 764385 609701 493964 540924
3112 540924 665959 706443 785300 750173 743689 664757 687949 598840 517510 835408 895961
3101 895961 766881 615333 645476 456405 346784 589460 664703 569017 471364 589929
3091 589929 666208 567595 602344 417051 499498 578491 661731 671187 543066 295472 420094
3080 420094 476133 473195 269969 327107 238495 338113 445975 431923 555949 510587 497603
3069 497603 599332 511266 484928 481311 376711 219137 311234 294550 305467 372104 215869
3058 215869 300091 292285 252370 265780 293524 365379 443623 458409 366391 282443 347362 329270
3046 329270 463217 395304 199659 236267 273615 245545 238010 170955 371824 351551 232483
3035B32483O9165J15256k09091j62888n117J02142J68601l5934q9181j43862J2475
3024E4049P5429K50600j57126k28635J20584J52340K2073k04986J7465J2276J95437
3013C09506m4248N4770j04348j56568k2536L2355K03684J51971n5464m8730k4788
3002B95604j95393P7087K64612j13438j71971l6403K02686P7086j54656p7966
2992A67248N5607J66408L5933k1905l5718p0130n5851J37269J15241j43579j1295
2981C39228J35882p9636j26857J82013p4453j71038q4780P9098M0192Q1207k2785
2970B98071j32335j32675O2097L10505J6403k33490L4322Q563L8936j6140n9783
2959A94474o8814N4990J53261j01222k6595n8963N6605l8287Q8309m5784M9421
$$ plain form
3035 232483 301648 416904 207813 44925 39808 141950 310551 274617 185436 41574 54049
3024 54049 129478 380078 222952 -5683 114901 267241 289314 84328 101793 114069 309506
3013 309506 265258 320028 215680 59112 36576 68931 272615 424586 369122 320392 295604
3002 295604 100211 177298 441910 328472 156501 120098 322784 399870 245214 167248
2992 167248 222855 389263 425196 403291 367573 297443 241592 378861 494102 350523 339228
2981 339228 475110 395474 268617 450630 376177 205139 120359 199457 239649 320856 298071
2970 298071 165736 33061 95158 405663 422066 188576 222898 231461 270397 254257 194474
2959 194474 125660 180650 333911 232689 206094 147131 203736 165449 253758 207974 257395
2948B57395j86836Q1288m2361q4237j7683K38452k29963j86863K47830J16060
2938A93082p3894m9017r5048N9984P9741p1170p196Q3864k6074J8528Q8233r803
2926A91230M6671j52049M4055j8802j67786j56289J21109J13253J29754J1910
2916A63056J90801K3075j25023j35995J49873J06567p2475K7011k52928M6634
2906A20596M5703m5630k4074J5033j37528J47424N3420L4784k8326k16991R3534
2895E7945K51944j18910O8479M4258j19031m2551o7846L8854O0017j27314j43550
2884i7705Q9353J51012J14523k22410n460J00791J28389p367J03569j57657k75026
2873g7988p0423J03987J07145o3111j10421J25327J33658j00944j2057K3244Q5399
$$ plain form
2948 257395 70559 151847 109486 25249 7566 246018 16055 -170808 77022 193082
2938 193082 119188 70171 -24877 35107 114848 43678 36482 120346 94272 112800 201033 191230
2926 191230 237901 85852 129907 111105 -56681 -212970 -91861 21392 151146 163056
2916 163056 353857 376932 251909 115914 265787 372354 299879 326890 73962 120596
2906 120596 166299 120669 96595 111628 -25900 121524 174944 209728 181402 -35589 57945
2895 57945 309889 190979 259458 303716 184685 142134 74288 113142 173159 45845 -97705
2884 -97705 -8352 142660 257183 34773 29313 130104 258493 251126 354695 197038 -77988
2873 -77988 -148411 -44424 62721 -390 -110811 14516 148174 47230 35173 58417 143816
2862A43816k3557J50386n5186n8277L7830l27271o5161K51515J13548k31060o0171
2851a23588q076N7913m992J08113N4096p5150j5162K77121j71525r7869r7728
2840i6847J83310R5944j05325j39589p963J9635k3364l1633J29255J50856J7926
2829A92205l5480j2499P2957m1655n2239o8341J20731j9483K4870k1562M8088
2818B07592l40725J74123J87125J03193k59772N9493K1848J49042j42134r3639
2808F6146j4461J15616J1086N01M0204L2910j04574j24515J17652J59308P6412
2797C76285k10683n8304l1482Q4533m1908K5238l5688o1535J7514K49321j00830
2786B12461N458k54555J31305J86908r0142j98352J88542r0662j15668P9041M9728
$$ plain form
2862 143816 120259 270645 215459 157182 195012 -132259 -197420 54095 167643 -63417 -123588
2851 -123588 -131664 -73751 -78743 29370 83466 8316 -6846 270275 98750 881 -96847
2840 -96847 86463 182407 77082 -62507 -70470 -50835 -74199 -105832 23423 174279 192205
2829 192205 156725 144226 217183 175528 123289 54948 175679 156196 181066 159504 207592
2818 207592 -133133 40990 228115 331308 71536 131029 152877 301919 159785 66146
2808 66146 51685 167301 178387 178888 219092 252002 147428 22913 140565 299873 376285
2797 376285 165602 107298 75816 160349 118441 143679 107991 46456 63970 313291 212461
2786 212461 217919 -36636 94669 281577 191435 -6917 181625 90963 -24705 54336 104064
2775A04064J7130K2501j21992M524J27856k65346r49l303J29674L2660K3114o2331
2763G602M3742j38276o0815K87063L9132o5477k06528K0624q6856j3988J17888
2752e5889J16280J0989o1087o739j5372L2723P087o8051P4719M2542N7485n3883
2740H0804j45453j2449P7136k580j4350R2856j05466j37273J15018K12135p5949
2729H4429o2476q227K11173j69204j02418K9004L4326j52133J63447J78598M5530
2718B52049k34176k17105J67332M536P0364P3788N2576k19810j22310Q2O2830
2707a09844J26382k7453m0067J00419J00691j26110j10247j1232p047J32898L1477
2696E9867p8816o5116r5102J37676K20576n4155j18435J23572n6880J69797J0806
$$ plain form
2775 104064 121194 143695 21703 26227 154083 -111263 -112212 -115515 14159 46819 69933 7602
2763 7602 51344 -86932 -147747 139316 178448 112971 -93557 -72933 -159789 -173777 -55889
2752 -55889 60391 71380 10293 3554 -11818 20905 27992 -40059 34660 77202 134687 80804
2740 80804 -64649 -77098 38 -2542 -16892 75964 -29502 -166775 -51757 160378 84429
2729 84429 21953 13726 224899 55695 -46723 -17719 16607 -135526 27921 206519 252049
2718 252049 17873 -199232 -31900 -27364 43000 116788 169364 -50446 -172756 -172674 -109844
2707 -109844 16538 -10915 -50982 49437 150128 24018 -86229 -97461 -104508 28390 59867
2696 59867 -18949 -84065 -179167 -41491 179085 124930 6495 130067 73187 242984 253790
2685B53790m2435o2294P6887L7746j7750r8173p6034j74853J8925Q9319L5463
2674D0591N3628O2927N4886l130j74255Q3047L24923p4821k6202J89618o0023
2663D71189l45169r8560j10803J46346m4717N2344j25389l0906K0528K04374O4535
2652B03772q6073L7229M8174l1190j7040q4394o3769j2715P3001j66631N0816
2641d8820J56557j32453r5564N7845P8257R6585J64782k3950j32240r6456k1053
2630C490r9785r7948k5545P9358L8051j09244J39975k23775J01013L4192J56732
2619c486J8546k8416K65851J31534k38783j04501O603K492j47704N7729J39705
2608I9570L7240n6152q4327J29370r3474J70135M9053n8364o8843J15868j19259
$$ plain form
2685 253790 211355 149061 225948 263694 245944 147771 71737 -103116 -84191 5128 40591
2674 40591 94219 157146 212032 208902 34647 117694 442617 367796 341594 531212 471189
2663 471189 126020 27460 -83343 63003 18286 70630 -54759 -85665 -65137 139237 203772
2652 203772 117699 154928 203102 171912 154872 70478 6709 -6006 66995 -99636 -48820
2641 -48820 107737 -24716 -120280 -62435 15822 112407 277189 253239 120999 24543 3490
2630 3490 -96295 -194243 -219788 -140430 -102379 -211623 -71648 -295423 -194410 -160218 -3486
2619 -3486 15060 -13356 252495 384029 145246 40745 47348 49840 -97864 -40135 99570
2608 99570 136810 80658 -3669 125701 32227 202362 251415 193051 124208 240076 120817
2597A20817l7201k7911j0321n1991K94886k65785R4124J7564Q0581j93864K2680
2586D3579J30124J31300q5909o5930r6333R6419N0838m2994r2601j23973J71946
2575A16466J245o9693o0604J83377q1856N6618O3307M4577j23653Q0258R2606
2564C02648m088m29883J17628K65950m0399j01473N4108q2959j04688M4860O3966
2553H5670J02969J4371p6667K1324o2128O0915j7646j6655p937j9131M8780N02
2541A34367m439k20474J1081J3994J17294N2162J13211j48578j62087j251j3533
2530a08253M9508j3455J07787o0696J5210j55544J05018O7478P8411J27347p51
2519B12060k15650k86098O9474o0856J31350N7109M8387m4505j71483Q4638J84009
$$ plain form
2597 120817 83616 55705 45384 -6607 288279 22494 116618 134182 214763 20899 43579
2586 43579 173703 305003 219094 153164 56831 153250 204088 161094 68493 -55480 116466
2575 116466 117711 48018 -12586 170791 88935 145553 208860 253437 129784 210042 302648
2564 302648 298560 -131323 -13695 252255 211856 110383 164491 81532 -23156 21704 85670
2553 85670 188639 203010 126343 147667 85539 146454 128808 112153 104216 85085 133865 134367
2541 134367 129928 -90546 -79465 -65471 51823 103985 217196 68618 -93469 -94720 -108253
2530 -108253 -58745 -72200 35587 -25109 -9899 -165443 -60425 7053 85464 212811 212060
2519 212060 -3590 -289688 -220214 -281070 -149720 -92611 -44224 -88729 -260212 -175574 8435
2508H435L1304j51217J34261O9902l2462k1889p148L0320j2749R5166l0371K0465
2496A34017K6574j3480m4750P502J8301p9973L9740J6517j3272q822K0445K9806
2484A32605P7477j4565p3174M8767j2663R727p5041N5135L45845O9502j83593
2473C80022j3663J15219l8129m1440L3087P0377j3256k1837J8239J9639j54846
2462C53412l9128L42250Q8977j17610m2348P7492o325P3684l995J3563J0816k11854
2450E38934N4768Q0917M9788q8557M3525K29813o6691p9381N7337K33144l1791
2439A021806R1813P4531n6485j14970n794n0210j31867O611J052J09452J46164
2428A092103J95284L1629k19134J67848L67898J37926j5814L11404r4514p9056
$$ plain form
2508 8435 39739 -111478 22783 92685 60223 38334 31186 61506 48757 143923 113552 134017
2496 134017 160591 147111 102361 109863 128164 48191 87931 104448 91176 82354 102799 132605
2484 132605 210082 195517 122343 171110 158447 168174 93133 148268 494113 563615 380022
2473 380022 366359 481578 443449 402009 435096 505473 492217 470380 488619 508258 353412
2462 353412 314284 656534 745511 627901 585553 663045 656720 730404 726409 739972 750788 538934
2450 538934 593702 674619 724407 635850 679375 909188 842497 763116 820453 1053597 1021806
2439 1021806 1113619 1188150 1131665 1016695 1010901 960691 828824 835435 836487 945939 1092103
2428 1092103 1287387 1319016 1099882 1267730 1635628 1773554 1757740 2069144 1974630 1895574
2418A895574J17924O24637P05226L58585N03582N09841J98340K08977N16722K50360
2408E889768N46576P52918J300712J831032L180472O073113J0798944J4645308
2400D5018843J5099613J1338007K707566o339330q481309r604302j0345141p628069
2392C1765878o213995n521839m235895l314952k083265j150573q09691n37311
2384G898357m00623n01333p58326o47408l89393l04887n80208k72231j02867l98359
2374C542722m53281J24302M9606k07383j54460j9014O3044m21408j80799J52405
2364B495734o0911k18260o1701J44137k63135r5000M8481J24595k12657j72412
2354A728871J92500M8049k46333j22439j612o5709O3201j01966Q9965N5073k25959
$$ plain form
2418 1895574 2013498 2638135 3343361 3701946 4205528 4715369 4913709 5122686 5639408 5889768
2408 5889768 6436344 7189262 8489974 10321006 13501478 19574591 30373535 45018843
2400 45018843 60118456 71456463 74164029 67824699 59343390 49739088 39393947 31765878
2392 31765878 25551883 20030044 15794149 12479197 10395932 9245359 8435668 7898357
2384 7898357 7497734 6996401 6238075 5590667 5201274 4896387 4316179 4043948 3941081 3542722
2374 3542722 3089441 3213743 3263349 3055966 2901506 2882492 2945536 2524128 2343329 2495734
2364 2495734 2434823 2216563 2154862 2298999 2035864 1940864 1989345 2113940 1901283 1728871
2354 1728871 1921371 1969420 1723087 1600648 1599036 1533327 1596528 1494562 1584527 1639600 1413641
2343A413641r4315K17578r05j27865p9922k6644J5304p7033j9348J3619j25264
2332A108846K9604m2284m3199k937o392K041q1018N4137j86453j5397j1977k2321
2320G82650Q0431o7303m7356o4417j7944J7037j46629P6614r659q3900P3112J67733
2308G60369J1698j22759l4379n3501j54835N8356J03124l2470j47648L3294P7511
2297D98760l5612j1624k5361O4709m9306M9250m6354J339j50335o9795J59127
2286C84798M3052k22266J83803k8814j59165p2374L48276m9071j32547J00444
2276C96136M4237j22081l9355K0523l1034j97269J08932N6173J7691j1025q3270
2265A59658J01473p2502N3714k08436O2533J01399p0421j24855o0087j53602K17384
$$ plain form
2343 1413641 1319326 1536904 1535999 1408134 1328212 1301568 1316872 1239839 1220491 1234110 1108846
2332 1108846 1138450 1096166 1052967 1050030 1043638 1045679 964661 1018798 832345 816948 804971 782650
2320 782650 863081 795778 748422 684005 666061 683098 536469 613083 603424 519524 592636 760369
2308 760369 772067 649308 614929 561428 406593 464949 568073 535603 387955 421249 498760
2297 498760 463148 451524 426163 490872 441566 490816 444462 445801 295466 225671 384798
2286 384798 427850 205584 389387 360573 201408 129034 477310 428239 295692 396136
2276 396136 440373 318292 278937 299460 268426 71157 180089 236262 253953 242928 159658
2265 159658 261131 188629 242343 33907 96440 197839 127418 2563 -57524 -211126 6258
2254F258L9541P0350q0177m8416P4307Q6729j07603J01940M9827n3275j14340
2243B5141M2474K12430M4488j35306N6710k2639q9764N9653m2831O5055p7313
2232A38098L9554O4062n231R4739J39493p6911j30834r0761r4262J13125K64603
2221D55675j87250j09328o0187j12445J19339J96299N011o4029L1847L2046k3866
2210B83112K7283J4427l9303P3685n1920M9166j51569L2279o3737k9687M7231
2199A90967K3116J64475m4406P7323L5288j23971j4390j29272p889J29709k7897
2188B73053j64611p0095p6419j37786J43598J31402M9721k0363j5960N0446o6379
2177I6607k8587m1029J06745K48285j28865q3884L9528k91528k5702P0003J65227
$$ plain form
2254 6258 45799 116149 35972 -12444 61863 148592 40989 142929 192756 139481 25141
2243 25141 67615 280045 324533 189227 245937 223298 133534 193187 150356 215411 138098
2232 138098 177652 241714 236483 331222 470715 393804 262970 172209 77947 191072 455675
2221 455675 268425 159097 98910 -13535 105804 302103 307114 243085 274932 306978 283112
2210 283112 310395 324822 285519 359204 307284 356450 204881 237160 173423 143736 190967
2199 190967 214083 378558 334152 411475 446763 322792 308402 179130 171241 300950 273053
2188 273053 108442 38347 -38072 -175858 -32260 99142 148863 128500 112540 162986 96607
2177 96607 68020 26991 133736 382021 253156 169272 208800 -82728 -108430 -38427 126800
2166A26800j11966j4592R3060q4928Q3204k1243J20091R4138n5338p4478J09107
2155B63855j10819k45143l2319J64983R588k0790j68513L6289l1884P2543J74317
2144A12107l3727j7323J23170Q9260N582k46698o4179J0703j8581P6464k8016
2133H762N6469j12867M3999Q5096J32854N0913O8733K00436j75553j38882L4975
2122B54935j03100j25143k3956P6065J28410k33731k8919j31272L1201J22704
2112c2806m5493p0486J78656p006k6361O6072M5455j56688P3050N5314N3138j05917
2100B6928q4834R3375m214J0783m981L1001o5303M6601L3022J73229j39472k19221
2088a03086Q563K71233l4939k9084L7404K8960q4755q6121K6524j18012r2151
$$ plain form
2166 126800 14834 242 93302 8374 91578 70335 190426 284564 229226 154748 263855
2155 263855 153036 -92107 -124426 40557 50145 29355 -139158 -102869 -134753 -62210 112107
2144 112107 78380 61057 184227 273487 279069 32371 -31808 -21105 -39686 36778 8762
2133 8762 65231 -47636 -3637 81459 214313 265226 333959 534395 358842 219960 254935
2122 254935 151835 26692 2736 78801 207211 -26520 -55439 -186711 -155510 -32806
2112 -32806 -78299 -148785 29871 22865 -3496 62576 108031 -48657 24393 79707 132845 26928
2100 26928 -57906 35469 31255 42038 37057 68058 2755 49356 82378 255607 116135 -103086
2088 -103086 -94523 176710 141771 112687 150091 179051 94296 8175 34699 -83313 -175464
2077a75464R0269Q397J20480L507p1761n8020J34687P6172J5723J67599l7281
2066B74308r5774l6359q821P4217j32462j025N1959l5375L0913r00K731L703L2771
2053A59886J43410n5884J1694o3051J8541j554j67185m4232J86732r6675k05860
2042a14178Q6073J6533k55174J80913J07102m579k0679O9293j06365Q4723l4551
2031I111N6459k2601j19069j05226M1346P787K8510j20155L0178K29183q7430
2020e1907l3869n4721J41994j12499N8828j8121J48218m7175l7240j05324m1804
2009a53620j82666J29377Q3661J2057q0974J4102o9313M7017N6743J21423j10630
1998a32823j04536J20550j2083j27643O7909O9562p2638j4828R8065J74351P873
$$ plain form
2077 -175464 -85195 -76798 43682 47189 -24572 -82592 52095 128267 143990 311589 274308
2066 274308 178534 142175 133354 207571 75109 74084 126043 90668 121581 120681 123412 127115 159886
2053 159886 303296 247412 259106 196055 214596 213042 45857 1625 188357 91682 -114178
2042 -114178 -28105 -11572 -266746 -85833 21269 16690 -3989 65304 -41061 43662 9111
2031 9111 65570 42969 -76100 -181326 -139980 -132193 -103683 -223838 -193660 35523 -51907
2020 -51907 -85776 -140497 1497 -111002 -52174 -70295 77923 30748 -6492 -111816 -153620
2009 -153620 -336286 -206909 -123248 -111191 -192165 -178063 -247376 -200359 -143616 -22193 -132823
1998 -132823 -237359 -116809 -128892 -256535 -188626 -119064 -191702 -206530 -108465 65886 73759
1987G3759o0451o9244J57663N6195J37044m3688r4977j44161N4619j3L9662q2631
1975B3777J0983Q2258N5034j39303p6008J98249J82354j18624j92705P0642j007
1964I5650M3181j90741K25680J4922k43671q0203J92966J3253M3309j21223k9781
1953c6658r9948J27691K77927O0368j91434j19171M3747j3832J85569j25757k92887
1942a84385K9625L8379M6452m422N2819L4481j02442j25157K07215J26327k04262
1931h5370r20Q0349K5206l9842j31740k3085Q2332j69505J15775j087j22178P6720
1919a93345K09467J23179J9695k37927J45J37190K08830k90318j02955k9748J50239
1908e548j30738J80180K1136k53081K3130O8867P9423l1122n4024O3737l2218
$$ plain form
1987 73759 13308 -55936 101727 157922 294966 251278 156301 12140 66759 66746 106408 23777
1975 23777 34760 117018 172052 32749 -43259 154990 337344 218720 26015 96657 95650
1964 95650 138831 -51910 173770 188692 -54979 -135182 57784 71037 114346 -6877 -36658
1953 -36658 -136606 -8915 269012 329380 137946 18775 62522 48690 234259 108502 -184385
1942 -184385 -154760 -116381 -69929 -74351 -21532 12949 -89493 -214650 -7435 118892 -85370
1931 -85370 -86290 -5941 19265 -20577 -152317 -175402 -93070 -262575 -146800 -147887 -270065 -193345
1919 -193345 16122 139301 158996 -78931 -78786 58404 267234 -23084 -126039 -155787 -5548
1908 -5548 -136286 43894 65030 -188051 -164921 -96054 -16631 -47753 -101777 -38040 -70258
1897g0258j1776k7045M4697J45994j69142r4378P0156R0438j20170N6338J0163
1886g4983J17003q514p8188j14252L55103l4099j41878K1281n9841l7086J58718
1875A03264k9979p1537o7681L869J41541J6216r5679J8831J81548j80215J01242
1864A21420o3161M7010k9018r1000o9475M5995J42636k5574j48510J03710J153
1853C5186j2969m2328q143j68490J66098J72387k11824p1551r9917K20136J64048
1842A42633j558j053P7887k6785N5102p5039r1075J06920M1924k16523J15616
1831A28049j77510j00766J33510J8005m0678M2493k1667j10439p4899J40884L4351
$$ plain form
1897 -70258 -82034 -109079 -64382 81612 -87530 -181908 -111752 -21314 -141484 -85146 -74983
1886 -74983 42020 33506 -44682 -158934 196169 162070 20192 41473 -18368 -55454 103264
1875 103264 73285 1748 -65933 -62064 79477 95693 14 18845 200393 20178 121420
1864 121420 58259 105269 76251 -14749 -84224 -38229 104407 78833 -69677 34033 35186
1853 35186 22217 -20111 -28254 -196744 -30646 141741 -70083 -141634 -241551 -21415 142633
1842 142633 141075 140022 217909 191124 246226 171187 80112 187032 228956 12433 128049
1831 128049 -49461 -150227 -16717 1288 -39390 3103 -18564 -129003 -203902 -63018 -28667
$$ [...]
##END NTUPLES=NMR SPECTRUM
##END=
