##TITLE=1H_DE-80H_X3
 200.13MHz, d2o
 8 sc
 
 19ns.26.2.2025
##JCAMPDX= 6.0         $$ Bruker NMR JCAMP-DX V2.0
##DATA TYPE= NMR SPECTRUM
##DATA CLASS= NTUPLES
##ORIGIN= UXNMR, Bruker Analytische Messtechnik GmbH
##OWNER= pz
$$ XWIN-NMR		Version 3.5
$$ Wed May 20 16:00:36 2026 Russian Standard Time (UT+4h)  Yarkov@DPX200
##.OBSERVE FREQUENCY= 200.1313
##.OBSERVE NUCLEUS= ^1H
##.ACQUISITION MODE= SIMULTANEOUS
##.ACQUISITION SCHEME= undefined
##.AVERAGES= 8
##.DIGITISER RES= 18
##SPECTROMETER/DATA SYSTEM= spect
##.PULSE SEQUENCE= zg30
##.SOLVENT NAME= DMSO
##.SHIFT REFERENCE= (INTERNAL, DMSO, 0, 15.4847)
##AUDIT TRAIL= $$ (NUMBER, WHEN, WHO, WHERE, WHAT)
$$ ##TITLE= Audit trail, XWIN-NMR		Version 3.5
$$ ##JCAMPDX= 5.01
$$ ##ORIGIN= Bruker BioSpin GmbH
$$ ##OWNER= Yarkov
$$ C:/Bruker/XWIN-NMR/data/yarkov2/nmr/H-C/1/pdata/1/auditp.txt
$$ ##AUDIT TRAIL=  $$ (NUMBER, WHEN, WHO, WHERE, WHAT)
(   1,<2026-05-20 15:59:25.10 +0400>,<Yarkov>,<DPX200>,
      <created by zg, POWCHK disabled, PULCHK disabled
       configuration hash MD5:
       00 E9 B6 7A A2 85 ED C7 34 08 36 98 17 FE 4E 26
       data hash MD5: 16K
       53 4D F9 8C A9 8A F3 E4 DE D3 04 46 7A 78 3B 59>)
(   2,<2026-05-20 15:59:34.32 +0400>,<Yarkov>,<DPX200>,
      <Start of raw data processing
       efp BC_mod = 2 LB = 0.25 FT_mod = 6 PKNL = 1 PHC0 = -5660.117 PHC1 = 16.22195 SI = 16K 
       data hash MD5: 16K
       A8 BB 70 DD 99 49 CF 7C 27 1F 1B CA FB 3D 8A A3>)
(   3,<2026-05-20 15:59:52.56 +0400>,<Yarkov>,<DPX200>,
      <pk PHC0 = -2.8 PHC1 = 0 
       data hash MD5: 16K
       81 78 15 A9 85 65 F5 8D 1B 1B D4 C9 4D 5D 54 02>)
$$ ##END=
$$ 
$$ hash MD5
$$ 78 74 1E B8 D8 7F 6F F0 22 2A B6 36 8C 06 2F D5
##$RELAX= 
##$RELAX= 
##$RELAX= 
##$RELAX= 
##$RELAX= 
##$RELAX= 
$$ Bruker specific parameters
$$ --------------------------
##$DU= <C:/Bruker/XWIN-NMR>
##$EXPNO= 1
##$NAME= <H-C>
##$PROCNO= 1
##$TYPE= <nmr>
##$USER= <yarkov2>
##$AMP= (0..31)
100 100 100 100 100 100 100 100 100 100 100 100 100 100 100 100 100 100 
100 100 100 100 100 100 100 100 100 100 100 100 100 100 
##$AQSEQ= 0
##$AQ_mod= 1
##$AUNM= <au_zg>
##$AUTOPOS= <>
##$BF1= 200.13
##$BF2= 200.13
##$BF3= 200.13
##$BF4= 200.13
##$BF5= 200.13
##$BF6= 200.13
##$BF7= 200.13
##$BF8= 200.13
##$BYTORDA= 1
##$CFDGTYP= 0
##$CFRGTYP= 5
##$CHEMSTR= <none>
##$CNST= (0..31)
1 1 145 1 1 1 1 1 1 1 1 1 1 1 1 1 1 1 1 1 1 1 1 1 1 1 1 1 1 1 1 1 
##$CPDPRG= <>
##$CPDPRG1= <>
##$CPDPRG2= <>
##$CPDPRG3= <>
##$CPDPRG4= <mlev>
##$CPDPRG5= <mlev>
##$CPDPRG6= <mlev>
##$CPDPRG7= <mlev>
##$CPDPRG8= <mlev>
##$CPDPRGB= <>
##$CPDPRGT= <>
##$D= (0..31)
0 0.7 0 0 0 0 0 0 0 0 0 0.03 0 0 0 0 0 0 0 0 0 0 0 0 0 0 0 0 0 0 0 0 
##$DATE= 1779278364
##$DBL= (0..7)
120 120 120 120 120 120 120 120 
##$DBP= (0..7)
150 150 150 150 150 150 150 150 
##$DBP07= 0
##$DBPNAM0= <>
##$DBPNAM1= <>
##$DBPNAM2= <>
##$DBPNAM3= <>
##$DBPNAM4= <>
##$DBPNAM5= <>
##$DBPNAM6= <>
##$DBPNAM7= <>
##$DBPOAL= (0..7)
0.5 0.5 0.5 0.5 0.5 0.5 0.5 0.5 
##$DBPOFFS= (0..7)
0 0 0 0 0 0 0 0 
$$ [...]
##$SUBNAM2= <"">
##$SUBNAM3= <"">
##$SUBNAM4= <"">
##$SUBNAM5= <"">
##$SUBNAM6= <"">
##$SUBNAM7= <"">
##$SUBNAM8= <"">
##$SUBNAM9= <"">
##$SW= 18.0517328524113
##$SWIBOX= (0..15)
0 0 2 0 0 0 0 0 0 0 0 0 0 0 0 0 
##$SW_h= 3612.71676300578
##$TD= 16384
##$TD0= 1
##$TE= 0
##$TE2= 300
##$TE3= 300
##$TEG= 300
##$TL= (0..7)
0 120 120 120 120 120 120 120 
##$TP= (0..7)
150 150 150 150 150 150 150 150 
##$TP07= 0
##$TPNAME0= <>
##$TPNAME1= <>
##$TPNAME2= <>
##$TPNAME3= <>
##$TPNAME4= <>
##$TPNAME5= <>
##$TPNAME6= <>
##$TPNAME7= <>
##$TPOAL= (0..7)
0.5 0.5 0.5 0.5 0.5 0.5 0.5 0.5 
##$TPOFFS= (0..7)
0 0 0 0 0 0 0 0 
##$TUNHIN= 0
##$TUNHOUT= 0
##$TUNXOUT= 0
##$USERA1= <user>
##$USERA2= <user>
##$USERA3= <user>
##$USERA4= <user>
##$USERA5= <user>
##$V9= 5
##$VALIST= <valist>
##$VCLIST= <CCCCCCCCCCCCCCC>
##$VD= 0
##$VDLIST= <DDDDDDDDDDDDDDD>
##$VPLIST= <PPPPPPPPPPPPPPP>
##$VTLIST= <TTTTTTTTTTTTTTT>
##$WBST= 1024
##$WBSW= 4
##$XGAIN= (0..3)
0 0 0 0 
##$XL= 0
##$YL= 0
##$YMAX_a= 166778
##$YMIN_a= -148327
##$ZGOPTNS= <>
##$ZL1= 120
##$ZL2= 120
##$ZL3= 120
##$ZL4= 120
##$ABSF1= 0
##$ABSF2= 0
##$ABSG= 0
##$ABSL= 0
##$ALPHA= 0
##$AQORDER= 0
##$ASSFAC= 0
##$ASSFACI= 0
##$ASSFACX= 0
##$ASSWID= 0
##$AUNMP= <proc_1d>
##$AZFE= 0.1
##$AZFW= 0.1
##$BCFW= 0
##$BC_mod= 2
##$BYTORDP= 0
##$COROFFS= 0
##$CY= -3
##$DATMOD= 1
##$DC= 0
##$DFILT= <>
##$DTYPP= 0
##$F1P= 0
##$F2P= 0
##$FCOR= 1
##$FTSIZE= 16384
##$FT_mod= 6
##$GAMMA= 0
##$GB= 0
##$INTBC= 1
##$INTSCL= 3.241238e-09
##$ISEN= 128
##$LB= 0.25
##$LEV0= 0
##$LPBIN= 0
##$MAXI= 10000
##$MC2= 0
##$MEAN= 0
##$ME_mod= 0
##$MI= 1.114404
##$NCOEF= 0
##$NC_proc= -8
##$NLEV= 6
##$NOISF1= 3.799351
##$NOISF2= 2.8
##$NSP= 0
##$NTH_PI= 0
##$NZP= 0
##$OFFSET= 15.48466
##$PC= 1
##$PHC0= -5662.917
##$PHC1= 16.22195
##$PH_mod= 1
##$PKNL= yes
##$PPARMOD= 0
##$PSCAL= 0
##$PSIGN= 0
##$REVERSE= no
##$SF= 200.130007412294
##$SI= 16384
##$SIGF1= 3
##$SIGF2= 2
##$SINO= 0.751879
##$SIOLD= 32768
##$SREGLST= <19F.Aceton>
##$SSB= 0
##$STSI= 16384
##$STSR= 0
##$SW_p= 3612.71676300578
##$SYMM= 0
##$S_DEV= 0
##$TDeff= 16384
##$TDoff= 0
##$TI= <>
##$TILT= no
##$TM1= 0
##$TM2= 0
##$TOPLEV= 0
##$USERP1= <user>
##$USERP2= <user>
##$USERP3= <user>
##$USERP4= <user>
##$USERP5= <user>
##$WDW= 1
##$XDIM= 16384
##$YMAX_p= 530066978
##$YMIN_p= -2771362
$$ End of Bruker specific parameters
$$ ---------------------------------
##NTUPLES= NMR SPECTRUM
##VAR_NAME=  FREQUENCY,     SPECTRUM/REAL,   SPECTRUM/IMAG
##SYMBOL=    X,             R,               I
##VAR_TYPE=  INDEPENDENT,   DEPENDENT,       DEPENDENT
##VAR_FORM=  AFFN,          ASDF,            ASDF
##VAR_DIM=   16384,         16384,           16384
##UNITS=     HZ,            ARBITRARY UNITS, ARBITRARY UNITS
##FACTOR=    0.220516191357247, 1,           1
##FIRST=     3098.94515032029, 0,            0
##LAST=      -513.771612685485, 0,           0
##MIN=       -513.771612685485, -2771362,    0
##MAX=       3098.94515032029, 530066978,    0
$$ Real data points
##PAGE= N=1
##DATA TABLE= (X++(R..R)), XYDATA
$$ [...]
5101B9663425p49977p97961n62581j29667j70203o49988o89536M47141p14877
5092B5645776m63198K33428o37092l1693o06758q93352J36994o41382o07148j18622
5082B2016953p41665n52267J17634O7747k25826l42977j004368q56864j6039J00979
5072A8563307j4652m57132n62957L41029j37836L41300L02244p60018k81750m34052
5062A6899483k57778M08277m11895j97277n43301n6137k02278Q41596k35380j064871
5052A5180439k63130k87284n07332q4104n23517K6142o44485M74251K35778o43414
5042A2963344j13478M75542n80160J92376o16307k26084k78049m30657J51466
5033A1537993M77927o43111j09652N99935l0368M7897O5967m52692l91498n35838
$$ y = [29663425, 28913448, 28115487, 27552906, 27423239, 27253036, 26603048, 25913512, 26360653, 25645776, 25182578, 25416006, 24778914, 24747221, 24140463, 23247111, 23384105, 22742723, 22135575, 22016953, 21275288, 20723021, 20840655, 20908402, 20682576, 20339599, 19335231, 18478367, 18462328, 18563307, 18548655, 18091523, 17528566, 17869595, 17731759, 18073059, 18375303, 17615285, 17333535, 16899483, 16641705, 17049982, 16638087, 16440810, 15897509, 15841372, 15639094, 16480690, 16245310, 15180439, 14917309, 14630025, 14122693, 14038589, 13515072, 13541214, 12896729, 13370980, 13606758, 12963344, 12849866, 13325408, 12745248, 12937624, 12321317, 12095233, 11817184, 11386527, 11537993, 12015920, 11372809, 11263157, 11863092, 11832724, 11880621, 11946588, 11493896, 11102398, 10566560]
5023A0566560J42706J37897j138517N25627N37285n51431J55616L60415J45322
5014A0881480K26970m98663k72548N1973J02317j01917O19360l17310O88529L7908
5004A1418099k11102K1584n3128m87910N88000J6972m27964q93905q2004N93841
4994A0482483r8496k95647J78769K72101P07656O97625j47083m88918j09652m56049
4984A0742789l46091l14159r85086n86836j1925m39982L84507J66172K8122j57469
4974H480042O9554q1960n9168o69920k95985k85099k07056R8474L27587Q09560
4964H186029n120k58975R3680k33680j44608l93726o08422r04052M29731N67060
4954F727917k42444k34694m0118O55007l403j91996K5344n702l97500J52600N081
$$ y = [10566560, 10709266, 10847163, 9708646, 10234273, 10771558, 10220127, 10375743, 10736158, 10881480, 11108450, 10609787, 10337239, 10389212, 10491529, 10389612, 11008972, 10691662, 11380191, 11418099, 11206997, 11228581, 11175453, 10687543, 11275543, 11292515, 10864551, 9970646, 9888642, 10482483, 10383987, 10088340, 10267109, 10539210, 11246866, 11944491, 11797408, 11308490, 11198838, 10742789, 10396698, 10082539, 9097453, 8510617, 8498692, 8058710, 8443217, 8609389, 8637511, 8480042, 8549596, 8467636, 8408468, 7738548, 7442563, 7157464, 6950408, 7048882, 7376469, 8186029, 8180909, 7921934, 8015614, 7781934, 7637326, 7243600, 6635178, 5731126, 6160857, 6727917, 6485473, 6250779, 6210661, 6865668, 6862265, 6670269, 6695613, 6689911, 6292411, 6445011, 6450092]
4943F450092L87634k64866J46962k85821P2653J40540M36579l39328l83230k21182
4933F140033J14202k97759k3514J05497j01127m07321j4784K43400M94702k68427
4923E984902M74829J70087N03791J40554n90009n86208Q5328m43415l49553K25717
4913E616023n2144L32841R1187j02653J45773J57192k60864p3351J80945n65938
4903E469011l24307j24438J48287L36307J42392L95960N420J26930q3577M05522
4893F497507k83335j74264k53536l34094K61787P78134j37830j2053L80355j00263
4883F622408Q9347N60261M42808k74056n70806l52921l19665R67963j88094O231
4873F983476K09706j72283M32844O99711J54662J97098l73610L9767K62313L85862
$$ y = [6450092, 6837726, 6572860, 6719822, 6434001, 6506654, 6647194, 7083773, 6744445, 6361215, 6140033, 6254235, 5956476, 5932962, 6038459, 5937332, 5530011, 5515227, 5758627, 6253329, 5984902, 6459731, 6629818, 7133609, 7274163, 6684154, 6097946, 6183274, 5739859, 5390306, 5616023, 5563879, 5896720, 5987907, 5885254, 6031027, 6188219, 5927355, 5854004, 6034949, 5469011, 5144704, 5020266, 5168553, 5504860, 5647252, 6043212, 6048632, 6175562, 6091985, 6497507, 6214172, 6039908, 5786372, 5452278, 5714065, 6492199, 6354369, 6342316, 6722671, 6622408, 6711755, 7272016, 7714824, 7440768, 6869962, 6517041, 6197376, 7165339, 6977245, 6983476, 7193182, 7020899, 7453743, 8153454, 8308116, 8505214, 8131604, 8171371, 8433684, 8819546]
4863H819546L45417K10247j07612P40370O22023L92802L62748R65668J21405Q73410
4853A3346024J003993J068818P80051O10810r7089k60244J50934L67121L37553
4844A7307971l04628K14335O69002R61907J184508J340285J300246J413140K690949
4835B6777715L454274N034268P474471J0086490J3795467J3916902O630973j481840
4827H5688720l017575n943687q679760j0131056j0730238q775460n999688n256524
4819B7154732l150331k471350j808023j912703j521842q53457j57602j953397
4811A3326027k58175K3613n76444r12946j88658o93136l80820K61280K5119K1304
4801A0647164n79512p00043L97156n92197l64294n1771m51321m89210j92018k05954
$$ y = [8819546, 9164963, 9375210, 9267598, 10007968, 10629991, 11022793, 11385541, 12351209, 12472614, 13346024, 14350017, 15418835, 16198886, 16809696, 16712607, 16452363, 16603297, 16970418, 17307971, 17003343, 17217678, 17886680, 18848587, 20033095, 21373380, 22673626, 24086766, 26777715, 30231989, 35266257, 42740728, 52827218, 66622685, 80539587, 87170560, 85688720, 82671145, 76727458, 68047698, 57916642, 47186404, 38410944, 32411256, 27154732, 24004401, 21533051, 19725028, 17812325, 16290483, 15437026, 15279424, 13326027, 13067852, 13091465, 12515021, 11602075, 11413417, 10720281, 10339461, 10600741, 10625860, 10647164, 10067652, 9367609, 9764765, 9172568, 8808274, 8756503, 8305182, 7815972, 7623954, 7418000]
4791G418000p5982J37126k09158k38005n24987J03629O4187m32041m5831j65286
4781F031652l80145L58590M23620j39515k72986J31298J04420Q20002R8907j03295
4771G072548j99227m31670l11856L18483j93693q75641K23776K57452k42160J86980
4761E804992J81872J90495m64101l95965k26501M43056q8600P56547r6862M3542
4751F148475n60102k53228N23237K53549N8796N02594j21306K92945K84571J00029
4741G229560j00666K33098l18241r5881L28449M43102M37503M81321J63410N78719
4731I380374M70141K63011R34098o11373p26133N89810P31307M74797L17890Q0612
4721A1904534N506o0455Q0086O28967l5884n74027N89360K06584m1683R24354
$$ y = [7418000, 7342018, 7479144, 7269986, 7031981, 6506994, 6610623, 6674810, 6242769, 6196938, 6031652, 5651507, 6010097, 6433717, 6294202, 6021216, 6152514, 6256934, 7076936, 7175843, 7072548, 6873321, 6441651, 6129795, 6448278, 6254585, 5378944, 5602720, 5860172, 5618012, 5804992, 5986864, 6177359, 5713258, 5317293, 5090792, 5533848, 5445248, 6201795, 6104933, 6148475, 5588373, 5335145, 5858382, 6111931, 6170727, 6673321, 6552015, 6844960, 7129531, 7229560, 7128894, 7361992, 7043751, 6947870, 7276319, 7719421, 8156924, 8638245, 8801655, 9380374, 9850515, 10113526, 11047624, 10436251, 9710118, 10299928, 11031235, 11506032, 11823922, 11904534, 11910040, 11849585, 11929671, 12558638, 12522754, 11948727, 12538087, 12744671, 12702988, 13627342]
4711A3627342L80675p3643p34848n61284O89496K06625n70492O90172J06364n84547
4701A3175860Q02661M57932k73714j503558O439P07074J86109o76708j33491k98636
4691A2449968l14204J2448O50732O5276m89597j022517k0682l08650k21337k34320
4681A0567117l30868n68694m07905J08859M65642k18586q01503k87132p2725j4760
4671H439445j55385o26807k53893l54786N7936m6732o6399q31j44521n2120j66373
4660F629534j98512j1742k74878K397p6679k14517L40262j04836L56553q1798
4650F365784k02762j6767K5475M2214N62017l10070L86509L20212l74953m43240
4640F354419R88306J23760n5104O45174J29881K28473M36693J074284J353450
$$ y = [13627342, 14008017, 13934374, 13199526, 12638242, 13327738, 13534363, 12963871, 13654043, 13760407, 13175860, 13978521, 14436453, 14162739, 12659181, 12665620, 13372694, 13558803, 12882095, 12748604, 12449968, 12135764, 12148212, 12798944, 12864220, 12374623, 11352106, 11331424, 11022774, 10801437, 10567117, 10236249, 9667555, 9259650, 9368509, 9834151, 9615565, 8814062, 8526930, 8454205, 8439445, 8284060, 7657253, 7403360, 7048574, 7106510, 7059778, 6993379, 6992548, 6848027, 6795907, 6629534, 6431022, 6419280, 6144402, 6146799, 6070120, 5855603, 6195865, 6091029, 6447582, 6365784, 6163022, 6146255, 6171730, 6213944, 6775961, 6465891, 6852400, 7172612, 6797659, 6354419, 7342725, 7466485, 7411381, 8056555, 8186436, 8414909, 8851602, 9925886, 11279336]
4631A1279336M59929J099424J711007K377067K349929L164395L441748K750762
4623B8633597O60200l9685o37255j730472j638267k523001j815367m07721p06346
4614A9795683k93843N87786J210150O91740K017068K732323K235729K120702J631991
4605C2729329K486190K969020J943548K321170L458923L775738L888841K781941
4597E6354700K243703J067659J252885K235089K183352J961612K913228K320708
4589G2532936J277302n78188o24493j163512j937717j288609j568035j486696
4581F5162988k065927k051183k130674k951814l250698k519670k147933k932947
4573D5112142k097282j988142k491543k351386k059964k481486k578414k037683
$$ y = [11279336, 11739265, 12838689, 14549696, 16926763, 19276692, 22441087, 25882835, 28633597, 29293797, 29254112, 28616857, 26886385, 25248118, 22725117, 20909750, 20502029, 19795683, 19501840, 20089626, 21299776, 21991516, 24008584, 26740907, 28976636, 31097338, 32729329, 35215519, 38184539, 40128087, 42449257, 45908180, 49683918, 53572759, 56354700, 58598403, 59666062, 60918947, 63154036, 65337388, 67299000, 70212228, 72532936, 73810238, 73232050, 72607557, 71444045, 69506328, 68217719, 66649684, 65162988, 63097061, 61045878, 58915204, 55963390, 52712692, 50193022, 48045089, 45112142, 43014860, 41026718, 38535175, 36183789, 34123825, 31642339, 29063925, 27026242]
4565B7026242j420800k030517j485904p92088K43371n92558l20894o41456l37354
4556A9648042k68222K94815q27011q20479j35547r69154r57927j9908k71177p6850
4546A5596582m91206n12102O12846m33975j029726O8702p8605j078115k35261
4537A2419140l2059M0957L1834k54095k7505L5456m92726R5904l42544j045040
4527A0429322M49380J7802q30427K30547m88293p7607n0398n73764l22194O0664
4517H845032q37777l74054L98168q9417m55863J26628l53980M10406q54143J0658
4507F825658K97755o93824m74489K31359j88641Q55312l60406o85341N40770M74000
4497F822153l53074N82323j53321p1175J45649J83075j31556j97255l63265N44085
$$ y = [27026242, 25605442, 23574925, 22089021, 21296933, 21540304, 20947746, 20626852, 19985396, 19648042, 19379820, 19674635, 18847624, 18027145, 17891598, 16922444, 15964517, 15944609, 15673432, 15596582, 15105376, 14593274, 15206120, 14772145, 13742419, 13811121, 13732516, 12654401, 12419140, 12387081, 12428038, 12459872, 12205777, 12178272, 12213728, 11721002, 11816906, 11474362, 10429322, 10878702, 10896504, 10066077, 10296624, 9808331, 9730724, 9680326, 9106562, 8784368, 8845032, 8007255, 7633201, 8031369, 7941952, 7486089, 7612717, 7258737, 7669143, 6815000, 6825658, 7123413, 6429589, 5955100, 6186459, 5997818, 6853130, 6492724, 5807383, 6348153, 6822153, 6469079, 7051402, 6898081, 6826906, 6972555, 7155630, 7024074, 6826819, 6463554, 7007639]
4487G007639N45787m98074M02156l0987j41155N09996J57081k28183R6346k38058
4477G582548M54971L21106q27198M49273K76263l41384J20648K96668J17447j95404
4467H254938L2322r0457N50479o97856J37037K54423p02999j94974K76997N44374
4457H364284O87703o08370L23342r3397J84267j7631l26878o36765J86184k32388
4447G830351L43971J88958N46449j2922J38737K29518P9306j2453n62927l9334
4437H729654l56288o51333J70520L35645N44991k11517j29740L79696l1662j89842
4427H590124j51910J79283j04160o43278J14442N92416O88059J19245l0014j86494
4417I167713l24536K0576L42159K45097R3356K31641M6194M85715N8429N6883
$$ y = [7007639, 7553426, 7055352, 7457508, 7426521, 7285366, 7795362, 7952443, 7724260, 7820606, 7582548, 8037519, 8358625, 7531427, 7980700, 8256963, 7915579, 8036227, 8332895, 8450342, 8254938, 8287260, 8196803, 8747282, 8049426, 8186463, 8440886, 7737887, 7542913, 7819910, 8364284, 9051987, 8443617, 8766959, 8673562, 8857829, 8840198, 8513320, 7876555, 8062739, 7830351, 8174322, 8363280, 8909729, 8896807, 9035544, 9265062, 9344368, 9331915, 8768988, 8729654, 8373366, 7722033, 7892553, 8228198, 8773189, 8561672, 8431932, 8811628, 8779966, 8590124, 8438214, 8617497, 8513337, 7870059, 7984501, 8576917, 9264976, 9384221, 9354207, 9167713, 8843177, 8863753, 9205912, 9451009, 9544365, 9776006, 9822200, 10307915, 10366344, 10423227]
4407A0423227n66726o15859J288988L23597j205032j53467k04968P98428K01243
4398A0289431N2552l02603j82916p20663J43764j65745l27132j75364K83128j03782
4388H790670m1208o7367J92256O93710p51989m26712N58058M47368M3961m88587
4378H950160n67085j97910K10102L45123N11083o29379l37165M50734Q09122m1314
4368I503471J17381L1096l4865L84883N50507R00547P71277M55607J052650N48204
4358A4280758J74590N75534k94425q64360j007767n91887k05822k31538q99687
4349A0935396K53559j82431p89289l42940K79580M52549L54558n17721K40639
4340A0683900j8891m60018Q42536O32532j07635k37256L15562N64433o20594o43810
$$ y = [10423227, 9856501, 9240642, 10529630, 10853227, 9648195, 9494728, 9289760, 10088188, 10289431, 10341983, 10039380, 9856464, 9135801, 9279565, 9113820, 8786688, 8611324, 8894452, 8790670, 8749462, 8682095, 8874351, 9568061, 8816072, 8389360, 8947418, 9394786, 9438747, 8950160, 8383075, 8185165, 8395267, 8740390, 9251473, 8622094, 8284929, 8735663, 9544785, 9503471, 9620852, 9651948, 9617083, 10001966, 10552473, 11453020, 12224297, 12679904, 13732554, 14280758, 14455348, 15030882, 14736457, 13872097, 12864330, 12272443, 12066621, 11835083, 10935396, 11188955, 11006524, 10217235, 9874295, 10153875, 10606424, 10960982, 10443261, 10683900, 10665009, 10204991, 11047527, 11680059, 11572424, 11335168, 11650730, 12215163, 11594569, 10950759]
4330A0950759Q035Q3426K5947L0908K21109K50454J00N01895o09513n16971L70903
4319A1317052Q7900m143m51520J01019r1368n40247Q50592j37733j53802m8990
4309A0928760J87426N2506p1084m29105L01424j15313N0455J38741j42020l75692
4299A0526098M45078R29572k74480Q7318k6714N16091O35389P460N00291M82281
4289A3828384J18493J093590O81878j51528N808R10255O53168M68414O58504O36907
4279A8903873Q53605M18181J150853N98017p41057k9690N7915J78976p81863p46712
4269A9862098p46442M6962r98252k41018n99386j126350n57934j07245k30671
4260A5301762M34984J85746J5330K9099J07826J26156Q17373R96496M63872O40566
$$ y = [10950759, 10958794, 11042220, 11068167, 11099075, 11320184, 11570638, 11570738, 12072633, 11463120, 10946149, 11317052, 11404952, 11400809, 10949289, 11050308, 10958940, 10418693, 11269285, 11131552, 10977750, 10928760, 11116186, 11168692, 11097608, 10668503, 10969927, 10854614, 10905069, 11043810, 10901790, 10526098, 10971176, 11900748, 11626268, 11713586, 11686872, 12202963, 12838352, 12845812, 13346103, 13828384, 13946877, 15040467, 15722345, 15570817, 15576625, 16486880, 17140048, 17608462, 18266966, 18903873, 19757478, 20175659, 21326512, 21924529, 21183472, 21153782, 21211697, 21390673, 20608810, 19862098, 19115656, 19162618, 18164366, 17923348, 17323962, 16197612, 15639678, 15532433, 15301762, 15736746, 15922492, 15937822, 15966921, 16074747, 16200903, 17018276, 18014772, 18478644, 19119210]
4250A9119210J30648O24719R85278J166988R71501O85435P89424J103676J654592
4241B7231471K255498J933034J659468J810247K532175L675111M513428O158231
4233E1768663P415306J0124181J4732176J5604460O605535k843370l138801o241351
4225I4026799r815670j0620503j1313757r502313p213024n624652l730604k972928
4217C3233348j762149j500365k154509k824114j594861l52441j086342j367212
4209B0591355j242867j722513o45105l46507m13315j135196j360545k75725j12310
4200A3337272m04725l00633m56139q46135j79224k29061N7367k0443m61773q53611
4190I642895n43288j8972N64037K49713q93318j5760J42253m33421K55757J043907
$$ y = [19119210, 19249858, 19874577, 20859855, 22026843, 22998344, 23683779, 24473203, 25576879, 27231471, 29486969, 31420003, 33079471, 34889718, 37421893, 41097004, 45610432, 51768663, 59183969, 69308150, 84040326, 99644786, 106250321, 103406951, 100268150, 94026799, 84211129, 73590626, 62276869, 52774556, 45561532, 39936880, 36206276, 33233348, 31471199, 29970834, 27816325, 24992211, 23397350, 23044909, 21958567, 20591355, 19348488, 17625975, 16980870, 16634363, 16221048, 15085852, 13725307, 13449582, 13337272, 12932547, 12631914, 12175775, 11329640, 11150416, 10921355, 10978722, 10958279, 10496506, 9642895, 9099607, 9080635, 9644672, 9894385, 9001067, 8985307, 9127560, 8694139, 8949896, 9993803]
4180I993803o70773p91433L46450O53230N95185k45849r70821J90292p29122K05578
4170H576540J078716j09609k27907K63844l66050k86384L50023L6472K10032n62231
4160H963446l34040M36047M35555J2524J86469m67071l88617J67831M30218m03413
4150I038949K1334q12128k9808O66076N01337N29031J6373l16960L12048m0159
4140I886093J74221K31351J48444J1650p9003P5699P87881L59638M23339J95433
4130A2214746K10679Q25025J71096p000j03097n20241J49912l7278L43984O9509
4120A3317335k51913K52427L19194O742l00759o1512m86598l41415k57569j57386
4110A2038546J17402M0664q81710K93125n6934n1067l58656M2579J13640K98704
$$ y = [9993803, 9323030, 8531597, 8878047, 9531277, 10126462, 9880613, 8909792, 9100084, 8370962, 8576540, 9655256, 9545647, 9317740, 9581584, 9215534, 8929150, 9279173, 9315645, 9525677, 8963446, 8629406, 9065453, 9501008, 9513532, 9700001, 9232930, 8844313, 9012144, 9442362, 9038949, 9060283, 8248155, 8218347, 8884423, 9385760, 9914791, 9931164, 9614204, 9926252, 9886093, 10060314, 10291665, 10440109, 10451759, 10372756, 10448455, 11236336, 11595974, 12019313, 12214746, 12425425, 13250450, 13421546, 13414546, 13311449, 12791208, 12941120, 12903842, 13247826, 13317335, 13065422, 13317849, 13637043, 13643785, 13343026, 13281514, 12794916, 12453501, 12195932, 12038546, 12155948, 12196612, 11314902, 11608027, 11551093, 11500026, 11141370, 11183949, 11297589, 11596293]
4100A1596293k97896K39877j00958n99647K40188L16390J83020n7466M67590l9758
4090A1947633J96687Q34469j7936O81767L3549M74271J37827j00743N11113Q06946
4080A5505583M31503M16128L61238l64790M42708Q67841L9012J16965M12262q5049
4070A8143401N26642O11478j66224N17920J004637J135453K148896J451632K148175
4061B7522010K306490J95855o67603j102849j392036j247070j738595k027595
4053B1848607r06607l60655j553239n21724k13977n92763o8767m43860j56887
4044A7030128j49703K2306M30293L79421o1487j7704m04586k52662q227K73505
4034A7241284n46727n57593Q9386L55528J228439N13685M43601k43961J03691
$$ y = [11596293, 11298397, 11538274, 11437316, 10837669, 11077857, 11394247, 11577267, 11519801, 11987391, 11947633, 12144320, 12978789, 12960853, 13642620, 13676169, 14150440, 14288267, 14187524, 14698637, 15505583, 15937086, 16353214, 16714452, 16349662, 16792370, 17660211, 17699223, 17816188, 18228450, 18143401, 18670043, 19281521, 19115297, 19633217, 20637854, 21773307, 23922203, 25373835, 27522010, 29828500, 30024355, 29356752, 28253903, 26861867, 25614797, 23876202, 21848607, 20942000, 20581345, 19028106, 18506382, 18292405, 17699642, 17630875, 17187015, 17030128, 16880425, 16902731, 17333024, 17712445, 17650958, 17633254, 17228668, 16976006, 16967779, 17241284, 16694557, 16136964, 16226350, 16581878, 17810317, 18324002, 18767603, 18523642, 18627333]
4025A8627333M81261L94064o8981l54264L58281O41149J5114j54587p05638n84220
4015A8649512Q1898Q42536l95419j14305k43135j27086O1737k81985k70503J01958
4005A8305208j78079M18055N61983l06119L24670P09161l26887l14189R9139O61179
3995A9954121k00709m37834K41989K46456n99431o3091N01614p6839k01850q1767
3985A9282659m50968J6281M3704n7909K9870n87241J55917N47846o77600p45825
3975A7556734J174968K10591l07804O5096J52323N28706P73214J70492M05775
3966B0730095n43723j03838J132335Q27490K18957L34686k68290J222201J716121
3957B5266034R83518J090240J587313K251796L003006P70208n90447n76404q95544
$$ y = [18627333, 19108594, 19502658, 19433677, 19079413, 19437694, 20078843, 20093957, 19939370, 19233732, 18649512, 18731410, 19573946, 19178527, 19064222, 18821087, 18694001, 18755738, 18473753, 18203250, 18305208, 18127129, 18545184, 19107167, 18801048, 19125718, 19834879, 19507992, 19193803, 19292942, 19954121, 19753412, 19315578, 19557567, 19804023, 19204592, 19141501, 19643115, 19566276, 19364426, 19282659, 18831691, 18847972, 18891676, 18833767, 18863637, 18276396, 18432313, 18980159, 18302559, 17556734, 18731702, 18942293, 18634489, 18699585, 18851908, 19380614, 20153828, 20324320, 20730095, 20186372, 20082534, 21214869, 22042359, 22261316, 22596002, 22327712, 23549913, 25266034, 26249552, 27339792, 28927105, 31178901, 34181907, 34952115, 34361668, 33785264, 32889720]
3948C2889720q63089l88859p65651j465613p93801j64066l72982M03740M79932
3939B8959331L45707L44495L66474p3924o47778J28260J46487l63401L8575O27976
3929B9872202L52894O47216O21904J319189J644662J702833K061624K311693R15080
3920D1449297j025283j78140l11737j067943j454025j079203k29814k27627n04855
3911C5370670j107686p58604l3214K44813J12468m58492o51217k65881k55738
3902C2197119L71022K01668p42489o12156K3616m16322k75732o81852q24545p34977
3892B8505352r94688Q0476M21796m83449n48879L40313O44310m46501n63447q9259
3882B6866024M2674m94p8529o9363l14410j68919Q62206K71202K58215j88337
$$ y = [32889720, 32026631, 31637772, 30872121, 29406508, 28612707, 28448641, 28075659, 28479399, 28959331, 29305038, 29649533, 30016007, 29942083, 29294305, 29422565, 29569052, 29205651, 29244226, 29872202, 30225096, 30872312, 31494216, 32813405, 34458067, 36160900, 38222524, 40534217, 41449297, 40424014, 40245874, 39934137, 38866194, 37412169, 36332966, 36103152, 35875525, 35370670, 34262984, 33504380, 33471166, 33715979, 33828447, 33369955, 32718738, 32452857, 32197119, 32568141, 32769809, 32027320, 31415164, 31438780, 31022458, 30746726, 30064874, 29240329, 28505352, 27510664, 27591140, 28012936, 27529487, 26980608, 27320921, 27965231, 27518730, 26955283, 26866024, 26908698, 26908204, 26829675, 26760312, 26445902, 26276983, 27139189, 27410391, 27668606, 27480269]
3872B7480269j31035J88048J61046p202P9400m7843J64125L85386j44708J73832
3862B8301318L35486O96291L58709m8525J039931O86761L06300L71543O65498
3853C2713312K12275O17358J131258J308020J100453P75607J747458J666774J492930
3844D2765445J105511J053871J688580J922335J257162K261608J949244J475506
3836E5479262R46821Q99892L45984J57414l49924j13580l38792p24713k34706
3827E6067658M40549k06052L75997Q69436O56618L81993N11430N94505N17711
3818F0209845L67577L12992N10516L14203J91802J10412o90373J1126J53072p21259
3808F0769913r10155n49103n92022k44365m00300m15924j6046n46157n79853N0543
$$ y = [27480269, 27349234, 27537282, 27698328, 27691126, 27770526, 27722683, 27886808, 28272194, 28127486, 28301318, 28636804, 29333095, 29691804, 29643279, 30683210, 31369971, 31676271, 32047814, 32713312, 32925587, 33542945, 34674203, 35982223, 37082676, 37858283, 39605741, 41272515, 42765445, 43870956, 44924827, 46613407, 48535742, 49792904, 52054512, 54003756, 55479262, 56426083, 57325975, 57671959, 57829373, 57479449, 57365869, 57027077, 56302364, 56067658, 56508207, 56302155, 56678152, 57547588, 58204206, 58586199, 59097629, 59692134, 60209845, 60577422, 60890414, 61400930, 61715133, 61906935, 62017347, 61326974, 61338100, 61491172, 60769913, 59859758, 59310655, 58718633, 58474268, 58073968, 57658044, 57641998, 57095841, 56515988, 56566531]
3798E6566531p04889j082892k11357j94810m66825p71422n25092n0305j82482
3789E2376457j084466m64338j261905n90855j83891k87015r24908q66264k60621
3780D6452194M57271m26480K56353j76088j036651l21630Q99838Q796r9335J34700
3770D6148968m47882P28543J026826M25131J56833o77545M20526L35523m71767
3761D7645156j57996j65455r02541m32705q45363r34805k01438o56101o48585
3752D2700167o66552j583977j108928K73447j233732j648165o23568j372624k58821
3743C4477247r44263j241735k22354j015514r98885N1620l11840j080313j74177
3734B8539786p81124m82534j46060l11933j72992K57747j15915K37412m99875
$$ y = [56566531, 55861642, 54778750, 54567393, 54372583, 53905758, 53134336, 52609244, 52558939, 52376457, 51291991, 50827653, 49565748, 48974893, 48791002, 48503987, 47579079, 46712815, 46452194, 46909465, 46482985, 46739338, 46563250, 45526599, 45204969, 46104807, 46113603, 46014268, 46148968, 45701086, 46429629, 47456455, 47881586, 48038419, 47360874, 47781400, 48116923, 47645156, 47487160, 47321705, 46419164, 45986459, 45141096, 44206291, 44004853, 43348752, 42700167, 42033615, 40449638, 39340710, 39614157, 38380425, 36732260, 36108692, 34736068, 34477247, 33532984, 32291249, 32068895, 31053381, 30054496, 30106116, 29794276, 28713963, 28539786, 27758662, 27276128, 27130068, 26818135, 26645143, 26902890, 26786975, 27024387, 26524512]
3725B6524512l26854L64556k41030O6628K41117p73769j22982O3348l35479l72889
3715B5087158N41734j31031k20034M00759q81292m77450M0778m04865j03047k17319
3705B3635391l43231M49530K63608k86725O1897J82087k54383o06182L90541K5024
3695B3517557J45021k12525k98442L87492r167M45832J785797k66876o62673O22811
3685B5454827k75375M7335K43451J84625l3122k80932L03050Q94526N89145n62749
3675B6564781P29651o80549o32077Q60863M48421M9792l98089m79450J74731j50706
3665B6487368J10466M27190j66038o44876J088307R33014L5484P35874Q14424
3656B9821213R3376j8787K07792K91044O63128p07216M6247j34328k28836R44786
$$ y = [26524512, 26197658, 26562214, 26321184, 26387812, 26628929, 25855160, 25732178, 25795526, 25460047, 25087158, 25628892, 25497861, 25277827, 25678586, 24797294, 24319844, 24360622, 23955757, 23852710, 23635391, 23292160, 23741690, 24005298, 23718573, 23780470, 23962557, 23708174, 23101992, 23492533, 23517557, 23662578, 23450053, 23151611, 23539103, 23529936, 23975768, 25761565, 25494689, 24832016, 25454827, 25179452, 25226787, 25470238, 25654863, 25621741, 25340809, 25643859, 26538385, 27127530, 26564781, 27294432, 26613883, 25981806, 26842669, 27291090, 27340882, 26942793, 26463343, 26638074, 26487368, 26597834, 27025024, 26858986, 26214110, 27302417, 28235431, 28270915, 29006789, 29821213, 29914589, 29895802, 30103594, 30394638, 31057766, 30350550, 30396797, 30262469, 30033633, 30978419]
3646C0978419M04662o33173M83170m08533K32602N90946L49255M26062J65355
3637C2588765K04595N75092J087684O31952Q09053J242179R44833J936082J109210
3628D1129445K617907K247538J854016K681776L337294M032199M224382L630269
3620F5754826K988819K200806J052192l73073k158338l003499l705974l747435
3612E9008324l394413l329846l509358l136465k065384k065613j680431o91122
3604C9135692j123231m18616k72204l45405n6304n94505m31961m87540o80376
3595C4725550K70501q67340n5148O20027k7145n65576R12583R63559K66641R27017
3585C7170669K23792N04342P03136J65443K25853Q8043k39316j49472N36835J19909
$$ y = [30978419, 31383081, 30749908, 31233078, 30824545, 31057147, 31648093, 31997348, 32423410, 32588765, 32793360, 33368452, 34456136, 35088088, 35897141, 37139320, 38084153, 40020235, 41129445, 43747352, 45994890, 47848906, 50530682, 53867976, 57900175, 62124557, 65754826, 68743645, 70944451, 71996643, 71623570, 69465232, 66461733, 62755759, 59008324, 55613911, 52284065, 48774707, 45638242, 43572858, 41507245, 39826814, 39135692, 38012461, 37593845, 37321641, 36976236, 36919932, 36325427, 35893466, 35405926, 34725550, 34996051, 34128711, 34073563, 34693590, 34666445, 34100869, 35013452, 35977011, 36243652, 37170669, 37394461, 37898803, 38601939, 38767382, 38993235, 39081278, 38841962, 38692490, 39229325, 39349234]
3575C9349234P83333K34955j03036J066361N24935j56110Q12686P25434L92446
3566D3630238L53388R02021K364704K745500L214669L877563L571984M215610
3558F4875677M027234L194913K339574j36451j926647j741005j923281l597971
3550F5112043k268143k908600k182091j119225j343212p86078j42453k93851L65125
3541E4433515J259199J285385K303586K551134K391084M523026L643686L223144
3533G5613759L027192R35318o88243k646926m184756l551487l291924m515151
3525F0697782l487232l231381k563353j870248k195559j895444j194376j299548
3517D2960641j002283j69317o30262j247190l90174K60447L62095N09231o92732
$$ y = [39349234, 40132567, 40367522, 40264486, 41330847, 41855782, 41699672, 42512358, 43237792, 43630238, 43983626, 44885647, 47250351, 49995851, 53210520, 57088083, 60660067, 64875677, 68902911, 72097824, 74437398, 74300947, 72374300, 70633295, 68710014, 65112043, 62843900, 59935300, 57753209, 56633984, 55290772, 54504694, 54362241, 54068390, 54433515, 55692714, 56978099, 59281685, 61832819, 64223903, 68746929, 72390615, 75613759, 78640951, 79576269, 78888026, 76241100, 72056344, 68504857, 65212933, 60697782, 57210550, 53979169, 51415816, 49545568, 47350009, 45454565, 44260189, 42960641, 41958358, 41789041, 41158779, 39911589, 39521415, 39781862, 40143957, 40653188, 39960456]
3508C9960456O09588K72786M11560J005906O77050N92011O27212J23856Q20771
3499D5101196K032869M54738J119470J430653Q72682K355585K890008L025160
3491E9282361L509137K921450L382484M746723N115156M436407M972980M372331
3483I2739029M482198K797504J028883M15482q13971k051352k351949k523450
3475I3722374k862059k523836k394078j547787p04380j093637M09754R23700J252488
3466H5182539K532316K519675K158299L301042L790595L116231K765202J607806
3458A06973705M033o03090j777202j950462m092445m463085l885720l847610m053304
3449H2304820l561512l821226l359692k672330k868781j625032r52441j143361
$$ y = [39960456, 40570044, 40842830, 41254390, 42260296, 42937346, 43529357, 44156569, 44280425, 45101196, 47134065, 47588803, 48708273, 50138926, 51011608, 53367193, 56257201, 59282361, 62791498, 65712948, 69095432, 73842155, 78957311, 83393718, 88366698, 92739029, 97221227, 100018731, 101047614, 101463096, 100649125, 98597773, 96245824, 93722374, 90860315, 88336479, 85942401, 84394614, 83690234, 82596597, 83006351, 83930051, 85182539, 87714855, 90234530, 92392829, 95693871, 99484466, 102600697, 105365899, 106973705, 106977738, 106374648, 104597446, 102646984, 98554539, 94091454, 90205734, 86358124, 82304820, 78743308, 74922082, 71562390, 68890060, 66021279, 64396247, 63443806, 62300445]
3441F2300445J9884o28791q68946J118496Q13790J151237J405068J194049K060231
3432F8565463K033320K446621L401513L012748L862888N381846M947257M957713
3424I8609369N819391N807428N838461N658655N325088N313657M686481M462881
3416A41521411N944060N100870M715792M485559M135974K603712J322843k159593
3408A67670628m744348o650328p780552p748435q406032r690272p707126p154218
3400A07789317n771676m568194m441769m080887l594102k911880j967312j591409
3392G8862088j717178j605022j450703j533477j037403k43420l17006q21099l12431
3383F9824349N23114J082993R05252R10981P45720J476071K087758K419224K441587
$$ y = [62300445, 62320329, 61691538, 60822592, 61941088, 62754878, 63906115, 65311183, 66505232, 68565463, 70598783, 73045404, 76446917, 79459665, 83322553, 88704399, 93651656, 98609369, 104428760, 110236188, 116074649, 121733304, 127058392, 132372049, 137058530, 141521411, 147465471, 152566341, 157282133, 161767692, 165903666, 168507378, 169830221, 167670628, 162926280, 156275952, 148495400, 140746965, 132340933, 122650661, 114943535, 107789317, 102017641, 97449447, 93007678, 88926791, 85332689, 82420809, 80453497, 78862088, 77144910, 75539888, 74089185, 72555708, 71518305, 71274885, 70957879, 70136780, 69824349, 70347463, 71430456, 72335708, 73246689, 73992409, 75468480, 77556238, 79975462, 82417049]
3374H2417049J770734K815606L797310L978619L471768L643171L386700K783036
3366A08063993L003445L050235J732589M14212m99375j76475j235851j880896
3358A12471877j775418j503163k296451p68337r93806q75947q48190o65217p22796
3349A02022552j356076j469307j520726j877348j374579j542437j484518q94226
3341I0503335p52776J15361J382385J614597K333200K641145K854473L740412
3333A04432132M451992M199834L730304L268400L066104K459512O09786j66873
3325A26051191n43960j389527j976555j547941j514144k07100P99079J303470
3317A20974513J912810K915728M083481M990142M505162K772885K119896J018520
$$ y = [82417049, 84187783, 87003389, 90800699, 94779318, 98251086, 101894257, 105280957, 108063993, 111067438, 114117673, 115850262, 116264474, 115765099, 115588624, 114352773, 112471877, 110696459, 109193296, 106896845, 106128508, 105134702, 104258755, 103410565, 102745348, 102022552, 100666476, 99197169, 97676443, 95799095, 94424516, 92882079, 91397561, 90503335, 89750559, 89865920, 91248305, 92862902, 95196102, 97837247, 100691720, 104432132, 108884124, 113083958, 116814262, 120082662, 123148766, 125608278, 126218064, 126051191, 125507231, 124117704, 122141149, 120593208, 119079064, 118871964, 119671043, 120974513, 122887323, 125803051, 129886532, 134876674, 139381836, 142154721, 144274617, 145293137]
3309A45293137J47867n76693k630609k310749l118786l568649l478458m520740
3301A25236320m521066l562502l786589l796635k719280l590602m229041k942949
3293I6087656l328227l884015m126826l625672k652482k664487l885929k617314
3285F9302704j934658k586104k327012k446107j708596j238089j878433n86379
3277E4597326m21538l81324k19275N03933L46109k47864L37746P22496Q82809
3268E6120418O72662K73729P40853J241684J169457J722546J222460J433232J549731
3259F6146772J192193J610316J688645J729502J214934J348200J423117Q60410
3251G7214089J062109N03166O82538J03124j71735n12452p93595j279404j901517
$$ y = [145293137, 145441004, 144864311, 142233702, 139922953, 136804167, 133235518, 129757060, 125236320, 120715254, 117152752, 113366163, 109569528, 106850248, 103259646, 99030605, 96087656, 92759429, 88875414, 84748588, 81122916, 78470434, 75805947, 71920018, 69302704, 67368046, 64781942, 62454930, 60008823, 58300227, 57062138, 55183705, 54597326, 54175788, 53794464, 53575189, 54079122, 54425231, 54177367, 54515113, 55237609, 56120418, 56793080, 57066809, 57807662, 59049346, 60218803, 61941349, 63163809, 64597041, 66146772, 67338965, 68949281, 70637926, 72367428, 73582362, 74930562, 76353679, 77214089, 78276198, 78779364, 79461902, 79565026, 79393291, 78880839, 78087244, 76807840, 74906323]
3242G4906323k473267k020852k034343k814663k460774j912279q58024j382336
3234E8949785j523792N866L79725O78597R17732J350213J551600K540289L062881
3225F7912896L835460L919074M255063M931970M609181L595334L659652L484168
3217A00202798L522919L354411L003593J916506J053935q95057j664185l054397
3209A07440523m096871l864413m969915n337099n049541n091148m784018m451443
3201F9796075m117639m650988m382388k880317j981984k112686l133166k126021
3193D4410886j495954j797894r62200p89666j009068j387627j146256l72463n85692
3184C4864066j665317r15636m97472j287168q28782j03263k63569j159306n17831
$$ y = [74906323, 72433056, 70412204, 68377861, 65563198, 63102424, 61190145, 60332121, 58949785, 57425993, 57431859, 57811584, 58490181, 59407913, 60758126, 62309726, 64850015, 67912896, 71748356, 75667430, 79922493, 84854463, 89463644, 93058978, 96718630, 100202798, 103725717, 107080128, 110083721, 112000227, 113054162, 112159105, 110494920, 107440523, 103343652, 99479239, 94509324, 89172225, 84122684, 79031536, 74247518, 69796075, 65678436, 61027448, 56645060, 53764743, 51782759, 49670073, 46536907, 44410886, 42914932, 41117038, 40154838, 39365172, 38356104, 36968477, 35822221, 35449758, 34864066, 33198749, 32283113, 31785641, 30498473, 29669691, 29566428, 29302859, 28143553, 27625722]
3175B7625722p90887m85565p76733n12877o97008j261196m34399L45938k76107
3166B2736888n63436k18255K57437l23502L2210k6321P82614K14000L78334N49857
3156B3819826N0443m21409J18496K65019k90140P58100N55016K17674J88642R76160
3146B6237827J148361N80591R59248P91231R58535J81446l93701o4226j58627
3137C0240685j372454q03869p47647j067193r51387j395581n40579k88209j151600
3128B1922166j266236k94422r31215r17532l26283n27661o45839r10306j184262
3119A4918410q7033n18415j026734K3991P1691j83612K87155p07296p17763J33483
3109A2193877k98833n73650l73929k14032M95310r4714m47764P52604j08018o01647
$$ y = [27625722, 26834835, 26349270, 25572537, 25059660, 24362652, 23101456, 22667057, 23012995, 22736888, 22173452, 21955197, 22212634, 21889132, 21921342, 21895021, 22677635, 22891635, 23269969, 23819826, 23870269, 23448860, 23567356, 23832375, 23542235, 24300335, 24855351, 25073025, 25261667, 26237827, 27386188, 27966779, 28926027, 29717258, 30675793, 30857239, 30463538, 30399312, 30240685, 28868231, 28064362, 27316715, 26249522, 25298135, 23902554, 23361975, 23073766, 21922166, 20655930, 20361508, 19430293, 18512761, 18186478, 17658817, 17012978, 16102672, 14918410, 14831377, 14312962, 13286228, 13310219, 13381910, 13198298, 13485453, 12778157, 12060394, 12193877, 11895044, 11321394, 10947465, 10733433, 11228743, 11134029, 10686265, 11438869, 11330851, 10729204]
3099A0729204Q28645L30762p08542j40881o2865j46041m36464p35058J69121L33041
3089A0160922l7207K43527L02777m68509n35869j19804n3083k14851K06672K5890
3079I510465l54472l19044J84858M50243j29520R6430r8762o21464J80531O78874
3069I578139N05049q47664n34328o7536l94000J35670Q1309M21515J82626q23009
3059H237771J34714K58102o06797q7100m40949o86856k22194k84759M07803L23567
3049G033302n64514K08064J93113K20002L01543J74047p70155j07336J19609o92717
3039F114958j53704N51263J9724j48206L4866O5818j88072m25195L15188M58956
3029F645596m69513m89752L20377M01702P40198J11979k51956L44229O30539L94457
$$ y = [10729204, 11557849, 11888611, 11180069, 11039188, 10976323, 10830282, 10393818, 9658760, 9827881, 10160922, 10123715, 10367242, 10670019, 10201510, 9665641, 9545837, 9492754, 9277903, 9484575, 9510465, 9155993, 8836949, 9021807, 9472050, 9342530, 9438960, 9340198, 8718734, 8899265, 9578139, 10083188, 9235524, 8701196, 8633660, 8239660, 8375330, 8456639, 8878154, 9060780, 8237771, 8372485, 8630587, 8023790, 7936690, 7495741, 6808885, 6586691, 6301932, 6709735, 7033302, 6468788, 6676852, 6869965, 7089967, 7391510, 7565557, 6795402, 6688066, 6807675, 6114958, 5961254, 6512517, 6532241, 6384035, 6418901, 6484719, 6296647, 5871452, 6186640, 6645596, 6176083, 5686331, 6006708, 6408410, 7148608, 7260587, 7008631, 7352860, 7983399, 8377856]
3019H377856j9485l85242k28340j99044m21951m47824Q7649j84883l25351K81729
3009F535114j22355o41190l97970k54575p9518m77358K51746N60538K22155q39380
2999D757207k55558L44508K32965M48383o1995o61656n82663L01290L46499K19525
2989E088505k75620m98187l3483N17444N35475L92381j030236m73452M8446l15278
2979C955995M01377N52895k25314m51402j95275l4783J00612l85866K86545J14147
2969D118931k34897J0627q8769j81212l48444k37515j30689k54646J76047N19387
2959C348820L89961k90839k90855J51244l2612K72808L05106n97529k51675l60808
2949B643621p3817k39323J68232P6486l74688L87662N8101j48714r0217k57121
$$ y = [8377856, 8358371, 7973129, 7744789, 7545745, 7123794, 6675970, 6763619, 6578736, 6253385, 6535114, 6412759, 5771569, 5373599, 5119024, 5039506, 4562148, 4813894, 5374432, 5596587, 4757207, 4501649, 4846157, 5079122, 5527505, 5465510, 4803854, 4221191, 4522481, 4868980, 5088505, 4812885, 4314698, 4281215, 4798659, 5334134, 5726515, 4696279, 4222827, 4271273, 3955995, 4357372, 4910267, 4684953, 4233551, 4038276, 4003493, 4104105, 3718239, 4004784, 4118931, 3884034, 3894661, 3805892, 3624680, 3276236, 3038721, 2908032, 2653386, 2829433, 3348820, 3738781, 3447942, 3157087, 3308331, 3275719, 3548527, 3853633, 3256104, 3004429, 2643621, 2569804, 2330481, 2498713, 2575199, 2200511, 2588173, 2646274, 2497560, 2407343, 2150222]
2939B150222M02968l4432o12282K20633N43650j82135m12813k51307J911N15017
2929B341432J77567k50757n48567k21441M95813O86436j64924m07672l76618m93656
2919A237613K20316J022475p60675p70056L1297O89437M28046j00159p7680K28441
2909B149055k47455n61189J03113N52730j49352n56208N2409L66494n7255k73913
2899A378429l8865K2526q99829P8608R28965N56761j131327m89259M30406O59664
2889A496079K22883k01408n77305l83400j77060Q40080N69981n22805J32678n19424
2879H80299K17670L46084k39753k63794N7221J14991j21865J67729J61758K95898
2869A616238j77267m17087Q5802r0024R969N33308n6429p9093J00979p94103O94744
$$ y = [2150222, 2553190, 2518758, 1906476, 2127109, 2670759, 2488624, 2075811, 1824504, 1826415, 2341432, 2518999, 2268242, 1719675, 1498234, 1994047, 2680483, 2515559, 2107887, 1731269, 1237613, 1457929, 2480404, 1719729, 949673, 980970, 1670407, 2098453, 1998294, 1920614, 2149055, 1901600, 1340411, 1443524, 1996254, 1846902, 1290694, 1343103, 1709597, 1652342, 1378429, 1339564, 1362090, 462261, 540869, 1469834, 2026595, 895268, 406009, 836415, 1496079, 1718962, 1517554, 940249, 556849, 379789, 1219869, 1789850, 1267045, 1399723, 880299, 1097969, 1444053, 1204300, 940506, 997727, 1112718, 990853, 1158582, 1320340, 1616238, 1438971, 1021884, 1107686, 1017662, 1027631, 1560939, 1504510, 1425417, 1526396, 732293, 1427037]
2858A427037P16983p58701o79681l67543K93368M50303l9341O22828M51116o95904
2848A420465p25474Q54765K22907k38143j05157o12986m4684K45300m65673J378510
2838A929830l8970n1787m68917L9635M89894K44146m47380p27885l22870n72845
2828G2851K16360P22221L17507m34415n22483L57335J008634J30068p17806O57035
2818A807307k81447l89651J10329N2477N39147m91859l04094K17133K25817l98958
2808A086201J28318N77842l84548q5221Q10041O1784k46867p07059k71870K50209
2798A218830J06379K75264J5561k38805M26449J36218M50638L0856l04687N2157
2788B168860n36567L0837j82255m86317K17754J75644O07469J75164l19287J21885
$$ y = [1427037, 2144020, 1385319, 705638, 338095, 631463, 1081766, 1042425, 1665253, 2116369, 1420465, 694991, 1549756, 1772663, 1534520, 1429363, 816377, 771693, 1016993, 551320, 1929830, 1890860, 1839073, 1370156, 1409791, 1899685, 2143831, 1696451, 968566, 645696, 72851, 289211, 1011432, 1328939, 894524, 372041, 729376, 1738010, 1868078, 1150272, 1807307, 1525860, 1136209, 1246538, 1299015, 1838162, 1346303, 1042209, 1259342, 1485159, 1086201, 1214519, 1792361, 1407813, 1322592, 2132633, 2194417, 1947550, 1240491, 968621, 1218830, 1325209, 1600473, 1616034, 1377229, 1803678, 1939896, 2390534, 2421390, 2116703, 2168860, 1632293, 1663130, 1480875, 994558, 1212312, 1387956, 1995425, 2170589, 1851302, 1973187]
2778A973187j49368l73611p9778j48707K53243o0108J3970o53330m9702K76191
2768A001987K01553N54732R4942n53115j1415k44297N36576L88192p4235k74433
2758A620487k73159m25602j3190P39153l53893o06553j809J5231O63576K06997
2748A571238K95117k8553j005001O0105J94907N1180j60925j06910R8860M31467
2738A401485N86490l83869m21615M2732k42153J70691K79244j063527O21006L35718
2728A326202k78976O47816L03820n53477n37417L34681j25519P4339k4057l84167
2718G83245J59657k72756m63829Q38119l76672K06873L02874k10317j04536j06712
2708G55946M2203J26430m89792j16923Q09091r4564n25408K53630J39364j39119
$$ y = [1973187, 1823819, 1450208, 1370430, 1221723, 1474966, 1414858, 1428828, 775498, 725796, 1001987, 1203540, 1758272, 1853214, 1300099, 1288684, 1044387, 1580963, 1969155, 1894920, 1620487, 1347328, 921726, 908536, 1647689, 1293796, 687243, 685434, 700665, 1364241, 1571238, 1866355, 1837802, 832801, 892906, 1087813, 1138993, 978068, 871158, 970018, 1401485, 1987975, 1604106, 1182491, 1225223, 983070, 1153761, 1433005, 369478, 990484, 1326202, 1047226, 1695042, 1998862, 1445385, 907968, 1242649, 1117130, 1191469, 1167412, 783245, 942902, 670146, 206317, 1044436, 667764, 874637, 1177511, 967194, 862658, 755946, 798149, 924579, 434787, 317864, 1126955, 1032391, 506983, 760613, 899977, 760858]
2698G60858k19131J36049n9381K62950j69006L97657o25112k94460Q67733J01551
2688A159708n15049J31773J39037r521J23092l01113J54451j48431m35285O47320
2678I45982L75064j73896l32335L56534o2752j53824k55375r8075k50578m6337
2668C04408O79484j59489J22413l06548k63624R384m1851J30090N56294n4763
2658I75798j53741k15684K1283k47677L37325k45416k32835L31303k34452O0887
2648C96791l61361K42709P33720n61473M13115K4696k13092j64078n69931M661
2638e4243P00157N1790n99068k05717K36711K95918K37458O6856m20806J35054
2628D44110J59376L54725L17851p14775K6674j67705Q5751L68404k34639K72304
$$ y = [760858, 541727, 677776, 618395, 881345, 712339, 1109996, 484884, 190424, 1058157, 1159708, 644659, 776432, 915469, 905948, 1029040, 727927, 882378, 733947, 298662, 945982, 1321046, 1147150, 814815, 1171349, 1108597, 954773, 699398, 601323, 350745, 304408, 983892, 824403, 946816, 640268, 376644, 386028, 344177, 474267, 1030561, 975798, 822057, 606373, 627656, 379979, 717304, 471888, 239053, 570356, 335904, 396791, 35430, 278139, 1011859, 450386, 863501, 888197, 675105, 511027, -58904, -54243, 645914, 697704, 98636, -107081, 129630, 425548, 663006, 729862, 309056, 444110, 603486, 958211, 1276062, 561287, 587961, 420256, 506007, 874411, 639772, 912076]
2618I12076J90125o54102l05445L41740P9088N651K00682L2326L3113P0000j265
2607I03989K16380J25988n03767j13358J96026J273873P76076p86129n73320P36132
2597B251890J270215N01746L82252J02881j353151r88110L03527m5826l79915
2588B045509m91863J53318M6658n03584q3192K35846k3316j153527j40473K89539
2578C74915L08318K97789p83156K54058q8933N97692K60447Q0401L28183j92347
2568A437367n60550K68988k15329J9461p89929J15880Q17385k05817r4892k0678
2558G71886N37496m4192l90136L75718J33645k51546k41805L41106J91736K07089
2548A630997l43503j36355J46188l74213Q5459k36651k5261M58524J93919m71558
$$ y = [912076, 1102201, 448099, 142654, 484394, 563482, 569133, 769815, 802141, 835254, 905254, 903989, 1120369, 1246357, 742590, 629232, 825258, 2099131, 2875207, 2089078, 1515758, 2251890, 3522105, 4023851, 4406103, 4508984, 3155833, 2167723, 2471250, 2425424, 2045509, 1553646, 1706964, 1753622, 1250038, 1166846, 1402692, 1379376, 225849, 85376, 374915, 683233, 981022, 197866, 451924, 362991, 960683, 1221130, 1301531, 1629714, 1437367, 876817, 1145805, 930476, 949937, 160008, 275888, 1093273, 887456, 792564, 771886, 1309382, 1265190, 875054, 1250772, 1384417, 1132871, 891066, 1232172, 1423908, 1630997, 1287494, 1151139, 1297327, 923114, 1008573, 771922, 746661, 1205185, 1399104, 927546]
2538I27546M12594L42492o58618j21731N874m45480M50597L61195P67962m35444
2528A606987o88665M24479K15384q4859P1127J30548o14848k17330J81200J38210
2518A162233J22077m87365J4854N12755j42125l2846K1168l38888K77611K84692
2508A394166o8422k17922k26144J91270J33809J84239J01317Q6820l87357l04177
2498H87599N45215k7585l8016J0777r1214j60219M22563K40015j93221o15563
2488I80351J13904K93536N2134q2958J74842l02463R6714O75799j5074j19094
2478A867691j01071P870J52247k30332k08216J038934m7962o06542l728M84492
2468B353383P829k9386m3485l37609k66603P204M37224L98890l78692N09655r05
$$ y = [927546, 1340140, 1682632, 1024014, 902283, 908157, 462677, 913274, 1274469, 2042431, 1606987, 918322, 1342801, 1558185, 1473326, 1544453, 1675001, 1060153, 842823, 1024023, 1162233, 1284310, 796945, 811799, 1324554, 1182429, 1149583, 1170751, 831863, 1109474, 1394166, 1325744, 1107822, 881678, 1072948, 1206757, 1390996, 1492313, 1579133, 1191776, 887599, 1432814, 1405229, 1367213, 1377990, 1286776, 1126557, 1549120, 1789135, 1595914, 980351, 1094255, 1387791, 1439925, 1356967, 1531809, 1229346, 1326060, 2001859, 1986785, 1867691, 1766620, 1774490, 1926737, 1696405, 1488189, 2527123, 2479161, 1872619, 1868891, 2353383, 2361212, 2331826, 2288341, 1950732, 1684129, 1691333, 2128557, 2527447, 2148755, 2658410, 2657505]
2457B657505o66492Q8267K19658j91286K03389J22047j36877k35478Q1348K8514
2447B170595M2054l89695K61009M41054l78655K69076P7559m37862M5952N22636
2437B623723L69886j98038j81001m9237R4908J12539k21998L24673j25775p6754
2427B672926N4791n09655o3770J13120m67886K50282Q29700L59215o47319n08015
2417B083389M45346O88667j70107j76502P6609l80941l64183N14864K53966k58674
2407B712434j62937l85509N32579O65759Q4243l48027J14654k53607m81148O07628
2397C086069M11954P20940p20345o69287M54321P17925j35354O49606L40439m88242
2387D368026m52163j53351Q92531K26243n51642M41091K72165K59020N17912J135803
$$ y = [2657505, 1991013, 2079280, 2298938, 2107652, 2311041, 2433088, 2296211, 2060733, 2142081, 2170595, 2212649, 1822954, 2083963, 2525017, 2146362, 2415438, 2492997, 2055135, 2101087, 2623723, 2993609, 2795571, 2614570, 2565333, 2660241, 2772780, 2550782, 2875455, 2749680, 2672926, 2727717, 2218062, 2154292, 2267412, 1799526, 2049808, 2879508, 3238723, 2591404, 2083389, 2528735, 3217402, 3047295, 2870793, 2947402, 2566461, 2202278, 2717142, 2971108, 2712434, 2549497, 2163988, 2696567, 3362326, 3446569, 3098542, 3213196, 2959589, 2478441, 3086069, 3498023, 4218963, 3498618, 2829331, 3283652, 4001577, 3866223, 4515829, 4856268, 4368026, 3915863, 3762512, 4655043, 4881286, 4329644, 4770735, 5042900, 5301920, 5819832, 6955635]
2377F955635L84358j47032j07610o1758N91154J41640m0133m2976P4760N00041
2367H248079Q20056j26108p530P57904L43392R8298M72408R61728R7736P99242
2357A2465205J428531J650004J486432N97749J677736J511263J708435K268610
2349B4793965K779357L548861M632663N217334N663465M034283L770418M890499
2341E9330845O075146O821719R189510J1402096J4877217K2662746L1646382M3356943
2333B05362604O1616385Q5715356J03628394P2326594J417645j9983161k4221647
2326D85862170m8974740o2308386p1383335o4697523n0205217l6483573k5717333
2319A26092063j9354904j3364738r375326o983706o098974p110602n558636m841033
$$ y = [6955635, 7339993, 7192961, 7085351, 7023593, 7614747, 7756387, 7716254, 7673278, 7748038, 8248079, 9068135, 8942027, 8934497, 9692401, 10035793, 10134091, 10606499, 11568227, 11665963, 12465205, 13893736, 15543740, 17030172, 17627921, 19305657, 20816920, 22525355, 24793965, 27573322, 31122183, 35754846, 40972180, 46635645, 50669928, 54440346, 59330845, 65405991, 72227710, 81417220, 92819316, 107696533, 130359279, 162005661, 205362604, 266978989, 352694345, 456322739, 528649333, 530066978, 510083817, 485862170, 436887430, 374579044, 303195709, 238498186, 188292969, 151809396, 126092063, 106737159, 93372421, 83997095, 77013389, 70914415, 63803813, 58245177, 53404144]
2311E3404144n346454m779070m523577l535397l075060k764367j762903k355695
2303B5261621j966526j471809K72644o09550j675934m37152k27162O3494k45777
2294A8963849q91965p81584j544092p62849j80694o45515q2174m66495o73573
2285A2934908o19898L11635M2485o19841n65316K1223k70858p60689q45780O61044
2275A0288913J94225p06772J35290j13626n07461n20339k859K1381j051970l2962
2265G703820m4998J9270m56836k63749K03244L74503m21317p18755m09235Q30776
2255F816723K91739o57960n66630k51090p1248j0960j57396q8161q28077M6161
2245D523101p6580L47638K06064m76103r6872k9559l10722q5028m7199o71634
$$ y = [53404144, 48057690, 43278620, 38755043, 35219646, 32144586, 29380219, 27617316, 25261621, 23295095, 21823286, 22095930, 21486380, 19810446, 19373294, 19146132, 19209626, 18963849, 18071884, 17290300, 15746208, 14983359, 14802665, 14157150, 14074976, 13608481, 12934908, 12315010, 12626645, 12669130, 12049289, 11483973, 11505196, 11234338, 10473649, 9627869, 10288913, 10483138, 9776366, 9911656, 9798030, 9290569, 8770230, 8767371, 8788752, 7736782, 7703820, 7658822, 7678092, 7221256, 6957507, 7160751, 7535254, 7113937, 6395182, 5985947, 6816723, 7108462, 6450502, 5883872, 5632782, 5561534, 5550574, 5393178, 5305017, 4476940, 4523101, 4446521, 4794159, 5000223, 4524120, 4427248, 4397689, 4086967, 4001939, 3954740, 3283106]
2235C283106L77318Q4701j80094M42275Q49625n3319M30922J34316o43710o21094
2225D104046j023982M36234N7813r49403o4887P07850l91880r5195L98762J33701
2215C313059K04174r91939j35536J90139o50887k08617L07735k9866L532L40643
2205B342437M21436L00208j05192o05889M01083k19541o18074q09140m0980K76373
2195A342721M85645n11923p1362P36376j78030n49255O00085P9198l55837L92398
2185A970016N531L74925o72675r03390J94418K54286p15427N33327Q33161R8287
2175A972459r6139L7823L16721Q59436q8332j083300j40369n53204J792R4527
2165A321414J24214R30686L49124o15532J73512J25831J81535n8602m98618n43225
$$ y = [3283106, 3660424, 3745125, 3565031, 4007306, 4856931, 4803612, 5234534, 5368850, 4725140, 4104046, 3080064, 3516298, 3574111, 2624708, 2559821, 3267671, 2875791, 2780596, 3179358, 3313059, 3517233, 2525294, 2389758, 2579897, 1929010, 1720393, 2028128, 1998262, 2001794, 2342437, 2763873, 3064081, 2958889, 2353000, 2754083, 2534542, 1916468, 1107328, 1066348, 1342721, 1828366, 1316443, 1245081, 1981457, 1803427, 1254172, 1854257, 1933455, 1577618, 1970016, 1975547, 2350472, 1677797, 774407, 968825, 1223111, 507684, 1041011, 1874172, 1972459, 1876320, 1914143, 2230864, 3090300, 3001968, 1918668, 1778299, 1225095, 1226887, 1321414, 1445628, 2376314, 2725438, 2109906, 2283418, 2409249, 2590784, 2532182, 2033564, 1490339]
2155A490339k61413k57506N41467M86799n65163K51404L65583M3627k22972j50699
2145A721466l82078K86179k97154J40114k0487N8474j18158O1963J56402O7644
2135A674365j6310l63971N58004K01746r88972m84338N51739K24625k88817m96834
2125E71237j6991K04191Q8318l18980O45951J44951m82960p9525L71493o5474
2115A062211n84084L60283r4874J13925o72508l77071P89329K54433n16071J55744
2105D91317Q6191j50265L40269m59005K69428j20358l03149K18346L29082J47063
2095H48919L16805l88588m14234K96067m33313l67910J036130L7578k09482J87663
2085I09635o8992l4490K63251n46253M32754K10126k39693k71908l70445O32827
$$ y = [1490339, 1228926, 971420, 1512887, 1999686, 1434523, 1685927, 2051510, 2095137, 1872165, 1721466, 1339388, 1625567, 1328413, 1468527, 1448040, 1506514, 1388356, 1450319, 1606721, 1674365, 1658055, 1294084, 1852088, 2053834, 1064862, 580524, 1132263, 1356888, 1068071, 571237, 554246, 758437, 846755, 527775, 1173726, 1318677, 835717, 756192, 1127685, 1062211, 478127, 838410, 743536, 857461, 184953, -192118, 597211, 851644, 335573, 491317, 577508, 427243, 767512, 308507, 577935, 457577, 154428, 372774, 701856, 848919, 1165724, 777136, 362902, 658969, 225656, -142254, 893876, 931454, 721972, 909635, 840643, 806153, 1069404, 523151, 955905, 1166031, 926338, 654430, 283985, 916812]
2075I16812P64190m72702r38759L44109O7130O1484J83848o2983L51674j58951
2065A055852L23068J419551j61951o49007Q07829R62782m81237p08937k0991L6341
2055B583300o59602r05344J2940M47757m19361M6892J65096k73307k90824k37095
2045D70452L71663L68429q53439j85024L47164L14922m34954M68691r5454j54075
2035F18375k50889k72594N71140K052l69061n32196K29994L69392N48495O6185
2025I80893N655K62072j04740m65135P7264M45595p90297l41764L1449P14663
2015H15655J65474p11895J13446P08006K46220m65590J67837M19726o57561m12317
2005C89001J18773l62445r71931J28393O21435N96631N42288N7815Q4040M9116
$$ y = [916812, 1681002, 1208300, 269541, 613650, 680780, 742264, 926112, 863129, 1214803, 1055852, 1378920, 2798471, 2636520, 1987513, 2795342, 3758124, 3276887, 2567950, 2546959, 2583300, 1923698, 1018354, 1031294, 1479051, 1059690, 1106582, 1271678, 998371, 707547, 470452, 842115, 1210544, 357105, 172081, 519245, 834167, 399213, 867904, 772450, 618375, 367486, 94892, 666032, 668084, 299023, -233173, -3179, 366213, 914708, 980893, 986548, 1248620, 1143880, 678745, 756009, 1201604, 411307, 69543, 100992, 815655, 981129, 269234, 382680, 1090686, 1336906, 871316, 1039153, 1458879, 801318, 389001, 507774, 145329, -826602, -698209, -76774, 519857, 1062145, 1119960, 1204000, 1253116]
1995A253116l98892l83263K15873M09822m01393r02400J08111J093709M37566
1986A432249m44000j91605J47064L15259n82882m3128K67133o52091k21067M49634
1976D76566K68141m28135K75330K62702J3201m26668Q2646M33670p9199k43219
1966F35035n48904M34859J47332J9792k80489K56277K91873M84883n8533p32618
1956F49507O0421l9757k53114N64095m22804m00704m01513N89352N14573K81215
1946A141271k36264l84631N42252K87235m43939m72475o3477k39022l13250k24553
1936d06853O62883M39888l06319N31291k3140L63183k12527j83851K71855m85089
1926F51321m96699q3313R03535k27997k876K85492o04392l70245M4798O19080
$$ y = [1253116, 854224, 470961, 686834, 1096656, 695263, -207137, -99026, 994683, 1432249, 988249, 796644, 943708, 1258967, 676085, 632957, 900090, 247999, 26932, 476566, 744707, 316572, 591902, 854604, 867805, 441137, 523783, 957453, 878254, 635035, 86131, 520990, 668322, 688114, 407625, 663902, 955775, 1440658, 1382125, 649507, 709928, 670171, 417057, 981152, 558348, 157644, -243869, 345483, 860056, 1141271, 905007, 520376, 1062628, 1349863, 905924, 433449, 369972, 130950, -182300, -406853, 256030, 695918, 389599, 920890, 897750, 1260933, 1048406, 864555, 1136410, 651321, 154622, 71309, 974844, 746847, 743971, 1029463, 425071, 54826, 99624, 718704]
1916G18704N29003o43454p53426O40551n24924j6963R01239k01905j55262j27808
1906C65755j25332J76180N51252l0293J16574K55590l26646j29753n17930l4141
1896C01256O09710n72889k62444M89175j76829K0462K27562n01969k47028K8663
1886h4331o54937N70481L62932p08858M48148N29214k32968N55003J61944P1849
1876A018477L89945p77840K40245p81184m73997N50480O45460O0488J73278j8944
1866A026408k410J12420K59034m94763j83536o99094N6644j00549l20367P62943
1856D16730M2761l35120L37117L89780k4009k28959J05538j72128k64560n2116
1846B15034l6928l96701P1558J74386N83260O26582k06846m37991j75560K02745
$$ y = [718704, 1247707, 604253, -149173, 491378, -33546, -50509, 850730, 648825, 493563, 365755, 240423, 416603, 967855, 937562, 1054136, 1309726, 983080, 853327, 335397, 301256, 910966, 338077, 75633, 564808, 387979, 408441, 636003, 134034, -112994, -84331, -739268, -168787, 194145, -514713, -66565, 462649, 229681, 784684, 946628, 1018477, 1408422, 630582, 870827, 89643, -384354, 166126, 811586, 872074, 1045352, 1026408, 1023998, 1136418, 1395452, 900689, 717153, 18059, 74703, -25846, -346213, 416730, 459491, 124371, 461488, 851268, 827259, 598300, 703838, 531710, 267150, 215034, 178106, -218595, -147037, 27349, 610609, 1237191, 1030345, 592354, 416794, 619539]
1836F19539l54830r7315j37225L31477P38123o30817k90762J64538j23162K9151
1826B48717L27545m709k97856N8770j97210m51779J05050N4933n44126K28965
1816d71700J37955N73597P9871L01718L37585L3166j06765o81091K34072P8350
1806E16758o98013Q7290J07262K27017K85347K11956k04517m40670Q2127J06935
1796B81492m08118k74054L47995P0815n8552l2687R5719O09375k38981K44563
1786F37567N6167M1759m25974l2961R4844j47522k11602O16364n3621k49873l03250
1775B1898N30671l41064j99981P5156j080779N66764O65409J96003n17748n89626
1765f73297L53850N1505L50790K0095J11752j47453n10305N71447N44357n29377
$$ y = [619539, 264709, 167394, 30169, 361646, 1099769, 468952, 178190, 342728, 219566, 248717, 576262, 571553, 273697, 332467, 135257, -316522, -211472, -156539, -700665, -471700, -333745, 239852, 319723, 621441, 959026, 992192, 885427, 204336, 438408, 516758, -181255, -93965, 13297, 240314, 525661, 737617, 533100, 92430, 174557, 281492, -126626, -400680, -52685, 18130, -40422, -73109, 22610, 631985, 393004, 637567, 693734, 735493, 309519, 276558, 371402, 223880, 12278, 628642, 575021, 325148, 21898, 552569, 211505, 11524, 86680, -994099, -427335, 238074, 434077, -83671, -673297, -319447, -267942, 82848, 102943, 214695, 67242, -443063, 128384, 672741, 143364]
1755A43364K2481N02161n0801j34472l54194J22011L13385P3149O7133l97026
1745C07191r7628L04440J91303j82409k02056J6991m7899O60076J9335k01283
1735G68061k88592J24692j36065r980P7619O33126r1445n06116k11265K34734
1725E94769P4726J31227P1862j08353m8703K95226j60155l56787J23559j21783
1715D95588m16046j23842K06447M89592m12796l50995J41473K41263m29760l63497
1705e22573K43800R09862J89471l77638J19029j16108N6362O94257K57578j148650
1695C05390o54384L90456R04813P4035m60622j034O3091J0106J64539K44641n76368
1684D64663m50615N8973P5901K82153L1826n8840k41331j54993P1080j55671M39655
$$ y = [143364, 165845, 668006, 617205, 482733, 128539, 250550, 563935, 637084, 704217, 307191, 209563, 514003, 705306, 522897, 320841, 337832, 289933, 950009, 969344, 768061, 479469, 604161, 468096, 458116, 535735, 1168861, 1077416, 571300, 360035, 594769, 669495, 800722, 872584, 764231, 715528, 1010754, 850599, 493812, 617371, 495588, 79542, -44300, 162147, 651739, 238943, -112052, 29421, 270684, -159076, -522573, -278773, 631089, 820560, 442922, 561951, 445843, 502205, 1196462, 1454040, 305390, -348994, 41462, 946275, 1020310, 559688, 558654, 621745, 631851, 796390, 1041031, 464663, 14048, 73021, 148922, 431075, 462901, 404061, 162730, 7737, 78817, -76854, 362801]
1673C62801P35126l94020p67641L95651N17609o82707l37193N14381L51346o95531
1663a78K61348M13586J63737j1784M0375K19065N6267j007636k79492P66002K47554
1652H68844N22508p80438p27444j29703N75850O24812m08729m46249j03985j16461
1642a20995j5507O95381J2544q86705K14526R19399M5755j07535m9099J7681o9180
1631F56265m16307P08052L67486j068299l77514J76943N82928j16784m67429K09576
1621B54917J77735n36425l66731N46828k5756j21727M59224L46944K8326L187
1611G66522o92296N59017N77424r25576J59104L12582m0862j53728k11066K43914
1601E95035k0165k94143n40733o3783L16002M10727M48224n19722m80207N89148
$$ y = [362801, 1097927, 703907, -63734, 331917, 849526, 166819, -170374, 344007, 695353, -178, 261170, 674756, 838493, 826709, 867084, 1086149, 1142416, 134780, -144712, 621290, 868844, 1391352, 610914, -116530, -246233, 329617, 954429, 545700, 99451, -4534, -120995, -136502, 558879, 571423, -315282, -100756, 818643, 864398, 756863, 707764, 725445, 656265, 239958, 948010, 1315496, 247197, -130317, 46626, 629554, 512770, 45341, 254917, 432652, -103773, -470504, 76324, 50568, -71159, 388065, 735009, 763335, 766522, 74226, 633243, 1210667, 285091, 444195, 756777, 715915, 562187, 351121, 595035, 574870, 280727, -260006, -323789, -7787, 402940, 851164, 331442, -148765, 440383]
1591D40383K84032N60600m22762q54528K1028M54390M71131p28941p5942P7193
1581B26584J95954L71921l03242m77141J22757p8347l212j12204M72284L07352
1571G22706k31694l4296J31700k71705k37417k72610p7602j16075M23418N56455
1561E92880K74295K6213o36527K97843M20599q6640n60618p39897j37358L74623
1551a74587K0700N03069Q1309o41193N19016M61529k92574k56831J56366q83162
1541e06358n9478j46962N34953K86755k72983K05271P50994m2421l26671K75432
1531F98532l08363j12371n17745j08090n0537P7614J83422O79080m62437l27872
1521b48767r2383R6984L99229K92861p62318o74726L99509L24462L85748J95596
$$ y = [440383, 724415, 1285015, 862253, 7725, 28753, 483143, 954274, 225333, 149391, 226584, 422538, 794459, 491217, 14076, 136833, 58486, 55274, -56930, 415354, 722706, 491012, 456716, 588416, 316711, 79294, -193316, -270918, -386993, 36425, 592880, 867175, 893388, 256861, 554704, 975303, 888663, 328045, -411852, -549210, -174587, -153887, 349182, 430491, -210702, 308314, 769843, 477269, 220438, 376804, -506358, -565836, -712798, -177845, 108910, -164073, 41198, 792192, 749771, 423100, 698532, 390169, 277798, -239947, -348037, -398574, -320960, -137538, 541542, 79105, -248767, -341150, -244166, 155063, 447924, -314394, -989120, -589611, -265149, 120599, 316195]
1511C16195m20437n04799k30736P64397O94547k99112q34890j54984R31831K76593
1501E38605k5853K10756p18042k25045l48628L38508L22572L23761k79096k73402
1491a35864j79569O05636K40942n49388p53619l31600N90292N56692K69003m35807
1481a23282q65230M23757Q56584O93958r26495p59618J84021l61136M76489L06610
1471i4342J9967m85009n6084O93001M71002j91405r66572k53303M67886p18712
1461a113571Q73107J73328k3677j31132L0018j73385J78854l67091k67516K65835
1451e55230M87677O20956k82039K23740n95434o62624K20158L59823L08155n05308
1441c80126j6327L50423n2770j10502M33438J00579l40260J07813j4091K20344
$$ y = [316195, -104242, -609041, -839777, -75380, 619167, 320055, -514835, -669819, 262012, 538605, 512752, 723508, 5466, -219579, -568207, -229699, 92873, 416634, 137538, -135864, -315433, 290203, 531145, -18243, -771862, -1103462, -513170, 43522, 312525, -123282, -988512, -564755, 291829, 985787, 59292, -700326, -516305, -877441, -400952, -94342, -74375, -559384, -615468, 77533, 548535, 357130, -609442, -862745, -394859, -1113571, -240464, -67136, -90813, -221945, -191927, -365312, -186458, -553549, -821065, -555230, -67553, 553403, 271364, 495104, -100330, -762954, -542796, -182973, 125182, -380126, -396453, -46030, -98800, -209302, 224136, 324715, -15545, 92268, 78177, 298521]
1431B98521j38835q7870q5699j32952N21688K82730k22585n47003J70182L65261
1421D23438J3193o1416r8434j42936l47630J23185N14258q51705m23022N25020
1411c26049M48752K6480p19080k2498O96385o0135M5499L5262N5286m80268K76818
1400b3548O93321k91909M07014k452n95085M6191n9395L5876l25364J3788r1593
1389a93156r3483M39973L42599L02406p49455L50714l6860n1750J96445K4185
1379E31618n31223j18801L03021j03849K02482L50119n29020L52862K68971K66802
1369I92982o56461J08569N60616j85459j18814l10310L26120L52281m42382k88150
1359C38992k5984L84386j29581j50617n45742j33071K47484J75420K95563j71776
$$ y = [298521, 159686, 71816, -13883, -146835, 374853, 657583, 434998, -112005, 58177, 423438, 436631, 375215, 276781, 133845, -213785, -90600, 423658, -428047, -851069, -326049, 122703, 149183, -569897, -592395, 103990, 43855, 89354, 124616, 179902, -300366, -23548, 669773, 377864, 784878, 782426, 187341, 233532, 174137, 210013, -115351, -101563, -193156, -286639, 153334, 495933, 798339, 48884, 399598, 362738, 310988, 507433, 531618, 395, -118406, 184615, 80766, 283248, 633367, 104347, 457209, 726180, 992982, 336521, 445090, 1005706, 820247, 701433, 391123, 717243, 1069524, 627142, 338992, 313008, 697394, 567813, 417196, -128546, -261617, -14133, 161287, 456850, 285074]
1349B85074k93688N82536M59270j83832j49552k7110L6023K31656K5401j54622
1339H11156K46928L267L0124j048000k55277L63808N06028m29933M03812q8235
1329E43678n05914P56120N35683j24950m22576p12966L9865j19654k03039L86786
1319A73033N36963j119035J16885J209130M60685n63450l14270o49690J06142
1310d3607J93541M03166K18006r92699O09967R82457k91294J94187P0137k42287
1300A101574n89693L9245L51214k84676p52777k43397L48292k32285J42458O09037
1290D88992J31343o16917m54963J227914l6609o02194l99019J66100M89866J99352
1280E93865L78784l15578j75678n32514J071943j27493R1923n34688l99396J96703
$$ y = [285074, -8614, 573922, 1033192, 849360, 699808, 672698, 708721, 940377, 965778, 811156, 1058084, 1061351, 1091475, 43475, -211802, 152006, 658034, 228101, 631913, 543678, 37764, 793884, 1329567, 1204617, 782041, 69075, 108940, -10714, -213753, 173033, 709996, -409039, -292154, 916976, 1377661, 814211, 499941, -149749, -43607, 149934, 553100, 771106, -221593, 388374, 1370831, 1079537, 1273724, 1343861, 1101574, 511881, 551126, 902340, 617664, -135113, -378510, -30218, -262503, -120045, 488992, 620335, 3418, -451545, 776369, 739760, 137566, -261453, -95353, 394513, 593865, 972649, 657071, 481393, -51121, 1020822, 893329, 985252, 450564, 51168, 247871]
1270B47871P7235J87845j59123l00282m0572o5755N25629j85994K02280n19139
1260c0005k72374O2339j8316k98071N78690M35136J81182o7643m27466Q83589
1250A027061J31071p87479J1255N5764l48510J2944j76145n38913J94548J847
1240d16557O67262O83411j44995l04445J33807j75500n78599k78943j3347R9695
1230c28211k15117j44787N43189N92331K62086k8637j82777K64213l11143k51208
1220A99939R3828j08824J6284j66110k47825K09142L56834J9891J31932K65225
1210G70316O3562l46036r86149N73494N0781j82394m18971l88761K74181J57863
1200d32114j58533O20980O77675n14594r2160M64886J2190k64737p09155O36207
$$ y = [247871, 325106, 512951, 353828, 53546, 12974, -52781, 472848, 286854, 489134, -30005, -302379, -240040, -258356, -556427, 22263, 457399, 638581, 570938, 143472, 1027061, 1158132, 370653, 381908, 437672, 89162, 102106, -74039, -612952, -418404, -416557, 250705, 934116, 789121, 484676, 618483, 442983, -135616, -414559, -427906, -328211, -543328, -688115, -144926, 447405, 709491, 680854, 498077, 762290, 451147, 199939, 293767, 184943, 201227, 35117, -212708, -3566, 353268, 373159, 505091, 770316, 833878, 487842, -498307, 75187, 125968, -56426, -475397, -864158, -589977, -432114, -590647, 30333, 708008, 193414, 101254, 566140, 578330, 313593, -395562, 240645]
1190B40645k51582k85345L25532M35984p7456Q1833q6491M53355k43413r52072
1180c59010l79432M82768R8141p3453m8497j25597K2231j8842K04129N01340k54230
1169D9548J76456M88163j3725m86078k39926L44997L05953K48460l88160J01274
1159E86962j31198j03787J67663k76340J77421K96744n85531q0492k91276P92678
1149E52844J81242j077534l40140M13771K07030k73266Q7746o3753j3227M89335
1139A64048N60945P50327q99990o57680J83610L20148r57947j121L34745L45353
1129A42438P97j81440N67572L09476n35570N5907j59207R9817l51004k69743K08324
1118a12633K88500j06959k88387N73325m42301K62955j82246q2962N04021m16744
$$ y = [240645, -10937, -296282, 29250, 465234, 387778, 469611, 383120, 836475, 593062, -359010, -738442, -255674, -157533, -230986, -279483, -405080, -382849, -401691, -197562, 303778, 49548, 226004, 714167, 700442, 214364, -25562, 319435, 625388, 873848, 485688, 586962, 455764, 351977, 519640, 243300, 420721, 717465, 131934, 51442, -239834, 552844, 734086, -343448, -683588, -269817, -62787, -336053, -248307, -312060, -325287, 164048, 724993, 1475320, 575330, -82350, 101260, 421408, -536539, -537660, -202915, 142438, 143235, -38205, 529367, 838843, 303273, 359180, 199973, 299790, -51214, -320957, -112633, 175867, 68908, -219479, 353846, -88455, 174500, -7746, -90708, 413313, -3431]
1108c431L64531N87779k31516j18993n3943j93540k78420k49648M19821p8273
1098A64367j23156m9636P05282L03844o25270j20265k93611k45111p1023j74108
1088e28687K91818K27446k60112J138512J82955q0259l83700R5957J16639l71964
1078D28605l76203K53939p27544O40587K85385J56204O179J7327k85744j93195
1068B05540J80059N51361J05928o69788l77996O11267j92622l456K44872j112293
1058d57128M52561l59252q2217N25341k34741k45253M85408L03937J52025k65078
1048B75603o077j21237J28325l74317j91649R22577p01434m47977O84568K94370
1038D62752L35382k57580P80203p1592j275272j02271O61910J28861q39298m42605
$$ y = [-3431, 361100, 948879, 717363, 598370, 544427, 350887, 72467, -177181, 242640, 164367, 41211, -8425, 696857, 1000701, 375431, 255166, -38445, -283556, -354579, -528687, -236869, -9423, -269535, 868977, 1051932, 971673, 587973, 683930, 800569, 428605, 52402, 306341, -421203, 219384, 504769, 660973, 667152, 684479, 398735, 205540, 385599, 936960, 1042888, 373100, -4896, 606371, 413749, 410293, 655165, -457128, -4567, -363819, -446036, 79305, -155436, -400689, 84719, 388656, 540681, 275603, 269526, 148289, 276614, -97703, -289352, 633225, -68209, -516186, 168382, 462752, 798134, 540554, 1320757, 1249165, -26107, -128378, 533532, 662393, -176905, -619510]
1028f19510M62209k97110k6025M58960P06900j19191j00303j82679m15616K2848
1018a09517M18984k83481m65786k98531K22076L46069L12891j04673L25048K36571
1008E99651O5740M76549j22409l86115Q79J0923n93057k96633j1405L84332m33212
997c04757J20751R57349K59469J24249k4530j5111r76313k76565n2788n20311
987g08557J89824J30349R0413N39832J99384j15432R7298k23526L56493O4211
977F20289o67490L99861J22860r07457J66741N89185L17983o03291J32293M58194
967F29168l22801m26252L85375K09135j225994m09164L00752L25239L42592J292
957a90658J94374j82970J51649O11074M16351m4505m03615l76165J66014l17891
$$ y = [-619510, -157301, -454411, -480436, -21476, 685424, 566233, 465930, 283251, -132365, -109517, 309467, 25986, -439800, -738331, -516255, -170186, 142705, 38032, 363080, 599651, 665391, 1141940, 1019531, 633416, 634295, 645218, 52161, -244472, -255877, 128455, -304757, -184006, 773343, 1032812, 1157061, 1132531, 1117420, 141107, -135458, -188246, -708557, -518733, -388384, -297971, 241861, 441245, 325813, 423111, 199585, 556078, 620289, -47201, 352660, 475520, -431937, -265196, 323989, 641972, 38681, 170974, 629168, 306367, -119885, 265490, 474625, -751369, -1160533, -859781, -534542, -191950, -190658, 3716, -179254, -27605, 583469, 999820, 955315, 551700, 175535, 341549, 23658]
947B3658N89703j48298p21752l191L33821M71409n1655l01785O4008j80098K60387
936C36207N5654j15703o22782j83131O35511o6222L95625k96267J5145J16958
926B70995l04728N1129k33184J92428r6314l7370K06442n73722O33831N08216
916F17723p314J1510k08504K4383m494l01484k39675o5508m3012K50896R4295
905A28816J29398L4698K12349K58605J1130l79556n24468N07367l62266j09387
895i3314N54730q47990K12564N13101J26234L3469m14328L29856N18215n85794
885C46743j6563J32061l78620m6101O20814m52705l02606L11471L558N08030O0340
874G86422o53542L05312k36719n77950K82280m1071K53945k36776K24448M44318
$$ y = [23658, 613361, 465063, -256689, -259880, 73941, 545350, 493695, 191910, 255918, 75820, 336207, 391861, 276158, -346624, -529755, 105756, 39534, 435159, 138892, 154037, 270995, -33733, 17396, -215788, -23360, -119674, -157044, 49398, -524324, 109507, 617723, 610409, 621919, 413415, 437798, 433304, 131820, -107855, -173363, -216375, 34521, 128816, 258214, 292912, 505261, 763866, 774996, 395440, -129028, 378339, 16073, -93314, 461416, -386574, -174010, 339091, 465325, 498794, 84466, 414322, 932537, 346743, 330180, 462241, 83621, 37520, 658334, 205629, -96977, 214494, 218052, 726082, 786422, 132880, 438192, 201473, -376477, -94197, -135268, 118677, -118099, 106349, 550667]
864E50667P01494M38136o8235j39110q48674J355J5516j165923M2131M4213K12006
853b16424L31066N23242O26229m41903n52831M40532l19927l59250m68847N8774
843c79339N8226m67321N89909L90068J67622N52699n45191L20411L75201k47298
833H14987R0577o74471k0675q7884L06302j36874L21016q7951k97162M55768R7149
822G80782n48783m4047K3245K80454J92127p23902O0343J9636r9648N3472k08573
811b14894k80013M38936j69701R51157P99205n36484o79620J80859J30337n38777
801H1005n5058K58365N28053r208p0463P62361J05258k07313q77301K78323J08334
790I02356o89481L465K86132M03924n98786l55711L85891l0773m76223k58277
$$ y = [550667, 1252161, 1690297, 1622062, 1482952, 634278, 635633, 651149, -514774, -472643, -428430, -216424, 114642, 637884, 1264113, 822210, 269379, 709911, 389984, 30734, -438113, -379339, -321113, -788434, -198525, 191543, 359165, 911864, 366673, 687084, 1062285, 814987, 905564, 231093, 210418, 122534, 428836, 291962, 612978, 525027, 227865, 683633, 780782, 231999, 187952, 211197, 491651, 683778, -40124, 20219, 39855, -59793, -6321, -214894, -494907, -55971, -225672, 725485, 1524690, 988206, 308586, 489445, 619782, 81005, 25947, 284312, 812365, 803157, 732694, 1495055, 1600313, 1393000, 515699, 794022, 902356, 212875, 216340, 502472, 906396, 307610, -48101, 337790, 307017, -169206, -427483]
780d27483J45640K46662J73584l729L71986J33630k31034N02476P329J63789r2645
769I90205q82437k69789R29490j55583k44550L59875m8879n77124j79571M9321
759b9042K84590k26061k97384K37658K53765j05083j23398L91822J69282l34352
749B21797m28799O43340n3404n18877J52033R9506N71202M71552k40741m9451
739H68158J4925j46253p2480j19478k1360m12295P359L24004K71628N0043J19685
728H83936o1235k77977j18520j75601J79364M82455m12870l04058j71112J67963
718A92345Q21554L3467j81378m35724o01848M64664J42799K29540l57678k68354
708C9387N99385L40872J36691l96474m25261l64897m59110O68993K99462J60739
$$ y = [-427483, -281843, -35181, 138403, 134674, 506660, 640290, 409256, 911732, 919061, 1082850, 990205, 107768, -162021, 767469, 611886, 367336, 727211, 678332, 101208, -78363, -29042, 255548, 29487, -267897, -30239, 223526, 118443, -4955, 386867, 556149, 221797, -207002, 436338, 382934, -135943, 16090, 115596, 686798, 1158350, 917609, 868158, 883083, 736830, 664350, 544872, 523512, 111217, 118576, 442580, 714208, 764251, 883936, 822701, 544724, 426204, 250603, 429967, 912422, 499552, 195494, 24382, 192345, 1013899, 1047366, 865988, 430264, -171584, 293080, 435879, 665419, 307741, 39387, 638772, 979644, 1116335, 719861, 294600, -70297, -529407, 139586, 439048, 599787]
698E99787k58692k49613L98514k21219q262M42804l90206n48445K80579L3270
688G8517N9545K35050j37254j4024R9457L55087N74943o23263n44055j01769M90993
677D73227j05632L0137o6811L83057m67697n28510O06571k9237l85563j52196
667b42654L28646M54890k4251j19534J23239o38782l4339n7799K13596n7161L8864
656a5285M66417L9439L45539L26797J4031p3905l15550l44229r6575n78306n9932
645b91559m18160M35614L50483l47982M56934J05807k50246K90566l06061k76504
635b51108K52355l55336M33009L76755p453L91220J80737o54137m26533p294k096
624f9881O60949l15155l38948O68463k00733L26710J47704p80198j44688m37357
$$ y = [599787, 341095, 91482, 489996, 268777, 260515, 703319, 313113, -235332, 45247, 78517, 138062, 373112, 235858, 221834, 321291, 676378, 1251321, 628058, 84003, -17766, 473227, 367595, 397732, 330921, 713978, 246281, -282229, 324342, 295105, -90458, -242654, 85992, 540882, 516631, 397097, 520336, -118446, -152785, -210584, 3012, -54149, -15285, 451132, 490571, 836110, 1162907, 1176938, 1103033, 787483, 443254, 346679, -231627, -291559, -709719, -274105, 76378, -271604, 185330, 291137, 40891, 331457, 25396, -251108, 1247, -354089, 78920, 455675, 448222, 839442, 1020179, 366042, -60491, -67785, -69881, 591068, 275913, -63035, 605428, 404695, 731405, 879109, 98911, -45777, -483134]
614d83134j3474J67411K02710p2878K80751J35728k2878K07410l7337J95405J92238
603G51952j017305J55199N2623k66878N54230j10754l36337M62827M76512K31362
593I53431m24842p30610K41575K6881j60789m44126J60162j23118m5006Q51029
583C04587Q0408j2129J72402m57920K01259k34551k25366K59456k78990m08909
573e99753L82134M113j03658M6922M86979Q0663N81892k9772o73816j705l2406
562A41593L97540o86227n67572N77319M66462k62122R2165K28151p481o3082M35459
551G52205l27485o48330K97290J58693k28839k78011R051K03017L45463L80850
541F63904L27711J5129k26564n61527j7646k60960J13304R1374q27228L55699
$$ y = [-483134, -496608, -329197, -126487, -199365, 81386, 217114, 194236, 401646, 364309, 559714, 751952, -265353, -110154, -57531, -324409, 229821, 119067, -217270, 245557, 722069, 953431, 528589, -202021, 39554, 66435, -94354, -538480, -378318, -501436, -546442, 304587, 384995, 372866, 545268, 87348, 288607, 54056, -171310, 88146, -190844, -599753, -217619, -213506, -317164, -270242, 216737, 297400, 879292, 849520, 175704, 173999, 141593, 539133, -147094, -714666, -137347, 329115, 66993, 159158, 387309, 379828, 316746, 752205, 424720, -223610, 73680, 232373, 3534, -274477, -265426, -62409, 283054, 663904, 991615, 1006744, 780180, 218653, 201007, -59953, 53351, 144725, -682503, -326804]
531c26804L47257J09170K45649K00403J36342l23100o57403M12329P00916l64349
521D80410p73787n97676L09125l07998K25874N58506L18754L45349l5932q7771
511D34854J40209j15416Q8116m39783r8665K04435n57067m5799K85463K13976
501A10323O48488M35270m9587L6523l85708l32145k09748m61862p34755J84586
491g58615L71611l33794M05233K83096N47068j26654o66066R6400L09766K52901
481C80946k39637k07488p1106K97371M80757m09182J06023L83952k79220k33630
471B08786J7988j44921l60420j30144R5989N52328k29345n4796J82143J74698
461C12306m47475k77197L16345m52423k8580O04884R9326K66280n54016J5849
$$ y = [-326804, 20453, 129623, 375272, 575675, 712017, 388917, -268486, 143843, 844759, 480410, -293377, -891053, -581928, -889926, -664052, -105546, 213208, 558557, 522625, 434854, 575063, 459647, 547763, 107980, 9315, 213750, -343317, -389116, -103653, 110323, 758811, 1194081, 1144494, 1181017, 795309, 463164, 253416, -208446, -943201, -758615, -387004, -720798, -315565, -32469, 514599, 387945, -278121, -181721, 128045, 380946, 141309, -66179, -137285, 160086, 640843, 231661, 337684, 721636, 442416, 208786, 226774, 81853, -278567, -408711, -312722, 239606, 10261, -44535, 137608, 312306, -135169, -412366, -96021, -548444, -577024, 27860, 127186, 393466, -160550, -144701]
451a44701N81527j81576J69617l13127k66051K51819K11123k41509N4774M93148
441F15044n21293j96563Q76159L22081o43114J08353m64700M4027J70584l93012
431h2434J47534M8592l84323o8744K40598L34341k34266j27111L6622N08715L9264
420D58788M96195m57738p47906L10169j15876j12637J56989P79709j85456j7908
410E64329K94799J25031o20111j99549J10284k62240n02783k44390N65309L8348
400a30973j67334R77872j77759k84870j45154L15544J6744J95549l60063n42769
390c03213M88060K36440r711K14391l35680J48968K41953P4215L93526j39117
380A009832q64651j02823p8961O20129L2197p16294j27093j2116m34652k08595
$$ y = [-144701, 436826, 255250, 424867, 111740, -154311, 97508, 308631, 67122, 121896, 615044, 93751, -102812, 773347, 1095428, 452314, 560667, 95967, 139994, 310578, -82434, 65100, 113692, -270631, -339375, -98777, 235564, 1298, -125813, -89191, 419524, 458788, 954983, 497245, -250661, 59508, -56368, -169005, -12016, 767693, 582237, 564329, 859128, 984159, 364048, 164499, 274783, 12543, -490240, -734630, -169321, -130973, -298307, 679565, 501806, 216936, 71782, 387326, 404070, 599619, 239556, -303213, 184847, 421287, 411576, 625967, 290287, 439255, 681208, 755423, 1148949, 1009832, 145181, 42358, -36603, 583526, 615723, -100571, -227664, -239780, -674432, -883027]
370h83027L65145O63506o680j30421L13288M98085J45900o78966j51817q2168
360E2845J75153n55421L64051K23067n5921l93596J0628P93469k25115o65587
350b76427K30042r7491m58960r8745J42430P9666K24466j13105K84271r4881N56748
339C78014J00133l66015k8213j43054Q0613j32933K71395r848o91660M27860P35445
328F21737n2903p4450l14345O02893O54627j290497j00191M84831m09353o29154
318e06805L10401J135416j01876j149568J05859Q76686j86483r02342K67004J64012
308A2304o55595J3694j52987J90559J78980k36351J11666P64913O68073j35207
298G60049j23289j97475o236o80674m9632J017155j75086r48211j50625P69572
$$ y = [-883027, -517882, 145624, 138944, 8523, 321811, 819896, 965796, 286830, 135013, 52845, 227998, -327423, 36628, 259695, 203774, -189822, -179194, 614275, 389160, -276427, -46385, -143876, -602836, -701581, -559151, -479485, -255019, -368124, -83853, -178734, 378014, 478147, 112132, 83919, -59135, 21478, -111455, 159940, 150092, -541568, -113708, 621737, 568834, 494384, 180039, 782932, 1437559, 147062, 46871, 531702, 122349, -506805, -196404, 939012, 837136, -312432, -206573, 670113, 483630, -418712, -151708, 12304, -643291, -629597, -782584, -592025, -413045, -649396, -537730, 227183, 895256, 760049, 636760, 439285, 433049, -247625, -297257, 719898, 544812, -403399, -554024, 215548]
288B15548L15179N3508n23647N5863N46447q26715p04350Q43538m98998l59382
278h83009O28455J86524J97583K64512k39777J53195K91124J05276l54112J74306
268E24077j20265J10550j89285n88909N49324J36915p27621P38813q3079m48933
258i8413j23624K92644J107798m77272j212902N92898J10240o81012Q8463M59719
248E8539J33283N944L37620R6523j32453n9200m0744K82963l58809o18602L32885
237C7949q5320N08112k14751j16115L73431K04133l60588P9011L19618k51425
227D94055k69053l270K49327k82177m07041j17956N65390J23211q7817N41307
217H05976m99373J99807k49215K04136J48811l48855q8131n96194M20731j68684
$$ y = [215548, 530727, 584235, 60588, 116451, 662898, -163817, -868167, -24629, -523627, -883009, -254554, -68030, 129553, 394065, 154288, 307483, 598607, 703883, 349771, 524077, 403812, 514362, 325077, -263832, 285492, 422407, -305214, 433599, 350520, -98413, -222037, 70607, 1178405, 701133, -511769, 81129, 191369, -489643, -401180, 58539, 191822, 197766, 535386, 631909, 499456, 440256, 399512, 682475, 323666, -294936, 37949, -47371, 460741, 245990, 129875, 503306, 707439, 346851, 425862, 745480, 494055, 225002, 221732, 471059, 188882, -218159, -336115, 229275, 352486, 264669, 805976, 306603, 506410, 257195, 461331, 610142, 261287, 173156, -423038, -2307, -170991]
207a70991L44082J56367l70001P00479j20062n43272M06592l68761k57483q8535
197c11585k97953P10231K44899r2492K59752K73728o58403l17710N65142P8436
187D54045k86797m76793k2760k7286j41908L32655K25856j2754K71830J50219
177D66307L23588L0820m67983k22256l1630K65895m01534m64389K96351L56828
167A51997k06440m13778N97487P53223j96356O8298k02228p18441l2894N87461
157C88329M61662p17418m21499L132P7157M95199l33152k27137L23652k89127
147b39202L23706j59126m17954k8532j73424M38592K50942L69815k79409p6637
137H771J04370K988j77390k57212k8092q5087o0604K99480L91084j90012m45541
$$ y = [-170991, 173091, 329458, -40543, 659936, 539874, -3398, 403194, 34433, -223050, -311585, -609538, 100693, 345592, 253100, 512852, 786580, 128177, -189533, 375609, 454045, 167248, -309545, -332305, -359591, -501499, -168844, 57012, 44258, 316088, 466307, 789895, 820715, 352732, 130476, 98846, 364741, -36793, -501182, -204831, 151997, -54443, -468221, 129266, 882489, 686133, 754431, 552203, -166238, -199132, 388329, 849991, 132573, -288926, -285794, -208637, 286562, -46590, -273727, 49925, -239202, 84504, -74622, -492576, -521108, -694532, -255940, -4998, 364817, 85408, 8771, 113141, 116129, -61261, -318473, -346565, -431652, -492256, -192776, 198308, 8296, -437245]
126d37245J31692J60545R1655p61406L25597M68873q9034j35652j35617M41427
116F0835l41700j54951j2578M3550J92373m92693R4637N92956L29623k63596n60187
105e11731n8388J69729r8635Q9397K68312L1776o95151q1885N19240j70795j67470
94g05601k55254K00367L31909O5773J02173o7581K76887L1724k09038K67402l12413
83b73652k07599j60589K8664K43046k22043j59289K02244J04788R7884J79547
73a66999L09724k58279M6758n58834k81389r819m736K96111J63861p8556J85026
62c57132J42500L65734m38759o80475J94435j93999j39162M22795k68056J71306
52g80813K10850L3620M90807K76884n85879k58704R8452p3195J08067l22781k55206
$$ y = [-437245, -305553, -145008, -53353, -814759, -489162, -20289, -109323, -244975, -380592, 60835, -280865, -435816, -448394, -404844, -212471, -705164, -610527, -17571, 312052, 48456, -511731, -570119, -400390, -499025, -409628, -141316, -109540, -804691, -886576, -367336, -538131, -705601, -960855, -760488, -428579, -362806, -260633, -328214, -51327, -19603, -228641, 38761, -273652, -481251, -641840, -613176, -370130, -592173, -751462, -549218, -444430, -346546, -166999, 142725, -115554, -68796, -627630, -909019, -918838, -923574, -627463, -463602, -542158, -357132, -214632, 151102, -287657, -968132, -773697, -967696, -1106858, -684063, -952119, -780813, -569963, -536343, -45536, 231348, -354531, -613235, -514783, -587978, -479911, -802692, -1057898]
41a057898j73711N62686K02123n3461j55266N58996o1014m84910K16074r6296
31e42677k56221K14178k91469L3677J83712m7227K72691P3068q2079Q435K20847
20b13065q9645r0369n85264l88321K91263R7389o098K04920k87219M22741M0790
9f02878j37203M45901l26065j69937J93921k49981l96906M37335M5268
0g60545
$$ y = [-1057898, -1231609, -668923, -466800, -520261, -675527, -116531, -177545, -662455, -446381, -542677, -798898, -584720, -876189, -842512, -658800, -706027, -433336, -360268, -442347, -433912, -213065, -302710, -393079, -978343, -1366664, -1075401, -978012, -984110, -779190, -1066409, -643668, -602878, -740081, -294180, -620245, -790182, -596261, -846242, -1243148, -805813, -760545]
$$ Imaginary data points
##PAGE= N=2
##DATA TABLE= (X++(I..I)), XYDATA
16383a892636k62727K86023M56496m13783n3083l1019j89389M84403K6510L7407
16373a551798k864J54023L40501J49196j86965k63478k709l29345J49178J415
16363a542846J24010L45584N827N96171K09879n33181L09345k27729l76699J29824
16353i59815R4838L68303L47670k74655K66436L38507l07732K56310L54571n92673
16343a08240n37405N6018L66558N72862m15023p510N17901m63485r8476K72560
16333A55760M9803j54871J69724K2849M12201j6047m9531R1622k39409J52321
16323E94422m3491K58164k7166N98480j22429l48456K08426p715J93145k89029
16313A014351m5681J29572m96284K2235M26533O9287K6460P4189Q51454L18149
$$ y = [-1892636, -2155363, -1869340, -1412844, -1826627, -1879710, -1910729, -2100118, -1615715, -1589205, -1551798, -1554662, -1400639, -1060138, -910942, -1097907, -1361385, -1364094, -1693439, -1544261, -1542846, -1418836, -1073252, -1067425, -471254, -261375, -794556, -485211, -712940, -1089639, -959815, -864977, -496674, -149004, -423659, -157223, 181284, -126448, 129862, 484433, -108240, -645645, -589627, -223069, 349793, -65230, -72740, 445161, -18324, -116800, 155760, 205563, 50692, 220416, 243265, 655466, 639419, 589888, 681510, 442101, 594422, 550931, 809095, 781929, 1380409, 1257980, 909524, 1117950, 1110235, 1303380, 1014351, 968670, 1098242, 601958, 624193, 1050726, 1120013, 1146473, 1220662, 2072116, 2390265]
16303B390265o31058l89901k34876J11331J7397k09441O28965L34907R1316j21854
16293A987051J61627k6490j35517k19399K22960K47969l79902o8L48060L27013
16283B533304l64902o10245M65343O69618l15097l12371n764O07093N3922j85757
16273B535144L52704N7686k13848K18491J09994j62766o11523L1323M70646O12621
16263C400472j18135k89793K63572R9964P5791k62740l73453J40187K16894q6979
16253C065780J80946K82122l57755M3886o654q5803k03970R9456K52099L93637
16243C663744o40268Q134M42099J4216j48164j37384J84058J74385m85206J57983
16233C233597M20252L56640l60094j16149N35712j93200J75013l53093j51028
$$ y = [2390265, 1759207, 1369306, 1134430, 1245761, 1263158, 1053717, 1682682, 2017589, 2108905, 1987051, 2148678, 2122188, 1986671, 1767272, 1990232, 2238201, 1858299, 1858231, 2206291, 2533304, 2168402, 1558157, 2023500, 2693118, 2378021, 2065650, 2059886, 2666979, 2720901, 2535144, 2887848, 2945534, 2731686, 2950177, 3060171, 2897405, 2285882, 2317205, 2787851, 3400472, 3282337, 2992544, 3256116, 3356080, 3431871, 3169131, 2795678, 2935865, 3152759, 3065780, 3246726, 3528848, 3171093, 3214979, 3208325, 3122522, 2918552, 3018008, 3270107, 3663744, 3023476, 3031610, 3473709, 3487925, 3339761, 3202377, 3386435, 3560820, 3075614, 3233597, 3653849, 4010489, 3650395, 3534246, 4069958, 3876758, 4051771, 3698678, 3547650]
16224C547650P394n4266K03919l7398O18995q9226l72989K71088J45569j78775
16214D061961j63051K87274k07048j82033j80749M73337L53025J29411l02045
16205D270082j91449L26107J59205m43646o62737L15837N05020M8592m86823m6760
16195C793428O08032l37913P11720K148n71909q95412K85921M96043j34510k64385
16185C693163J38689L68564j73255m02987M22239O70555n90211j72573L32743
16176D286927l7235j51891J44657P49360J95751r44042l58275K51283L79757P4143
16166D590435m15060q2088K51334P44380n11729k85167k12110J40708L83498m95786
16156D108415L9561J43619j31970R00503J27709l13288K42817L4056L00296k99141
$$ y = [3547650, 3555044, 3500778, 3704697, 3667299, 4286294, 4197068, 3824079, 4095167, 4240736, 4061961, 3898910, 4186184, 3979136, 3797103, 3616354, 4089691, 4442716, 4572127, 4270082, 4078633, 4404740, 4563945, 4120299, 3457562, 3773399, 4278419, 4327011, 3840188, 3793428, 4401460, 4063547, 4775267, 4777415, 4205506, 3310094, 3596015, 4092058, 3957548, 3693163, 3831852, 4200416, 4027161, 3624174, 4046413, 4716968, 4126757, 3954184, 4286927, 4249692, 4097801, 4242458, 4991818, 5187569, 4243527, 3885252, 4136535, 4516292, 4590435, 4175375, 4093287, 4344621, 5089001, 4577272, 4292105, 4079995, 4220703, 4604201, 4108415, 4147976, 4291595, 4159625, 5060128, 5187837, 4874549, 5117366, 5151422, 5451718, 5152577]
16146E152577n14570p46885P7974P46757r0508l07934M21276k51590J50360j06847
16136D530610L28231j09360m06597l2724K45154J93624k35341J78666K25811k54572
16126D663502M96747L39233J64455l66079p94288J46083K87707j93973M2209m55290
16116D330306K71254L28150n80000J96573M96016J24953k26119J86931l8051j80451
16106D909562M1319m01114j55336N5851L34418M89304K0184Q4487J10472l38967
16096E150180M55568k96337o39871L18835k95269J93035p8185m68253K7786P67669
16086E135158L19136J74517m22622j22505K24345p9382p83452L72804N39614l95458
16076D962155N26712k885n08313j21017J28893N35468j18536q34292L2355N48532
$$ y = [5152577, 4638007, 3891122, 3969096, 4715853, 4625345, 4317411, 4738687, 4487097, 4637457, 4530610, 4858841, 4749481, 4342884, 4310160, 4555314, 4748938, 4513597, 4692263, 4918074, 4663502, 5160249, 5499482, 5663937, 5297858, 4503570, 4649653, 4937360, 4743387, 4785596, 4330306, 4601560, 4929710, 4349710, 4546283, 5042299, 5167252, 4941133, 5128064, 5090013, 4909562, 4950881, 4549767, 4394431, 4450282, 4784700, 5274004, 5294188, 5378675, 5489147, 5150180, 5605748, 5309411, 4669540, 4988375, 4693106, 4886141, 4807956, 4339703, 4367489, 5135158, 5454294, 5628811, 5206189, 5083684, 5308029, 5228647, 4445195, 4817999, 5357613, 4962155, 5488867, 5485982, 4977669, 4856652, 4985545, 5521013, 5402477, 4568185, 4600540, 5149072]
16066E149072M64205l00669K54472k76949l79562N74670K47189n50655o82615
16057D499158J83274K72859K4086Q0045L47828M11994l53566m69103N95907l72152
16047E220330M77742j27341n53263j80988j01806K51340Q62810j80720o25165
16038E042939O2909O99521M36390o95020n00715k08139K11782l70852J67767k17702
16028D628880o9364R91504K1387J5572N26222j08899l38923k1572o10743P2300
16018E106364M58653n34169j05912J48984N58477K52287k84792J92466Q55770
16009F648128r91886n87576K31955O939l63736P32519l9049l96597J09300O98512
15999F048509L8127o51416O7895M72951l88403l25318N0904P1381n36856o1253
$$ y = [5149072, 5613277, 5312608, 5567080, 5290131, 4910569, 5485239, 5732428, 5181773, 4499158, 4682432, 4955291, 4979377, 5059422, 5407250, 5819244, 5465678, 4996575, 5592482, 5220330, 5698072, 5570731, 5017468, 4836480, 4734674, 4986014, 5848824, 5668104, 5042939, 5105848, 5805369, 6241759, 5546739, 5046024, 4837885, 5049667, 4678815, 4846582, 4628880, 4559516, 5551020, 5572407, 5587979, 6114201, 6005302, 5666379, 5644807, 5034064, 5106364, 5565017, 5030848, 4924936, 5073920, 5632397, 5884684, 5599892, 5792358, 6648128, 5656242, 5068666, 5300621, 5307560, 4943824, 5676343, 5637294, 5240697, 5349997, 6048509, 6086636, 5435220, 5503115, 5976066, 5587663, 5262345, 5313249, 5384630, 4847774, 4786521]
15989D786521P47315k56618R6132J97505O05262L0160p52642J17547J26624j55717
15979E542089k61520O6881J70855L79015L9187p01106l84971p5934M28029J89028
15969E391553M88777J52008m17716l80386L60802M71580k6590o88423p9322j54845
15959E117438k75187J20031K63078L14226q3388l1233L33869K18899N618q7691
15949E895660o3733m15877O120J97948M4736Q8867j32223n20692j04484N70313
15939E566635L89818m24229N835N27804J7167k73018m31527M64384K86567m34992
15929E694444k49241p1116K07491J40030k29538K02773j61354k29743M38876N31183
15919F273805n91325r25956J46698K27292K71134l22367L12236J28330K98096
$$ y = [4786521, 5533836, 5277218, 5373350, 5570855, 6176117, 6206277, 5453635, 5571182, 5697806, 5542089, 5280569, 5347450, 5518305, 5897320, 5936507, 5235401, 4850430, 4774496, 5202525, 5391553, 5880330, 6032338, 5614622, 5234236, 5595038, 6066618, 6040028, 5351605, 5272283, 5117438, 4842251, 4962282, 5225360, 5539586, 5456198, 5424965, 5758834, 5977733, 5983351, 5895660, 5831927, 5416050, 5422170, 5620118, 5664854, 5753721, 5621498, 5100806, 4996322, 5566635, 5956453, 5532224, 5538059, 6065863, 6083030, 5810012, 5378485, 5842869, 6129436, 5694444, 5445203, 5374087, 5581578, 5721608, 5492070, 5694843, 5533489, 5303746, 5742622, 6273805, 5682480, 4756524, 4903222, 5130514, 5401648, 5079281, 5391517, 5519847, 5817943]
15910E817943l80312N82788J48288m30313k14774j13465m08730J61391l26975
15901D835841Q2965L93591J06757j20655K04513K87021l82339M66307m29137j43120
15891E301744r6632n90124k04099M89426L16531j7348m17905J86493K66337m15312
15881D819111r4192Q42096N55505o7873m00252m07969M55836L51790j147615L62008
15871E268445m28480n30901Q52417M97485K50569k79379k61939L78917k51574
15862E495560k40765l5257J23870r6462L9632L27683q1865J83437L98678l67454
15852E747057M94875p5030j44081J8527m01443k49430M6861p30261n4275O94278
15842E347078J98141k05362M2892M68009l76264j56158j7552L95430l5946o84541
$$ y = [5817943, 5437631, 6020419, 6168707, 5738394, 5523620, 5410155, 5001425, 5162816, 4835841, 4918806, 5312397, 5419154, 5298499, 5503012, 5790033, 5407694, 5874001, 5444864, 5301744, 5205112, 4614988, 4410889, 4900315, 5216846, 5199498, 4781593, 4968086, 5234423, 4819111, 4724919, 5567015, 6122520, 6054647, 5654395, 5246426, 5702262, 6054052, 4906437, 5268445, 4839965, 4309064, 5161481, 5658966, 5909535, 5630156, 5368217, 5747134, 5495560, 5254795, 5219538, 5343408, 5246946, 5286578, 5614261, 5532396, 5715833, 6114511, 5747057, 6241932, 6166902, 6022821, 6041348, 5639905, 5390475, 5437336, 4707075, 4652800, 5347078, 5545219, 5339857, 5382749, 5850758, 5474494, 5318336, 5300784, 5696214, 5660268, 4975727]
15832D975727J47151l05139k96508M74127L6989k5699l1866M95330M49592m6831
15822E872873k92740m79919M28612m6850m5494K37177l32037N80041J74685o23085
15812E473263j1476M0984J22418J50025l59010j51978n07925K60011L78725k17822
15802E177215k71305m04992Q6682K43756M67263O10044o91926P05373J30210n51315
15792E501005P0111K40906o0738l02244m23628L43414R5520M86113l33227l3769
15782E583463q5236l18899P33802k35301l47014k04924n44868P75554M11123j48363
$$ y = [4975727, 5122878, 4817739, 4521231, 4995358, 5032347, 5006648, 4974782, 5470112, 5919704, 5872873, 5580133, 5100214, 5528826, 5481976, 5436482, 5673659, 5341622, 5921663, 6096348, 5473263, 5461787, 5502771, 5625189, 5775214, 5416204, 5264226, 4756301, 5016312, 5395037, 5177215, 4905910, 4500918, 4587600, 4831356, 5298619, 5908663, 5216737, 5922110, 6052320, 5501005, 5571116, 5812022, 5751284, 5449040, 5025412, 5368826, 5464346, 5950459, 5617232, 5583463, 5498227, 5179328, 5913130, 5677829, 5330815, 5125891, 4581023, 5356577, 5767700, 5619337]
$$ [...]
##END NTUPLES=NMR SPECTRUM
##END=
