##TITLE=1H_DE-80H_X3
 200.13MHz, d2o
 8 sc
 
 19ns.26.2.2025
##JCAMPDX= 6.0         $$ Bruker NMR JCAMP-DX V2.0
##DATA TYPE= NMR SPECTRUM
##DATA CLASS= NTUPLES
##ORIGIN= UXNMR, Bruker Analytische Messtechnik GmbH
##OWNER= pz
$$ XWIN-NMR		Version 3.5
$$ Mon Apr 20 10:37:02 2026 Russian Standard Time (UT+4h)  Yarkov@DPX200
##.OBSERVE FREQUENCY= 200.1313
##.OBSERVE NUCLEUS= ^1H
##.ACQUISITION MODE= SIMULTANEOUS
##.ACQUISITION SCHEME= undefined
##.AVERAGES= 8
##.DIGITISER RES= 18
##SPECTROMETER/DATA SYSTEM= spect
##.PULSE SEQUENCE= zg30
##.SOLVENT NAME= CDCl3
##.SHIFT REFERENCE= (INTERNAL, CDCl3, 0, 15.4252)
##AUDIT TRAIL= $$ (NUMBER, WHEN, WHO, WHERE, WHAT)
$$ ##TITLE= Audit trail, XWIN-NMR		Version 3.5
$$ ##JCAMPDX= 5.01
$$ ##ORIGIN= Bruker BioSpin GmbH
$$ ##OWNER= Yarkov
$$ C:/Bruker/XWIN-NMR/data/yarkov2/nmr/H-C/1/pdata/1/auditp.txt
$$ ##AUDIT TRAIL=  $$ (NUMBER, WHEN, WHO, WHERE, WHAT)
(   1,<2026-04-20 10:35:54.87 +0400>,<Yarkov>,<DPX200>,
      <created by zg, POWCHK disabled, PULCHK disabled
       configuration hash MD5:
       00 E9 B6 7A A2 85 ED C7 34 08 36 98 17 FE 4E 26
       data hash MD5: 16K
       81 72 EF CA C8 0F 38 C2 9C F3 39 C7 24 0A 56 0B>)
(   2,<2026-04-20 10:36:07.31 +0400>,<Yarkov>,<DPX200>,
      <Start of raw data processing
       efp BC_mod = 2 LB = 0.25 FT_mod = 6 PKNL = 1 PHC0 = -5305.771 PHC1 = 21.62193 SI = 16K 
       data hash MD5: 16K
       CF 97 2B 71 A8 84 D5 ED 24 ED 08 67 73 F6 E4 07>)
(   3,<2026-04-20 10:36:35.09 +0400>,<Yarkov>,<DPX200>,
      <pk PHC0 = 3.454504 PHC1 = -10.2 
       data hash MD5: 16K
       32 D7 EE 98 0E 8A 3F 8A AE 13 E7 7C DB 0C 78 1C>)
$$ ##END=
$$ 
$$ hash MD5
$$ FC D6 0D 08 41 04 B9 6B 07 DC 38 93 2B 4D 83 0E
##$RELAX= 
##$RELAX= 
##$RELAX= 
##$RELAX= 
##$RELAX= 
##$RELAX= 
$$ Bruker specific parameters
$$ --------------------------
##$DU= <C:/Bruker/XWIN-NMR>
##$EXPNO= 1
##$NAME= <H-C>
##$PROCNO= 1
##$TYPE= <nmr>
##$USER= <yarkov2>
##$AMP= (0..31)
100 100 100 100 100 100 100 100 100 100 100 100 100 100 100 100 100 100 
100 100 100 100 100 100 100 100 100 100 100 100 100 100 
##$AQSEQ= 0
##$AQ_mod= 1
##$AUNM= <au_zg>
##$AUTOPOS= <>
##$BF1= 200.13
##$BF2= 200.13
##$BF3= 200.13
##$BF4= 200.13
##$BF5= 200.13
##$BF6= 200.13
##$BF7= 200.13
##$BF8= 200.13
##$BYTORDA= 1
##$CFDGTYP= 0
##$CFRGTYP= 5
##$CHEMSTR= <none>
##$CNST= (0..31)
1 1 145 1 1 1 1 1 1 1 1 1 1 1 1 1 1 1 1 1 1 1 1 1 1 1 1 1 1 1 1 1 
##$CPDPRG= <>
##$CPDPRG1= <>
##$CPDPRG2= <>
##$CPDPRG3= <>
##$CPDPRG4= <mlev>
##$CPDPRG5= <mlev>
##$CPDPRG6= <mlev>
##$CPDPRG7= <mlev>
##$CPDPRG8= <mlev>
##$CPDPRGB= <>
##$CPDPRGT= <>
##$D= (0..31)
0 0.7 0 0 0 0 0 0 0 0 0 0.03 0 0 0 0 0 0 0 0 0 0 0 0 0 0 0 0 0 0 0 0 
##$DATE= 1776666954
##$DBL= (0..7)
120 120 120 120 120 120 120 120 
##$DBP= (0..7)
150 150 150 150 150 150 150 150 
##$DBP07= 0
##$DBPNAM0= <>
##$DBPNAM1= <>
##$DBPNAM2= <>
##$DBPNAM3= <>
##$DBPNAM4= <>
##$DBPNAM5= <>
##$DBPNAM6= <>
##$DBPNAM7= <>
##$DBPOAL= (0..7)
0.5 0.5 0.5 0.5 0.5 0.5 0.5 0.5 
##$DBPOFFS= (0..7)
$$ [...]
##$SUBNAM2= <"">
##$SUBNAM3= <"">
##$SUBNAM4= <"">
##$SUBNAM5= <"">
##$SUBNAM6= <"">
##$SUBNAM7= <"">
##$SUBNAM8= <"">
##$SUBNAM9= <"">
##$SW= 18.0517328524113
##$SWIBOX= (0..15)
0 0 2 0 0 0 0 0 0 0 0 0 0 0 0 0 
##$SW_h= 3612.71676300578
##$TD= 16384
##$TD0= 1
##$TE= 0
##$TE2= 300
##$TE3= 300
##$TEG= 300
##$TL= (0..7)
0 120 120 120 120 120 120 120 
##$TP= (0..7)
150 150 150 150 150 150 150 150 
##$TP07= 0
##$TPNAME0= <>
##$TPNAME1= <>
##$TPNAME2= <>
##$TPNAME3= <>
##$TPNAME4= <>
##$TPNAME5= <>
##$TPNAME6= <>
##$TPNAME7= <>
##$TPOAL= (0..7)
0.5 0.5 0.5 0.5 0.5 0.5 0.5 0.5 
##$TPOFFS= (0..7)
0 0 0 0 0 0 0 0 
##$TUNHIN= 0
##$TUNHOUT= 0
##$TUNXOUT= 0
##$USERA1= <user>
##$USERA2= <user>
##$USERA3= <user>
##$USERA4= <user>
##$USERA5= <user>
##$V9= 5
##$VALIST= <valist>
##$VCLIST= <CCCCCCCCCCCCCCC>
##$VD= 0
##$VDLIST= <DDDDDDDDDDDDDDD>
##$VPLIST= <PPPPPPPPPPPPPPP>
##$VTLIST= <TTTTTTTTTTTTTTT>
##$WBST= 1024
##$WBSW= 4
##$XGAIN= (0..3)
0 0 0 0 
##$XL= 0
##$YL= 0
##$YMAX_a= 333915
##$YMIN_a= -465836
##$ZGOPTNS= <>
##$ZL1= 120
##$ZL2= 120
##$ZL3= 120
##$ZL4= 120
##$ABSF1= 0
##$ABSF2= 0
##$ABSG= 0
##$ABSL= 0
##$ALPHA= 0
##$AQORDER= 0
##$ASSFAC= 0
##$ASSFACI= 0
##$ASSFACX= 0
##$ASSWID= 0
##$AUNMP= <proc_1d>
##$AZFE= 0.1
##$AZFW= 0.1
##$BCFW= 0
##$BC_mod= 2
##$BYTORDP= 0
##$COROFFS= 0
##$CY= -3
##$DATMOD= 1
##$DC= 0
##$DFILT= <>
##$DTYPP= 0
##$F1P= 0
##$F2P= 0
##$FCOR= 1
##$FTSIZE= 16384
##$FT_mod= 6
##$GAMMA= 0
##$GB= 0
##$INTBC= 1
##$INTSCL= 3.241238e-09
##$ISEN= 128
##$LB= 0.25
##$LEV0= 0
##$LPBIN= 0
##$MAXI= 10000
##$MC2= 0
##$MEAN= 0
##$ME_mod= 0
##$MI= 1.114404
##$NCOEF= 0
##$NC_proc= -6
##$NLEV= 6
##$NOISF1= 3.799351
##$NOISF2= 2.8
##$NSP= 0
##$NTH_PI= 0
##$NZP= 0
##$OFFSET= 15.42516
##$PC= 1
##$PHC0= -5302.316
##$PHC1= 11.42193
##$PH_mod= 1
##$PKNL= yes
##$PPARMOD= 0
##$PSCAL= 0
##$PSIGN= 0
##$REVERSE= no
##$SF= 200.130019320585
##$SI= 16384
##$SIGF1= 3
##$SIGF2= 2
##$SINO= 0.751879
##$SIOLD= 32768
##$SREGLST= <19F.Aceton>
##$SSB= 0
##$STSI= 16384
##$STSR= 0
##$SW_p= 3612.71676300578
##$SYMM= 0
##$S_DEV= 0
##$TDeff= 16384
##$TDoff= 0
##$TI= <>
##$TILT= no
##$TM1= 0
##$TM2= 0
##$TOPLEV= 0
##$USERP1= <user>
##$USERP2= <user>
##$USERP3= <user>
##$USERP4= <user>
##$USERP5= <user>
##$WDW= 1
##$XDIM= 16384
##$YMAX_p= 267848458
##$YMIN_p= -10455795
$$ End of Bruker specific parameters
$$ ---------------------------------
##NTUPLES= NMR SPECTRUM
##VAR_NAME=  FREQUENCY,     SPECTRUM/REAL,   SPECTRUM/IMAG
##SYMBOL=    X,             R,               I
##VAR_TYPE=  INDEPENDENT,   DEPENDENT,       DEPENDENT
##VAR_FORM=  AFFN,          ASDF,            ASDF
##VAR_DIM=   16384,         16384,           16384
##UNITS=     HZ,            ARBITRARY UNITS, ARBITRARY UNITS
##FACTOR=    0.220516191357247, 1,           1
##FIRST=     3087.03765048017, 0,            0
##LAST=      -525.679112525611, 0,           0
##MIN=       -525.679112525611, -10455795,   0
##MAX=       3087.03765048017, 267848458,    0
$$ Real data points
##PAGE= N=1
##DATA TABLE= (X++(R..R)), XYDATA
$$ [...]
8274 -19356 -80349 105220 -28187 21557 -89118 -47187 -9152 220443 211081 55126 284511
8263 284511 190658 -34886 98767 -64728 -87271 108636 -173490 -164817 138545 -50382
8253 -50382 -56210 320699 4233 14750 33467 -20522 -90920 287124 -9818 -53006 -93466
8242 -93466 -135462 -363779 -255012 -477253 -375110 -33780 -637374 -740312 1926 -13925
8232 -13925 12854 65330 -218815 24396 -87499 -446008 -265295 2706 -140343 116289
8222 116289 175476 -230355 542487 424612 783985 94789 107882 197450 -134169 -96688
8212 -96688 -12821 96927 525255 52866 440898 403885 427859 373147 333351 226801 376142
8201 376142 -331234 183102 662050 835608 700966 350223 248037 398603 -2326685 -10455795
8191 -10455795 -5264522 -1846216 -1641354 -1422633 -1012865 -406544 -622128 -684763 -675064 -599878
8181 -599878 -1220778 -1021270 -884295 -432985 -205792 -149527 -360117 -82038 -138004 -453414
8171 -453414 -249832 -29985 110136 -201880 -315601 -27706 -54276 -26354 -505861 -9660
8161 -9660 -198766 -585254 -55742 399023 126115 735862 465207 424411 328620 -174987
8151 -174987 -100644 172721 5724 -153886 213479 197801 287577 359194 146601 399603
8141 399603 74825 -387689 -446289 -182650 -405457 -60223 157270 402281 408155 -26799
8131 -26799 240365 141218 120669 -179633 39115 234497 47191 -120045 170465 -29010
8121 -29010 -87536 -46906 -311364 -42385 -290130 -312177 171338 206687 -10356 70263 174024
8110 174024 9069 -274687 -198519 376916 329627 237017 223402 199644 428682 -196370 151261
8099 151261 209028 -99827 -58908 -89588 -142372 66849 92672 81769 218143 -175247 -116855
8088 -116855 -311642 -196200 194975 -64988 129135 -1930 -5086 -19413 -362011 -46680
8078 -46680 -208862 -529181 -282928 -424513 -280755 -16434 99635 717614 223037 -14530
8068 -14530 -187739 -215336 -179449 -23423 88393 107709 42392 158579 -22124 -38587 -157520
8057 -157520 55578 -272283 -518884 -504792 -586843 -103611 -124059 -45122 -307737 -232276 -305613
8046 -305613 -362968 -283536 -107375 187188 9823 -185814 -148376 -80813 -350095 -156769
8036 -156769 -145730 -254000 -356417 -191688 -76330 156560 22848 -152618 -41247 -31228
8026 -31228 -204531 -75127 -51459 66948 378264 72258 -2500 268782 117228 97641
8016 97641 153237 -96491 46654 -92113 -197959 -241378 -128885 -403405 -169295 -558757
8006 -558757 -233999 -24311 -194248 125286 256739 325796 433743 -59120 409317 123856
7996 123856 140227 27186 295238 219911 412979 216194 370274 72193 194148 263239
7986 263239 -36873 227704 91631 -109062 598 -41735 -171994 -49442 -303621 289897
7976 289897 182547 -35985 -53837 482677 18621 -7405 -6278 -55481 61379 -178832 -221628
7965 -221628 218652 184157 133176 -141644 155619 76113 -2288 -55310 252642 753365 588942
7954 588942 -6801 531869 626161 129986 84919 72399 191259 376929 53993 387311
7944 387311 434159 570269 345594 286493 -72638 11122 90727 -91430 -111368 148013 101893
7933 101893 -151829 71557 -177070 -102609 82590 -95539 164382 -24127 248241 282015
7923 282015 219795 407138 41098 -42762 -169697 129683 140317 206212 74688 535517
7913 535517 500279 215498 129596 185200 15752 178690 -46558 -207794 -83967 291761
7903 291761 209649 133733 202914 334705 223797 83926 -77151 421305 270516 250781
7893 250781 355874 149089 -60921 361747 -17645 206290 52613 -163370 35853 -43258
7883 -43258 -105974 7372 -46498 36774 -52384 -301297 -320308 -112487 -50730 -88810 -18992
7872 -18992 124051 -8675 -227843 111980 30183 143589 -11725 299690 313986 154897
7862 154897 75730 371416 212173 91842 108625 -54066 254373 146110 191232 875788
7852 875788 348730 511304 521117 309607 368030 523249 332857 680619 769816 528521
7842 528521 465918 874188 346724 380687 391246 -105710 -107056 -66384 -103673 147006 332908
7831 332908 -30249 344355 288894 -305910 -185657 -183140 -111531 164846 -84406 323584
7821 323584 647983 517989 239222 175259 284782 51802 -16859 -42215 4287 288619
7811 288619 9512 54206 472248 -42125 239027 23085 -77396 357941 180039 113507
7801 113507 446125 404032 191232 301262 207735 314762 388970 323540 157906 253331 115731
7790 115731 -4023 234588 266710 3087 234682 116268 43580 74533 180498 233770
7780 233770 528653 -110529 260455 181538 370305 446618 454332 268676 394931 132764
7770 132764 183699 73883 82834 314884 90781 287774 308267 500573 480147 251473 326765
7759 326765 182600 -350015 -218081 224779 469266 455069 662661 563213 795693 215398
7749 215398 80227 -17149 256008 -182183 63532 -116242 178569 354575 586012 463471
7739 463471 115820 44342 -230289 -207766 61195 -99869 227460 255932 350761 390518 236170
7728 236170 410646 184427 425196 -16292 27126 202 296154 512878 483035 412617
7718 412617 491416 455961 531355 184529 490281 643040 612559 543331 579065 626219 726530
7707 726530 770636 792291 421124 568513 470568 520385 602472 273258 385945 460456 10625
7696 10625 256670 73704 343348 328866 362897 330935 156114 180058 -14240 131346 -39790
7685 -39790 -91372 35441 187205 151830 208004 251453 397839 324951 159712 10999 414091
7674 414091 207978 227851 233614 111852 24609 57083 -9134 413129 166775 205729 382812
7663 382812 324052 611021 253755 128247 214105 51023 223401 67102 248163 482295
7653 482295 645314 570947 683362 640379 771437 629608 358810 154861 426391 394474
7643 394474 452217 132598 519768 513840 683951 279137 469305 346534 335552 374383 412510
7632 412510 449024 429013 629834 531661 620737 357278 453031 273801 377682 351725 622699
7621 622699 343565 544257 443521 717479 410769 889867 615331 597610 657864 317786
7611 317786 576446 671174 662840 599236 427973 670531 643192 540408 565982 692509 688050
7600 688050 419314 321447 594024 599216 391016 159144 492971 106500 267719 99294
7590 99294 490390 608375 556742 459450 405374 489534 225686 312964 202009 559230 95925
7579 95925 303652 414500 412429 687804 590648 582633 534278 406123 511235 780147 480199
7568 480199 588660 742615 457389 599900 399704 393105 670589 331904 422597 468607
7558 468607 442155 506118 148332 537281 605982 461731 -69852 180342 251522 414479
7548 414479 103143 233579 560600 334764 147939 183244 412034 475643 254727 50613
7538 50613 272848 179192 268749 279970 468136 449651 216605 127895 512921 530589 256419
7527 256419 391331 329652 557958 262304 343314 680732 601775 606347 465331 497054 615146
7516 615146 512679 141466 294454 319453 383247 318665 129511 525409 536163 231176
7506 231176 244574 136121 -25021 -35535 -64814 431933 350975 591271 677136 505104 558816
7495 558816 464102 107208 138159 107455 264582 431066 498459 883651 632294 596279 636005
7484 636005 291234 498512 269927 201703 627179 642528 681009 688106 494704 585918 672796
7473 672796 104243 244300 465622 521923 453871 646413 700777 661847 233928 287309 335195
7462 335195 313822 -160588 146536 241950 255430 241567 318216 486333 339810 39794 22330
7451 22330 351293 182743 238820 58418 256505 259582 282024 17463 485932 300017 191777
7440 191777 350941 235118 276987 166809 243423 164133 -15269 148851 213963 257688 181548
7429 181548 235227 366132 431452 148052 102464 361192 293823 348298 613469 373571 682092
7418 682092 585868 502444 745524 488326 530809 409257 370440 538226 407151 689939
7408 689939 654912 492543 698031 136461 669242 342860 326303 662922 551106 625590
7398 625590 727283 586309 782572 561904 414938 439048 364941 228306 182536 296687
7388 296687 372055 374286 270210 266736 375975 340275 156393 102703 227753 109029 132345
7377 132345 216223 492423 484953 529156 547691 571030 577762 736299 509027 440151 417079
7366 417079 408776 578123 322486 525970 553261 395302 339157 388762 427201 632431 151356
7355 151356 628453 683306 626063 800259 545428 836995 695779 450236 439060 251323
7345 251323 535750 136194 189976 366223 176153 278044 333826 171629 606595 296960
7335 296960 434239 451769 182789 63779 223083 319371 83071 350839 286531 600955
7325 600955 766454 307836 307774 589855 98872 417549 -27539 212438 387615 215324
7315 215324 387955 311577 404143 307573 308224 519138 283813 486915 492960 762794 746177
7304 746177 494595 445212 232296 570134 -189208 29136 150455 397975 659488 318123
7294 318123 340907 870917 419501 98351 97113 -114741 55549 122856 274292 685798
7284 685798 938528 845588 729888 595277 68340 141105 100206 8098 -3291 216598 108241
7273 108241 710881 522567 588287 431864 705618 305676 199116 360991 97035 546479
7263 546479 340563 444355 307730 327562 400144 658651 570878 215776 104430 220320
7253 220320 -38206 83926 51874 236309 270894 350941 200523 403596 347582 466898
7243 466898 322023 292491 151262 288529 125421 372939 494924 472268 552533 331585
7233 331585 44945 188386 -310530 -213692 -191703 -264509 325324 195342 351035 965890
7223 965890 544256 817582 531061 380958 319307 396713 523726 489546 464919 811472
7213 811472 676609 431889 332329 55673 231281 -84789 -187130 187725 105571 111265
7203 111265 137388 161836 129858 -45905 86451 37026 293912 114641 141873 438152 482583
7192 482583 309241 214070 -60753 202827 374286 284121 301275 623285 576634 748554
7182 748554 324882 284378 479341 445605 711926 454596 566833 915234 622840 653503
7172 653503 668697 700867 636058 622683 464414 605221 343949 538982 373557 385108 -47737
7161 -47737 -50121 268104 160049 47629 377324 658352 399696 225957 313050 602821
7151 602821 250540 203520 353556 532492 157709 164124 572024 980593 743564 354200
7141 354200 645817 622432 572840 502403 473141 506538 687779 -24593 -9331 387465 312002
7130 312002 227729 250949 132314 -14323 48651 -97706 290665 228345 63751 29904 205011
7119 205011 -189428 -129160 -58267 318297 -80362 100685 93131 71080 645244 568872 830978
7108 830978 449131 385206 190632 227697 -142423 273494 186792 604842 410243 280734
7098 280734 242717 459896 166934 66157 -193791 -186552 54501 -50924 221790 433127
7088 433127 429788 68666 187118 -339491 -297806 -200406 36238 258068 -57512 185910
7078 185910 239781 200414 250775 103066 92799 -102632 -19384 -298560 125357 509153 559983
7067 559983 841481 544393 222364 551829 275136 549564 442397 509785 601874 676007
7057 676007 306240 318222 571253 941200 356436 259503 80411 287130 72553 77085
7047 77085 223165 372764 132230 105702 -13061 -50215 350449 168035 -50864 -49243 76278
7036 76278 105675 347521 560649 766144 634072 131443 236614 309377 -8907 89290
7026 89290 157913 697266 50516 584089 308402 557828 825709 438626 557226 244583
7016 244583 29530 430365 325661 690927 527712 540206 875972 362126 429267 383921
7006 383921 509971 603363 69884 -7283 216198 264725 -39025 150010 486186 -33793
6996 -33793 -37598 -146332 200578 34018 -128381 18034 374388 83048 -150625 6810
6986 6810 522971 98558 26848 27174 91359 112396 25234 177722 388960 290209 247862 763559
6974 763559 444247 434769 -41000 592339 570182 202523 29718 454838 761464 294834
6964 294834 276919 265925 382968 410658 -122160 45082 378867 205979 479831 305377
6954 305377 422506 418381 218356 297183 284028 525673 124672 271660 403433 450606 183169
6943 183169 26125 341135 415878 304667 97822 146512 506552 397987 338101 337505 207616
6932 207616 367709 256894 369195 478641 670309 925070 861996 425610 648658 450041
6922 450041 547387 391179 29780 68183 17229 70683 167908 271996 377305 445070 363290
6911 363290 435948 103066 291731 258753 547862 254855 -24244 426624 446280 372320
6901 372320 411739 225345 680995 277741 -17980 360293 719364 382014 396221 405691
6891 405691 450636 255458 -41796 167101 656587 522768 498816 681910 1129447 917290
6881 917290 890114 994328 1098020 1102003 636782 656051 525704 697220 486953 482024 530722
6870 530722 590090 476590 592578 604082 587944 612347 580397 467038 332096 265639 424112
6859 424112 413265 294924 92528 492487 511440 243759 284816 529239 269559 295802
6849 295802 -309794 -88320 -74684 -378038 140399 -59921 510015 531298 419385 686380
6839 686380 566097 646661 534842 432031 465404 534035 202762 556393 527532 559776 258928
6828 258928 393336 337162 531504 172573 463188 241016 564345 375998 390140 130632
6818 130632 176079 267879 250966 208911 86356 445541 320385 452663 225547 315067 111731
6807 111731 -111166 -451242 -273357 -383578 -99875 -80167 202726 130801 237457 308047
6797 308047 419315 403079 296351 435008 533864 659857 462834 354015 534584 156426
6787 156426 -56 -172475 -235758 -366206 41086 -35315 150885 236582 287953 91854
6777 91854 347688 -10365 -106734 45037 -23557 367583 550163 768260 948487 1428440
6767 1428440 1050187 827306 640303 565309 373739 371486 307871 519723 736642 589439
6757 589439 647851 492845 746635 651875 607698 580521 786968 810426 945122 1092277 794755
6746 794755 688771 474607 411564 450315 424453 116887 394520 202803 -115826 328942
6736 328942 161914 122394 424593 -114667 -21210 -24092 206839 274977 667182 429799 621117
6725 621117 871330 832739 817082 1011271 901539 843046 846162 353687 501719 303234 514794
6714 514794 455069 181413 379686 575255 519308 711798 959758 759854 610410 573606
6704 573606 247904 626294 405723 343884 604702 376189 147338 517974 445486 581766
6694 581766 628506 737256 604649 832581 687837 603981 878454 697110 364678 563813
6684 563813 462853 893829 875157 938203 1237645 1343776 1036127 690726 922158 865125
6674 865125 598174 680649 889490 685789 558222 708097 1021503 889189 836337 709665
6664 709665 1329963 1449368 1187443 1442683 1638835 1743002 1629034 1287680 1445965 1643655
6654 1643655 1868149 1705403 1812234 2136238 2014528 2254110 2010129 1834408 1975662 1879727
6644 1879727 1787212 1804753 1862030 2341312 2422235 2461576 2335191 2772317 2896779 3107060
6634 3107060 3411584 3724004 4302697 4638865 4852426 4789474 4668662 4604177 4391104 4325282
6624 4325282 4585056 4750850 5095017 5216719 5755807 5541152 5720520 5571487 5779530 5604548
6614 5604548 5547198 5293103 5489104 5433004 5735316 5593807 5843490 5810019 6114468 5997845
6604 5997845 5869846 6392644 7006671 7225743 7447126 7898545 8442922 9086506 9090973 9103584
6594 9103584 9205207 9018307 8578442 8240273 7894714 7741705 7680397 7123817 7008696 7207950
6584 7207950 6996438 7091069 7010855 7080028 6921112 7087789 7040942 7363639 7321080 7528716
6574 7528716 7703933 7817627 7635158 7923775 8034086 7696808 7826517 7663674 7586934 7544593
6564 7544593 7593967 7746169 8108606 7659014 7487713 7339798 6826148 6217336 5887367 5197629
6554 5197629 5120982 4949902 4589302 4735358 5061592 5276191 5579145 5548533 5978935 6946008
6544 6946008 7388217 7596536 8257271 8657308 8028678 7839469 7431757 6817798 6626078 6088615
6534 6088615 5399821 5697740 5629146 5461767 6129784 6231659 6844743 6929908 6121173 5885394
6524 5885394 5511383 4712765 4173200 4343817 3603992 3441157 3266124 3228188 3166186 2950988
6514 2950988 2870755 3416563 2831248 3319602 3387897 3477739 3263693 3176387 2961100 3104829
6504 3104829 2809239 3065364 3264389 3138235 3553494 3172008 3274906 3440189 3125943 3034813
6494 3034813 3081135 3091327 3177141 3306403 3348235 3620986 3543938 3496325 3470800 3281771 3454787
6483 3454787 3825295 3954549 4449786 4620391 5265854 5531326 5872389 6851729 7452726 8198973
6473 8198973 9264721 10287640 11077478 11403389 10996479 10533026 9568506 8619663 7789275
6464 7789275 7361191 6997814 7421030 7622665 8305704 9397061 10503512 11715657 12395082
6455 12395082 12595535 12902402 12288461 11947863 11594407 11372851 11751301 12701614 12904734
6446 12904734 13839612 14991933 15744325 16227646 16130887 15492835 14568438 13161898 11982840
6437 11982840 11282262 9924142 8943798 8619432 8054978 7512107 6999141 7505952 7363532
6428 7363532 6797274 7059999 6754786 6717981 6450372 6218746 6518212 6674913 6770230 7264164
6418 7264164 7875438 7913320 8462094 8891540 9341382 9931595 10326543 11060098 11959141 12651633
6408 12651633 12787505 12700643 12577547 11807742 10788560 9753297 9408548 8586379 7993511
6399 7993511 7729684 7514896 7394989 7370205 7279522 7526115 7559802 7631221 7856801 8456630
6389 8456630 8559278 9373290 10448828 11101296 12302182 13484961 14901127 16730611 18800243
6380 18800243 21267745 23936855 26805396 28784816 29956055 30019145 28514051 26605125
6372 26605125 24240300 21287328 19477780 17543836 16007801 15091599 13957150 13736551
6364 13736551 12759404 12131393 11921148 11769296 11311569 11291212 11444639 11524908 11640951 11566622
6354 11566622 11933384 12387242 12528142 13009774 13827744 14773691 15707831 17477056 19338726
6345 19338726 21235085 23331805 24960098 25440192 25986261 24779761 23752742 22463894
6337 22463894 20597544 18915506 17922598 16658649 16209171 15241911 15127877 14952712 15182846
6328 15182846 15037567 15891083 17085283 17762837 18593984 18809307 18698195 17858872 17095639
6319 17095639 16756611 16935604 16694614 17340232 17800458 19277961 20428431 22565708 24900028
6310 24900028 27758080 30613913 32866773 35181344 36419652 37338494 38218977 38893947 39268575
6301 39268575 39452883 40268531 40481592 41109690 41271152 41460549 41886030 41852471 42236783 43078163
6291 43078163 44454621 46580827 49072630 51976965 55623954 59951682 64264056 67515825
6283 67515825 69885545 69785329 68052475 64404455 60294144 56412016 53577432 51625611
6275 51625611 51345450 51598041 52018701 52476707 51760010 50365670 48910171 47876514 47259152
6266 47259152 47605500 48653296 50004627 50715149 51316068 51452089 50488157 48455640 45177702
6257 45177702 41657084 38193657 34436550 31658180 29330409 27105896 25261818 23212230
6249 23212230 20963614 19236099 17726944 16481311 15350532 14429125 13640116 13178545 12614420
6240 12614420 12184494 11786925 11688755 11772185 11385355 11551349 12037518 12814289 13496335 13695021
6230 13695021 13798274 13659525 12851304 12260001 11798627 11768041 11917995 11584741 12482983 13115773
6220 13115773 13969071 15136473 16016349 17016497 17237653 16493471 15739503 15014880 14182987
6211 14182987 12727310 12104425 11489342 10938741 10298786 9751456 9970665 10115755 9956888
6202 9956888 9921214 10012134 10790665 11057690 11567266 12238754 13053156 13413874 13647642 13539649
6192 13539649 13228737 12677130 11537597 11003543 10124347 8913009 8293557 8110443 7647822
6183 7647822 6912852 6481070 6558624 6281587 5585949 5080596 5770698 5320777 5285540 5081240
6173 5081240 4835660 4774063 4701327 4415764 4778733 4445713 4068839 4364768 4098511 3823712
6163 3823712 4094345 3728809 4038635 3904548 3431017 3521426 3728896 3728937 3713619 3588635 3913557
6152 3913557 3696083 3545993 3772504 3547909 3981856 3618480 3699703 3725058 3649548 3657544
6142 3657544 4144907 3624905 3942409 3605671 3629471 3418862 3377694 3442299 3819494 3778520
6132 3778520 3655925 4068860 3673718 3768953 4110677 3797724 3637556 3838815 3547677 3605008
6122 3605008 3613997 3631886 3618198 3676424 3154359 3140071 2940993 3116462 3192444 3310690 3223190
6111 3223190 3189196 3258181 3104887 3164785 3322210 3240471 3343105 3067892 3216195 3241802
6101 3241802 3559318 3765805 3907777 3669260 4046603 3615236 3542568 3758411 3885962 4201062
6091 4201062 3901848 4039732 4236543 4457099 4471533 4766092 4714149 5044592 4660154 4885750
6081 4885750 4718396 4899602 5271221 5272978 4994156 5294079 5168335 5528180 5533126 5922661
6071 5922661 6354788 6612094 6887805 7060098 7211343 7781493 7814565 7785481 8049566 7952782
6061 7952782 8337997 8487955 8412083 8582032 8851238 8522808 8978114 9311998 9380059 9695554
6051 9695554 10103943 9873638 10467542 10202007 10209221 10617058 10637912 10728567 11075293 10994740
6041 10994740 11253778 11417338 11343686 11312441 11864834 11733345 12172185 12021396 11964087 12178155
6031 12178155 12168063 12545239 12648483 13399542 13702025 13673792 13520081 13075373 12718216 12392510
6021 12392510 11857872 11764746 11757765 11637300 11542069 11794001 11860670 11852860 11795202 11757017 11917199
6010 11917199 11920652 12111489 12174249 11884701 11878304 11257234 11189385 10994855 10589986 10653762 10787430
5999 10787430 10193180 10318611 9703966 9351598 9381883 9356223 9198342 9353051 9213355 8751699
5989 8751699 8678175 8027217 7775575 7721695 7359655 7333256 6942041 6888623 6918670 6711703
5979 6711703 6582078 6035810 5956231 5885744 5384633 5586094 5549141 5651382 5628848 5551546
5969 5551546 5609013 5141616 5369658 5370286 5077348 4578930 4519044 4210053 3859819 3468999
5959 3468999 3324056 3390326 3226006 3098997 3097463 3192906 3285710 3350514 3381911 3042649 2906025
5948 2906025 3094924 2615387 2628981 2720770 2489871 2369361 2619257 2115622 2029887 1841029
5938 1841029 1580347 1923002 1532575 1706272 1781169 1892759 1952545 2047507 1573296 1538154
5928 1538154 1472164 1298102 1086352 1183303 1618574 1975352 1617898 1956830 2200729 1754351
5918 1754351 1727886 1465423 1275018 1263808 1050376 1435342 1271156 1455450 1724592 1850742
5908 1850742 1866529 1578328 1763744 1529584 1166487 1500908 1410414 1583326 1774594 1561259
5898 1561259 1476840 1521041 1281923 1212508 1464960 1032609 1318012 1109268 1090458 1407016
5888 1407016 1529591 1487713 1796732 1380322 1328752 945742 1018871 685270 851265 1072599
5878 1072599 720577 750535 1202368 1154866 1199792 1291969 1208124 1413100 929656 705944
5868 705944 1131123 1016567 916074 1122751 1098560 1324666 1066977 1067592 1139179 982244 1130830
5857 1130830 835625 864598 1215437 999006 1187982 1260234 1242846 1081616 870370 818534
5847 818534 1230916 844368 880407 1328903 1245361 1027484 995630 1100834 992892 1336361
5837 1336361 815632 920080 940166 965283 1119880 772751 794173 1357034 1213833 652416
5827 652416 1018984 1284208 1314859 987353 1203914 1632872 1292913 1025582 1011755 1001736
5817 1001736 1091008 917349 877374 1109895 993028 1030990 1039675 1083193 1017456 951799 1032257
5806 1032257 829903 1173427 802941 982045 1034571 1114581 736948 1015580 715804 856866
5796 856866 1053766 991208 1129725 1146988 783493 923802 735643 459582 815883 842250
5786 842250 794640 1044405 1108904 1127420 1263737 1145289 1005850 846255 984327 784090
5776 784090 1083834 1147172 1157010 1232595 1113572 1022654 958216 830956 871925 1061706 1041085
5765 1041085 974863 1029008 877775 1231293 903967 886127 862525 627258 663621 817306
5755 817306 677979 1341978 1046959 982942 1098742 1050974 711561 776076 852564 938445 952152
5744 952152 550060 1017870 1273929 939641 784812 1019085 883513 732240 524338 657693
5734 657693 766904 998451 919426 740707 943034 594419 849123 974392 957394 1229352
5724 1229352 1356237 1114944 1535966 1452471 1496705 1356051 1291141 1270667 1040303 1043669 885827
5713 885827 1262447 1429190 1634567 1243066 1536301 1310925 1421833 1456560 1016525 1418748
5703 1418748 1550531 1070040 1352076 1409510 1637933 1500776 978662 1055970 1079996 1099585
5693 1099585 1038002 971753 1430065 1193952 1470719 1300896 1099830 1361747 1272164 748092
5683 748092 992643 1056331 919121 866340 1184096 1300262 1431511 1235374 982054 1497354
5673 1497354 1021886 1285683 1281343 1372735 1380221 1234422 1071407 981903 1031019 1112629 819580
5662 819580 1232118 1316447 1452805 1546531 1621222 1842900 1696844 1773846 1626200 1770598
5652 1770598 1457158 1681391 1672462 1574841 1481931 1330265 1220341 1296077 1249417 1482678 1531355
5641 1531355 1613441 2066092 1704429 1959808 2071855 1802380 1598519 1465098 1571149 1343870
5631 1343870 921050 1591689 1590935 1562014 1208955 1091302 1368990 1251669 764004 1232885
5621 1232885 1316883 1107019 1228304 1180326 1071042 1257946 1137446 1521312 1322062 1578060
5611 1578060 1066788 1406707 1938933 1331576 1175048 1345548 1262571 1253093 1119310 1043024
5601 1043024 1823444 1732683 1435533 1611351 1443429 1408658 1488084 1410343 1434708 1343497 1565318
5590 1565318 1713534 1748132 2027277 2051158 2047506 2124606 1886388 1846328 1474910 1870064 1810786
5579 1810786 1724360 1531964 1763781 1417493 1753699 1264985 1284700 1254819 1072298 1044374
5569 1044374 1159231 1110946 1471201 1617385 1598625 1294789 1644601 1313848 1735371 1703407
5559 1703407 1748121 2046218 1690516 1714610 1448387 1584692 1496761 1254880 1442600 1082193
5549 1082193 1406276 1022696 918129 1362427 1089426 929889 1010436 781176 1097625 745141
5539 745141 840198 977811 959816 1088387 1093904 1480203 1188890 1367006 1159381 1281125
5529 1281125 885482 932423 917101 985223 862961 932439 921459 1169891 651635 907453
5519 907453 1076311 1060370 952918 933163 1155044 1142601 758620 1284134 1253006 1669887
5509 1669887 1717070 1326525 2017763 1664320 1339005 1273869 1344862 1189649 964755 846554
5499 846554 880774 1166320 691818 1091942 903859 926793 803585 853979 799343 962040
5489 962040 673631 984009 723543 711700 933412 650112 805251 849972 1279399 753290
5479 753290 583557 842753 833492 599760 640109 853151 867760 710774 621410 608332 648239
5468 648239 620418 630120 707563 599922 792130 685067 700871 935467 895814 662995 633239
5457 633239 732137 617394 506794 844056 763337 695480 216358 403096 507554 46378
5447 46378 496909 599493 240023 513006 669721 626715 619209 551187 1010394 713290 252371
5436 252371 517330 1039878 1017678 1043955 1256618 1517897 1137507 1029929 819622 851149
5426 851149 1006883 718927 576717 814879 831811 752759 711739 1010892 1361046 811018
5416 811018 487429 917322 634044 705855 866345 984806 1098780 646954 717904 979306
5406 979306 620504 1127194 971038 649014 770622 815022 773160 779330 863019 1218557 884927
5395 884927 893687 991070 1092485 1215616 1131552 1226289 1055923 768533 952489 832987 1019145
5384 1019145 1586444 1412368 1280990 1925952 2127237 2261343 2428052 2980673 2978584 2742645
5374 2742645 2509900 2762229 2608796 2586728 2805855 3049263 2835180 3060517 3693475 4114045
5364 4114045 4377346 4854534 5090577 5029021 5109504 5060281 5227802 5232913 5705287 5619879 5285482
5353 5285482 5531510 5620734 5479186 5726245 6107057 6539947 6376235 6569657 7162128 7442403
5343 7442403 7478893 7349068 6950120 6443255 6086514 5714816 5547968 5374636 5674891 5687765
5333 5687765 5500279 5639900 6115097 5718935 5582977 5851198 5707666 5506022 5207862 5314981
5323 5314981 5024627 4841377 4361668 4156588 3360240 2990073 2320895 2359722 2154523 2835627
5313 2835627 2784259 2834211 3081046 3209309 2881098 2933214 2576145 2631812 2172386 1843119
5303 1843119 1928021 1698563 1683306 1894308 1586513 1294322 1120158 1056790 629830 1109390
5293 1109390 1030092 919159 990478 817124 641726 1029575 705592 1095908 1240551 618952
5283 618952 875841 845131 493915 964235 910076 631831 600573 305515 567338 255145
5273 255145 727085 620937 864643 543380 491081 305921 544131 809811 1070124 849555
5263 849555 1012652 733922 1048328 581764 1026920 1075823 1127474 917087 783252 767577
5253 767577 654190 931208 1067181 574312 575529 522666 613858 454771 725223 1122349
5243 1122349 762587 770925 692596 626881 702459 575604 868504 927607 404980 651103 698814
5232 698814 988148 641312 769680 978565 529399 518077 243663 150702 772034 769448
5222 769448 741327 714787 1093856 1022681 1176105 1044996 1205625 1273741 1196475 833475 1169161
5211 1169161 1164313 1293308 1386456 1210428 1262575 1169629 1198683 1037328 1323879 1462557 1340420
5200 1340420 1455584 1509121 1749465 1330341 1308032 1416681 1320447 1256679 987602 1399921
5190 1399921 1489574 1504782 1756594 1571718 1640030 1716215 1384352 1553174 1051201 1139202
5180 1139202 1483214 1445480 1242880 1299714 1889393 2034797 1722845 1690961 1646675 1937066
5170 1937066 1373610 1531503 1753175 1676965 1732617 1872070 1615282 1730719 1659602 1791443
5160 1791443 2029007 1678714 1736015 2047108 2023687 1931768 1820531 1824035 2172122 2214523 1931587
5149 1931587 1766510 1773744 2085340 1587773 2080857 1942388 2054210 2320609 2420119 2355631
5139 2355631 2789438 2157984 2506435 2214468 1840770 1846205 1790915 2106487 2178115 1882420
5129 1882420 1795176 1903481 2068499 2014383 1558634 1858476 2080143 2005827 1850333 1933249
5119 1933249 2183466 2252475 2128550 2639223 2240433 2721421 2430695 3035552 2795324 3156378
5109 3156378 2949727 3440627 2945577 2830832 2825972 2883924 2675182 2559411 2486977 2534129
5099 2534129 2403840 2211845 2372165 2675179 2135618 2011683 2471674 2588299 2085656 2218839
5089 2218839 2354593 2777660 2477696 2351817 2468712 2679099 2463009 2379646 2598843 2182228
5079 2182228 2115984 2244253 1900312 1880898 2030910 1652583 1772056 1864729 1695717 1750531
5069 1750531 1756065 1977771 2161634 2019145 2279943 2827571 2652258 2298129 2325038 2171014
5059 2171014 2099059 1600096 1803047 1771198 1770407 2094529 2354535 2384327 2395893 2279897 2200769
5048 2200769 1940238 1590681 1376785 1312195 1685752 1918105 1692463 2125566 2079284 2101490
5038 2101490 1965381 1885535 1944395 2128923 1523637 2104972 2406007 2114614 2831082 3119781
5028 3119781 2835477 3227431 2910437 3410437 3261140 3043204 3638560 4129377 4122646 4651459
5018 4651459 4774457 5155840 5046559 4808432 4429136 4311356 3639125 3624220 3678054 3492452
5008 3492452 3552812 3465520 3631073 3670105 3944243 4045604 4554789 4833072 4807323 5032601
4998 5032601 5392542 5233948 5014756 4890369 4683452 4466171 3990428 3725942 4039228 3619370
4988 3619370 3598490 3741184 3541233 3881396 3792604 3905945 3939806 4189608 3849285 3767968
4978 3767968 3563689 3298439 3820892 3816166 3829574 4238008 4034651 4415077 4713549 4610361
4968 4610361 5285186 5881438 6515647 6974032 7778071 8372920 8850734 8611007 8352177 7900266
4958 7900266 7135006 6355440 5953357 5392494 5535067 5354774 5500157 5544712 6214481 6140847
4948 6140847 6824296 7196168 8168679 9014934 9842883 10796263 11827640 12024491 11646692
4939 11646692 11099532 9761013 8427517 7202243 6655982 5708178 5395984 5203970 5231030
4930 5231030 5519797 5424501 5459133 5744411 5299947 5404937 4972932 4610823 4259124 3988440
4920 3988440 3837255 3993277 3784076 4130813 4135989 4279348 4220827 4092605 4748833 4802596
4910 4802596 5372057 5616198 5858591 6231363 6092014 5747285 5720712 5020968 4770372 4501504
4900 4501504 4135478 3927793 3966930 4121555 4683266 4630762 5288468 5985991 6893599 7850628
4890 7850628 8028025 8405309 8384871 7779255 7032772 6386056 6107290 5736338 5404408 5348080
4880 5348080 5302821 5330793 5553782 6032789 6981666 7617998 8413766 9091633 9210162 8843267
4870 8843267 8185378 7369218 6951495 6633067 6103293 6361396 6146261 6573297 6887919 7238281
4860 7238281 8038018 8607443 9541283 11097998 12317970 13665421 14517151 15414049 15916595
4851 15916595 15510770 14806838 13735822 12563614 11050837 10120353 9329125 8776794 8118528
4842 8118528 7644223 7575574 7436468 7827251 8308582 9279256 10098808 11284844 12144014 12564909
4832 12564909 11710707 10816117 9745488 8722320 7817408 6967926 6284885 6095952 5441334
4823 5441334 5021792 5005075 4714815 4938179 4912416 4947838 5546099 5776934 6042323 6528050
4813 6528050 6916294 7364713 8467451 9054106 9609642 9833487 9793127 9564425 9010694 8400385
4803 8400385 7988823 7737716 7023563 6729800 7070200 7159473 7287732 7483758 7783431 8249292
4793 8249292 8617861 8888986 10031729 10741865 11382244 11917470 11769111 12199808 11894025
4784 11894025 11931604 11885405 11691937 11595662 11201034 10382109 10530453 10007837 9406667 8803022
4774 8803022 8561697 8165037 7683806 7298038 7462881 7284753 6864883 6022559 5864118 5985310
4764 5985310 5471130 5365640 5223932 5315317 5350869 5048769 5468285 5786709 6009762 6160152
4754 6160152 6385233 6753082 6943183 7578398 8523849 9222730 9895714 10164932 10683086 10643631
4744 10643631 10307356 10325541 10394288 9855729 9560245 9179730 9261296 9493669 8718682 8842369
4734 8842369 8544401 8345029 7828566 7701148 7823714 8366154 8432573 8885274 9405424 9453536
4724 9453536 9695582 9402851 9314951 8689585 8033878 8032421 7592053 7293173 7190828 6802417
4714 6802417 6837774 6573557 6215140 6054040 5920651 6172495 6148931 6375250 6106805 6340946
4704 6340946 6080983 5811377 5857495 5843194 5821218 5754589 5999062 6135852 6575956 6840895
4694 6840895 7339020 8047724 8363826 9197677 9394745 9863050 9720238 9863873 9433749 8938397
4684 8938397 8455576 8047151 7478770 7148939 6803003 6542716 6495320 6221704 6048572 5968447
4674 5968447 6022746 6052576 6289604 6314861 6773611 6817679 7159359 6963192 6906168 6852397 6856863
4663 6856863 6829795 6809376 7422232 8177614 9031692 10388045 10779495 11199207 10595368 9932762
4653 9932762 9297544 8944966 8408180 8836886 8884703 9867148 10651992 11233951 11836472 11611581
4643 11611581 11053953 10170988 9224394 9671220 9840376 10238176 10873772 11629825 12076120
4634 12076120 11581043 10794636 9772013 8700641 7908493 7442883 7048335 7560088 7632004
4625 7632004 8574242 8736717 8575525 7970110 7021283 6105227 5436580 4589169 4197011 3579135
4615 3579135 3454080 2996136 2705859 2601375 2797187 2759987 2305950 2570747 2505847 2624194
4605 2624194 2680828 2381660 2254650 2415689 2397638 2176899 2414050 2324468 2297408 2431903
4595 2431903 1935877 1948272 1947909 1735626 1955992 1780733 1609113 1680435 2012599 1915382 1638229
4584 1638229 1749168 1580345 1747471 1320312 1388802 1554727 1719947 1687891 1577910 1626023
4574 1626023 1582199 1563081 1057218 1454969 1583135 1351630 1385917 1503341 1533122 1693869
4564 1693869 1410875 1567150 1455021 1641210 951044 1494414 1433440 1577325 1700219 1623957
4554 1623957 1781496 1623635 1245473 930424 1013820 1235679 1055154 680458 1441891 1207446
4544 1207446 1254609 929795 1116969 1240444 1110901 756387 957067 1332761 1248886 1144539
4534 1144539 1309809 1200545 1027272 937540 765159 1105958 1077011 1095472 1240430 1492185
4524 1492185 1442761 1110115 1315611 1489605 1255035 1128690 1065985 1157180 1095161 848982
4514 848982 1125324 1317810 1036826 658997 812584 908256 707458 746730 983724 904928
4504 904928 936149 536420 726440 867364 478749 543778 947057 882554 1058003 1040999
4494 1040999 1158641 1509634 1452231 1029876 1009419 1140515 827770 1179261 1042413 1298994
4484 1298994 1350995 807652 944260 974852 972040 473541 766792 758177 797693 665421 826508
4473 826508 1160989 1246826 1142053 1101201 1310547 1036756 1206569 1054016 960791 943388
4463 943388 908216 895003 973805 990737 1202225 1218796 1059815 933959 1191920 1286001 1282367
4452 1282367 1538438 1643066 1776656 1859014 1812527 1921063 1903620 1822581 1406484 1383796
4442 1383796 1357105 1123052 1156182 1166994 1229049 979672 975884 858824 1014240 1074511 964539
4431 964539 1293892 1270949 1169555 1617587 1506526 1545985 1540787 1477247 1495684 1427143 969331
4420 969331 1578682 1364743 1271143 1313966 1333277 1536025 1769114 1583734 1718108 1800027
4410 1800027 1373470 1471049 1218453 1288370 1304155 1198360 1022193 1148282 959314 1355154
4400 1355154 1127741 1179386 1324279 985218 1079411 957525 917982 1264633 871225 996802
4390 996802 894511 936339 720271 651851 847971 756788 376729 481625 395547 543259
4380 543259 516144 801047 1011536 1048749 1045108 1060665 994314 1084782 885994 884658 851406
4369 851406 505930 975067 1317881 1049853 1680913 1293125 1276579 957188 1043710 1152495
4359 1152495 965577 1025384 1041584 1292489 1551566 1308646 1516946 1978105 1565709 1424191
4349 1424191 1088132 1325922 1602270 1422825 1202889 1758160 1495747 1285891 1062561 1386584
4339 1386584 1372253 1043655 1153468 1249307 1442705 1539085 1685167 2029181 1646170 1478567
4329 1478567 1600490 1594609 1612327 1810210 1752547 2023505 1726549 1883722 1669786 1666192 1676888
4318 1676888 1869611 1713067 1930556 1845835 2171395 1977310 2179876 1859837 1549747 1607587
4308 1607587 1510044 1720463 2116998 2106956 2538435 2160146 2133445 2313911 2121588 2280024
4298 2280024 1931669 2046414 2381245 2315742 2561204 2655704 2636188 2811684 2502333 2307881
4288 2307881 2864994 2941708 3026432 3437556 3352957 3857453 3488335 3584176 3745781 3683944
4278 3683944 3600801 4113217 3571902 4673595 4380278 5086256 5379718 5376147 5799236 6029022
4268 6029022 6389664 7150184 7670447 8557453 9541559 10553731 12192891 12987098 14895679
4259 14895679 16067221 17170414 18691080 19489405 20363609 21737566 22835880 23331086 23770660
4250 23770660 23532836 23431308 22538088 21514271 20675096 19805048 18673165 17346594 16387947
4241 16387947 14979772 13430637 12514462 11183783 9851091 9066108 8102792 7717048 7349435
4232 7349435 6806114 6490330 6378797 5989035 6034761 5659802 5614158 5541654 5492707 5138130
4222 5138130 5251987 5586850 5341310 5492272 5527208 5262860 5387516 5102600 5331184 5677302
4212 5677302 5518158 5485741 5990801 6256840 6740270 6678532 7262841 7843215 8285419 8585849
4202 8585849 8988660 10292015 11085943 11871590 13270361 14683151 16429732 18572966 21498832
4193 21498832 25099585 28637961 32276664 35294298 37603248 38568576 38233618 38011088 38176668
4184 38176668 38590188 39011774 38947088 38226596 36518163 33470031 29583591 25822879 22468685
4175 22468685 19701737 17147872 15453935 13278846 12462766 11301747 10153722 9074884
4167 9074884 8763465 8229338 7973704 7426357 6906352 6910405 6439049 6052001 5703443 5702620
4157 5702620 4812093 5034548 4957402 4840950 4950718 4937202 4565672 4963003 4648081 4450795
4147 4450795 4415742 4519999 4346562 4087900 3864643 3880565 4659146 4251202 4313205 4391365
4137 4391365 4650557 4606607 4696560 5013804 4965048 5455819 5908711 6016384 6448262 6842388
4127 6842388 7253642 8173035 7893255 8467971 8812173 9049334 10033723 9871520 10444416 11175421
4117 11175421 11156679 11377101 11611407 11636408 12238878 12211806 12667789 13628515 14539209 15769478
4107 15769478 18068895 20791595 24378288 29968214 36519905 42054685 43206333 40001669
4099 40001669 33512060 27148519 22049166 18063563 15430718 13335168 11623691 10077156
4091 10077156 8777060 8065503 7231131 6689255 6471185 5906440 5892395 5339098 4873394
4082 4873394 5020635 4558241 4247853 4230487 4214824 3999863 3636011 3833176 3658446 3881690
4072 3881690 3457538 3214940 3213907 3234841 3086923 3055997 3105872 3188351 3191207 3009393 3099942
4061 3099942 3161366 2896288 2860681 3080984 2914701 2824603 3051950 3409610 3166843 3226408
4051 3226408 3095205 3179693 3109261 2605010 3068576 3194552 2833672 3204558 3261957 3510426
4041 3510426 3800710 3684291 4036115 4282552 4233704 4126248 4329673 4929742 5361140 5563966
4031 5563966 5945643 6885183 7002077 7684187 7845030 8044883 8118763 8075474 8222242 8316461
4021 8316461 8353024 8798139 8993036 8961617 8734594 9001620 9218958 8749865 9149894 9280605
4011 9280605 9241889 9088564 9043473 9260099 8952191 9092989 8792076 8367355 8280337 7562528
4001 7562528 7299447 6909497 6332077 6286144 5890406 5375828 5192935 5030031 5170096 4758438
3991 4758438 4667286 4497965 4535497 4627441 4685065 4571201 4645734 4929619 4682788 4594305 5042438
3980 5042438 4691155 4602023 4810998 4693700 4544154 4567204 4274004 4499296 4639045 4168417
3970 4168417 4442506 4718994 4174544 4325594 4167817 4058688 4301309 4183328 4333965 4277837
3960 4277837 4485366 4576448 4171526 4637140 4206156 4491463 4748632 4329619 4612974 4776197
3950 4776197 4785208 5176016 4915632 4780756 5069140 4389508 4637622 4739153 4746713 4826838
3940 4826838 5012647 4756156 5368373 4878379 4945333 5092912 4937462 4727819 4586409 4266017
3930 4266017 4228657 4810845 4541089 4696309 4709558 4986108 4989084 4868207 5231745 5177004
3920 5177004 5464346 5471027 4958228 5354058 5331966 5384854 5732862 5231656 5220637 5395035
3910 5395035 5173803 5343010 5752761 5747691 5996407 6137200 5909906 6360665 6536110 6717327
3900 6717327 7474686 7555135 7873501 8697542 8850154 9753795 10471426 11054178 11655515 12453634
3890 12453634 13447770 14688834 16402075 17719921 19528895 20612634 21263990 21754595 22099719
3881 22099719 22028781 22186095 22202831 22440629 22353617 21776202 21479101 20480520 19220292 17719390
3871 17719390 16328557 15068351 14445120 13647111 13320796 13137829 12939926 12752155 12619628
3862 12619628 12344155 12158251 12113419 12033295 11966986 11914300 12121746 12252867 12810796 12900539
3852 12900539 13202390 13692653 14056300 14437024 14506143 15004934 15184182 15550583 15794756 16315705
3842 16315705 16608979 16954199 17400814 17782776 18320810 18623174 19492838 20606897 21695057
3833 21695057 22524209 23990133 25231626 26534936 27606517 28531375 29702793 31272512
3825 31272512 33014349 34785775 36849525 38365171 40675463 42778878 44348356 45983022
3817 45983022 48020387 49871160 51593046 52173561 52867963 53686714 53876989 53449616 53024486
3808 53024486 52951574 52361882 52040633 51065182 50742126 50412434 49830566 49716496 49783698 49690179
3798 49690179 49259676 49300585 48249987 47512020 46154995 44452916 43211829 41543350 39874522
3789 39874522 38314694 36863725 35406194 34249998 32629229 31587303 30723208 30461420
3781 30461420 30224331 30091918 30013740 30362285 30987209 32110826 32793072 33519260 33923701
3772 33923701 33845112 33862352 33216843 32896799 32844945 32707385 32916574 32752286 33139197 33981391
3762 33981391 34152284 33990846 34505885 34368505 34616579 34276215 34254195 34321750 33485480 32718726
3752 32718726 32240958 31542741 30528794 30082388 29772663 29681603 29249146 28945123 28612982
3743 28612982 28623107 28479221 28332673 27910816 27758348 27184757 27242736 26857872 26714614 26613962
3733 26613962 26276137 26378590 26098065 26187127 26759879 27862072 28509584 29401192 30467052
3724 30467052 31497983 32245249 32466734 32713492 33281778 32966276 32782994 33175603 32995253
3715 32995253 33202827 33059395 33111580 32746307 32952903 33374777 33643278 34170733 34746279 35181150
3705 35181150 35366453 35313207 35228669 35338499 34743646 34031245 33499038 32594174 31899466 31351995
3695 31351995 30459521 30010507 29584983 28742847 28464291 28278190 28607200 28944935 29030871 29474490
3685 29474490 29591269 29182012 28897028 28107681 27639120 26661500 25925582 25299796 24678260
3676 24678260 24797902 24735012 24734413 25286224 25615261 25991301 25798699 26199796 27029751 27296340
3666 27296340 27486208 27650773 28301937 28912823 29044601 29730288 30270525 30320530 30673441 30604720
3656 30604720 30683519 30632223 30887571 30732611 31284730 31284541 31967046 32541895 33334057 33833109
3646 33833109 33992952 34567569 34598326 34233071 33719837 33309379 32898846 32451370 31900341 31940905
3636 31940905 31777859 31275131 31523709 31807746 32109747 31852603 32077064 32560860 32584310 32491673
3626 32491673 32356697 32020936 32218154 32239040 32529341 33248845 34215335 35358792 36932109
3617 36932109 38108935 39720619 41308109 42548968 43564409 44162299 44580970 44765766 45186618
3608 45186618 45087208 45203869 45315728 45117977 44714155 44159722 43370816 42782911 41848324 42033195
3598 42033195 41978536 42301440 42816383 43777781 44530983 44600133 44401895 44773822 44913037 45390554
3588 45390554 46262594 47262369 47779997 48580674 48954055 49189382 49167227 48611100 48036591 46939531
3578 46939531 45577300 44929691 45036366 45469058 46318751 47416915 48592244 49746568 51347405
3569 51347405 52035533 52825566 52986932 52820549 52349189 52031856 51339405 50923448 50414323
3560 50414323 50277097 50096144 50232112 49501054 48654432 47172011 45385715 44356955 43097638
3551 43097638 41929035 41151959 40375961 39847601 39255435 39179301 39608281 40742725 41468605
3542 41468605 42378716 43138861 43227939 43253477 42646036 42338350 42734492 43430124 43673129 43518785
3532 43518785 43052303 42329188 40750033 39124926 36905258 35445132 33865927 33066467 32400352
3523 32400352 32915190 33529143 34711502 35889449 36874337 37477557 38131769 38405526 38845963
3514 38845963 38647504 37933180 36828045 35241140 33430465 31594046 30486901 29502889 28349449
3505 28349449 27523966 27121347 26748278 26971863 26370583 26166062 25229248 24290004 23719792
3496 23719792 22752835 21993765 21084054 20697926 20091325 19301253 19158189 18667844 18929217
3487 18929217 18781047 18827334 19119860 19221433 19753660 19608118 19572815 19689994 19738641 19953846
3477 19953846 19888557 19756638 19742548 19099302 18671986 18045678 17977473 17617501 17850585 17770048
3467 17770048 17751984 18086547 18184077 18416465 19057400 19853292 20632706 21798913 22371483 23070727
3457 23070727 22900881 23010602 22365616 22216712 21501248 21130160 21101039 20553593 20354056 20239447
3447 20239447 19964343 19567118 19668173 20013587 20148688 20746174 21231121 21605764 22254178
3438 22254178 22235942 22107846 22278247 21649744 21527207 21054965 20879734 21018899 21046953 21342072
3428 21342072 21246440 21003786 20499927 19941137 19702708 19156628 19141824 18917616 18820788 18781340
3418 18781340 18857757 19253026 19599866 19972667 20682175 21322532 21724238 22470482 22898736 23406650
3408 23406650 23340364 23862130 23678259 24186441 24661934 25291759 25779920 25974683 26290266 25813638
3398 25813638 25269723 24602632 23940180 23528865 23094827 22729843 22848238 22841667 22908752 23121286
3388 23121286 23226012 23179795 23177775 23170328 23536447 24044238 25059819 25530665 26429544 26840682
3378 26840682 26853734 26757555 26746622 27043936 27386399 28043696 28596699 29119813 30099322 30179824
3368 30179824 30135301 30011290 29659747 30147740 30100841 30086717 31014875 31956860 32985208 34145863
3358 34145863 35372241 37014965 38218999 39110087 40056887 41427550 42605545 44077896
3350 44077896 45983102 48481332 51479558 55390665 58909482 62520535 64771192 66111127
3342 66111127 66808011 66716882 67021544 67622684 68066561 67939913 66448434 64681261 62264647
3333 62264647 60262628 58496953 58008109 57877941 58375009 59462223 61372227 64646504 69597280
3324 69597280 75952663 84098857 92064810 99011239 102519674 101668341 97223903 90872810
3316 90872810 84605566 78622697 73663250 69779039 66395790 63580751 61244028 59318041
3308 59318041 58666035 58125618 58085273 58712181 60017206 61329957 62692283 63941203 64431876
3299 64431876 64107502 63556809 62753402 62808894 62406678 62478867 62465468 62066596 60960964 59416534
3289 59416534 57717897 56755916 55918684 56763059 58139395 61501790 66858251 73783073 82305201
3280 82305201 90184139 95742950 97656344 94960289 88587986 80332818 72224820 65523561
3272 65523561 60125045 56188667 53542195 52038413 51533447 51468116 52143595 53974833 56306486
3263 56306486 60273188 65087245 69662869 74627968 78495766 80774632 82308821 82697827
3255 82697827 82774581 82108681 80199042 78611786 76884118 75708830 75413172 76492913 79200451
3246 79200451 81754044 84659588 86853625 88090502 88595328 88606460 89239119 91612495 94994072
3237 94994072 100273208 107109040 114983585 124428890 134860450 146151773 160075665 175104222
3229 175104222 190570714 204198487 211985942 213076628 206487587 194955668 181029911
3222 181029911 166739434 154176872 143791310 135310987 128450081 122038336 116564878 110775994
3214 110775994 104740223 99094305 93380305 88103451 83472759 78801610 74723261 70912392
3206 70912392 67144491 63445227 60776794 58392143 56521626 55266158 54193977 53359362
3198 53359362 52793572 51660546 51278545 51208716 50775265 50618781 50060926 49412299 48865015
3189 48865015 47876016 46871380 46304710 45717446 45465879 45672979 46137068 46971274 47246642
3180 47246642 47864784 48689687 49078766 49897818 50208823 51912934 53483435 55198820 57558311
3171 57558311 60310343 62568558 65223387 67747257 70915770 74756718 78870316 84217517
3163 84217517 90871201 99281820 111190261 127509696 150094415 176530489 203338927
3156 203338927 223625055 231359941 224043015 204114927 178676879 153723818 132548796
3149 132548796 116778147 105070826 96803329 90898633 86011656 82945446 79660750 77520872
3141 77520872 75643472 74944692 75278101 76444593 79067105 83661098 90122298 99528572
3133 99528572 112565264 130958052 154973606 183444111 214003572 241470388 260426943
3126 260426943 267848458 264384738 253100782 236467923 217537130 196908322 175843661
3119 175843661 155270094 136032094 119796304 106012454 96126840 88525060 83544564
3112 83544564 80375399 78291377 77526723 76244495 73634630 70879334 66549438 62090257
3104 62090257 57073635 53125579 48985968 45915042 43505657 41281162 39941778 38614107
3096 38614107 37423845 36966575 35703255 35345315 34660660 33692173 33560572 32964594 33010257
3087 33010257 33147188 33227397 33502745 33403815 33419933 34069474 34388693 35615966 37690402 40117956
3077 40117956 43015227 46790857 51689887 57629765 65653628 76053160 89562157 104933154
3069 104933154 120671977 134545833 142464169 142641953 134565328 121923265 106211418 91399092
3061 91399092 78577522 68529977 60419662 55000895 50386220 47732885 45548849 44406392
3053 44406392 44026149 44918844 46225066 48699956 53088389 57931890 63374971 69006412
3045 69006412 72535553 75030731 73666960 69639286 64714332 58605641 52269982 46771138
3037 46771138 42300212 38534083 35019431 32426489 30317112 28619179 27133508 25658479
3029 25658479 25236421 24396186 23472161 22956219 22382422 21985796 21558207 20650749 20350644
3020 20350644 20381328 20327594 20062685 19978390 20226019 20760047 20983002 21523011 22370503 23518299
3010 23518299 24682468 26440378 28468099 31542087 35448197 40849074 47073580 55951289
3002 55951289 65404208 74194059 80468183 82604228 80052498 73300136 64306319 55578561
2994 55578561 47561266 40707177 35548963 31762916 28696279 26372170 24765957 23675008
2986 23675008 22635794 22241892 21526302 21257546 20821019 20770713 20877104 20560178 19858427
2977 19858427 19694070 18776474 17859151 17325505 16248351 15796999 15814381 14736893 14523689
2968 14523689 14264055 13830732 14191980 13491367 13398772 13421965 12977531 12988413 13182693 13261555
2958 13261555 13297991 13195908 13692740 13165082 13321129 13691212 13951472 14445673 14562291 14858840
2948 14858840 15526508 15387688 15838509 16384842 16528841 16904350 17111185 17258289 18228163
2939 18228163 18789608 19520259 20441518 21618085 22430661 23921991 26176376 28933502 32295975
2930 32295975 36229407 41294469 48187122 56254247 67521173 82593766 101516184 123007271
2922 123007271 145519666 164690095 176464986 178377858 169322017 152555713 131328953
2915 131328953 109860762 90464007 74487910 61917074 52389128 44957361 39320738
2908 39320738 34858837 31046387 27978779 25716332 23352318 21879032 19952775 18819633
2900 18819633 18031439 16752883 15977390 15884661 14956459 14778239 14133737 13484306 13249450
2891 13249450 12832675 12690807 12295941 11887029 11910611 11388682 10802710 10707093 10511809 10621332
2881 10621332 10158722 9897379 10032917 9544269 9542693 9869581 9478324 9727214 9926918 9532472
2871 9532472 9378959 8903681 8956964 8829744 8546058 8303963 7967465 7880316 7589622 7607520
2861 7607520 7433756 7177932 7095267 7164536 6838025 6778550 6862376 6885496 7010718 6768932
2851 6768932 6544204 6514298 6604495 6843923 6897944 7023290 7541970 7515746 7555117 7627333 7463769
2840 7463769 7413905 6954581 6739729 6498229 6044975 5880709 6227838 6136194 6380026 5930433
2830 5930433 5937303 5622097 5504503 5492667 5146571 5351386 5447903 5350639 5446963 5291464 5571628
2819 5571628 5657697 5399152 5109519 5013375 4982973 4968425 5183823 4812229 5105990 4927340
2809 4927340 4822913 4692977 4446760 4446165 4707917 4487081 4506361 4469330 4670748 4998379
2799 4998379 4717155 4619557 4494465 4532404 4315866 4121671 4141646 4699195 4320112 4615786
2789 4615786 4811495 4617737 4496626 4621977 4790319 4676808 4417465 4738193 4715952 4713559
2779 4713559 4656875 4436725 4810277 4150340 4053052 4327850 4146373 3962880 4170452 4240395
2769 4240395 4037174 4235705 3944357 3944343 3826521 3712517 3602432 3941356 3678356 3566531
2759 3566531 3528463 3636823 3521560 3362057 3359966 3699900 3721334 3524932 3419400 3799859
2749 3799859 3923816 3473971 3777886 3628491 3386813 3367323 3485521 3552393 3710553 3782540
2739 3782540 3942482 3633149 3757505 3616865 3704096 3373462 3526590 3574005 3398996 3375821
2729 3375821 3761088 3747484 3902015 3529502 3684675 3321749 3030982 3210435 3534243 3555513
2719 3555513 3535079 3603403 3574704 3069662 3098166 3125913 3198297 3186773 2947078 2901909 3551177
2708 3551177 3404758 3236477 3477190 3131574 3055267 2584582 2335036 3107431 2973733 2922823
2698 2922823 3062945 2981756 2970929 2534042 2910847 2920265 2630310 2757241 2586862 2727589
2688 2727589 2868666 2987562 3281924 3033187 2766188 2866676 2238286 2289290 2273912 2397086
2678 2397086 2807488 2267017 2521808 2408073 2492086 2611903 2229248 2213680 2322999 2001916
2668 2001916 2238687 2300394 2851929 2697193 2485188 2731701 2695890 2414601 2632902 2880794
2658 2880794 2809867 2692657 2681562 2774185 2703903 2360508 2795662 2741015 2718972 2725339 2743407
2647 2743407 2749755 2706751 2774312 3021165 2592623 2816668 2808695 2742877 3113680 3204356 3288678
2636 3288678 3183253 3447874 2879281 2967125 2685703 2473990 2660076 2094181 2105542 2526162
2626 2526162 2139098 2491940 2568888 2364855 2633189 2436837 2643791 2291475 2379520 2678924
2616 2678924 2720992 2504389 2329957 2404198 2455106 2208336 2074532 2016316 2113975 2273526
2606 2273526 2179468 1925823 2208769 2474039 2116589 2134891 2037061 2215801 2047806 1916866
2596 1916866 2146026 2148817 1950773 2162970 2349906 1974504 1837424 1634181 1814392 1496505
2586 1496505 1498526 1266455 1462357 1683723 1677414 1826201 1859753 2041146 2165710 1971855
2576 1971855 2037297 2128193 2037980 2083755 2075359 1812694 1549149 1598689 1818860 1859928 1715268
2565 1715268 1627289 2122816 1738484 1737937 1870928 1885394 2066371 1697116 1681317 1561858 1962822
2554 1962822 1808515 1992403 2167687 2192266 2141693 1873919 1975793 1923075 1734739 1509639
2544 1509639 1421492 1688236 1242294 1479210 1913712 1604657 1697911 1619509 1501648 1810316
2534 1810316 1590584 1941392 1895602 2017299 1762908 1867652 1604458 1630445 1726493 1392417
2524 1392417 1467853 1619766 1326654 1395149 1620821 1666149 1838610 1498698 1390667 1563587
2514 1563587 1505930 1569527 1905012 1790423 1644632 1798357 1693081 1552803 1581402 1450408
2504 1450408 1558567 1411975 1133452 1250807 1045360 1426945 1311333 1078849 1142324 973001
2494 973001 1307014 1210054 1288536 1652126 1567347 1478260 1463956 1356855 1224419 1228914 1230884
2483 1230884 1278049 1160546 1335722 1805448 1739388 1631732 1882673 1219219 1473578 1595878
2473 1595878 1436897 1656433 1880949 1896406 2143755 1986032 1818265 2163482 1730401 1704140
2463 1704140 1564001 1597132 1553531 1547311 1689190 1798402 1589762 1666208 1278985 1178533
2453 1178533 1575101 1107653 1370922 1834503 1736859 1889907 1973253 1946466 1860297 1583325
2443 1583325 1543224 1797993 1599518 1377189 1630782 1666438 1768512 1742707 1753908 1992422
2433 1992422 1732915 1926710 1972912 1994572 2012706 2228016 2224097 2537804 2378492 2493632
2423 2493632 2585002 2590714 2753087 2397250 2522003 2790703 2334646 2659299 2682382 3025852
2413 3025852 2865526 2987537 2915339 3194671 3136609 3227118 3397814 3727493 4268674 4071807
2403 4071807 4828507 5264816 5800019 6248203 6366190 6307937 6541121 6491614 7369944 8532557
2393 8532557 10064991 11607339 14116520 17744940 22809091 31310070 43959234 57159480
2385 57159480 66685906 68523677 59613351 46175408 35260862 27119875 21750839 17827965
2377 17827965 14111190 11425252 9575964 8607820 8155848 7665856 7530081 7292580 7053134
2368 7053134 6350131 5559218 5272590 4814404 4309097 4240483 3891204 3836316 3856246 3841444
2358 3841444 3765984 3508832 3553751 3111247 3170994 2930851 2822191 2346122 2410545 2317690
2348 2317690 1958476 2148785 2178649 2220704 2529265 2017442 1989157 1951709 1624744 1486365
2338 1486365 1533388 1475606 1507109 1660675 1573292 1532123 1631138 1481334 1512706 1186298 1188596
2327 1188596 1102789 1178815 1310483 1560120 1544886 1651037 1553500 1392146 1698312 1179842
2317 1179842 1424729 1459141 1557945 1695181 1516944 1557459 1882298 1556951 1619309 1371727
2307 1371727 1292912 1106313 957054 789287 1116477 871137 960701 1234721 1226414 966583
2297 966583 1320138 1221284 1319928 970885 686931 1041873 974612 792681 632485 1087035
2287 1087035 973630 1139535 896274 719892 789437 690071 809793 935415 872538 782963
2277 782963 1219636 1150943 1044142 934058 977033 832869 955286 817966 941768 1176967
2267 1176967 1324507 982037 1372141 891795 727262 1065337 552219 439302 734858 733772
2257 733772 589887 845203 659176 726231 904706 632304 671423 788454 605664 864030
2247 864030 945502 929385 567363 931058 1022177 524200 804193 701417 902118 745112
2237 745112 542869 631398 788515 462835 381628 614366 496474 618096 312902 814811
2227 814811 938819 611329 433065 616911 651111 671276 536259 723985 844930 694987
2217 694987 397947 787511 758089 683649 573497 979350 745655 783749 828845 926656 1027255
2206 1027255 835469 725841 722317 573239 737830 756707 772439 794274 1134562 789669
2196 789669 802137 822843 785232 985532 319276 382819 401907 356030 486670 783534 745464
2185 745464 894819 372468 494182 681229 504346 434096 483723 710560 706298 256864
2175 256864 273756 709216 670215 559356 476769 407776 537488 880519 758173 732450 673546
2164 673546 679517 485308 538529 383498 614357 983694 724152 492456 675140 447407
2154 447407 666036 674179 274027 342069 677593 279977 451911 718808 698454 718973 576007
2143 576007 494375 370126 390210 441062 677382 577396 737066 726062 469444 445935 639857
2132 639857 332090 301940 31206 303797 267163 202096 599528 681973 468887 327639
2122 327639 462400 324432 452918 560049 395204 616130 558965 928473 806617 557663
2112 557663 1028666 1063939 643583 674648 465740 764404 496712 372385 559769 502573
2102 502573 728352 676594 681114 720899 1011779 777521 726434 761810 770452 407352 479591
2091 479591 492621 636364 465304 230262 951014 533496 482748 291579 462885 422071
2081 422071 282385 532683 357318 636501 834195 237283 537217 294182 278198 217154
2071 217154 -15865 247913 263339 594387 791254 1042492 394817 423037 893863 136805
2061 136805 23450 144292 585161 664530 359479 494347 982226 699398 651597 759785
2051 759785 363627 559944 545301 469597 665175 622457 508952 337974 372282 183217
2041 183217 89257 170837 427686 880706 428805 622126 1094597 581614 533362 607486
2031 607486 305375 234545 306275 566750 352030 417757 203659 511750 140843 -183092
2021 -183092 305592 403967 404559 327580 421056 510776 530612 643296 376588 412917 695207
2010 695207 458644 383027 211492 693635 618468 435863 496334 508724 546060 344325 539579
1999 539579 176762 305267 -81099 16749 -64757 -123443 112725 322131 420296 602789
1989 602789 613555 516109 627375 553177 412360 74525 196254 406120 144883 517812
1979 517812 366277 493110 594542 445333 356484 69383 305609 458337 424029 543565
1969 543565 503472 867728 639853 568501 452076 547526 234794 62236 288276 230723
1959 230723 144400 340926 373603 430911 317613 -732 277533 135312 175545 -32086
1949 -32086 355535 433784 355299 310754 386850 516761 265685 198546 232294 233468 61982
1938 61982 117760 76810 307188 142611 194441 466035 322233 600704 155139 482822
1928 482822 119864 191946 189775 -146295 223575 435289 580963 541644 355141 248794
1918 248794 286893 -124485 -260150 -237231 -313161 31952 26646 851 50275 666825 378230
1907 378230 185442 153300 166049 481944 -21596 168049 850449 415124 226175 288555
1897 288555 301945 110606 89314 -178541 131102 146058 -55444 -160887 184400 243829
1887 243829 343496 164830 196654 330139 412761 230599 433811 505611 197290 284446 83278
1876 83278 311589 509584 481700 711646 561420 104329 531372 217955 -89939 331866
1866 331866 233690 89791 178294 114229 699367 56737 205823 297710 291073 344263 127355
1855 127355 248610 652582 523629 515524 449748 177139 213604 249039 5304 277284 345840
1844 345840 537892 334976 495124 444995 549521 398407 505040 149034 336282 294377
1834 294377 554852 651669 520835 152557 399104 357376 -125598 -166683 163059 273419
1824 273419 317410 418170 207001 542220 302156 13952 7428 36817 -504623 -219092
1814 -219092 7640 -74168 5466 336045 108628 186218 -377242 -174067 -4675 230573
1804 230573 106947 149048 421242 557766 302117 505158 181145 708273 427820 334837
1794 334837 296097 547828 495885 596589 523318 281136 121766 163882 275665 101706
1784 101706 41407 433060 354760 187254 275707 137959 289826 313284 304582 496228 420817
1773 420817 288484 695688 264067 261317 101442 120346 21340 -164233 -136974 55659 230071
1762 230071 422114 298519 287790 236657 269564 372685 414224 306496 563129 365244
1752 365244 421021 293286 149653 396284 239008 219245 -43250 -63201 397779 393697 122682
1741 122682 116867 129532 110876 122800 -394728 -295486 260348 112893 -24517 61223 107632
1730 107632 421256 151608 -1030 167038 174193 74493 90525 -31325 128322 109080 129285
1719 129285 -59889 -16969 -31472 134220 -78039 180300 501263 286944 520716 658641
1709 658641 405921 574491 197090 262755 238731 208499 110348 157160 209727 591696 476987
1698 476987 347578 455094 695865 542359 131628 236625 608256 370211 170909 293137
1688 293137 339700 697661 295299 589331 311618 358424 193361 -114951 -380590 -878
1678 -878 -1225 142981 135443 8813 -53355 -22804 -71866 5169 -104539 -99014 70633 89278
1666 89278 -114717 451972 497125 547206 332021 245579 99074 -374931 -48006 348780
1656 348780 493713 269029 307193 512379 406329 -44570 -225240 -38684 170230 41794
1646 41794 -139042 434300 677263 628020 635555 454988 339898 -118311 -225809 -72649
1636 -72649 211955 -58651 29510 481579 340072 303148 187983 348764 314849 258506 195503
1625 195503 42078 131570 242627 453110 305860 301968 150748 415130 156368 255409
1615 255409 345384 536097 686555 350232 136205 56791 -3504 86367 -21900 -30273 69717
1604 69717 -139008 -66353 7108 -260597 -112235 7178 -4503 -123107 -265475 402393
1594 402393 -30118 164650 257630 121756 -91117 -34119 -189324 289916 -89431 -89024 470191
1583 470191 220866 -18526 -110343 247888 329456 276533 -11020 23639 169593 -113711
1573 -113711 -29853 -190645 360999 -379590 -127842 -146684 -379408 -164944 -92071 178237
1563 178237 91409 33744 -118400 -135172 -106585 2881 20891 88443 -373136 98287 37298
1552 37298 -50211 238975 564153 397733 286582 192276 301388 223421 642455 282154
1542 282154 380326 165881 -85680 15037 -54919 -273953 -87625 -140780 -116693 -119676 -248674
1531 -248674 171911 398110 239559 -111476 -308747 -107557 -532301 -421145 -378788 -78802
1521 -78802 -305873 -274151 -86034 152278 108154 291136 435418 76167 -128270 -57359
1511 -57359 -199177 -120287 -173908 44708 208590 134452 536035 452510 584449 752166 552551
1500 552551 523546 159335 175127 246092 143387 42798 81785 105742 141507 -35322 -27478
1489 -27478 115968 -34529 -70639 -227266 54665 72740 2565 74795 357280 -4246 98365
1478 98365 -139252 159517 -66699 -248413 -96581 -85247 -125702 -204378 -87225 -153589 -351401
1467 -351401 -172680 -377323 -243746 -215326 -302530 -158756 665 -270819 251800 32659
1457 32659 208439 83079 281769 449393 466553 310579 499142 620272 631091 143784
1447 143784 169890 388969 -147131 -233105 -234639 117429 -73314 -88431 14960 322186 548153
1436 548153 259560 179881 196389 97797 248867 107453 145178 238394 354000 101371 -61582
1425 -61582 -84531 -350793 -85476 -306230 -212240 9312 -169477 97929 64892 23979 223365
1414 223365 -55255 -126973 -55058 -159744 79460 -124390 411736 481264 208150 474591
1404 474591 232018 235655 109215 -21646 -224277 -54801 -21969 -168099 6813 -146034
1394 -146034 101780 427843 344836 187206 227483 100505 189504 209362 219845 310932 290401
1383 290401 332411 361868 299419 596865 165821 281703 282637 57813 -97225 24658 264981
1372 264981 587533 388033 348251 165869 242290 246498 -164188 -71524 36944 162667 -152739
1361 -152739 -152336 91432 362781 289399 -295286 -40431 -181716 -300660 -386847 2740 172082
1350 172082 105621 102257 113901 173890 287203 -192216 80577 86714 -21515 -333161 -314920
1339 -314920 254870 177167 75839 47084 199935 45658 21158 -202086 252885 243871 -132354
1328 -132354 64915 221502 -49770 130100 193454 181105 143862 157411 62401 617828 243474
1317 243474 62539 71444 -129738 323210 -191083 -134519 583624 281408 355055 -49106
1307 -49106 394243 571765 293976 233358 240632 500396 387073 124790 471460 339862
1297 339862 194114 188035 86996 -159468 197503 -9531 -140936 494957 -215726 -48182
1287 -48182 -99485 -109627 278724 -71758 -177799 123840 -111150 -28402 49862 159571 132838
1276 132838 -19451 -247780 39634 205353 70158 380131 128113 -53247 286799 -279869
1266 -279869 167107 178939 -9015 -150881 324383 48680 38402 -15408 227765 314284
1256 314284 -179887 39736 -79859 370773 316450 398715 194384 126732 -234135 -32652
1246 -32652 -380833 -158738 -292610 43983 -123682 -13808 32462 246238 -33418 80446
1236 80446 -439775 -821502 -463639 -695024 -349821 -229810 -114721 -217201 -79195 128857
1226 128857 137415 151773 208745 108029 192755 -537789 -178891 210880 84690 301305 -20532
1215 -20532 67231 -100699 -99218 14072 -15628 60297 104558 29221 -182140 124166 168440
1204 168440 315641 323776 145125 -37834 -87224 120393 388860 102229 364635 279835
1194 279835 285885 -43287 -45617 577933 24568 -152626 -187377 -130682 -65933 177052 155741
1183 155741 469779 285266 256404 74177 252679 299548 109860 464460 354841 11062
1173 11062 374944 279558 268380 525133 -110674 2165 -88964 -300120 -467584 32340
1163 32340 -24080 49919 146967 197157 -167491 221652 -287848 -43528 -124837 -279739 -137789
1152 -137789 224490 133729 245614 324338 183701 -64082 -101261 -183282 -106839 13261 -84684
1141 -84684 162211 312844 217386 173386 12634 145901 107345 -181095 -33003 62867 112701
1130 112701 256411 306399 196245 439030 225042 305561 -49722 -127196 13095 -265648
1120 -265648 -142325 89384 7214 235867 -15092 151019 193446 11226 79094 148884
1110 148884 200662 10494 34087 195587 25142 -14128 -24894 -325755 197606 319400
1100 319400 119281 315012 439041 484334 256062 82992 80832 356534 212373 55301
1090 55301 270231 408455 172277 223358 88355 368256 63782 151792 -310152 -21908
1080 -21908 -64275 -119523 -141172 245544 -33735 114823 -197614 329204 285532 219394 14431
1069 14431 73884 68650 -217202 -155705 -143817 59408 72929 32773 237870 213482 -16232
1058 -16232 365369 -126070 50036 -317291 -44340 172228 156969 118189 439558 517151
1048 517151 392897 123483 150237 263562 147333 -84431 88473 139056 219387 -18706
1038 -18706 60980 20627 12350 -186854 -233339 -168652 -367 -24478 46905 348649 -7200
1027 -7200 299321 -19694 -70651 14003 -195836 -65066 135772 47068 96301 45814 285013
1016 285013 21650 -66524 -57766 78691 93239 -47530 31908 322745 340730 279639 396914
1005 396914 -43648 241806 -16926 -58486 12613 297753 169750 111978 99562 64312 31090
994 31090 -59957 -140737 88267 -201228 -242772 -52946 459686 122978 305093 430030 440508
983 440508 240910 217514 168063 266072 226438 95816 -26721 25871 174498 61216 422687
972 422687 314536 342806 70910 9727 172191 333588 243147 209572 364857 222541 201319
961 201319 317508 524347 251662 172488 93659 -51923 -151382 -440435 -217845 -32140
951 -32140 -104612 -208881 -287712 59281 122787 -104233 -185924 -259870 19591 -78985 -408648
940 -408648 35487 175942 124569 -142135 38307 -104848 -68716 -132807 48131 184756
930 184756 5528 -140193 -8345 261523 -57885 224759 8559 315763 81387 251380
920 251380 116385 482352 159963 211298 226031 256477 150967 8835 301127 89735
910 89735 -417017 -51719 -88365 -257319 -169810 -398205 8541 -158393 -114401 116822 182795
899 182795 176159 353142 -103171 -29043 -157811 128944 117038 -112245 70797 26865 -100895
888 -100895 -180763 60078 -136706 -99671 -258413 41018 118333 241750 153321 120661 179874
877 179874 49505 -396815 -174140 -83766 394330 173566 248924 248854 352491 116022 -44867
866 -44867 44556 22972 -453529 -166324 -272137 -320932 -2627 149527 265265 -147409 145681
855 145681 131010 278305 185002 392659 258135 420455 200439 262215 208395 291612 439735
844 439735 311758 183487 151410 176599 512069 206874 464038 263188 225316 149758 146019
833 146019 -176459 48871 303806 -60268 24 -162278 31463 124648 -90945 245749
823 245749 -14702 76840 163669 -132702 251808 -51929 -32169 -127443 -43780 -63388 80860
812 80860 -92886 295687 263358 38778 -138754 -154169 73560 -222788 -278764 204214 -212781
801 -212781 146714 87164 209323 267261 138688 202008 351109 92000 266666 96477
791 96477 23655 327988 -42443 161114 228239 210135 97001 191 44806 488622 -85331
780 -85331 261079 102725 148981 -231040 -247119 86345 -14664 -9499 203937 211890 152377
769 152377 97575 274859 -102644 20568 -314792 -371133 -554532 -407931 -502522 -177692
759 -177692 -43124 -314052 -253144 -442272 -444483 -295904 -425886 -357565 -270273 -41265 -95320
748 -95320 -143767 127351 40118 -105739 103591 -428770 -355523 96242 36323 80816 176917
737 176917 149416 355385 233681 -131618 101818 262738 130606 -47278 -322727 51924
727 51924 80176 139958 381834 207476 318434 104661 139081 250871 272429 276203 420938
716 420938 171902 172573 -200902 171741 87532 36960 64225 104137 212810 385358 131185
705 131185 328295 213181 255181 65827 -188621 -139588 79763 81396 -90569 -93558 71563
694 71563 6254 -135277 -346736 -152299 22595 14745 -16998 74337 -39143 -38482 -8956 59902
682 59902 -146386 -76194 -370099 -54149 3858 -123025 -275154 148577 79251 -202957 -30254
671 -30254 136422 -30667 353764 -30047 34372 151102 -142601 -172283 -207300 -2215 -56081
660 -56081 47294 -239094 -152822 381073 319378 117471 222152 126765 -55962 -363288 -690047
649 -690047 -101947 -149982 -205931 149713 120469 332162 -36165 3904 40394 146212 -549499
638 -549499 -86876 -58600 -83290 -533642 -141296 -90825 -13943 -567223 -324758 -358728 101705
627 101705 -276566 -249053 36027 -282623 -92460 54449 -218135 -62244 -81870 31741
617 31741 104132 -328954 -71305 -61982 115745 -134384 -322615 -96579 240442 -148210 282888
606 282888 193525 431694 535468 68629 130688 76966 -214633 89623 -129206 201259
596 201259 -37517 288302 164968 118824 44589 -39137 -189147 -14592 -229049 54611
586 54611 15239 331190 353401 -6724 176460 23897 124208 -120169 321476 316366 571023
575 571023 394900 376473 125108 242744 -148080 -226955 -125575 -52810 86958 112934 29423
564 29423 262929 109742 -87639 -224735 -156443 -41907 -74043 56484 491077 461963 464274
553 464274 303788 -290180 -67317 -468473 -382034 -313080 -488098 -31647 -54146 -156025
543 -156025 227408 -127768 -61429 -297469 -477515 -265328 -453600 45108 -136601 -31783
533 -31783 -6916 38476 25031 -146377 -96057 301450 27490 419695 224903 18806 222365
522 222365 -28984 -331869 -236308 -431704 -269647 144473 150046 109844 411342 82744 79588
511 79588 136102 -513922 8907 182876 126258 5610 -334082 -80974 -264816 -409725
501 -409725 -766065 -643603 -323308 -627250 -321081 -452852 -211080 -181927 -370759 -593666
491 -593666 -222744 -449733 -433668 -186635 -157566 -423799 -252783 -501150 -334974 -272197
481 -272197 -728095 -122297 -70052 -119838 269790 259564 435699 265031 -184386 -323218
471 -323218 -599163 -385989 -263711 -169937 -31364 186268 218637 447433 127505 81630
461 81630 -134345 -402715 -379660 -290776 -408740 12174 289258 -44192 410037 72026
451 72026 174549 -23178 268238 303809 365935 -51864 152205 99631 54751 -70283 128680
440 128680 320718 28900 43579 144224 -105227 38233 -220760 -269688 -126113 -35722
430 -35722 -91498 129948 350845 229760 205795 122098 -8262 135783 -277960 -275745 -50210
419 -50210 1375 -152808 229574 71735 69000 157125 71798 -254415 -192160 -60755 -123045
408 -123045 252520 29045 537781 361667 124510 -80442 291868 -131229 -13358 -51542
398 -51542 229661 302623 116820 167442 272417 276763 -325718 -116723 -162652 159322 145405
387 145405 127556 391666 274013 245357 -91379 178140 -80946 13728 219139 463129
377 463129 116766 438421 345783 243580 -185942 -680266 -645943 -592869 -778190 -615890
367 -615890 -316001 166059 -188980 102489 -7676 -16594 -49719 -350743 -425534 -369158 -236760
356 -236760 -434520 193549 223587 -39157 71177 -90688 88110 -218435 -589655 -5819
346 -5819 -18082 89522 -84455 -94479 82672 59046 -174852 -310687 -328470 43162 90894
335 90894 431856 232326 496571 809501 50500 -73716 -232655 -454429 -224574 -49757
325 -49757 -450982 -126827 -150749 238868 102103 -268044 -265981 199259 -302014 -105775 -135826
314 -135826 131097 283404 83890 301328 -201729 -222469 32055 -60775 -44579 -218505
304 -218505 -73294 196789 -27527 -284846 -371670 -162730 -37467 -342498 -315909 -229150
294 -229150 64737 152156 -237863 473556 24528 -103557 147962 309846 134836 51951
284 51951 96346 473224 315724 29634 -256125 502883 102106 -124382 15545 393969
274 393969 29579 136510 -83950 144048 356333 -76802 -98600 220486 -79909 -244558
264 -244558 21904 151556 -11926 -169690 -16807 -84140 -303604 -158535 -226958 -198986
254 -198986 -305298 -456319 -5359 -228773 4245 115745 247910 307872 -3557 143328
244 143328 205395 -265738 373940 -291682 -251585 111916 -55800 22353 166288 255589 154595
233 154595 -116731 -222760 -348872 -541425 -447024 -435924 -307176 -128822 -278695 56621
223 56621 42845 -329199 -182353 -288035 -409553 -413903 -299937 -732349 -87322 -196802 -9886
212 -9886 -259190 -99877 -173579 -326129 -131167 -136701 -93113 -67057 326886 299050 -55807
201 -55807 198316 188224 258235 -249121 -490571 64817 -124526 -219442 -78904 148807 313269
190 313269 161640 -255324 10351 -232028 -56979 -371780 -320438 -381042 -151652 -291757
180 -291757 -189810 -182213 -181037 -9125 -181984 -60701 -534816 -166666 -71653 -402047 -146332
169 -146332 -319193 -309563 -297074 -244283 -175464 -67776 -201919 81524 181873 -84453 138744
158 138744 98378 100822 -26844 -347217 -173651 -494029 -29888 54678 78554 139766 268918
147 268918 397262 181439 -9335 95411 -63567 14300 31441 -253016 -123597 256279
137 256279 -70144 269531 -171621 124402 280215 -270962 -112010 174258 -89229 47478
127 47478 -183700 -146766 -308978 -150221 -75678 -82150 -148443 -216040 -195114 -435101 -390799
116 -390799 -218956 -339253 -248319 -73298 -139416 -156348 -296287 99719 -449381 -252022
106 -252022 -568697 -386360 -354896 -394001 -91346 135412 -326836 72108 -379636 -445967
96 -445967 -497290 -482185 -610128 -394997 -617799 -315479 -425395 -197231 -238171 -365464 -422282
85 -422282 -324786 -389461 -560048 -439209 -81053 -186117 -387904 -335577 -249364 -385010 -442427
74 -442427 -444311 -318933 -207359 -320190 42216 -307148 -43577 -133910 -372796 -248178 -454550
63 -454550 -509473 -335974 -463993 -151112 -139737 -212787 -236925 -358733 -423681 -479598 -515210
52 -515210 -579556 -590327 -459491 -648213 -538585 -490719 -442462 -619559 -591691 -570922 -729961
41 -729961 -688725 -696419 -659012 -356627 -432083 -200277 -166353 -444626 -284897 -281730 -462678
30 -462678 -427486 -375072 -279619 -350647 -389952 -421828 -217286 -398336 -359675 -416415 -438507 -375250
18 -375250 -684797 -538396 -464525 -487490 -515500 -535727 -495474 -531644 -550266 -442598 -411224
7 -411224 -517046 -682828 -688724 -631376 -779043 -760894 -489596
0 -489596
$$ Imaginary data points
##PAGE= N=2
##DATA TABLE= (X++(I..I)), XYDATA
16383 -1983161 -1825286 -1696879 -1451779 -1448715 -1624983 -1336335 -1261255 -1336325 -1394713 -1355706
16373 -1355706 -1237690 -1188895 -1363667 -1456766 -1305376 -1257528 -1004635 -1139345 -1006724 -1104613
16363 -1104613 -1048409 -1144210 -1236033 -947035 -883930 -988335 -1056823 -1131003 -842329 -909490 -958616
16352 -958616 -900222 -828099 -1026480 -844730 -1125265 -732519 -567403 -806267 -582310 -702836
16342 -702836 -711594 -754059 -807212 -550505 -695632 -607075 -592018 -447206 -209423 -309362 -70026
16331 -70026 -19314 -308505 -379056 -387294 -444154 -203465 -49573 45877 -39258 97205 171046
16320 171046 308075 242304 20327 189464 147310 422514 272175 124762 642381 504443
16310 504443 605713 287505 316900 514586 420535 358191 385799 502213 665619 321418
16300 321418 705852 214971 619721 552622 300438 478145 706585 621206 751258 686896
16290 686896 732746 667775 713686 621973 786977 772504 540078 942420 761197 758479 691948
16279 691948 747210 628882 716645 854450 968069 1031310 1333648 1288790 1353975 1369459 1102800
16268 1102800 1554604 1431946 1515943 1606485 1567855 1769649 1834218 1508227 1493804 1589065
16258 1589065 1397452 1419710 1341384 1639408 1784722 1910833 2051415 1977755 1646088 1737165
16248 1737165 1598445 1914738 1837605 1819936 2087169 2082413 1918339 2231673 2110918 2036823
16238 2036823 1991446 1621958 1700689 1770591 1712447 2151833 2137969 2015744 1839487 1951089
16228 1951089 1768836 2012086 1751103 2035130 2079490 1952353 1988411 2155407 2138920 2193132
16218 2193132 2156902 1952996 1978019 1808685 1894297 2288067 2184471 2326125 2207701 2250172
16208 2250172 2341133 2318823 2334021 2745419 2602797 2487275 2523545 2584695 2891937 2577083
16198 2577083 2544443 2467035 2384132 1975503 2220221 2216511 2242820 2275920 2112655 2244595 2124094
16187 2124094 2232804 2176107 2045881 2208807 2024376 2056448 2247795 2233764 2580530 2624880
16177 2624880 2365832 2716274 2408098 2290795 2578537 2567954 2476103 2708318 2309934 2660933
16167 2660933 2617899 2616702 2485234 2695174 2554229 2890996 2667569 3059227 2990727 3144871
16157 3144871 2905776 3100010 2960655 2742879 2981862 2789466 2735206 2889439 2355653 2495849
16147 2495849 2400174 2552334 2795462 2599785 2473948 2596965 2722489 2372945 2486586 2660472
16137 2660472 2567146 2816639 2744360 2655852 3121865 3053708 3156424 3041444 3152134 2946816
16127 2946816 2998743 2670151 2761604 3020791 2560525 2487757 2839343 2647876 2743153 2531686
16117 2531686 2801949 2745137 2691248 2634088 3023689 2765552 3072745 3236197 2856481 3114228
16107 3114228 3138481 2946411 2989057 2766746 3056237 3042732 2916918 2992920 3161293 2866244
16097 2866244 2895636 3283371 2917612 3067016 2919867 2975924 2955370 2831229 2853659 2964223
16087 2964223 3188337 3168504 3132235 2972806 3026801 3198578 3018544 2854271 3010621 2543486
16077 2543486 2663748 2691669 2856208 2935520 3013149 2818490 3036221 2918146 2777331 3060359
16067 3060359 3085853 2926791 3050536 2920613 3046462 3344210 3310320 3150228 3349550 3039155
16057 3039155 2995043 3061717 3016857 3347168 3503447 3367188 3260420 3042250 2858928 3104398
16047 3104398 3090787 3019785 3282935 3212279 3208550 3281863 3288299 3567840 3107426 2903888 2881539
16036 2881539 2784540 2970962 3097562 3104896 3281487 3166692 3127219 2647320 2998551 2956926
16026 2956926 3001122 3100451 2892660 3266751 3064352 3025826 3303621 3226233 3109101 2843313
16016 2843313 3070212 2763077 2993384 3193013 3072442 3232675 3306464 3153964 3079948 3035991
16006 3035991 3267601 3113662 2909076 2637282 3017533 3111829 3006526 3206322 3232587 3178854
15996 3178854 2936117 2963498 2976349 2947171 3064084 2986166 3236019 3100775 3235409 2960975
15986 2960975 3125955 3118316 2899164 2991125 2894939 3138750 3092654 3154708 3067139 3449647 2945042
15975 2945042 3082847 3153980 2858188 3065621 2940824 3070677 2999588 3111881 3112732 3199903
15965 3199903 3247335 3150870 3191478 3394694 3069136 3166366 2961427 2759341 2962463 2823392
15955 2823392 2974786 2854236 2912021 2977531 3055929 3119059 2957123 3077234 3183010 2988733
15945 2988733 2472018 2884415 2972395 2947014 3049421 2879426 3169976 3129346 2693810 2445905
15935 2445905 2579003 2602491 2809705 2481986 2581701 2826609 2973968 2725242 2613730 2814723
15925 2814723 2910615 2547061 2731104 2993788 3076953 3092259 3268424 3269991 3260717 2961367 3156577
15914 3156577 3238244 2974233 2870604 2755747 2958810 3174508 2717418 2898743 3230163 3161091
15904 3161091 3177559 2814886 3148060 3639416 3371961 3309025 3600270 3269628 3346316 3340369
15894 3340369 3350469 3122720 3150097 3195185 3294005 3073567 2951002 3075253 3103076 2919120
15884 2919120 2718900 2962549 3117768 3206431 3185119 3085659 3296703 3370058 3024025 3118689
15874 3118689 2973532 3134773 3280864 2918842 2985820 3207238 2744069 2980849 2619356 2587240
15864 2587240 2771602 2611482 2760815 2819102 3166846 3000590 2891562 2800572 2908249 2983201
15854 2983201 2846008 3152251 3290490 3388690 3407721 3635981 3570225 3350558 3151557 3067270
15844 3067270 2735397 2890195 2896302 2944180 2999039 3196296 3327844 3301350 3259556 3091955
15834 3091955 3129196 2983331 2750900 2784729 3020909 3015142 2885418 2986462 2653785 3007366
15824 3007366 2707490 2530559 2738358 2864180 2750412 2654858 2734679 2788015 3007846 2918153
15814 2918153 2881404 2873908 3221712 2892990 3198056 3238135 3457421 3575916 3438208 3069730
15804 3069730 3498372 3489998 3408548 3244943 3315653 3090940 3020260 2883366 3101565 3356000
15794 3356000 3393820 3205771 2957649 2956286 2863607 2806463 3112040 2827322 3021789 3043055
15784 3043055 3210188 2960732 3291770 3118419 3254920 2980077 2566628 2767696 2703483 2867027
15774 2867027 3117779 3297887 3494559 3389754 3148742 3703548 3352889 3486067 3400564 3312412
15764 3312412 3068310 3282628 3207999 3682680 3628050 3355450 3393992 3260632 3066209 3011147
15754 3011147 3410709 3237099 3164357 3290389 3211897 3108825 2926745 3146180 3252807 3232505
15744 3232505 2754202 2860878 3087797 3083084 3121737 3223536 3348804 3077572 3013941 2970794
15734 2970794 3036981 3455460 3113505 3107517 3244265 2981378 3218587 3185314 3264775 3506897
15724 3506897 3290899 3438551 3111556 3207003 3470261 3390421 3308970 3311311 3038372 3267471
15714 3267471 3088057 2998065 3468931 3492237 3321521 3361889 3181667 2915850 3230117 3095757
15704 3095757 3269390 3189742 2969418 3084043 3018889 3007641 3247985 3025558 3112911 2837775
15694 2837775 3259767 2941046 3053094 3137840 3358848 3235039 2826167 3078507 2890659 3242895
15684 3242895 2854135 3185626 3294752 3293283 3291616 3084792 3041691 3064733 2855392 2761429 2826245
15673 2826245 2567176 3059549 3213423 3208077 3416701 3211553 3286796 3305978 2916617 2936483
15663 2936483 3190331 3089722 3262689 2939328 3277819 3008922 3085201 2930169 3068795 3054259
15653 3054259 3081267 3065859 3019066 3253095 3102078 3197567 2945824 3029871 3089143 3070662 3231628
15642 3231628 3474366 3474037 3737502 3495156 3570940 3109676 3158769 3069466 3028453 2936554 3230772
15631 3230772 3184586 3277811 3281547 3334766 3328039 3286689 3045642 3077278 3120492 2965606 3129031
15620 3129031 3138741 3328259 3507340 3452382 3034384 3404910 3195217 3147018 3150670 3264751
15610 3264751 3089796 3356814 3086952 3384642 3418509 2985753 3362067 3718129 3468101 3535726
15600 3535726 3353608 3746857 3750226 3504209 3338163 3365830 3446615 3078757 3053243 3244970
15590 3244970 3442246 3427902 3273238 3120560 3221074 3086047 3301884 2876115 3239565 3195009
15580 3195009 3393870 3485149 3399114 3591066 3589972 3418635 3608016 3128967 3364634 3400426
15570 3400426 3705755 3810911 3624991 3706744 3667001 3425400 3235037 3153378 3288888 3477141
15560 3477141 3372879 3448878 3668120 3716233 3810854 3703200 3548298 3661049 3146445 3136666
15550 3136666 3287424 3245688 3266476 3494196 3116464 3227131 2849659 2854448 3094721 2988554
15540 2988554 2896472 3113715 3113652 2910401 3076357 3407377 3011343 3365248 3128328 3202184
15530 3202184 3125073 3125712 3283770 3462037 3351574 3249248 3469928 3312831 3370931 2987800
15520 2987800 3528090 3105448 3219000 3144807 2919916 3152716 3069201 3160636 3642050 3367487
15510 3367487 3468568 3440269 3426726 3471046 3217448 3075397 3219505 3018609 2983331 3346781
15500 3346781 3225294 3387107 3294761 3469920 3482150 2876347 2819208 3098859 3193804 3325618
15490 3325618 3287474 3385974 3920228 3534491 3350290 3096699 3246714 3326804 2708952 2942928
15480 2942928 3061306 3416563 3244884 3328431 3555728 3533773 3017109 2969345 2755559 2909496
15470 2909496 2812450 3050548 3473594 3167066 3419977 3028744 3439673 3198065 3062603 2946104
15460 2946104 2968027 3136493 2994060 2964755 3410144 3360809 2950275 2898989 2476880 2890827
15450 2890827 2697083 2974173 3457575 3216923 3305014 3262507 3408610 3274192 3100381 3260142
15440 3260142 3285612 3231994 3126204 3084919 3235311 3701501 3521762 3219965 3428112 2951874
15430 2951874 3067723 3276199 2975105 3593448 3504370 3443660 3145869 3125021 3201875 3289599
15420 3289599 3540321 3325206 3054568 3457297 3180703 3428059 3676377 3498361 3482097 3374183
15410 3374183 2826953 2981614 2992334 3193428 3307991 3038249 2921031 2700430 2803866 2967653
15400 2967653 3084689 3294124 3156109 3122325 2964985 2863842 3113040 3549938 3186494 3182455
15390 3182455 3042212 3030349 3086105 3174929 3277600 3548847 3274278 2991762 3081073 2990681
15380 2990681 3354151 3419931 3440766 3198669 3315036 2826144 3069761 3050220 3633797 3281550
15370 3281550 3322208 3283504 3462859 3374692 3337281 3532141 3671240 3200110 3149414 3092380
15360 3092380 3416966 3447025 3317660 2975077 3086809 2744262 2686666 2719314 2920834 3372604
15350 3372604 3493742 3114906 3326045 3274127 3318088 3176729 3032935 3140406 3010953 2955290
15340 2955290 2992209 3246468 3672868 3442956 3050183 3260385 3172093 3096384 3027029 2820509
15330 2820509 3145504 3374762 3057278 3200842 3294509 3502554 3464691 3301018 3245049 3384182
15320 3384182 3495464 3615441 3491726 3702536 3690486 3448508 3538845 3420427 2974598 3249144
15310 3249144 2923653 2972652 3043712 2938502 3036783 3258784 3142437 3223638 3106415 3226790
15300 3226790 3591057 3500179 3262159 3346936 3319258 3482796 3089235 3072102 3070761 3162929 3001429
15289 3001429 3217083 2947814 3134161 3212906 3236483 3039889 2904081 2969921 3160723 3004685
15279 3004685 3089493 3001004 3115118 2854048 2862078 3153712 3078733 3305058 3475548 3567781
15269 3567781 3594675 3415712 3402106 3363809 3189437 3040759 2812616 2846285 2944731 3238387
15259 3238387 3320655 3567832 3861419 3695064 3757985 3523723 3628092 3465095 3607744 3399243
15249 3399243 3246786 3501852 3523120 3691177 3682986 3408385 3361602 3460113 3056298 3118813
15239 3118813 3151980 3411009 3634820 3299877 3355252 3404789 3405403 3244464 3048408 3206941
15229 3206941 3343983 3231503 3137858 3523878 3756848 3759385 3484873 3340114 3251718 3254300
15219 3254300 2671904 2849783 3079314 3309138 2933488 3297330 3563034 3691003 3249566
15210 3249566 3154161 3413473 3386822 3213882 3295612 3394166 3551670 3230252 3673311 3109363
15200 3109363 3658997 3014220 3046446 3089198 2989431 3175551 3512060 3164722 3453962 3303987
15190 3303987 3258379 3294644 3246062 3381162 3581311 3468103 3475388 3645473 3455781 3575186
15180 3575186 3310778 3283169 3278774 2907152 2828515 2959728 3038528 3379544 2956427 3285740
15170 3285740 3284405 3221120 3283901 3153157 3442434 3417791 3053170 3440834 2954014 3216492
15160 3216492 3432536 3167695 3404182 3422709 3171032 3694384 3177151 3581715 3533584 3221436
15150 3221436 2931699 2952192 2828727 3109032 3188433 3389629 3740672 3720108 3547290 3600036
15140 3600036 3706266 3569300 3362974 3485082 3203630 3475631 3156365 3187138 3402781 3284303
15130 3284303 3073301 3040462 2747555 3056866 3134684 3090490 3486886 3529111 3562607 3468759
15120 3468759 3305581 3507259 3462508 3328420 3577164 3503347 3637420 3679485 3749158 3928376
15110 3928376 3666380 3400992 3293854 3513822 3420881 3261829 3180184 3552692 3313497 3473232
15100 3473232 3223777 3574972 3652078 3331442 3430719 3438106 3669864 3495552 3428768 3563433
15090 3563433 3458875 3384043 3343013 3331357 3257326 2992832 3096996 2884267 3161316 2924193
15080 2924193 3017193 3299680 3352897 3358347 3358246 3311910 3486945 3474903 3468003 3346291 3404460
15069 3404460 3338297 3492810 3251364 3446140 3437857 3417536 3072678 3135232 3121392 3304363
15059 3304363 3118413 3362018 3428540 3441651 3334902 3413996 3653984 3319485 3342097 3402785
15049 3402785 3220842 3505624 3730362 3466708 3811370 3982867 3664857 3786213 3224422
15040 3224422 3313618 3652338 3106448 3481760 3335663 3402555 3532208 3471656 3508062 3380373
15030 3380373 3324239 3348657 3090136 3361067 3312184 3468758 3570578 3446007 3428506 3179186
15020 3179186 3303086 3358322 3317797 2932247 3419051 3445510 3269973 3009167 3340799 3534129
15010 3534129 3363808 3222916 3460248 3301225 3508889 3206071 3780183 3616820 3290874
15001 3290874 3342247 3498733 3216359 3170271 3152195 3183285 3476392 3210947 2970545 3116982
14991 3116982 3375668 3205074 3020490 3262697 3236813 3386016 3290476 3220766 3532821 3397679
14981 3397679 3347881 3566199 3495619 3346245 3738907 3722306 3530981 3685194 3767296 3355912
14971 3355912 3568302 3361975 3576112 3242486 3361148 3331683 3716525 3216257 3511760 3294182
14961 3294182 3645329 3510216 3652521 3676156 3628384 3715918 3648690 3222888 3313312 3354886
14951 3354886 3169750 3250760 3379141 3512091 3501480 3712755 3473290 3564333 3461567 3514373
14941 3514373 3504394 3185562 3383005 3574512 3775235 3535996 3875042 3562343 3739071 3793664
14931 3793664 3647973 3678845 3830619 3790523 3607046 3350032 3259461 3552563 3371669 3071187
14921 3071187 3142047 3242722 3089854 3351025 3260058 3459307 3277037 3229802 3124993 3214205
14911 3214205 3527475 3396668 3569647 3838615 3795126 3273383 3255475 3382156 3559389 3373101
14901 3373101 3060903 3589196 3457881 3555735 3652255 3695583 3718690 3510356 3152428 3131302
14891 3131302 3071275 3460625 3686938 3654021 3574644 3705548 3710955 3289429 3512861 3273704
14881 3273704 3399408 3622487 3188278 3542719 3430400 3716621 3463279 3418234 3289562 3166510
14871 3166510 3058427 2914495 3261892 3634065 3262596 3522243 3543711 3340196 3211900 3046466
14861 3046466 2990096 3099402 2954606 3045309 3368026 3576693 3517802 3566985 3364272 3599392
14851 3599392 3546852 3273526 3539404 3630723 3504273 3662795 3598944 3570933 3615294 3529961
14841 3529961 3546300 3825599 3826019 3957603 3882747 3760764 3582081 3877368 3247074 3344584
14831 3344584 3448583 3234337 3640118 3450887 3587236 3415417 3590903 3375356 3239119
14822 3239119 3392459 3163741 2885554 3244358 3024417 3494120 3234659 3038685 3724097
14813 3724097 3342525 3166340 3593462 3788025 3945527 3693692 3811061 3783513 3740659 3602075
14803 3602075 3664472 3588649 3493988 3607202 3730577 3761758 3604382 3953777 4179545 3566908
14793 3566908 3663921 3512569 3310135 3452245 3464947 3423025 3715385 3313770 3497011 3177300
14783 3177300 3309556 3608356 3296602 3267836 3322363 3385520 3710555 3393464 3702060 3654208
14773 3654208 3437524 3475097 3053437 3458482 3462219 3618166 3698238 3693219 3893014 3935102 3460162
14762 3460162 3829036 3918035 3775755 3378533 3386516 3409812 3387632 3439717 3354388 3865074 3402874
14751 3402874 3389129 3183520 3517745 3507468 3303349 3531861 3352100 3382913 3450402 3407615
14741 3407615 3417233 3558625 3568728 3777242 3234891 3331849 3719315 3608697 3538076 3451672
14731 3451672 3758974 4134439 3542171 3394788 3798526 3898881 3653664 3542027 3508785 3374439
14721 3374439 3705451 3482914 3533955 3641943 3478669 3577360 3555726 3405481 3402781 3390282
14711 3390282 3526969 3414270 3238103 3503965 3158799 3708203 3451433 3327479 3671884
14702 3671884 3536300 3576702 3555717 3403896 3522148 3850058 3844966 3496143 3591228 3403983
14692 3403983 3682354 3661271 3346317 3363016 3555708 3635015 3296248 3405029 3419851 3607048
14682 3607048 3508735 3222850 3268073 3316076 3051104 3101071 3299013 3258623 3344151 3430363 3362606
14671 3362606 3499625 3618423 3441248 3494597 3463529 3399597 3154596 3269897 3438346 3984432
14661 3984432 3484299 3439927 3910401 3559109 3358508 3365780 3551788 3569172 3429411 3712774
14651 3712774 3901915 3555486 3629447 3929109 3792765 3647684 3628476 3741369 4095100 3600456
14641 3600456 3961571 3956275 3777105 3843852 3286125 3272858 3546013 3429683 3589961 3488521
14631 3488521 4000315 3758174 3687736 3744771 4003388 3724277 3648888 3795843 3968693 3731041
14621 3731041 3731759 4014621 4202198 4035689 3826368 3710383 3607483 3708532 3553289 3573030
14611 3573030 3470690 3557962 3596787 3588251 3406224 3862248 3855085 3554648 3697844 3835208
14601 3835208 3773437 4144250 3851964 3898654 4094842 3779970 3643693 3837079 3681554 3764251
14591 3764251 3572493 3622377 3598150 3545389 3148530 3466397 3569708 3530399 3710648 3741132
14581 3741132 3774049 3881837 3973771 4051545 3834614 3798286 3861638 3749659 3489782 3495686 3473943
14570 3473943 3244869 3431515 3165960 3076593 3306529 3485651 3439014 3337100 3710588 3392866
14560 3392866 3681224 3768834 3585643 4011735 3806072 3698116 4240750 4025217 3739406 4373043
14550 4373043 3862494 3706880 3658198 3638293 3318507 3599629 3460287 3345558 3580855 3591729
14540 3591729 3627599 3571660 3375934 3624830 3903789 3645314 3554972 3961075 3935814 3718861
14530 3718861 3630632 3627933 3446031 3558589 3327839 3358837 3289143 3357307 3250786 3292659 3149203
14519 3149203 3199008 3301701 3479361 3421503 3469240 3790314 3938734 3863013 3956941 3859436
14509 3859436 3658505 3805358 3637026 3732703 3756989 3560046 3858341 3733568 3475815 3506890
14499 3506890 3540369 3611234 3702021 3267399 3535506 3810115 3984384 3938762 3947747 4188259
14489 4188259 4131708 3895748 3734475 4008175 3995455 3963168 3786062 4257564 3653983 3785519
14479 3785519 3887657 3645691 3537406 3638162 3382886 3648696 3379592 3710513 3687335 3488957
14469 3488957 3634299 3776013 3866871 3642848 3841891 4205387 4044596 3349327 3346414 3456212
14459 3456212 2950641 3225831 2998760 3395062 3528399 3370253 3276678 3833187 3539001 3490860
14449 3490860 3478662 3456175 3686314 3453740 3664692 4129163 3950702 3793496 3538477 3329019
14439 3329019 3997626 3335287 3793956 3722096 3725252 3851679 3644109 3491802 3546751 3392196
14429 3392196 3166865 3266602 3332673 3479310 3599722 3816733 3867318 3794290 3522182 3461247
14419 3461247 3172769 3418957 3237619 3256796 3288112 3538887 3461411 3310975 3426501 3178916
14409 3178916 3407674 2707182 2954847 3106974 3387556 3371649 3877677 3621017 3853298 3615823
14399 3615823 3671743 3881462 3480633 3917073 3789021 3695329 3822244 3951264 3702525 3897558
14389 3897558 3663016 3779523 3409440 3261826 3684759 3820817 3611886 3802510 3900805 3779073
14379 3779073 3667772 3704212 3821178 3726400 3740616 3517006 3743216 3665920 3753287 3903395
14369 3903395 3926069 3957272 3660335 3454097 3614845 3376395 3433462 3378411 3437536 3598425
14359 3598425 3498853 3546141 4058802 3945000 4015766 4207812 3974126 4140507 3979765 3950960
14349 3950960 4242051 3842897 3800188 3917742 3743145 3667982 3820748 3536186 4083472 3719946
14339 3719946 3376410 3678324 3345068 3743301 3851484 3507357 3904835 3719911 3804697 3886667
14329 3886667 3611256 3805075 3760713 3733113 3592591 3508510 3661108 3635057 3604225 3832262
14319 3832262 3446256 3295584 3513297 3284160 3368522 3649776 3333360 3902209 3541852 3447304
14309 3447304 3931056 3809114 3768924 3647906 3719215 3565970 3662724 3730133 3982209 3914214
14299 3914214 3894589 3876451 3800579 3513015 3420356 3385650 3639661 3598817 3704961 3623065 3587292
14288 3587292 3731602 3712047 3711312 3772568 3764707 3653618 3598180 3533085 3933491 3553296 3898413
14277 3898413 3547854 3585854 3492452 3699713 3520275 3657791 3472003 3628516 3662732 3360615
$$ [...]
##END NTUPLES=NMR SPECTRUM
##END=
