##TITLE=1H_DE-80H_X3
 200.13MHz, d2o
 8 sc
 
 19ns.26.2.2025
##JCAMPDX= 6.0         $$ Bruker NMR JCAMP-DX V2.0
##DATA TYPE= NMR FID
##DATA CLASS= NTUPLES
##ORIGIN= UXNMR, Bruker Analytische Messtechnik GmbH
##OWNER= pz
$$ XWIN-NMR		Version 3.5
$$ Fri Apr 24 10:16:53 2026 Russian Standard Time (UT+4h)  Yarkov@DPX200
##.OBSERVE FREQUENCY= 200.1313
##.OBSERVE NUCLEUS= ^1H
##.DELAY= (6, 6)
##.ACQUISITION MODE= SIMULTANEOUS
##.ACQUISITION SCHEME= undefined
##.AVERAGES= 8
##.DIGITISER RES= 18
##SPECTROMETER/DATA SYSTEM= spect
##.PULSE SEQUENCE= zg30
##.SOLVENT NAME= DMSO
##.SHIFT REFERENCE= (INTERNAL, DMSO, 0, 14.3821)
##AUDIT TRAIL= $$ (NUMBER, WHEN, WHO, WHERE, WHAT)
$$ ##TITLE= Audit trail, XWIN-NMR		Version 3.5
$$ ##JCAMPDX= 5.01
$$ ##ORIGIN= Bruker BioSpin GmbH
$$ ##OWNER= Yarkov
$$ C:/Bruker/XWIN-NMR/data/yarkov2/nmr/H-C/1/audita.txt
$$ ##AUDIT TRAIL=  $$ (NUMBER, WHEN, WHO, WHERE, WHAT)
(   1,<2026-04-24 10:13:53.73 +0400>,<Yarkov>,<DPX200>,
      <created by zg, POWCHK disabled, PULCHK disabled
       configuration hash MD5:
       00 E9 B6 7A A2 85 ED C7 34 08 36 98 17 FE 4E 26
       data hash MD5: 16K
       44 9D 00 E0 8E 9F 8D 4D 37 82 EF 73 34 94 73 1E>)
$$ ##END=
$$ 
$$ hash MD5
$$ 05 AB 35 70 DD D3 06 6A 73 B7 C7 08 8C 05 22 00
##$RELAX= 
##$RELAX= 
##$RELAX= 
##$RELAX= 
##$RELAX= 
##$RELAX= 
$$ Bruker specific parameters
$$ --------------------------
##$DU= <C:/Bruker/XWIN-NMR>
##$EXPNO= 1
##$NAME= <H-C>
##$PROCNO= 1
##$TYPE= <nmr>
##$USER= <yarkov2>
##$AMP= (0..31)
100 100 100 100 100 100 100 100 100 100 100 100 100 100 100 100 100 100 
100 100 100 100 100 100 100 100 100 100 100 100 100 100 
##$AQSEQ= 0
##$AQ_mod= 1
##$AUNM= <au_zg>
##$AUTOPOS= <>
##$BF1= 200.13
##$BF2= 200.13
##$BF3= 200.13
##$BF4= 200.13
##$BF5= 200.13
##$BF6= 200.13
##$BF7= 200.13
##$BF8= 200.13
##$BYTORDA= 1
##$CFDGTYP= 0
##$CFRGTYP= 5
##$CHEMSTR= <none>
##$CNST= (0..31)
1 1 145 1 1 1 1 1 1 1 1 1 1 1 1 1 1 1 1 1 1 1 1 1 1 1 1 1 1 1 1 1 
##$CPDPRG= <>
##$CPDPRG1= <>
##$CPDPRG2= <>
##$CPDPRG3= <>
##$CPDPRG4= <mlev>
##$CPDPRG5= <mlev>
##$CPDPRG6= <mlev>
##$CPDPRG7= <mlev>
##$CPDPRG8= <mlev>
##$CPDPRGB= <>
##$CPDPRGT= <>
##$D= (0..31)
0 0.7 0 0 0 0 0 0 0 0 0 0.03 0 0 0 0 0 0 0 0 0 0 0 0 0 0 0 0 0 0 0 0 
##$DATE= 1777011233
##$DBL= (0..7)
120 120 120 120 120 120 120 120 
##$DBP= (0..7)
150 150 150 150 150 150 150 150 
##$DBP07= 0
##$DBPNAM0= <>
##$DBPNAM1= <>
##$DBPNAM2= <>
##$DBPNAM3= <>
##$DBPNAM4= <>
##$DBPNAM5= <>
##$DBPNAM6= <>
##$DBPNAM7= <>
##$DBPOAL= (0..7)
0.5 0.5 0.5 0.5 0.5 0.5 0.5 0.5 
##$DBPOFFS= (0..7)
0 0 0 0 0 0 0 0 
##$DE= 6
##$DECBNUC= <off>
##$DECIM= 32
##$DECNUC= <off>
##$DECSTAT= 4
##$DIGMOD= 1
##$DIGTYP= 9
##$DL= (0..7)
0 120 120 120 120 120 120 120 
##$DP= (0..7)
150 150 150 150 150 150 150 150 
##$DP07= 0
##$DPNAME0= <>
##$DPNAME1= <>
##$DPNAME2= <>
##$DPNAME3= <>
##$DPNAME4= <>
##$DPNAME5= <>
##$DPNAME6= <>
##$DPNAME7= <>
##$DPOAL= (0..7)
0.5 0.5 0.5 0.5 0.5 0.5 0.5 0.5 
##$DPOFFS= (0..7)
0 0 0 0 0 0 0 0 
##$DQDMODE= 0
##$DR= 18
##$DS= 0
$$ [...]
##$SUBNAM2= <"">
##$SUBNAM3= <"">
##$SUBNAM4= <"">
##$SUBNAM5= <"">
##$SUBNAM6= <"">
##$SUBNAM7= <"">
##$SUBNAM8= <"">
##$SUBNAM9= <"">
##$SW= 18.0517328524113
##$SWIBOX= (0..15)
0 0 2 0 0 0 0 0 0 0 0 0 0 0 0 0 
##$SW_h= 3612.71676300578
##$TD= 16384
##$TD0= 1
##$TE= 0
##$TE2= 300
##$TE3= 300
##$TEG= 300
##$TL= (0..7)
0 120 120 120 120 120 120 120 
##$TP= (0..7)
150 150 150 150 150 150 150 150 
##$TP07= 0
##$TPNAME0= <>
##$TPNAME1= <>
##$TPNAME2= <>
##$TPNAME3= <>
##$TPNAME4= <>
##$TPNAME5= <>
##$TPNAME6= <>
##$TPNAME7= <>
##$TPOAL= (0..7)
0.5 0.5 0.5 0.5 0.5 0.5 0.5 0.5 
##$TPOFFS= (0..7)
0 0 0 0 0 0 0 0 
##$TUNHIN= 0
##$TUNHOUT= 0
##$TUNXOUT= 0
##$USERA1= <user>
##$USERA2= <user>
##$USERA3= <user>
##$USERA4= <user>
##$USERA5= <user>
##$V9= 5
##$VALIST= <valist>
##$VCLIST= <CCCCCCCCCCCCCCC>
##$VD= 0
##$VDLIST= <DDDDDDDDDDDDDDD>
##$VPLIST= <PPPPPPPPPPPPPPP>
##$VTLIST= <TTTTTTTTTTTTTTT>
##$WBST= 1024
##$WBSW= 4
##$XGAIN= (0..3)
0 0 0 0 
##$XL= 0
##$YL= 0
##$YMAX_a= 69327
##$YMIN_a= -36239
##$ZGOPTNS= <>
##$ZL1= 120
##$ZL2= 120
##$ZL3= 120
##$ZL4= 120
##$ABSF1= 10
##$ABSF2= 0
##$ABSG= 5
##$ABSL= 3
##$ALPHA= 0
##$AQORDER= 0
##$ASSFAC= 0
##$ASSFACI= 0
##$ASSFACX= 0
##$ASSWID= 0
##$AUNMP= <proc_1d>
##$AZFE= 0.1
##$AZFW= 0.1
##$BCFW= 1
##$BC_mod= 2
##$BYTORDP= 1
##$COROFFS= 0
##$CY= 83.5205535888672
##$DATMOD= 1
##$DC= 2
##$DFILT= <>
##$DTYPP= 0
##$F1P= 10.8118882576601
##$F2P= -7.23987719738617
##$FCOR= 0.5
##$FTSIZE= 0
##$FT_mod= 4
##$GAMMA= 1
##$GB= 0.15
##$INTBC= 1
##$INTSCL= 1
##$ISEN= 128
##$LB= 0.25
##$LEV0= 0
##$LPBIN= 0
##$MAXI= 10000
##$MC2= 0
##$MEAN= 0
##$ME_mod= 0
##$MI= 1.114404
##$NCOEF= 0
##$NC_proc= 0
##$NLEV= 6
##$NOISF1= 3.799351
##$NOISF2= 2.8
##$NSP= 1
##$NTH_PI= 0
##$NZP= 0
##$OFFSET= 14.38212
##$PC= 1
##$PHC0= -5305.116
##$PHC1= 11.42193
##$PH_mod= 1
##$PKNL= yes
##$PPARMOD= 0
##$PSCAL= 0
##$PSIGN= 0
##$REVERSE= no
##$SF= 200.129724274929
##$SI= 16384
##$SIGF1= 3
##$SIGF2= 2
##$SINO= 400
##$SIOLD= 16384
##$SREGLST= <1H.CDCl3>
##$SSB= 0
##$STSI= 0
##$STSR= 0
##$SW_p= 3205.1282051282
##$SYMM= 0
##$S_DEV= 0
##$TDeff= 0
##$TDoff= 0
##$TI= <>
##$TILT= no
##$TM1= 0
##$TM2= 0
##$TOPLEV= 0
##$USERP1= <user>
##$USERP2= <user>
##$USERP3= <user>
##$USERP4= <user>
##$USERP5= <user>
##$WDW= 1
##$XDIM= 8192
##$YMAX_p= 0
##$YMIN_p= 0
$$ End of Bruker specific parameters
$$ ---------------------------------
##NTUPLES= NMR FID
##VAR_NAME=  TIME,          FID/REAL,        FID/IMAG
##SYMBOL=    X,             R,               I
##VAR_TYPE=  INDEPENDENT,   DEPENDENT,       DEPENDENT
##VAR_FORM=  AFFN,          ASDF,            ASDF
##VAR_DIM=   8192,          8192,            8192
##UNITS=     SECONDS,       ARBITRARY UNITS, ARBITRARY UNITS
##FACTOR=    0.0002768,     1,               1
##FIRST=     0,             0,               0
##LAST=      2.2672688,     0,               0
##MIN=       0,             -36239,          0
##MAX=       2.2672688,     69327,           0
$$ Real data points
##PAGE= N=1
##DATA TABLE= (X++(R..R)), XYDATA
$$ plain form
0 0 0 0 0 0 0 0 0 0 0 0 0 0 0 0 0 0 0 0 0 0 0 0 -6 8 -8 8 -8 8 -14 16 -16 21 -24 29 -32 38 -45 51 -57 65 -75 88
42 88 -98 112 -127 144 -162 183 -205 230 -259 292 -325 363 -406 455 -509 568 -636 714 -804 908
62 908 -1034 1190 -1391 1667 -2089 2841 -4623 11775 64334 -20574 36607 28390 26494 6853
76 6853 -5253 1647 -36239 23309 -29144 -4197 27208 8733 -1286 -5559 19525 -33490 844
89 844 -16639 3261 7788 13347 -5654 18376 30059 -20817 335 18036 -21264 -9608 -1941
102 -1941 2626 -19958 13151 -21987 2587 5647 -9042 -5973 20786 86 1732 3898 18423
115 18423 -7463 11797 87 -2078 5250 671 -25788 11278 -11766 -24300 -6596 13699 -18697
128 -18697 19251 10575 15754 8822 11644 -10081 3015 -10522 -12349 -10246 7148 -5266 6972
$$ packed form
0@%%%%%%%%%%%%%%%%%%%%%%oJ4j6J6j6J6k2L0l2L7m5N3o1P0q3R6j08J22j40J63
42H8j86K10k39K71l06L45l88M35m89N51o17O88p69Q61r64J077j204J350j518J712
62I08j942K224k581L058l756M930p464J6398N2559q4908N7181q217j896j9641
76F853j2106O900l7886N9548n2453K4947L1405j8475j0019m273K5084n3015L4334
89H44j7483J9900M527N559j9001K4030J1683n0876K1152J7701l9300J1656P667
102a941M567k2584L3109l5138K4574L060j4689L069K6759k0700J646K166J4525
115A8423k5886J9260j1710k165P328m579k6459L7066k3044j2534J7704K0295l2396
128a8697L7948q676N179o932K822k1725J3096j3537j827K103J7394j2414J2238
$$ plain form
141 6972 3324 9480 -11924 2909 -19247 1066 -9798 6855 -5109 24173 11675 -959 12324
154 12324 10176 -19146 2320 -8103 -6080 -8847 7817 -13709 11328 -8085 -722 -3825 8127
167 8127 -5078 6875 4715 11550 -1417 10697 -5575 1697 -1877 -9712 -9444 10502 -17090 3164
181 3164 -1777 7121 -12710 9871 19 4355 2525 5104 313 6011 -2055 124 -2403 1856 -6723
196 -6723 551 -6960 10254 -13497 9779 -7046 2243 -1563 -3107 -667 10019 121 -833 15061
210 15061 2657 -5285 11697 -11126 2055 -11431 -393 -8828 4832 -5738 3686 3469 1640
223 1640 2124 -356 2878 866 -24 2749 -3848 9359 -7868 2772 -4871 2495 -8896 -2488 4480
238 4480 -2736 -2410 2850 1278 -2327 3867 83 476 3873 -1545 2521 -2415 4406 -5587 -342 -583
$$ packed form
141F972l648O156k1404J4833k2156K0313j0864J6653j1964K9282j2498j2634J3283
154A2324k148k9322K1466j0423K023k767J6664k1526K5037j9413P363l103J1952
167H127j3205J1953k160O835j2967J2114j6272P272l574p835K68J9946k7592K0254
181C164m941Q898j9831K2581r852M336j830K579m791N698q066K179k527M259q579
196f723P274p511J7214k3751K3276j6825R289l806j544K440J0686r898r54J5894
210A5061j2404p942J6982k2823J3181j3486J1038q435J3660j0570R424k17j829
223A640M84k480L234k012q90K773o597J3207j7227J0640p643P366j1391O408O968
238D480p216L26N260j572l605O194l784L93L397n418M066m936O821r993N245k41
$$ plain form
254 -583 -166 -2259 -698 -1896 360 1474 -7173 8872 1017 -4274 6370 2338 -1539 -2222 2105
269 2105 -4226 -464 -1185 -3073 2773 -1836 2669 -2867 2628 -1544 1008 -2089 697 2484 -3059
284 -3059 792 3261 -1765 3103 -4350 4343 -741 -4478 874 1929 -4437 991 890 1696 -2555 7341
300 7341 -6823 4803 -4570 475 -3370 1115 2991 -2639 2342 1360 -2068 3956 -6772 6871
314 6871 -5866 3175 -4703 8242 -6514 1652 183 -155 -2588 -296 -605 -482 -2126 4521 -4914
329 -4914 6369 -5266 8113 -7336 5800 -2828 -624 -4331 3149 -4070 301 -857 2596 -507
343 -507 2502 -5880 8492 -8659 2592 -688 2751 -3867 8182 -3371 5053 -1964 2888 -5993
357 -5993 1962 -5248 1079 -6433 3872 -2954 3293 -3589 6980 -781 3876 -3189 7804 -7780
$$ packed form
254e83M17k093J561j198K256J114q647J6045p855n291J0644m032l877o83M327
269B105o331L762p21j888N846m609M505n536N495m172K552l097K786J787n543
284c059L851K469n026M868p453Q693n084l737N352J055o366N428j01Q06m251R896
300G341j4164J1626r373N045l845M485J876n630M981r82l428O024j0728J3643
314F871j2737R041p878J2945j4756Q166j469l38k433K292l09J23j644O647r435
329d914J1283j1635J3379j5449J3136q628K204l707P480p219M371j158L453l103
343e07L009q382J4372j7151J1251l280L439o618J2049j1553Q424p017M852q881
357e993P955p210O327p512J0305o826O247o882J0569p761M657p065J0993j5584
$$ plain form
371 -7780 5381 -5771 5227 -6276 3026 -1767 161 -2885 1929 -4096 874 -2542 4744 -4246
385 -4246 8918 -2370 8543 -7559 8742 -5493 -1094 -1522 -1668 -883 217 -2397 4616 -3977
399 -3977 2118 -4008 5203 -10191 8558 -5142 3941 846 5798 78 3779 726 766 -4661 -813
414 -813 -7212 -309 -8510 5652 -2922 5452 -595 9254 -3426 3131 -1749 29 -1885 930 -191
429 -191 4760 -3749 4554 -4021 -939 -5055 -426 -6393 1752 -531 4174 -1064 5914 1145 1965 -1036
445 -1036 3777 -4401 2033 -1925 921 -1162 -1885 655 -579 -4921 1455 -3023 701 -2491 5733
460 5733 -2415 4722 2469 2928 1394 1847 2006 -2519 -1312 -2064 -2629 -3107 -5484 3530 -5425 2375 2746
477 2746 2337 2562 3323 1178 -426 -51 -3491 1488 -3348 476 4713 -2210 2108 293 -2800 -5114
$$ packed form
371g780J3161j1152J0998j1503R302m793J928l046M814o025M970l416P286q990
385d246J3164j1288J0913j6102J6301j4235M399m28j46P85J100k614P013q593
399c977O095o126R211j5394J8749j3700R083l095M952n720L701l053M0n427L848
414h13o399O903q201J4162q574Q374o047R849j2680O557m880J778j914K815j121
429a91M951q509Q303q575L082m116M629n967Q145k283M705n238O978m769Q20l001
445a036M813q178O434l958K846k083p23K540j234m342O376m478L724l192Q224
460E733q148P137k253M59j534M53J59m525J207p52n65m78k377R014q955P800L71
477B746m09K25P61k145j604L75l440M979m836L824M237o923M318j815l093k314
$$ plain form
493 -5114 -3473 -2121 -3875 2487 3476 5118 3713 4553 1828 -113 -3845 -890 -3247 -2081 -607 1502
509 1502 -2297 974 -1232 -1551 -3094 1022 -552 2226 2016 6254 -367 2339 -748 1663 -4938 249
525 249 -1587 1420 -4486 2394 -1705 -3827 -573 -374 -1928 3617 -697 7305 -635 4866 -1108 1733
541 1733 -6391 1669 -5151 -1543 1223 2829 -966 1822 -2237 -593 -6933 2127 -5436 5964 -1069
556 -1069 9556 4992 4754 1051 2855 -8489 -2802 -7398 -2928 -2544 5108 874 6870 -626 6009
571 6009 -5339 -623 -4710 2723 -5084 6101 1408 5970 -1671 4437 -3008 -2649 -4814 -67 -5460
586 -5460 2140 -3524 6056 -2480 5604 -2022 4905 -3441 5443 -2272 1714 -1406 2618 -4948 1118
601 1118 -2569 2553 -5545 5415 -2308 2258 -4380 1793 -2207 2021 -2761 7342 -942 5725 1789
$$ packed form
493e114J641J352j754O362R89J642j405Q40k725j941l732K955k357J166J474K109
509A502l799L271k206l19j543M116j574K778k10M238o621K706l087K411o601N187
525B49j836L007n906O880m099k122L254J99j554N545m314Q002p940N501n974K841
541A733q124Q060o820L608K766J606l795K788m059J644o340R060p563J1400p033
556a069J0625m564k38l703J804j1344N687m596M470L84P652m234N996p496O635
571F009j1348M716m087P433p807J1185m693M562p641O108p445L59k165M747n393
586e460P600n664R580q536Q084p626O927q346Q884p715L986l120M024p566O066
601A118l687N122q098J0960p723M566o638O173m000M228m782J0103q284O667l936
$$ plain form
616 1789 2602 -4147 1603 -7320 -1018 -4649 1212 -2297 4939 -910 7241 -2939 2860 -2754 231
631 231 -4868 2676 -895 3510 1601 5458 -2221 1554 -5221 -2 -6536 5 -2085 4283 -2467
646 -2467 6455 1352 1656 464 1911 -4093 326 -2833 2744 -3340 3279 170 906 -2749 478 -3127
662 -3127 13 -3160 4314 -1413 2880 1498 1819 -2369 2965 -1440 487 -1749 1824 -1940 585
677 585 -1472 1912 -2783 1359 152 1467 -1447 2304 578 -1061 -750 2977 -1391 1709 367 1195
693 1195 -618 174 -1175 -230 -2839 -285 1059 -878 414 3400 -2023 2321 373 -151 -493 -627
709 -627 1277 -1411 8 -80 1247 -653 -654 1763 -1326 -1160 52 552 -1644 1088 1482 -1394 3486
726 3486 -1534 1955 -2015 -650 798 -1819 -295 1432 561 -814 923 1381 -2733 1310 -1485 1278
$$ packed form
616A789Q13o749N750q923O302l631N861l509P236n849Q151j0180N799n614K985
631B31n099P544l571M405j909L857p679L775o775N219o534O541k090O368o750
646b467Q922n103L04j192J447o004M419l159N577o084O619l109P36l655L227l605
662c127L140l173P474n727M293j382L21m188N334m405J927k236L573l764K525
677E85k057L384m695M142j207J315k914L751j726j639L11L727m368L100j342Q28
693A195j813P92j349R45k609K554J344j937J292K986n423M344j948n24l42j34
709f27J904k688J419q8J327j900jK417l089J66J212N00k196K732L94k876M880
726C486n020L489l970J365J448k617J524J727q71j375J737M58m114M043k795K763
$$ plain form
742 1278 -3356 3683 -463 855 656 257 434 -1093 -312 2107 -3327 2527 -1383 1402 -2284 3981
758 3981 -2569 1422 -1710 1029 -1108 -583 -367 1350 -2488 3261 -1085 4154 -3631 2492 -1190 -846
774 -846 -1135 1480 -2171 2955 -677 2214 -1263 2355 -2629 2307 -4989 3549 -2596 606 -662 3081
790 3081 -2247 2797 -1531 1884 -3549 3322 -3286 2051 -2990 2473 -1912 1945 -1550 3824 -3038
805 -3038 1658 -409 1181 -4091 4083 -2892 2690 -1196 2906 -1915 1692 -2760 2773 -4283 1945
820 1945 -2453 2270 -2251 3769 -1393 1371 -2535 3721 -4383 2310 -2226 1436 -2595 2787 -2240
835 -2240 2725 -3276 3090 -1672 493 -1977 2878 -4356 2105 -1749 2934 -1704 3343 -1342 439
850 439 -1789 2551 -3948 2272 -3466 3827 -2619 1261 -268 1966 -3158 3480 -1481 354 -334 2054
$$ packed form
742A278m634P039m146J318j99l99J77j527P81K419n434N854l910K785l686O265
758C981o550L991l132K739k137N25K16J717l838N749m346N239p785O123l682L44
774h46k89K615l651N126l632K891l477L618m984M936p296Q538o145L202j268L743
790C081n328N044m328L415n433O871o608N337n041N463m385L857l495N374o862
805c038M696k067J590n272Q174o975N582l886M102m821L607m452N533p056O228
820A945m398M723m521O020n162K764l906O256q104O693m536L662m031N382n027
835b240M965o001O366m762K165k470M855p234O461l854M683m638N047m685J781
850D39k228M340o499O220n738P293o446L880j529K234n124O638m961J835o88K388
$$ plain form
866 2054 -2320 2784 -3603 3693 -3740 1842 -1093 1376 -2297 1748 -203 -465 -1189 2920 -2932 2460
882 2460 -1390 2451 -2330 2241 -1816 1510 -2306 946 757 -190 -579 2937 -2790 1360 -1265 680
898 680 -2182 1827 -182 1578 -706 2584 -44 781 -804 1177 -2100 -957 -743 1068 -3163 1845
914 1845 1075 60 811 1487 -892 -151 -1186 589 -1849 54 975 1413 -807 1770 478 -1061 -1414
931 -1414 427 -795 -854 1802 903 -424 998 -306 -569 -619 -1618 1969 -491 -250 2411 -872 -1388
948 -1388 2071 -799 -683 271 70 -468 92 104 1007 -1742 2073 182 708 -1145 1264 337 -810 -364
966 -364 1031 -2394 812 -531 1333 -427 2624 -433 1580 -1788 1120 -2009 -982 -635 1806 -1150
982 -1150 2224 -111 2378 -2894 1528 -2738 -19 -1854 555 -1061 2699 152 1825 -1181 1332
$$ packed form
866B054m374N104o387P296p433N582k935K469l673M045j951k62p24M109n852N392
882B460l850L841m781M571m057L326l816L252j89r47l89L516n727M150k625J945
898F80k862M009k009J760k284L290k628Q25j585J981l277J143K14J811m231N008
914A845p70j015P51O76k379P41j035J775k438J903R21M38k220K577j292j539l53
931a414J841j222n9K656q99j327J422j304k63n0r99L587k460K41K661l283n16
948a388L459k870J16R54k01n38N60J2R03k749L815j891N26j853K409r27j147M46
966c64J395l425L206j343J864j760L051l057K013l368K908l129J027L47K441k956
982a150L374k335K489n272M422m266K719j835K409j616L760k547J673l006K513
$$ plain form
997 1332 -1452 890 -4792 2274 -1965 1196 362 2082 -1895 1309 -2469 1784 -3569 1271 -366
1012 -366 1450 -923 2960 -1411 679 -2216 2403 -3561 859 -225 1439 -1208 3467 -2762 2594
1027 2594 -3291 1396 -1145 463 -936 3453 -2452 2311 -1507 1418 -3324 2334 -1839 1532 -1469
1042 -1469 2668 -1779 1996 -2329 2074 -3143 1180 -1020 2042 -2983 3560 -1026 1446 -1771 2068
1057 2068 -3078 1723 -2678 2734 -1891 1945 -984 1688 -2250 1876 -2293 1131 -2535 3052 -2165
1072 -2165 1683 -838 2111 -2788 2333 -2091 883 -1700 1222 -419 1788 -1805 3704 -3195 1395
1087 1395 -1367 1390 -2228 2490 -634 997 -1198 1869 -2609 1133 -2291 2051 -1998 1515 -892
1102 -892 2143 -3141 1284 -1106 -1236 -661 1775 -1572 2625 -1510 735 -2307 592 -1291 561 -1868
$$ packed form
997A332k784K342n682P066m239L161q34J720l977L204l778M253n353M840j637
1012c66J816k373L883m371K090k895M619n964M420j084J664k647M675o229N356
1027B594n885M687k541J608j399M389n905M763l818K925m742N658m173L371l001
1042a469M137m447L775m325M403n217M323k200L062n025O543m586K472l217L839
1057B068n146M801m401N412m625L836k929K672l938M126m169L424l666N587n217
1072b165L848k521K949m899N121m424K974k583K922j641K207l593N509o899M590
1087A395k762K757l618M718l124J631k195L067m478L742l424M342m049L513k407
1102h92L035n284M425k390j30N75K436l347M197m135K245l042K899j883J852k429
$$ plain form
1118 -1868 2146 689 268 -534 1697 -1407 291 -1320 262 -2112 910 -356 475 -1322 350 -434
1134 -434 296 -609 1811 -1556 431 900 444 -977 1196 -29 535 -1012 922 -836 -579 -237 -50
1151 -50 87 93 -22 759 -1526 259 536 -967 -192 1512 -358 -50 832 -445 174 -413 146 128 -613
1170 -613 228 996 -1067 67 239 -124 -1039 1513 -6 90 185 898 -1100 360 -445 333 -473 107 -71
1189 -71 1223 -2389 2072 -1089 -645 160 729 -774 1211 -486 1197 -1376 961 -574 892 -1448
1205 -1448 1580 -1068 497 -1004 1770 -1791 592 -72 635 -1662 1986 -1489 1136 -1328 1608
1220 1608 -886 564 -1028 2147 -1772 961 -865 799 -1849 1974 -413 1048 -1326 2530 -1610
1235 -1610 1187 -406 981 -1497 1320 -1547 2182 -2523 2036 -953 400 -1302 2041 -1608 1375
$$ packed form
1118a868M014j457m21q02K231l104J698j611J582k374L022j266Q31j797J672p84
1134d34P30r05K420l367J987M69m56j421K173j225N64j547J934j758K57L42J87
1151e0J37Oj15P81k285J785K77j503P75J704j870L08Q82j277O19n87N59j8p41
1170f13Q41P68k063J134J72l63r15K552j519R6R5P13j998J460q05P78q06N80j78
1189g1J294l612M461l161M44Q05N69j503J985j697J683k573K337j535J466k340
1205a448L028k648J565j501K774l561K383o64P07k297L648l475K625k464K936
1220A608k494J450j592L175l919K733j826J664k648L823k387J461k374L856m140
1235a610K797j593J387k478K817k867L729m705M559k989J353j702L343l649K983
$$ plain form
1250 1375 -918 2398 -1565 1809 -1342 1409 -2240 1930 -1470 541 -2113 2235 -1626 1096 153
1265 153 1713 -2404 2614 -1104 1527 -1711 1721 -1445 1497 -1380 3825 -2016 1278 -495 1292
1280 1292 -2298 2309 -1148 704 -1447 2392 -1289 2306 -1652 2063 -2312 1734 -817 1585 -1507
1295 -1507 1423 -660 999 -1936 2868 -2239 1439 -821 791 -1353 749 -1171 1589 -1621 2146
1310 2146 -978 842 -1543 1306 -1728 376 -782 1683 -1871 1672 -416 47 -612 694 -1547
1325 -1547 1433 -1675 1852 -1173 314 -182 1115 -1837 1432 -755 137 -758 1551 -1032 402 -403
1341 -403 1019 -1051 859 -566 1105 -1378 591 -65 -146 -1297 1829 -1267 246 640 59 -440 600
1358 600 -543 1120 -1052 815 230 -29 -384 899 -748 -541 175 139 -724 471 244 -181 -305 646
$$ packed form
1250A375k293L316l963L374l151K751l649M170l400K011k654M348l861K722r43
1265A53J560m117N018l718K631l238L432l166K942k877N205n841L294j773J787
1280A292l590M607l457J852k151L839l681L595l958L715m375M046k551K402l092
1295a507K930k083J659k935M804n107L678k260J612k144K102j920K760l210L767
1310B146l124J820k385K849l034K104j158K465l554L543k088M63o59J306k241
1325a547K980l108L527l025J487m96J297k952L269k187Q92q95K309k583J434q05
1341d03J422k070J910j425J671k483J969o56q1j151L126l096J513L94n81m99J040
1358F00j143J663k172J867n85k59l55J283j647K07P16l6q63J195k27m25j24R51
$$ plain form
1376 646 -198 262 86 328 385 -775 573 201 -1094 347 358 -520 217 251 -87 -614 264 -403 219 -539
1396 -539 1151 -208 276 -118 424 -287 -776 334 127 -1483 1664 -772 31 -328 424 -495 320 -462
1414 -462 1107 -607 267 94 515 -1285 1307 -638 306 -907 1331 -1367 417 -292 328 -761 890
1431 890 -745 1518 -1501 1120 -117 -18 -812 1606 -1754 1089 -423 597 -1209 687 -1007 812
1447 812 -1355 1653 -1005 833 -978 1411 -1310 497 -354 1206 -1675 1755 -852 490 -1025
1462 -1025 1250 -1472 1001 -1133 1731 -1228 1134 -566 1128 -1621 1521 -617 751 -1542 1625
1477 1625 -1184 802 -671 1526 -1984 1992 -1451 1743 -943 851 -661 1138 -2157 2069 -1748
1492 -1748 502 -297 903 -1781 1253 -1210 1365 -1439 2147 -385 694 -366 1789 -854 -167
$$ packed form
1376F46q44M60j76K42N7j160J348l72j295J441J1q78P37L4l38n27Q78o67O22p58
1396e39J690j359M84l94N42p11m89J110k07j610L147k436Q03l59P52r19Q15p82
1414d62J569j714Q74j73M21j800K592j945R44j213K238k698J784p09O20j089J651
1431H90j635K263l019K621j237R9p94K418l360K843j512J020j806J896j694J819
1447H12k167L008k658J838j811K389k721J807q51J560k881L430k607J342j515
1462a025K275k722K473k134K864k959K362j700J694k749L142k138J368k293L167
1477A625k809J986j473K197l510L976l443L194k686J794j512J799l295M226l817
1492a748K250p99J200k684L034k463K575k804L586k532J079j060K155k643O87
$$ plain form
1507 -167 -900 1713 -2133 1633 -333 606 -723 1081 -2193 1430 -937 1026 -288 193 -142 1096
1523 1096 -1849 1975 -865 608 -643 2202 -1056 1029 -941 701 -1388 716 -919 1411 -899
1538 -899 880 -564 542 -1851 714 -1189 636 72 476 -1613 1656 -861 926 -318 1217 -35
1554 -35 390 -255 1136 -574 83 -687 1193 -919 373 -561 -188 -559 1155 -1311 -51 73 -905 -70
1572 -70 -273 -112 292 15 940 839 -983 -876 1374 -1754 179 -255 923 -191 487 249 194 316 -357
1591 -357 415 -274 198 -201 -305 -696 554 674 -372 739 -857 1183 -372 -834 -227 160 -56 -12
1609 -12 822 -573 437 865 -337 19 243 62 -986 730 206 -1697 1054 -251 1066 -592 783
1626 783 944 -958 -1232 1333 -346 504 -43 171 -1516 1827 -428 223 -1338 2006 -367 103 -670
$$ packed form
1507a67p33K613l846L766j966R39j329J804l274L623k367J963j314M81l35J238
1523A096k945L824k840J473j251K845l258K085j970J642k089K104j635K330k310
1538h99J779j444J106k393K565j903J825n64M04k089L269k517J787j244J535j252
1554c5M25o45J391j710O57p70J880k112J292r34L73l71J714k466J260J24r78Q35
1572g0k03J61M04k77R25j01j822J07K250l128J933m34J178j114O78k38n5J22o73
1591c57P72o89M72l99j04l91J250J20j046J111j596K040j555m62O07L87k16M4
1609a2Q34j395J010M28j202L56K24j81j048J716n24j903K751j305J317j658J375
1626G83J61j902k74K565j679Q50n47K14j687L343k255O51j561L344k373M70p73
$$ plain form
1643 -670 375 -675 -293 -300 795 -1099 965 -155 509 -1159 1626 -1359 -1 -1119 694 -713
1659 -713 471 -108 906 -1056 1024 -700 399 -1126 2198 -151 1056 -791 755 -1475 1032
1674 1032 -1056 201 -1447 653 -229 561 -1121 874 -1220 628 -909 1526 -1637 1061 -838
1689 -838 821 -846 955 -743 643 -824 1321 -1153 876 -793 1165 -1416 1155 -570 364
1704 364 -1246 1368 -1361 859 -674 934 -592 716 -1030 1101 -1643 1123 -472 430 -579
1719 -579 1346 -1399 796 -564 1258 -1352 968 -412 529 -733 877 -821 1072 -1272 1534
1734 1534 -868 414 -35 1066 -1075 1064 -545 571 -1024 728 -924 582 -470 958 -978
1749 -978 296 -191 1023 -1285 439 -268 405 -1192 983 -555 197 -297 689 -780 641 -664 1023
$$ packed form
1643f70J045j050L82pJ095j894K064j120O64j668K785k985J358j118J813j407
1659g13J184n79J014j962K080j724J099j525L324k349J207j847J546k230K507
1674A032k088J257j648K100q82P90j682J995k094J848j537K435l163K698j899
1689h38J659j667J801j698J386j467K145k474K029j669J958k581K571j725R34
1704C64j610K614k729K220j533J608j526J308j746K131k744K766j595R02j009
1719e79J925k745K195j360J822k610K320j380R41j262J610j698J893k344K806
1734A534k402J282m49J101k141K139j609J116j595J752j652J506j052J428j936
1749i78J274m87J214k308J724p07O73j597K175j538P52m94R86j469J421j305J687
$$ plain form
1766 1023 -643 427 -151 587 -542 1343 -710 655 -220 845 -645 309 117 774 -665 581
1782 581 -549 313 -711 468 -116 -268 -58 700 -685 677 30 -73 -417 286 18 -5 -483 714
1800 714 -182 -420 182 79 -426 259 250 164 -415 807 -162 -611 -101 201 -524 257 101 -64 104 -107 665
1821 665 -266 -435 630 -129 -650 567 48 -334 -176 573 -612 445 171 53 -414 -137 -447 475 -567
1840 -567 176 133 -262 -51 608 -965 588 235 172 -242 537 -266 712 -873 804 -145 -187 -567 810
1859 810 -685 385 -186 687 -827 561 -145 277 -263 556 -733 374 -1062 724 -579 295 -228
1876 -228 537 -1148 726 -553 416 -739 513 -500 578 -414 1093 -989 728 -792 374 -720
1892 -720 404 -325 406 -1002 1198 -914 286 -106 471 -970 1165 -874 979 -1033 459 -962
$$ packed form
1766A023j666J070n78P38j129J885k053J365q75J065j490R54j92O57j439J246
1782E81j130Q62j024J179n84j52K10P58j385J362o47j03l44P03k68k3m78J197
1800G14q96k38O02j03n05O85rq6n79J222r69m49N10L02p25P81j56j65J68k11P72
1821F65r31j69J065p59n21J217n19l82J58P49j185J057k74j18m67K77l10R22j042
1840e67P43m3l95K11O59j573J553l53o3m14P79q03R78j585J677r49m2l80J377
1859H10j495J070n71Q73j514J388p06M22n40Q19j289J107j436J786j303Q74n23
1876b28P65j685J874j279R69j155J252j013J078r92J507k082J717j520J166j094
1892g20J124p29P31j408K200k112J200l92N77j441K135k039J853k012J492j421
$$ plain form
1908 -962 721 -2074 1333 -840 1455 -707 564 -1042 795 -1548 455 -235 943 -105 520 -516
1924 -516 1088 -934 587 -626 1292 -853 1556 -128 360 -336 489 -1153 537 -1556 916 -1436
1940 -1436 693 -367 616 -1458 255 -53 1115 -993 972 -1543 540 -692 995 -765 555
1955 555 -945 715 -577 442 -645 747 -643 771 -745 615 138 203 -1037 657 -214 612
1971 612 -406 1148 -471 644 -502 166 -648 177 -524 1605 -1493 584 178 -351 -474 703 -998
1988 -998 638 -652 621 -747 -498 -234 549 -1161 1278 -223 698 -353 1579 419 145 -97 151
2005 151 -958 572 -438 229 266 -435 284 -828 -660 918 136 246 1109 638 -512 -38 504 845
2023 845 -40 638 -189 -341 -355 438 -250 302 -418 27 6 -205 612 -639 -429 575 477 -745 183 860
$$ packed form
1908i62J683k795L407k173K295k162J271j606J837k343K003o90J178j048O25j036
1924e16J604k022J521j213J918k145K409j684M88o96Q25j642J690k093K472k352
1940a436K129j060R83k074J713l08J168k108J965k515K083j232J687j760J320
1955E55j500J660j292J019j087J392j390J414j516J360m77O5j240J694q71Q26
1971F12j018J554j619J115j146O68q14Q25p01K129l098K077m06n29j23J177j701
1988i98J636j290J273j368K49K64P83j710K439j501R21j051J932j160k74k42K48
2005A51j109J530j010O67L7p01P19j112J68J578p82J10Q63m71j150M74N42L41
2023H45q85O78q27j52j4P93o88N52p20M45k1k11Q17j251K10J004r8j222R28O77
$$ plain form
2043 860 132 -689 -101 -501 23 -759 38 561 -792 351 676 -974 945 300 41 383 979 -769
2061 -769 -268 -245 71 171 -95 -866 303 -1268 1070 378 68 -548 99 -393 908 -733 108 117 -409
2080 -409 -512 -343 320 -123 -1530 538 -555 332 -1141 -130 706 594 -676 1291 172 1329 -881
2097 -881 674 -467 574 -748 805 -366 573 -1218 655 -514 681 166 264 -651 1020 -872
2113 -872 383 -538 482 -997 628 -668 1129 -1432 1027 354 501 -879 938 -1117 637 -781
2129 -781 444 -501 211 -672 523 -576 764 -221 366 -1209 1296 -124 -75 -431 873 -999 908
2146 908 -596 605 -379 645 -764 740 -1000 1261 -818 334 -368 757 -974 239 -130 46
2162 46 -1165 568 -474 70 -437 1137 -702 361 -1019 618 -844 78 -117 253 -784 630 -358
$$ packed form
2043H60p28q21N88m00N24p82P97N23j353J143L25j650J919o45k59L42N96j748
2061g69N01K3L16J00k66p71J169j571K338o92l10o16O47m92J301j641Q41Rn26
2080d09j03J69O63m43j407K068j093Q87j473J011Q36j12j270J967j119J157k210
2097h81J555j141J041j322J553j171R39j791J873j169J195n15R8r15J671j892
2113h72J255r21J020j479J625j296J797k561K459o73J47j380J817k055J754j418
2129g81J225r45P12q83J195j099J340r85N87j575K505j420M9l56J304j872J907
2146I08j504J201r84J024j409J504j740K261k079J152p02J125j731J213l69J76
2162D6j211J733j042N44n07J574j839J063j380J637j462R22j95L70j037J414r88
$$ plain form
2179 -358 52 173 770 -795 742 -374 247 -70 490 263 606 -494 1206 -915 267 -199 161 -818
2197 -818 973 -432 -279 65 -25 168 348 -975 1016 -1225 -273 191 294 -624 16 -128 456 -589
2215 -589 474 -536 -69 -384 -314 -100 340 -167 730 -571 -287 766 -310 -421 407 -1003 -130 -112 965
2234 965 65 187 -91 847 889 461 -334 -629 -65 1020 -42 353 443 1424 -599 82 873 627 19 160
2254 160 -464 304 -186 -78 -295 -481 15 -76 210 1012 -86 -31 -17 -23 1154 -23 386 -89 -72 -466 637
2275 637 522 354 -795 739 -14 -752 534 403 -587 80 -554 222 -420 277 -771 80 -252 1091
2293 1091 -178 -180 242 -159 -581 240 244 285 -396 1314 337 212 -354 961 -675 970 -410 180 27
2312 27 -40 841 -37 -746 970 -439 330 -58 359 -987 576 -809 805 -873 -146 -1082 -37 -1294
$$ packed form
2179c58M10J21N97j565J537j116O21l17N60k27L43j100J700k121J182m66L60r79
2197h18J791j405J53L44r0J93J80j323J991k241R52M64J03r18O40j44N84j045
2215e89J063j010M67l15P0K14M40n07Q97j301K84J053j076j11Q28j410Q73J8J077
2234I65r00J22k78R38M2m28p95k95N64J085j062L95R0R81k023O81P91k46o08J41
2254A60o24P68m90J08k17j86M96r1K86Q02j098N5J4oJ177j177M09m75J7l94J103
2275F37j15j68j149J534p53p38J286j31r90O67o34P76o42O97j048Q51l32J343
2293A091j269kM22m01m22Q21MM1o81J710r77j25n66J315j636J645j380N90j53
2312B7o7Q81q78p09J716j409P69l88M17j346J563j385J614j678P27r36J045j257
$$ plain form
2330 -1294 230 -405 231 -242 885 -1924 458 481 351 74 707 -837 874 126 1048 -889 488
2347 488 -154 510 -503 544 -172 287 -579 617 -374 314 -87 351 -1120 990 -525 647 -623
2364 -623 914 -36 91 -1790 405 -1453 312 -657 788 -644 487 -575 373 -537 475 11 624
2381 624 -761 572 -676 161 -367 830 -793 320 -184 39 -170 455 -575 924 -441 710 -385
2398 -385 251 81 684 -197 125 -531 333 -767 771 104 400 -334 976 -256 549 -197 595 -469
2416 -469 151 -186 194 -787 809 -307 -102 -203 487 -353 521 -172 287 -431 151 -71 351 -502 600
2435 600 -316 293 -254 528 -381 52 209 164 -345 368 -248 273 -115 -39 -144 176 -336 393 -366 160 165
2456 165 -60 -258 229 -35 -135 -139 202 -181 209 -12 219 -77 -35 47 159 -303 278 195 -401 155 57 -255
$$ packed form
2330a294J524o35O36m73J127k809K382K3j30k77O33j544J711p48R22j937J377
2347D88o42O64j013J047p16M59q66J196r91O88m01M38j471K110j515J172j270
2364f23J537r50J27j881K195j858J765r69J445j432J131j062R48r10J012m64O13
2381F24j385J333j248Q37n28J197j623J113n04K23k09O25j030J499j365J151j095
2398c85O36j70O03q81L22o56Q64j100J538o67K96p34J310j232Q05p46P92j064
2416d69O20l37L80r81J596j116K05j01O90q40Q74o93M59p18N82k22M22q53J102
2435F00r16O09n47P82r09M33J57m5n09P13o16N21l88P6j05L20n12P29p59N26N
2456A65k25j98M87k64j00mL41l83L90k21K31k96M2Q2J12m62N81q3n96N56r8l12
$$ plain form
2478 -255 257 36 -11 -125 -159 261 -113 -49 189 84 -108 101 111 59 -233 402 -160 -57 271 288 -408 105
2500 105 -57 233 -273 178 34 66 -220 323 -176 68 -204 360 -288 125 -78 60 -196 304 -242 178
2520 178 -171 401 -42 6 -120 585 -524 230 -36 69 -124 422 -315 253 -329 351 -298 175 -232 462
2540 462 -450 293 -39 296 -539 543 -285 83 -241 486 -486 425 -364 279 -187 165 -165 317 -671 631
2560 631 -512 83 -9 312 -221 384 -210 410 -521 390 -257 312 -342 454 -287 312 -371 605 -558 265
2580 265 -53 342 -524 585 -422 344 -300 351 -342 302 -191 528 -451 220 -253 297 -397 504 -226
2599 -226 212 -252 509 -505 329 -300 244 -364 319 -199 476 -461 521 -16 56 -132 332 -580 257 -164
2619 -164 225 -418 409 -189 161 -285 274 -268 233 -190 277 -376 197 -73 249 -452 591 -345 260 -293
$$ packed form
2478b55N12k21m7j14l4M20l74O4K38j05j92K09J0n2k92O35n62J03L28J7o96N13
2500A05j62K90n06M51j44L2k86N43m99K44k72N64o48M13k03J38k56N00n46M20
2520A78l49N72m43M8j26P05j109P54k66J05j93N46p37N68n82O80o49M73m07O94
2540D62r12P43l32L35q35J082q28L68l24P27r72R11p89O43m66L52l30M82r88J302
2560F31j143N95r2L21n33O05n94O20r31R11o47N69o54P96p41N99o83R76j163Q23
2580B65l18L95q66J109j007P66o44O51o93O44m93P19r79O71m73N50o94R01p30
2599b26M38m64P61j014Q34o29N44o08O83n18O75r37R82n37P2j88M64r12Q37m21
2619a64L89o43Q27n98L50m46N59n42N01m23M67o53N73k70L22p01J043r36O05n53
$$ plain form
2639 -293 245 -195 99 -235 399 -252 100 33 54 -364 361 -295 119 -189 270 -257 225 0 118 -321 279
2660 279 -246 162 -177 256 54 15 -118 326 -455 91 5 115 -150 74 -58 59 -177 224 -91 101 -96
2681 -96 136 -128 -37 74 99 -300 314 -20 -65 -38 62 -121 36 -166 175 -92 11 29 -80 -210 168 -24
2703 -24 -178 -41 138 -154 183 10 -318 136 66 221 -81 160 -395 268 -512 -497 -127 343 -415 256 -150
2724 -150 442 -320 -150 223 -149 -182 67 -327 464 343 -256 -163 240 -157 39 59 255 -336 -171 -214 -38
2745 -38 -390 -54 -116 234 -395 421 -45 30 -131 290 -401 156 -119 172 -186 240 -125 156 -45 152 -270
2766 -270 85 -360 288 -189 93 -25 145 -253 481 -186 143 -125 296 -157 187 -263 287 -304 215 -75
2786 -75 142 -352 266 -199 33 -173 397 -384 271 -114 106 -248 284 -146 221 -351 436 -252 62 -201
$$ packed form
2639b93N38m40K94l34O34o51L52o7K1m18P25o56M14l08M59n27M82k25J18m39O00
2660B79n25M08l39M33k02l9j33M44p81N46q6J10k65K24j32J17k36M01l15J92j97
2681i6K32k64R1J11K5l99O14l34m5K7J00j83J57k02L41k67J03J8j09j30L78j92
2703b4j54J37J79k92L37j73l28M54p0J55l02K41n55O63p80J5L70M70p58O71m06
2724a50N92p62J70L73l72l3K49l94P91j21n99R3M03l97J96K0J96n91J65m3J76
2745c8l52L36o2L50o29Q16m66P5j61M21o91N57k75K91l58M26l65K81k01J97m22
2766b70L55m45O48m77K82j18J70l98P34o67L29k68M21m53L44m50N50n91N19k90
2786g5K17m94O18m65K32k06N70p81O55l85K20l54N32m30L67n72P87o88L14k63
$$ plain form
2806 -201 359 -413 564 -118 164 -327 217 -293 248 -448 159 -37 112 -119 -47 -498 181 -267 447 -318
2826 -318 267 173 4 -446 302 -449 395 -381 -20 -60 35 262 332 -344 158 -206 294 -305 241 -447 214
2847 214 13 128 -338 466 -322 180 -300 295 31 -83 -49 438 -404 256 -11 62 -168 149 -162 110 -224
2868 -224 292 -172 147 -169 4 -131 547 -157 -335 -272 127 -252 42 -359 -59 -692 -264 -808 -809 676 66
2889 66 -888 108 -60 -359 193 -592 403 576 -696 -352 140 151 -683 -448 563 -103 555 65 60 523 -934
2910 -934 -416 -702 -322 175 -352 -89 -145 -827 39 -22 67 34 50 -116 149 -128 -37 -148 100 -142 225 446
2932 446 7 404 61 -448 -167 237 -718 170 -122 342 145 -378 -170 -266 30 -178 49 440 124 -556
2952 -556 -87 220 -66 9 -131 -485 55 -2 -232 8 148 353 425 252 -472 -57 -174 287 -203 170 -72
$$ packed form
2806b01N60p72R77o82K82m91N44n10N41o96O07j96J49k31P2m51O79m48P14p65
2826c18N85r4j69m50P48p51Q44p76L61m0R5K27P0o76N02l64N00n99N46o88O61
2847B14k01J15m66Q04p88N02m80N95k64j14L4M87q42O60k67P3k30L17l11K72l34
2868b24N16m64L19l16J73j35O78p04j78O3L99l79K94m01L00o33M28n44jJ485o10
2889F6r54R96j68k99N52p85R95J73j272L44M92J1q34K35J011o66O58m90nM63j457
2910i34N18k86L80M97n27K63n6o82Q66o1Q9l3J6j66K65k77R1j11K48k42L67K21
2932D46m39L97l43n09K81M04r55Q88k92M64j97n23K08r6K96k08K27L91l16o80
2952e56M69L07k86P5j40l54N40n7k30K40J40K05P2j73p24M15j17M61m90L73k42
$$ plain form
2973 -72 165 -216 181 -28 69 -154 128 -122 82 -152 244 -237 142 -53 -43 -200 209 -261 105 -91 135
2994 135 13 64 -135 202 -236 175 -122 37 -102 246 -111 131 13 382 -211 200 -93 248 -210 103
3014 103 -52 159 -238 198 -30 50 -117 112 -283 328 -96 169 -102 184 -131 155 -206 163 -105 163
3034 163 -203 299 -328 341 -113 21 -336 300 -306 164 -87 262 26 94 -152 275 -191 145 -216 149
3054 149 -211 268 -203 117 -278 212 -328 66 -131 169 -162 162 -125 218 -264 237 -80 115 -154 150
3074 150 -295 153 -142 5 -169 196 -184 147 -276 347 -93 32 -131 169 -122 158 -69 218 -237 199
3094 199 -166 158 -100 102 12 156 -198 138 -194 5 40 176 -184 7 -226 124 -33 68 -63 47 -126
3115 -126 61 -185 316 -234 -64 -462 278 -513 -693 28 339 -1804 -311 740 361 202 -43 -280 -100
$$ packed form
2973g2K37l81L97k09R7k23K82k50K04k34L96m81L79j95J0j57M09m70L66j96K26
2994A35j22N1j99L37m38M11k97J59j39L48l57K42j18L69n93M11k93L41m58L13
3014A03j55K11l97M36k28Q0j67K29l95O11m24K65k71K86l15K86l61L69k68K68
3034A63l66N02o27O69m54J34l57O36o06M70k51L49k36O8k46M27m66L36l61L65
3054A49l60M79m71L20l95M90n40L94j97L00l31L24k87L43m82N01l17J95k69L04
3074A50m45M48k95J47j74L65l80L31m23O23m40J25j63L00k91K80k27K87m55M36
3094A99l65L24k58K02r0J44l54L36l32J99L5J36l60J91k33L50j57J01j31J10j73
3115a26J87k46N01n50J70l98P40p91j80P21L11k143J493J051l79j59k45k37J80
$$ plain form
3134 -100 -27 -831 -425 -240 43 313 -218 534 815 -327 70 213 -638 -340 -559 861 -548 34 -467
3153 -467 792 181 459 34 -99 -663 164 -101 85 -157 25 -344 -354 -284 -16 317 483 350 253 633 -329
3174 -329 610 567 415 -229 35 10 -678 492 -319 396 815 303 26 -135 315 -90 -334 38 -75 462
3194 462 -11 -370 -159 -461 216 -255 -159 -647 211 160 -87 -445 -228 -250 330 -17 377 -265 -289 -671 150
3215 150 486 -44 -187 104 369 -559 -401 481 460 -262 38 861 -483 550 -374 265 -375 240 229 217
3235 217 -307 -111 497 567 -448 -95 -424 6 -182 507 348 -17 146 449 -179 687 -302 -240 204 432
3255 432 -35 -406 -46 368 203 536 -411 -174 58 -365 -202 -78 484 -392 -275 -43 -929 427 -52 798
3275 798 -867 -145 -131 554 124 -520 329 -157 -32 421 -329 -63 -251 663 -617 156 216 384 138 272
$$ packed form
3134a00P3q04M06J85K83K70n31P52K81j142L97J43q51K98k19J420j409N82n01
3153d67J259o11K78m25j33n64Q27k65J86k42J82l69j0P0K68L33J66j33r7L80r62
3174c29R39m3j52o44K64k5o88J170q11P15M19n12k77j61M50m05k44L72j13N37
3194D62m73l59K11l02O77m71R6m88Q58n1k47l58K17k2N80l47L94o42k4l82Q21
3215A50L36n30j43K91K65r28J58Q82k1p22L00Q23j344J033r24O39o40O15j1j2
3235B17n24J96O08P0j015L53l29M30j88O89j59l65J63L03o28Q66r89O2M44K28
3255D32m67l71L60M14j65L33r47K37K32m23J63J24N62q76J17K32q86J356m79Q50
3275G98j665P22J4O85m30o44Q49m86J25M53p50K66j88R14j280P73O0J68k46J34
$$ plain form
3295 272 352 367 -160 -28 371 128 -587 262 -606 1158 -766 -1697 457 -256 -196 -142 260 340 -475 -51 69
3316 69 306 -86 347 -608 172 188 478 774 55 -65 -47 124 145 582 790 -217 -317 81 -1053 103
3336 103 780 -514 -306 -665 -573 -465 391 -354 -194 871 -65 1008 151 -11 336 -1144 -391 334 617
3355 617 -632 565 -275 575 -475 189 712 -1043 178 486 61 325 317 421 76 628 -83 -401 722
3374 722 -94 740 317 1257 33 -16 324 618 613 112 287 -32 738 50 457 596 -598 -656 377 -560
3394 -560 378 -71 402 112 464 -158 -22 -568 -338 210 -1 339 -821 -232 -480 99 -596 -47 14 179
3414 179 -265 624 811 -146 -849 485 472 369 -119 -564 -691 -33 -107 106 793 -716 -618 166 -107 -190 54
3435 54 -316 -514 809 -151 308 414 218 11 378 544 58 -498 -558 725 14 -192 851 -601 89
$$ packed form
3295B72Q0J5n27J32L99k43p15Q49q68J764j924r31K154p13O0N4M02Q0q15M24J20
3316F9K37l92M33r55P80J6K90K96p19j20J8J71K1M37K08j007j00L98j134J156
3336A03O77j294K08l59R2J08Q56p45J60J065r36J073q57j62L47j480P53P25K83
3355F17j249J197q40Q50j050O64N23j755J221L08m25K64qJ04l45N52p11l18J123
3374G22q16Q34m23R40j224m9L40K94nn01J75l19P70o88M07J39j194n8J033r37
3394e60R38m49M73k90L52o22J36n46K30N48k11L40j160N89k48N79o95N49O1J65
3414A79m44Q89J87r57p03J334j3j03m88m45j27O58p4K13O87j509R8P84k73q3K44
3435E4l70j98J323r60M59J06j96k07L67J66m86n56o0J283p11k06J043j452O90
$$ plain form
3454 89 -17 819 -628 156 -229 591 -106 98 709 712 225 -278 -470 807 744 436 288 240 162 86 24 -276
3476 -276 793 -88 371 161 -250 785 -772 395 35 -563 67 368 -271 -486 769 -302 153 646
3494 646 -146 367 461 303 66 17 -230 -91 -861 130 -125 336 -175 -439 -589 288 -234 290 -268 907
3514 907 794 811 -185 185 -173 -203 548 820 -517 -123 299 357 12 566 498 43 533 475 -320 297 -347
3535 -347 59 405 -226 -185 -23 367 -476 245 525 474 347 -182 -1273 -3 -174 267 724 296 554 -24
3555 -24 47 -140 489 -267 657 213 648 471 -236 -97 -53 40 86 -553 -825 87 1005 -289 774 163 936
3576 936 1178 502 -360 892 439 461 1063 1241 -29 589 137 -1097 436 -939 -105 952 -223 857
3594 857 178 13 534 100 413 776 41 -195 287 19 218 -241 -444 -271 -289 498 -383 526 47 409
$$ packed form
3454H9j06Q36j447P84l85Q20o97K04O11Lm87n03j92J277o3l08j48m8p8p6o2l00
3476b76J069q81M59k10m11J035j557J167l60n98O30L01o39k15J255j071M55M93
3494F46p92N13R4j58k37m9k47J39p70R91k55M61n11k64j50Q77n22N24n58J175
3514I07j13J7r96L70l58l0P51K72j337L94M22N8l45N54o8m55M90n8p95O17o44
3535c47M06L46o31M1J62L90q43P21K80n1j27n29j091J270j71M41M57m28K58n78
3555b4P1j87O29p56R24m44M35j77p07J39M4R3M6o39k72R12R18j294J063o11P73
3576I36K42o76q62J252m53K2O02J78j270O18m52j234J533j375Q34J057j175J080
3594H57o79j65N21m34L13L63p35k36M82k68J99m59k03J73j8P87q81R09m79L62
$$ plain form
3614 409 459 102 -433 -445 -131 -305 487 1008 315 531 139 -75 345 -508 1210 -435 72 410 -51 712
3634 712 -163 730 642 -65 307 -541 -232 59 502 -856 -262 735 -403 -571 -38 -89 20 464 141 -168
3654 -168 58 459 -356 293 -558 -6 3 226 -153 150 -408 -2 -102 -554 -150 125 36 -556 250 -163 70
3675 70 -475 -96 68 376 -153 -279 -70 100 68 238 132 157 -409 231 55 221 209 -128 -742 -728 -126 170
3697 170 201 30 214 -72 -242 655 -367 -955 -19 1296 -8 861 1136 299 815 325 823 385 114
3716 114 -971 502 -69 158 230 810 -308 -289 -194 261 -472 -374 1034 664 877 -1009 -1169 4 165
3735 165 430 -591 -457 263 -286 -135 39 692 -277 500 381 -265 -82 -295 1434 772 36 896 -772
3754 -772 731 267 111 839 340 -240 1028 475 133 -893 879 -50 -4 614 436 1082 545 649 -361
$$ packed form
3614D09N0l57n35j2L14j74P92N21o93K16l92k14M20q53J718j645N07L38m61P63
3634G12q75Q93q8p07L72q48L09K91M43j358N94R97j138j68N33n1J09M44l23l09
3654a68K26M01q15O49q51N52RK23l79L03n58M06j00m52M04K75q9n92Q06m13K33
3675G0n45L79J64L08n29j26K09J70l2J70j06K5n66O40j76J66j2l37o14J4O02K96
3697A70L1j71J84k86j70Q97j022n88R36J315j304Q69K75q37N16m90M98m38k71
3716A14j085J473n71K27P2N80j118J9R5M55p33R8J408l70K13j886j60J173J61
3735A65K65j021J34P20n49J51J74O53r69P77j19o46J83k13J729o62p36Q60j668
3754g72J503m64j56P28m99n80J268n53l42j026J772r29M6O18j78O46n37J04j010
$$ plain form
3773 -361 15 97 -85 -761 -201 -785 661 281 -441 -167 238 -77 -432 279 83 810 -763 270 -414
3792 -414 -522 150 362 651 254 6 -495 -193 -9 -253 -1363 -512 -1322 -684 -319 -204 1184 -252 -453
3811 -453 -343 255 538 285 -782 -281 156 -589 -142 135 -550 -227 -416 -85 -366 -16 -575 -112 231 208
3831 208 -58 379 -29 130 313 -348 -200 265 -159 -53 477 -105 45 -378 118 531 -416 -76 -324 -866
3851 -866 50 -54 -297 259 -455 -76 -121 105 -214 183 42 341 269 285 313 4 23 426 392 85 1036 44
3873 44 419 -356 123 28 446 340 203 -47 258 -182 129 -47 -555 -510 -454 1233 -178 -40 -782 440
3893 440 311 -473 -51 -205 111 662 1075 184 -113 871 -7 -422 345 429 -81 227 350 202 329 -380
3913 -380 294 -99 129 -273 122 141 -32 3 521 -564 166 304 209 398 396 60 307 85 -80 -317 261
$$ packed form
3773c61L76Q2j82o76N60n84J446l80p22K74M05l15l55P11j96P27j573J033o84
3792d14j08O72K12K89l97k48n01L02J84k44j110Q51q10O38L65J15J388j436k01
3811d53J10N98K83k53j067N01M37p45M47K77o85L23j89L31k81L50n59M63L43k3
3831B08k66M37m08J59J83o61J48M65m24J06N30n82J50m23M96M13r47L40k48n42
3851h66R16j04k43N56p14L79m5K26l19L97j41K99p2J6K8l09J9M03l4l07R51r92
3873D4L75p75M79r5M18j06j37k50L05m40L11j76n08M5N6J687j411J38p42J222
3893D40j29p84M22j54L16N51M13q91k97R84q78m15P67Q4n10L08J23j48J27p09
3913c80O74l93K28m02L95J9j73L5N18j085P30J38r5J89kl36K47k22j65k37N78
$$ plain form
3934 261 494 1 1079 -47 136 29 -131 131 -121 -234 -227 -164 273 -336 -200 245 111 77 -159 -254 -102
3955 -102 377 -28 26 115 -253 -902 -68 515 -1409 -105 -155 -1128 455 -198 279 -373 616 -315 78 18
3975 18 -511 213 -71 644 49 -39 -5 -758 -969 118 464 727 316 -194 -160 313 1022 257 112 -242 111
3996 111 -421 -366 -515 -92 -478 -52 -227 243 33 -140 330 485 -216 165 -190 327 -489 415 16 -18 40
4017 40 183 -284 -25 -24 226 -310 69 267 -77 124 -123 34 257 16 31 -354 332 -55 115 -365 415
4038 415 -274 -15 398 -29 143 193 -45 -107 332 115 0 -128 728 -171 -36 126 131 327 103 394 -327
4059 -327 -73 213 287 169 -302 -11 197 -241 -193 72 -206 -267 -255 -13 25 -78 186 192 17 174 -257 111
4081 111 15 -289 60 260 -20 -16 51 -55 73 -82 -71 -87 -15 140 -92 83 111 -14 106 5 124 -78 -82
$$ packed form
3934B61K33m93J078j126J83j07j60K62k52j13PO3M37o09J36M45j34l4k36r5J52
3955a02M79m05N4Q9l68o49Q34N83j924J304n0r73J583o53M77o52R89r31L93o0
3975A8n29P24k84P15n95q8L4p53k11J087L46K63m11n10L4M73P09p65j45l54L53
3996A11n32N5j49M23l86M26j75M70k10j73M70J55p01L81l55N17q16R04l99l4N8
4017D0J43m67K59JK50n36L79J98l44K01k47J57K23k41J5l85O86l87J70m80P80
4038D15o89K59M13m27J72N0k38o2M39k17j15j28Q56q99J35J62NJ96k24K91p21
4059c27K54K86P4j18m71K91K08m38M8K65k78o1J2K42L8j03K64Oj75J57m31L68
4081A11r6l04L49K00k80MO7j06J28j55J1j6P2J55k32J75K8j25J20j01J19k02m
$$ plain form
4104 -82 58 -5 -173 5 30 -50 105 -84 11 -4 74 35 19 32 120 -107 142 41 -58 -68 -49 -11 -60 49 40 -38
4130 -38 60 -65 -34 13 -1 -12 113 -18 -2 -125 135 -48 110 -5 -66 256 89 -261 100 -170 25 -14 -18 -422
4154 -422 -24 82 -184 -167 88 202 -174 -111 -164 -565 -177 -216 -328 268 222 30 147 -312 338 272 165 -95
4176 -95 546 647 -83 237 271 -146 -900 -62 -694 -22 247 412 847 -66 332 -764 -621 -928 -96 -849
4196 -849 803 227 -786 -962 -145 649 284 -1190 -976 1205 -316 990 581 -106 170 212 466 -293
4214 -293 487 186 -289 -306 -857 87 912 -368 -309 -1353 853 -152 333 -402 435 -344 -244 144 92 -294
4234 -294 -429 -1593 189 -982 -317 -486 414 -111 -83 -559 -179 -111 857 -519 -65 -328 -903 -178 200
4253 200 -493 -404 1371 -942 -239 259 -377 -50 409 -577 -638 138 311 -87 100 -35 -405 -183 189 -608
$$ packed form
4104h2J40o3j68J78K5q0J55j89R5j5P8l9j6J3Q8k27K49j01r9j0J9L8m9J09rp8
4130c8R8j25L1M7j4j1J25j31J6j23K60j83J58j15o1L22j67l50L61k70J95l9mm04
4154d22L98J06k66J7K55J14l76O3n3m01L88l9j12N96m6j92J17m59O50o6j07k60
4176i5O41J01p30L20L4m17p54Q38o32O72K69J65M35r13L98j096J43l07Q32p53
4196h49J652n76j013j76Q17P94l65j474K14K181j521J306m09o87K76M2K54p59
4214b93P80l01m75j7n51R44Q25j280N9j044K206j005M85p35Q37p79J00L88n2l86
4234b94j35j164J782j171O65j69R00n25K8m76L80O8R68j376M54k63n75P25L78
4253B00o93Q9J775k313P03M98o36L27M59r86o1P76J73l98J87j35l70K22L72p97
$$ plain form
4273 -608 995 503 -1025 269 382 -619 -11 -642 -546 432 940 -833 1038 334 -1085 455 960 295
4291 295 -128 282 992 359 -348 -461 -1051 310 -772 -648 -466 -346 1196 385 781 -38 1 -14 108 106
4311 106 219 198 131 715 -622 375 -45 667 438 -270 -364 402 289 -474 114 944 664 758 -377 107 198
4332 198 -166 1915 -302 358 85 -133 -1001 136 -633 -148 -998 273 -29 79 -542 -115 -420 632
4350 632 221 -392 65 469 -98 -196 -332 122 -441 -404 -278 241 0 88 -365 62 -701 125 609 -651 170
4371 170 717 503 286 -98 261 374 72 -605 348 107 -5 -93 -68 -14 208 102 656 326 944 -536 116
4392 116 -247 -292 -63 14 -371 152 -390 -216 -170 -1110 -910 -643 -973 -308 -50 -405 552 820 -36 -290 211
4413 211 429 342 -710 771 824 -274 -945 -682 869 599 -249 -1239 7 246 -304 -473 1181 -1
$$ packed form
4273f08J603m92j528J294J13j001O08o31R6R78N08j773J871p04j419J540N05o65
4291B95m23M10P10o33p07j13n90J361j082J24J82J20J542q11L96q19L9j5J22k
4311A06J13k1o7N84j337R97m20P12k29p08r4P66j13p63N88Q30k80R4j135M84R1
4332A98l64K081k217O60k73k18q68J137p69M85q50J271l02J08o21M27l05J052
4350F32m11o13M57M04n67r8j36M54n63L7J26N19k41Q8m53M27p63Q26M84j260Q21
4371A70N47k14k17l84L59J13l02o77R53k41j12q8K5N4K22j06N54l30O18j480O52
4392A16l63m5K29P7l85N23n42J74M6r40K00K67l30O65K58l55R57K68q56k54N01
4413B11K18q7j052J481N3j098o71K63J551k70q48r90J246K39n50j69J654j182
$$ plain form
4431 -1 -583 -501 644 -1241 -159 -572 -163 437 432 1325 731 -535 164 771 -91 -339 -356 957 -272 295
4451 295 -186 1119 -258 -282 676 -747 487 455 1425 -10 -343 -241 698 -144 839 -409 -382 -435 -146
4470 -146 -959 117 -793 -560 490 -241 -333 438 536 122 -246 -208 -817 32 152 -284 -834 352 248 127
4490 127 -518 158 -1114 -406 -212 1198 -1238 -203 -472 -238 338 -164 423 -584 -598 -646 856 219 406
4509 406 564 -145 345 -1 465 -281 -298 -618 8 918 -28 189 240 -403 -44 716 511 116 505 -1674
4529 -1674 1306 28 -233 -648 71 137 294 33 463 233 574 22 245 -1020 -1101 -1 -358 -402 -410 512
4549 512 -140 639 451 62 -210 -123 139 129 202 -472 131 -218 84 181 29 -62 -34 -298 44 -372 -259 -279
4571 -279 -208 -20 185 -15 -384 112 -486 -237 -260 388 -516 503 501 -453 206 728 636 -389 1034 -528
$$ packed form
4431an82Q2J145j885J082m13M09O00nQ93n94j266O99O07q62k48j7J313j229N67
4451B95m81J305j377k4R58j423J234l2R70j435l33J02R39q42R83j248K7n3K89
4470a46q13J076r10K33J050p31r2P71R8m14l68L8o09Q49J20m36n50J186j04j21
4490A27o45O76j272P08J94J410k436J035k69K34N76n02N87j007j4m8J502o37J87
4509D06J58p09M90l46M66p46j7l20O26R10r46K17N1o43L59P60k05l95L89k179
4529a674K980j278k61m15P19O6J57k61M30k30L41n52K23j265q1J100l57m4qR22
4549E12o52P79j88l89k72Q7K62j0P3o74O03l49L02R7j52r1K8k64L42m16J13k0
4571b79P1J88K05k00l69M96n98K49k3O48r04J019kr54O59N22r2j025J423j562
$$ plain form
4591 -528 438 -122 18 330 -268 -191 469 23 -490 -94 -408 17 -218 295 -46 77 -253 204 42 91 -184
4612 -184 337 -33 88 -258 20 -180 -233 9 246 593 196 -144 359 840 -321 124 -13 -1066 489
4631 489 109 -100 -478 -687 -146 67 -182 609 -18 412 -62 260 -136 -94 -332 304 53 -265 226 728
4651 728 206 642 126 198 143 577 111 35 -537 -180 781 44 -566 90 226 -25 -541 -320 136 -157 -273
4672 -273 296 -725 -401 -313 -222 -479 149 427 125 158 -579 -230 332 -751 -661 -635 -771 -408 -254 -643 -435
4693 -435 -654 -86 -250 -34 644 -918 -1113 -30 -196 252 -1059 -78 558 -905 -379 265 -389 850
4711 850 230 -463 -840 178 -257 421 707 -97 206 296 -428 -381 -643 -42 -39 -1072 93 -46 -48 687 -744
4732 -744 -952 -495 721 644 -1 -627 -177 -142 -455 -734 64 -251 357 -249 -423 -932 496 211 -820 -835
$$ packed form
4591e28R66n60J40L12n98P7O60m46n13L96l14M25k35N13l41J23l30M57j62M9k75
4612a84N21l70J21l46K78k00n3K42K37L47l97l40N03M81j161M45j37j053J555
4631D89l80k09l78k09N41K13k49P91o27M30m74L22l96M2k38O36k51l18M91N02
4651G28n22M36n16P2n5M34m66p6n72L57R61p37o10O56J36k51n16K21M56k93j16
4672b73N69j021L24Q8R1k57O28K78l02L3p37L49N62j083R0K6j36L63J54l89K08
4693d35k19N68j64K16O78j562j95J083j66M48j311R81O36j463N26O44o54J239
4711H50o20o93l77J018m35O78K86q04L03R0p24M7k62O01Lj033J165j39kP35j431
4732g44k08M57J216p7o45o26M50L5l13k79P98l15O08o06j74n09J428k85j031j5
$$ plain form
4752 -835 53 -362 597 -390 47 -31 -314 -250 139 513 -155 -481 -164 -849 529 133 220 175 -155 201 184
4773 184 -90 927 381 728 -383 -740 -801 -412 91 221 76 -105 742 -84 157 -106 -403 -145 350 -369
4793 -369 -289 97 95 -53 376 16 403 -649 941 -714 733 -452 -45 232 846 -39 530 948 77
4812 77 -84 434 1095 941 -346 48 -73 -792 -717 -639 -118 -390 103 291 234 26 -99 -263 513 1153 -372
4833 -372 -634 -364 -384 -212 128 -378 -717 -951 490 -545 -666 -530 110 193 238 -331 96 -604 72 120 -5
4854 -5 -192 153 -330 12 -52 233 89 91 -177 79 42 -6 -64 4 -57 142 -105 80 47 59 -67 156 -79 6
4878 6 -30 3 -17 29 -19 109 -104 60 -68 59 -43 14 -57 -12 -25 83 63 62 -151 105 -93 17 -205 -14 -87
4903 -87 79 -145 127 -56 16 94 37 -42 16 -20 143 -103 -77 44 -38 -165 39 -33 17 -29 124 16 136 -77
$$ packed form
4752h35Q88m15R59r87M37p8k83O4L89L74o68l26L17o85J378l96Q7m5l30L56j7
4773A84k74J017n46L47j111l57o1L89N03J30j45j81Q47q26K41k63k97K58M95p19
4793c69Q0L86kj48M29l60L87j052J590j655J447j185M07K77O14q85N69M18q71
4812G7j61N18O61j54j287L94j21p19P5P8N21k72M93J88n7k08j25j64P76O40j525
4833c72k62K70k0J72L40n06l39k34J441j035j21J36O40Q3M5n69M27p00O76M8j25
4854ej87L45m83L42o4K85j44Kk68K56l7m8n8O8o1J99k47J85l3J2j26K23k35Q5
4878Fl6L3k0M6m8J28k13J64j28J27j02N7p1M5j3J08k0jk13K56j98J10k22J91p3
4903h7J66k24K72j83P2P8n7p9N8l6J63k46K6J21q2j27K04p2N0m6J53j08J20k13
$$ plain form
4927 -77 -15 -63 -21 -43 119 -63 104 -169 29 -60 122 53 -9 35 -16 28 1 -69 91 -55 -13 -68 -112 -3 31 -43
4953 -43 -54 85 11 22 -17 -55 30 -44 32 -2 -40 32 36 -107 -65 17 58 -45 89 5 -67 -43 -108 -5 -46 -55 -2 26 49
4982 49 31 -14 68 -181 -22 -2 58 -40 35 -90 -99 83 33 48 62 27 59 -122 87 -110 -45 63 -55 -83 76 -11
5008 -11 80 -249 135 81 100 -222 263 -16 65 250 -222 -318 -82 236 -204 33 173 -1 62 -20 -40 39 -102
5031 -102 -360 -207 -202 668 108 -229 32 216 170 -315 -151 122 -107 76 145 -84 513 -117 262 -213 487
5052 487 179 -192 742 370 4 202 18 330 -100 189 248 234 607 -79 115 292 288 412 2 -88 362 138
5074 138 252 -145 392 426 421 -16 -199 269 -38 -101 -17 -350 560 -326 735 -970 -214 -578 41 221 353
5095 353 255 -145 -115 37 -151 -36 -77 232 538 -170 290 407 59 205 -382 -204 -79 -517 -384 -77 327
$$ packed form
4927g7O2m8M2k2J62j82J67k73J98q9J82o9o2M4n1M4k7p0J60j46M2n5m4J09L4p4
4953d3j1J39p4J1l9l8Q5p4P6l4l8P2Mj43M2Q2M1j03J34q4p2K4o5J03m1rN3K8K3
4982D9j8m5Q2k49J59K0O0r8P5j25rJ82n0J5J4l5L2j81K09j97O5J08j18k8J59q7
5008a1R1l29L84n4J9l22M85k79Q1J85m72r6K36L18m40K37J40j74O3q2k0P9j41
5031a02k58J53NQ70n60l37K61J84m6m85J64K73k29J83O9k29N97o30L79m75P00
5052D87l08l71R34l72l66J98j84L12m30K89N9j4L73o86J94J77mJ24m10r0M50k24
5074A38J14l97N37L4nm37j83M68l07o3Q4l33R10q86J061j705P56l64O19J80J32
5095C53r8m00L0J52j88J15m1L09L06p08M60J17l48J46n87J78J25m38J33L07M04
$$ plain form
5116 327 -55 204 -119 -303 620 461 387 -211 343 -303 -41 -91 -2 270 -29 -374 -209 -269 -180 -145 203 -152
5138 -152 54 35 576 -81 117 437 277 558 510 -642 -172 33 -415 221 -459 -400 369 358 -165 32 171
5159 171 -29 25 -101 -50 78 226 -122 -39 95 -208 -220 -32 68 874 -92 96 61 109 47 -37 -14 65 -16 -15
5183 -15 -57 66 38 -98 -108 -31 -104 52 -391 -8 -233 -244 206 -249 211 -366 -363 253 -26 62 419 -396 -582
5206 -582 59 -90 -74 -603 254 545 181 803 937 364 -278 95 670 -519 -817 498 261 -171 -192 414
5226 414 139 713 -6 -25 633 163 -50 -38 -227 -295 12 268 -177 125 44 -105 -81 71 -115 89 -51 -93
5248 -93 -17 185 13 65 34 54 -29 77 -23 167 54 39 28 -16 -8 89 -117 -42 -74 54 -95 70 -51 60 45
5273 45 35 -87 10 29 48 -61 -143 -119 -61 -186 -134 -169 -15 365 -178 -123 201 -345 -132 -517 395 -140 381 5
$$ packed form
5116C27l82K59l23j84R23j59p4n98N54o46K62n0Q9K72k99l45J65o0Q9L5L48l55
5138a52K06j9N41o57J98L20j60K81m8j152M70K05m48O36o80N9P69j1n23J97J39
5159A71k00N4j26N1J28J48l48Q3J34l03j2J88J00Q06r66J88l5M8o2q4K3P9q1J
5183a5m2J23k8j36j0P7p3J56m43L83k25j1M50m55M60n77LO16k79Q8L57q15j86
5206e82O41j49J6n29Q57K91l64O22J34n73o42L73N75j189k98J315k37m32k1O06
5226D14k75N74p19j9O58m70k13J2j89o8L07K56m45L02q1j49K4J52j86K04j40m2
5248i3P6K02j72N2l1K0q3J06j00J90j13j5j1m4QR7k06P5l2J28j49J65j21J11j5
5273D5j0j22R7J9J9j09q2K4N8j25N2l5J54L80n43N5L24n46K13l85R12n35N21l76
$$ plain form
5297 5 138 -110 100 -332 -117 -217 -376 -210 -51 -202 467 218 -36 -15 -84 -143 -34 -42 78 -402 4 62 -123
5320 -123 -12 83 98 187 -45 -58 -71 -47 -56 101 -77 84 -36 -29 -179 -49 22 105 134 230 245 34 35 33 -91 -50 16
5347 16 67 -26 -14 -24 -37 -89 61 -117 33 11 122 -5 38 -120 4 -126 73 25 -55 -95 171 -103 31 0
5371 0 206 -89 162 103 -41 -105 50 88 -20 29 130 -18 8 -48 39 148 -112 12 194 -161 -21 -17 74 64
5395 64 -248 -169 -1 -223 463 42 -372 -318 -161 -402 49 -132 -27 212 -103 174 -158 -72 -176 -231 -95 179
5417 179 190 -199 277 -385 -355 117 317 -132 -68 -55 -445 82 -326 -144 -307 371 -252 -49 -601 -240 -268 -3
5439 -3 -241 -198 -185 266 -131 351 305 86 52 -177 -25 277 36 -205 710 268 -350 -502 297 -364 397 -111
5461 -111 -205 -7 325 610 -191 -140 -166 143 376 -213 -207 -205 -1020 85 -612 -691 -165 -127 -493 -244 -228 -84 -562
$$ packed form
5297EJ33k48K10m32K15j00j59J66J59j51O69k49k54K1o9n9J09qJ20m80M06N8j85
5320a23J11R5J5Q9k32j3j3K4rJ57j78J61j20Pj50J30P1Q3K9R6J5k11Jkj24M1O6
5347A6N1r3J2j0j3n2J50j78J50k2J11j27M3j58J24j30J99m8q0m0K66k74J34l1
5371@K06k95K51n9j44o4J55L8j08M9J01j48K6n6Q7J09k60J24J82l55J40MR1j0
5395F4l12P9J68k22O86m21m14N4J57k41M51j81J05K39l15K77l32Q6j04n5J36K74
5417A79J1l89M76o62L0M72K00m49O4J3l90N27m08J82j63O78o23K03n52L61k8K65
5439ck38M3J3M51l97M82m6k19l4k29J52L02k41k41R15m42o18j52P99o61P61n08
5461a11r4J98L32K85q01N1k6L09K33n89OKq15J105o97p9N26L8l66K49J6J44m78
$$ plain form
5484 -562 535 792 941 406 331 1196 6 -529 281 141 -200 -276 316 -133 -444 -192 -62 34 -79 -156 334
5505 334 241 125 -499 214 -229 441 109 210 -272 -256 -258 -98 -101 165 -62 552 -146 413 173 86 -286 248
5527 248 -127 138 -86 52 198 241 -320 34 151 134 -162 75 -324 247 -54 56 -184 113 30 -100 7
5548 7 61 -122 -87 125 -73 -92 96 -39 7 -8 27 -36 -14 -51 157 -15 72 -142 -92 -71 -24 -100 189 -58 11 -29
5574 -29 1 -53 90 -6 46 -117 -56 -44 58 -5 -16 90 -29 9 61 -101 -29 -49 24 -165 23 -95 77 -20 25
5599 25 -1 89 -41 -45 56 29 21 43 -102 62 52 -55 124 -10 303 -155 135 372 -84 -37 139 58 65 111 331
5624 331 62 -371 214 102 -78 115 -134 -406 44 -1464 309 106 -211 76 -55 102 484 -157 215
5643 215 -4 20 3 104 -50 62 -46 95 4 14 -60 90 -111 -47 -66 -48 -132 37 -132 442 -35 23 465
$$ packed form
5484e62J097K57J49n35p5Q65j190n35Q10j40l41p6N92m49l11K52J30R6j13p7M90
5505C34r3j16o24P13m43O70l32J01m82J6kJ60lK66k27O14o98N59k40q7l72N34
5527B48l75K65k24J38J46M3n61L54J17j7k96K37l99N71l01J10k40K97q3j30J07
5548GN4j83L5K12j98j9J88j35M6j5L5o3K2l7K08j72Q7k14N0K1M7p6K89k47O9m0
5574b9L0n4J43r6N2j63O1J2J02o3j1J06j19L8N2j62P2k0P3j89J88j18J72r7M5
5599B5k6R0j30mJ01k7qK2j45J64j0j07J79j34L13m58K90K37m56M7J76q1PM6K20
5624C31k69m33N85j12j80J93k49k72M50j508J773k03l17K87j31J57L82o41L72
5643B15k19K4j7J01j54J12j08J41r1J0p4J50k01O4j9J8q4J69j69N74m77N8M42
$$ plain form
5666 465 -42 519 -565 -35 -163 51 -681 -40 684 -445 287 -29 -865 -158 -127 -200 343 -46 331 -108
5686 -108 214 -56 74 -202 -171 288 111 -649 -167 152 -181 541 -83 -145 -264 56 101 503 -388 206 -170
5707 -170 -97 138 108 -191 31 -169 410 125 102 -11 13 -176 21 -113 694 109 -69 5 389 563 -335 899
5729 899 -55 327 355 311 209 70 162 -173 -75 -174 -677 441 182 -343 328 -67 67 82 -248 -25 221 -288
5751 -288 106 514 -308 -256 -258 141 36 -120 47 18 51 -50 681 649 85 173 -54 -387 107 89 130 84 205
5774 205 -229 135 -240 167 -41 117 -182 167 -135 61 -165 -46 -140 180 26 47 -249 78 -251 231 -106
5795 -106 -61 -234 27 -42 311 204 -89 15 -80 190 -143 -58 -5 135 48 -124 -176 -4 136 -321 305 -114
5817 -114 -306 -408 -63 194 43 -49 -13 38 19 -102 347 149 -97 -120 74 -209 1 -600 -212 -115 -287 -185
$$ packed form
5666D65n07N61j084N30j28K14p32O41P24j129P32l16q36P07L1p3N43l89L77m39
5686a08L22k70J30k76L1M59j77p60M82L19l33P22o24o2j19L20M5M02q91N94l76
5707a70P3K35l0k99K22k00N79k85k3j13K4j89J97j34Q07n85j78P4L84J74q98J234
5729H99r54L82K8m4j02j39R2l35R8r9n03J118k59n25O71l95J34J5l30K23K46n09
5751b88L94M08q22N2kL99j05j56J67k9L3j01P31l2n64Q8k27l33M94j8M1m6J21
5774B05m34L64l75M07k08J58k99L49l02J96k26J19r4L20j54K1k96L27l29M82l37
5795a06M5j73K61o9L53j07k93J04r5K70l33Q5N3J40q7j72n2J72J40m57O26m19
5817a14j92j02L45K57j51r2L6N1j9j21M49j98k46k3J94k83K10o01L88R7j72J02
$$ plain form
5839 -185 208 -374 57 -91 254 448 158 -193 111 -65 -123 187 -225 -49 4 -74 -354 -233 -77 212 142
5860 142 134 -165 -116 -37 -256 188 20 0 -123 22 -409 -153 -56 -4 372 136 879 -66 -620 -299 -265 87 -422
5883 -422 -259 95 -24 -226 15 -229 759 51 224 144 -42 -232 -421 -19 -624 170 175 198 114 106 53 179 -141
5906 -141 -122 62 53 103 3 -187 -20 -26 -139 285 112 -17 122 53 95 -119 -42 -153 34 -97 -16 -70 80 -42
5930 -42 46 -48 13 -78 11 -63 43 -112 -108 -73 43 -3 13 -2 58 -62 60 -51 10 -68 -7 17 15 -52 -14 -69 66 -31
5958 -31 73 -29 38 26 99 -85 50 -19 70 -141 191 18 129 -35 21 -169 72 -95 25 -55 53 -107 4
5981 4 -27 -55 2 -49 -78 -41 -113 -75 -71 34 -18 3 -48 90 -15 35 -83 113 -24 41 -87 54 47 -8 51 -49 -44 220
6009 220 408 573 -725 -519 -366 -799 -966 760 -541 -299 407 -390 -66 -487 -592 522 -61 -531 -765
$$ packed form
5839a85L93n82M31j48L45J94k90l51L04j76n8L10m12J76N3p8k80J21J56K89p0
5860A42qk99M9P9k19M44j68k0j23J45m31K56R7N2L76k36P43r45n54L21L4L52n09
5883d22J63L54j19k02K41k44R88p08J73q0j86j90j89M02o05P94NK3q4qn3J26l20
5906a41J9J84rN0j00j90J67oj13M24j73j29J39o9M2k14P7j11J87j31Q1n4J50j22
5930d2Q8r4O1r1Q9p4J06j55ML5J16m6J6j5O0j20J22j11O1p8O1K4ko7L8n5J35r7
5958c1J04j02O7j2P3j84J35o9Q9k11L32j73J11j64N6j90K41j67J20q0J08j60J11
5981Dl1k8N7n1k9L7p2L8MJ05n2K1n1J38j05N0j18J96j37O5j28J41pn5N9j00NK64
6009B20J88J65j298K06J53m33j67J726j301K42P06p97L24m21j05J114n83m70k34
$$ plain form
6028 -765 100 1035 -25 61 -72 513 253 -388 3 -394 387 -256 -407 -289 245 73 182 -600 867 655
6048 655 -892 118 719 -762 -258 35 -25 193 -531 107 -139 13 -95 216 300 -30 123 0 56 63 29
6069 29 -64 59 31 -79 7 -30 8 18 44 35 -112 -6 -48 6 -114 -376 574 -202 -385 -27 -232 -372 282 386
6093 386 4 -194 306 -79 -130 151 451 -276 438 89 236 100 -181 98 151 -395 -11 49 -87 0 13 107
6115 107 16 -34 94 -91 3 -39 66 -18 28 -53 5 -108 106 -46 61 37 9 -33 44 67 139 -60 68 66 54 -84
6141 -84 55 -65 92 32 30 -70 47 44 158 -17 43 16 -31 -13 150 83 -261 190 838 -134 -326 -368 475 -56
6165 -56 22 -114 98 -100 55 26 12 -102 -43 -189 122 -41 68 -29 39 -98 40 90 -20 -1 74 -95 104
6188 104 -33 46 -46 120 -130 89 93 31 27 -14 0 66 -32 70 -123 65 9 11 -123 29 -35 50 -6 43 -19 11 -79
$$ packed form
6028g65Q65R35j060Q6j33N85k60o41L91l97P81o43j51J18N34j72J09p82J467k12
6048F55j547J010O01j481N04K93o0K18p24O38k46J52j08L11Q4l30J53j23N6Pl4
6069B9r3J23k8j10Q6l7L8J0K6rj47J06m2N4j20k62R50p76j83L58k05j40O54J04
6093C86l82j98N00l85n1K81L00p27P14l49J47j36k81K79N3n46L84O0j36Q7J3R4
6115A07r1n0J28j85R4m2J05q4M6q1N8j13K14j52J07k4k8m2P7K3P2j99J28kj2j38
6141h4J39j20J57o0kj00J17lJ14j75O0k7m7J8J63o7l44M51O48r72j92m2Q43n31
6165e6P8j36K12j98J55k9j4j14N9j46L11j63J09r7O8j37J38N0j10J9P5j69J99
6188A04j37P9r2J66k50K19Mo2mm1J4O6r8J02j93J88n6Kj34J52o4Q5n6M9o2L0r0
$$ plain form
6215 -79 35 -29 108 18 -20 -82 -13 -119 25 28 76 -4 68 80 111 -87 -8 -25 -17 -40 125 -47 38 63 0 -5 103 -149
6243 -149 60 -46 147 84 13 -52 -14 20 21 -67 11 -21 26 63 5 -82 33 -65 25 -24 59 17 -11 -16 -2 -68 -15 -71 90
6272 90 -22 -4 11 14 -92 43 -111 22 36 16 -53 -16 13 82 30 -57 17 -161 12 -71 6 15 -43 25 -112 -95 63
6299 63 -116 86 9 3 -97 -55 28 0 48 58 23 18 56 -7 84 66 -21 138 -82 -6 -11 -15 -84 45 4 51 23 -24 75
6328 75 115 -11 312 190 -603 -405 432 197 116 -7 -87 -52 19 -147 -5 -47 23 11 35 -108 53 20 102 -40
6352 -40 -9 13 7 63 65 -31 -59 -193 116 -4 50 -92 6 9 40 95 79 -105 -26 -31 -33 111 -60 -86 59 -43 45 -70
6380 -70 88 -59 153 -146 116 35 68 -18 30 -139 53 4 39 -49 32 -27 53 13 62 39 -51 50 25 85 26 81
6406 81 60 -122 41 3 97 -65 -15 109 -70 -100 241 -155 -91 -26 -198 72 34 -168 -65 -208 49 224 -51
$$ packed form
6215g9J14o4J37r0l8o2O9j06J44LM8q0P2J2L1j98P9j7Qk3J65j72Q5K5o3nJ08k52
6243a49K09j06J93o3p1o5L8L4Jq8P8l2M7L7n8q7J15r8R0m9Q3m2k8nJ4o6N3n6J61
6272I0j12J8J5Lj06J35j54J33J4k0o9L7K9O9n2q7P4j78J73q3P7Rn8O8j37J7J58
6299F3j79K02p7oj00M2Q3k8M8J0l5nL8o3R1j8q7J59k20P6nmo9J29m1M7k8m7R9
6328G5M0j26L23j22p93J98Q37k35q1j23q0L5P1j66J42m2P0j2K4j43J61l3Q2j42
6352d0L1K2oN6Kr6k8j34L09j20N4j42R8LL1N5j6j84P9nkJ44j71k6J45j02Q8j15
6380g0J58j47K12k99K62q1L3q6M8j69J92m9L5q8Q1n9Q0m0M9k3r0J01k5O0n9N5
6406H1k1j82J63l8R4j62N0J24j79l0L41l96O4O5j72K70l8k02J03j43K57J75k75
$$ plain form
6429 -51 -91 68 -84 -9 181 60 -162 81 -67 -54 156 5 32 88 150 123 -131 -134 2 147 -126 -108 26 6
6453 6 -104 69 -218 13 -40 38 28 135 9 -10 -11 78 20 -58 -27 61 109 -17 2 10 -71 53 -53 -8 -37 17 23 -56
6481 -56 23 3 22 -75 -61 91 23 98 62 15 -81 -126 44 -48 -113 34 -45 55 77 -51 -24 65 -92 1 -35 -9 201
6508 201 -5 -187 54 142 58 -111 -52 202 251 29 79 -22 51 -106 -81 53 37 -106 9 -10 36 101 197 134
6532 134 152 112 -61 112 53 2 -55 14 -113 54 152 45 -326 -279 -94 -139 -8 259 -182 26 168 -154 171
6555 171 237 -80 62 233 -125 254 44 -22 69 -82 263 -337 -122 104 -192 -127 299 203 -256 -75 17 224
6577 224 -112 -39 70 95 -166 248 407 -25 72 -184 73 380 -313 354 -306 -143 105 103 -19 -26 -29 -156 8
6600 8 -68 -260 -639 -536 -38 -52 174 711 -254 -211 -416 -210 -221 152 -611 -408 -941 -415 -599 -107 -357 133
$$ packed form
6429e1m0J59j52P5J90j21k22K43j48J3K10j51K7N6O2k7k54lJ36J45k73J8J34k0
6453Fj10J73k87K31n3P8j0J07j26j9jQ9n8p8L1Q8M8j26J9Qq1J24j06M5k9N4Op9
6481e6P9k0J9r7J4J52o8P5l6m7r6m5J70r2o5J47p9J00K2j28K7Q9j57R3l6K6K10
6508B01k06j82K41Q8q4j69N9K54M9k22N0j01P3j57K5J34j6j43J15j9M6O5R6o3
6532A34J8m0j73J73n9n1n7O9j27J67R8j07l71M7J85m5J31K67m41K08J42l22L25
6555A71O6l17J42J71l58L79k10o6R1j51L45o00K15K26k96O5M26r6m59J81R2K07
6577B24l36P3J09K5k61M14J59m32R7k56K57L07o93O67o60J63K48kj22plj27J64
6600Hp6j92l79J03M98j4K26N37r65M3k05K06j1L73p63K03n33N26j84M92k50M90
$$ plain form
6622 133 -713 548 -253 -600 747 74 433 312 -556 320 916 -565 -184 -477 -508 15 189 166 -175 333
6642 333 320 498 501 -251 856 547 -418 244 -500 458 325 -787 -89 -662 747 -250 16 160 139 146 -93
6663 -93 -17 -746 -915 -583 -656 109 676 337 -296 448 -315 -250 500 -43 -282 -1682 -83 456 408 271 -186
6684 -186 -138 -68 375 -397 321 -64 -880 255 1175 128 -376 1289 -576 -138 -621 95 -59 290 -389
6703 -389 -436 -397 760 -459 -593 -163 -780 1063 403 -128 2 -277 424 -329 1182 -797 927 -555
6721 -555 704 -1188 -1353 -110 -2093 169 -49 381 -755 -565 -511 229 -1026 -72 -158 66 -49 -105 52
6740 52 -366 233 476 454 546 281 190 -354 -809 -753 -547 -903 1145 74 1039 174 -240 -172 551 1041 -793
6761 -793 -132 502 447 -277 96 -460 213 267 -1015 -157 18 -952 -900 -513 399 -117 86 106 391 1019 313
$$ packed form
6622A33q46J261q01l47J347o73L59j21q68Q76N96j481L81k93l1N23J74k3l41N08
6642C33j3J78Lp52J107l09r65O62p44R58j33j112O98n73J409r97K66J44k1Pk39
6663i3P6p29j69L32p3P65N67l39o33P44p63O5P50n43k39j400J599N39m8j37m57
6684a86M8P0M43p72P18l85q16J135R20j047n04J665j865M38m83P16j54L49o79
6703c89m7L9J157j219j34M30o17J843o60n31J30k79P01p53J511j979J724j482
6721e55J259j892j65J243j983K262k18M30j136J90N4P40j255R54q6K24j15n6J57
6740E2m18N99K43k2R2k65r1n44m55N6K06l56K048j071R65q65m14O8P23M90j834
6761g93O61O34n5p24L73n56O73N4j282Q58J75r70N2L87R12n16K03K0K85O28p06
$$ plain form
6782 313 1440 378 636 193 566 -137 -425 -684 -143 -799 -848 -466 -150 -993 99 -434 -285 -387 -893
6801 -893 -494 -31 -467 298 -157 135 -129 276 13 314 -126 -282 -324 -322 161 -15 192 -154 -149 20 209 199
6823 199 -79 507 -350 -154 -199 74 83 108 -173 234 302 -115 49 -56 -253 -181 307 177 236 -36 75 204
6845 204 -149 -6 145 -270 2 107 163 64 -385 19 -35 -169 -29 157 -150 277 -290 -246 -344 -18 -42 204
6867 204 -255 -338 -37 -71 -1 195 28 -88 98 -110 24 61 -41 29 -52 -129 -65 -25 18 -12 -47 -13 -56 -14 -16 29
6893 29 -83 15 83 148 -81 -22 -14 -72 -13 0 -92 65 -1 61 -116 43 -3 -122 38 21 -62 95 -46 100 43 105
6919 105 -100 207 -111 290 -215 -146 292 409 -98 -381 -268 -8 483 -162 -5 -110 138 -764 -624 -284
6939 -284 -675 -25 -638 173 -171 -574 352 108 155 -61 -967 321 -170 -68 494 -294 -673 45 -229 -294
$$ packed form
6782C13J127j062K58m43L73p03k88k59N41o56m9L82L16q43J092n33J49j02n06
6801h93L99M63m36P65m55K92k64M05k63L01m40j56m2KM83j76K07l46NJ69J89j0
6823A99k78N86q57J96m5K73RK5k81M07O8m17J64j05j97P2M88j30N9k72J11J29
6845B04l53J43J51m15K72J05N6r9m49M04n4j34J40J86l07M27n67M4r8L26k4K46
6867B04m59q3L01l4P0J96j67j16J86k08J34L7j02P0q1p7O4M0M3l0l5L4m3M2kM5
6893B9j12R8O8O5k29N9Qn8N9J3r2J57o6O2j77J59m6j19J60j7q3J57j41J46n7O2
6919A05k05L07l18M01n05O9M38J17n07k83J13K60M91o45J57j05K48r02J40L40
6939b84l91O50o13Q11l44m03R26k44M7k16r06J288m91J02N62p88l79P18k74o5
$$ plain form
6959 -294 -414 170 441 173 -105 276 -37 -243 244 -258 -146 60 -57 -291 -205 -75 -199 -98 102 -295
6979 -295 130 -146 102 -90 40 76 99 -16 64 -75 18 -191 103 -87 -42 1 -88 18 -60 -181 185 5 -35
7002 -35 -61 89 -16 65 -111 -76 -69 85 -47 95 61 87 135 122 -1 42 -87 -71 -147 -188 80 -494 269 195 678
7027 678 221 -6 50 -77 -124 -175 -353 -176 82 -176 -8 -86 21 -106 44 91 1 89 96 170 -53 506 -883
7050 -883 -158 494 -120 -315 1572 975 -241 -413 807 160 -295 560 67 173 190 118 -18 25 -9 86 -180
7071 -180 29 -12 -48 45 33 13 45 84 115 -94 76 -8 116 -228 -294 119 384 528 -35 31 177 -309 -327 -693
7095 -693 640 355 486 -477 -358 512 523 -36 15 -90 55 -304 -452 77 106 790 344 -115 -57 399 -101
7116 -101 -15 298 -419 135 123 -280 -563 -672 -184 391 -539 490 396 -68 188 66 -10 116 -347 304 -45
$$ packed form
6959b94j20N84K71k68k78L81l13k06M87n02J12K06j17k34Q6J30j24J01K00l97
6979b95M25k76K48j92J30L6K3j15Q0j39R3k09K94j90M5M3q9J06p8j21L66j80m0
7002c5k6J50j05Q1j76L5PJ54j32J42l4K6M8j3j23M3j29J6p6m1K68n74P63p4M83
7027F78m57k27N6j27m7n1j78J77K58k58J68p8J07j27J50M7r0Q8PP4k23N59j389
7050h83P25O52o14j95J887n97j216j72J220o47m55Q55m93J06J7p2j36M3l4R5k66
7071a80K09m1l6R3j2k0L2L9L1k09J70q4J24l44o6M13K65J44n63O6J46m86j8l66
7095f93J333k85J31r63J19Q70J1n59N1j05J45l59j48N29K9O84m46m59N8M56n00
7116a01Q6L13p17N54j2m03k83j09M88N75r30J029r4m64K56j22p6J26m63O51l49
$$ plain form
7137 -45 -295 823 113 375 -688 -366 -34 231 362 -428 545 170 51 -644 -401 246 399 -150 581 -1086
7157 -1086 -566 -472 -374 868 -241 -92 -276 -1044 -203 139 133 -225 -942 -19 1121 201 -371 316 -496 48
7177 48 -394 -713 -412 134 657 377 529 -675 261 388 -292 753 117 1070 512 -794 399 702 839
7196 839 -458 51 477 1210 546 441 349 -352 381 398 281 423 -240 -575 -904 -668 726 364 745 -830
7216 -830 777 -395 -410 248 -181 -57 -547 -131 257 -307 731 -285 19 775 198 158 -45 619 344
7235 344 -773 529 420 -765 830 15 7 -399 209 -306 -119 -214 -544 247 -58 221 731 -114 289 -291
7255 -291 -204 -8 237 -45 196 433 -190 -432 262 -252 -154 -344 -259 217 152 -542 -264 -150 -278 -491 -92
7276 -92 -45 82 -415 -5 -764 237 303 373 364 -269 -592 146 -77 -189 377 353 390 144 -550 -653 138 43 973
$$ packed form
7137d5k50J118p10K62j063L22L32K65J31p90R73l75j19o95K43O47J53n49P31j667
7157a086N20R4R8J242j109J49j84p68Q41L42ol58p17R23J140r20n72O87q12N44
7177D8m42l19L01N46N23k80J52j204R36J27o80J045o36R53n58j306J193L03J37
7196H39j297N09M26P33o64j05r2p01P33J7j17J42o63l35l29K36J394l62L81j575
7216h30J607j172j5O58m29J24m90M16L88n64J038j016L04P56n77m0k03O64k75
7235C44j117J302j09j185J595q15qm06O08n15J87r5l30P91l05K79N10q45M03n80
7255b91Q7J96K45k82K41K37o23k42O94n14R8j90Q5M76o5o94K78J14j28k13L99
7276i2M7J27m97M10p59J001O6P0ro33l23P38k23j12N66k4L7k46o94j03P91r5R30
$$ plain form
7299 973 484 -45 -145 -231 446 741 -787 -16 389 407 332 -861 -386 323 7 -98 7 208 -194 76
7319 76 -261 470 455 681 -590 1087 69 138 -60 -320 6 370 80 -617 246 347 52 11 437 326
7339 326 -72 -31 -359 -347 267 503 -175 227 -369 -142 190 36 -112 -500 352 -416 8 -38 651 341 -215
7360 -215 246 -615 324 46 -363 419 196 -352 572 1052 -785 -397 46 366 -239 11 -187 256 495 303
7380 303 84 322 1251 -329 -83 -335 206 562 -116 282 191 -218 -205 -4 75 400 -404 140 419 -222 -159
7401 -159 -788 393 -376 -165 303 104 -359 193 -677 83 375 -736 46 -299 173 -515 18 378 497
7420 497 -19 -354 -14 -110 504 -42 -605 316 351 -6 -394 98 240 -78 151 -565 -578 -241 -219 -199 -102 22
7442 22 143 693 -413 -574 136 582 578 -90 -319 -472 188 593 -465 228 27 -281 -689 337 96 27
$$ packed form
7299I73m89n29j00q6O77K95j528P71M05J8p5j193M75P09l16j05J05K01m02K70
7319G6l37P31j5K26j271J677j018O9j98k60L26L64k90o97Q63J01k95m1M26j11
7339C26l98M1l28J2O14K36o78M02n96K27L32j54j48l88Q52p68M24m6O89l10n56
7360b15M61q61R39k78m09P82k23n48R24M80j837L88M43L20o05K50j98M43K39j92
7380C03k19K38R29j580K46k52N41L56o78L98r1m09J3K01P9L25q04N44K79o41O3
7401a59o29J181p69K11M68j99m63N52q70P60K92j111P82l45M72o88N33L60J19
7420D97n16l35L40r6O14n46n63R21L5l57l88M92J42l18K29p16j3L37K2K0R7J24
7442B2J21N50j106j61P10M46mo68k29j53O60M05j058O93k01l08m08J026k41o9
$$ plain form
7462 27 -379 56 -265 -445 -529 50 -579 650 256 593 -873 228 444 77 426 -1011 -414 -43 -570
7481 -570 534 -46 611 -649 126 596 218 137 510 -922 557 376 -356 -708 -547 493 488 -825 341
7500 341 -467 -1 587 -4 -652 -28 -174 -81 -819 -171 -195 -398 371 455 520 104 172 912 404 116 -64 535
7522 535 1079 -643 520 22 71 -414 883 732 1631 -290 69 95 -51 -117 -93 -281 -286 -172 -200 -134 270
7543 270 -32 -781 -405 -172 267 -720 -407 563 -152 1074 -321 472 -42 334 -922 394 871 -478
7561 -478 460 -626 -233 46 -415 -230 -610 61 -367 639 235 459 800 815 162 241 592 339 140 493
7581 493 -85 -830 1011 586 -31 20 -246 120 106 199 529 440 842 774 70 1080 -638 -237 -233 735 -696
7602 -696 255 -109 613 19 -571 -31 -51 -177 -90 -36 -1028 117 -394 71 -496 235 615 1135 146 489 -540
$$ packed form
7462B7m06M35l21j80q4N79o29J229l94L37j466J101K16l67L49j437N97L71n27
7481e70J104n80O57j260P75M70l78q1L73j432J479j81p32l52J61J040nj313J166
7500C41q08M66N88n91o48O24j46R3p38O48k4k03P69Q4O5m16O8P40n08k88j80N99
7522E35N44j722J163m98M9m85J297j51Q99j921L59K6j46o6K4j88nJ14k8O6M04
7543B70l02p49L76K33M39r87L13R70p15J226j395P93n14L76j256J316M77j349
7561d78R38j086L93K79m61J85l80O71m28J006m04K24L41J5o53P9L51k53j99L53
7581D93n78p45J841m25o17N1k66L66j4R3L30q9M02o8p04J010j718M01MR68j431
7602f96R51l64P22n94n90N40k0j26Q7N4r92J145n11M65n67P31L80N20r89L43j029
$$ plain form
7623 -540 -566 -150 -81 57 -269 43 -368 -684 535 10 379 232 123 117 -652 -485 -634 -87 -36 376 771
7644 771 87 -408 8 300 -596 7 -994 -269 -68 180 405 -328 -456 -149 -824 -746 185 713 -339 -491
7664 -491 -149 129 192 -473 333 196 22 -365 -623 -443 -468 -192 -219 -177 108 -292 212 84 399 21 683
7685 683 424 -40 -292 322 399 295 -230 -289 127 150 83 -78 -194 165 -404 -223 306 323 -34 241 284 -135
7707 -135 778 191 280 136 -228 -189 -523 -202 -66 126 32 468 -164 221 -124 -114 -468 -441 391 -366 -194 246
7729 246 -244 -242 420 -296 -81 -199 -494 -478 50 114 342 92 9 470 536 297 -251 24 -200 -443 238 149
7751 149 -235 -182 -570 244 124 16 444 -120 -596 455 -614 210 -532 -64 -255 480 17 -45 -378 297
7771 297 -51 -29 758 -421 522 -317 158 209 -215 -697 -393 -235 -218 -225 -221 -323 -491 64 8 141 -303 -316 -372
$$ packed form
7623e40k6M16O9J38l26L12m11l16J219n25L69j47j09op69J67j49N47N1M12L95
7644G71o84m95M16K92q96O03j001P25K01K48K25p33j28L07o75P8R31N28j052j52
7664d91L42K78O3o65Q06j37j74l87k58J80k5K76k7M2K85m00N04j28L15l78O62
7685F83k59m64k52O14P7j04n25n9M16K3o7j61j16L59n69J81N29J7l57K75M3m19
7707a35R13n87Q9j44l64L9l34L21J36J92r4M36o32L85l45J0l54K7Q32p57J72M40
7729B46m90KO62p16K15j18k95J6N28O4K28k50q3M61O6k39n48K75k24k43O81q9
7751A49l84N3l88Q14j20j08M28n64m76J051j069Q24p42M68j91P35m63o2l33O75
7771B97l48K2P87j179R43q39M75N1m24m82L04J58J7pMj02j68N55n6J33m44j3n6
$$ plain form
7794 -372 257 -191 478 106 -77 166 304 499 213 -273 7 611 -10 93 6 296 61 34 132 -254 -457
7815 -457 12 -234 -462 -201 33 -461 -83 333 333 -189 -93 -299 -282 -500 -232 150 482 -669 1021 563 -285
7836 -285 -551 -609 510 -729 -95 1140 -85 -342 248 -196 -449 1301 934 1161 558 723 -289 -1231
7854 -1231 -873 -240 287 652 434 29 -492 591 743 -379 222 -304 1030 60 -458 695 -417 561
7872 561 73 190 507 -713 -263 365 207 313 -1193 749 670 -816 137 197 265 865 316 49 -58 210
7892 210 127 65 -361 163 337 163 -25 -373 46 -422 -593 354 47 -714 336 -186 -406 -34 950 -77
7912 -77 447 282 -381 141 712 352 596 -435 -64 -245 225 93 221 28 87 60 290 70 -274 321 -193
7933 -193 -85 -286 178 464 -271 29 -182 11 82 -221 -102 -133 -370 -163 59 -55 229 -154 44 69 3
$$ packed form
7794c72O29m48O69l72j83K43J38J95k86m86K80O04o21J03q7K90k35k7R8l86k03
7815d57M69k46k28K61K34m94L78M16%n22R6k06J7k18K68L82L32j151J690m58q48
7836b85k66n8J119j239O34J235j225k57N90m44k53J750l67K27o03J65j012r42
7854a231L58O33N27L65k18m05n21J083J52j122O01n26J334r70n18J153j112R78
7872E61m88J17L17j220M50O28j58J06j506J942p9j486R53O0O8O00n49k67j07K68
7892B10q3o2m26N24J74j74j88l48M19m68j71R47l07p61J050n22k20L72R84j027
7912g7N24j65o63N22N71l60K44j031L71j81M70j32J28j93N9k7K30k20l44N95n14
7933a93J08k01M64K86p35L00k11J93P1l03J19l1k37K07K22j14K84l83J98K5o6
$$ plain form
7954 3 -67 85 -72 137 -46 99 -33 -27 37 116 -28 1 35 56 79 -42 -14 -50 8 10 -26 15 112 -23 -142 8
7980 8 44 -18 -53 -68 -95 61 28 -104 6 -51 -21 47 -9 -87 -91 31 -13 16 18 202 -1 -102 33 -40 -121 -24 -84 -36
8008 -36 82 -36 -53 72 -1 26 -30 -64 -154 18 -63 4 113 42 18 -166 92 -120 260 271 54 8 -1021 305
8032 305 -401 -276 -912 -32 466 376 621 185 460 3 77 37 636 -149 -360 -59 132 -337 -205 192 137
8053 137 417 -16 -511 317 160 94 -261 -90 269 -40 47 -79 14 -40 -14 -12 -49 -15 61 -13 138 68 31 -160
8077 -160 -33 75 14 -97 -134 21 -14 157 -44 82 15 -88 189 22 -82 -12 97 104 -51 124 -131 17
8099 17 -95 71 -142 -25 90 38 -15 -39 -28 29 40 -54 -9 24 79 152 206 -127 293 -182 455 -204 426 742
8123 742 -61 133 -856 180 53 355 -508 -97 -340 442 -328 -60 -161 -396 98 230 93 -619 362 79
$$ packed form
7954Cp0J52j57K09j83J45j32OO4P9j44K9L4K1K3j21K8l6N8Kl6M1R7j35j19J50
7980HL6o2l5j5k7J56l3j32J10n7L0O8n6p8mJ22m4K9KJ84k03j01J35p3q1R7o0M8
8008c6J18j18j7J25p3K7n6l4r0J72q1O7J09p1k4j84K58k12L80J1k17m6j029J326
8032C05p06J25o36Q80M98r0K45m36K75m57P4m0N99p85k11L01J91m69J32L97n5
8053A37K80m33m95Q28j57o6l55J71L59l09Q7j26R3n4K6Kl7L4P6p4J51p0l7j91
8077a60J27J08o1j11l7J55l5J71k01J26o7j03K77j67j04P0J09Pj55J75k55J48
8099A7j12J66k13J17J15n2n3k4J1N7J1r4M5L3N5P3N4l33M20m75O37o59O30L16
8123G42q03J94r89J036j27L02q63M11k43P82p70K68j01k35M94J32j37p12R81k83
$$ plain form
8143 79 208 67 179 16 119 -21 11 -93 43 74 -37 -126 -17 -72 35 32 -2 -11 91 -8 161 152 86 109 -82
8168 -82 80 -44 0 -21 -25 -46 85 -23 144 -14 45 15 -19 101 63 -15 10 -54 5 63 72 -98 65
$$ packed form
8143G9J29j41J12j63J03j40L2j04J36L1j11q9J09n5J07ll4rJ02r9J69ro6K3j91
8168h2J62j24M4k1mk1J31j08J67j58N9l0l4J20l8p8K5o4N9N8Rj70J63
8191F5
$$ Imaginary data points
##PAGE= N=2
##DATA TABLE= (X++(I..I)), XYDATA
$$ plain form
0 0 0 0 0 0 0 0 0 0 0 0 0 0 -8 8 -8 8 -8 16 -16 24 -24 32 -33 40 -48 56 -70 80 -93 105 -121 141 -160 184
34 184 -208 234 -265 298 -335 375 -421 470 -524 583 -648 718 -795 881 -974 1077 -1190 1315
52 1315 -1451 1606 -1776 1966 -2182 2427 -2706 3033 -3417 3873 -4434 5142 -6067 7345 -9260
67 -9260 12523 -19767 69327 18130 -2049 42155 -14831 -2614 -35839 -1447 -29608 9481
79 9481 9024 -21873 44899 -4609 -2314 -21495 16887 -25817 -5784 8762 4880 18859 9953
92 9953 -1585 1995 17535 -21990 -26391 21346 -25643 -11051 170 11011 -16208 11431 -2373
105 -2373 -2633 18100 -1180 -3574 22825 3133 -3603 -93 11852 -9951 -3820 -488 -10305 -4868
119 -4868 688 -25149 5188 3370 -16034 3373 28905 -2890 12727 20278 694 -633 -5018
$$ packed form
0@%%%%%%%%%%%%qJ6j6J6j6K4l2M0m8N6o5P3q8J04j26J50j73J98k26K62l01L44
34A84l92M42m99N63o33P10p96Q91r94J107j231J366j513J676j855K051k267K505
52A315k766L057l382L742m148M609n133N739o450P290q307R576j1209J3412j6605
67i260K1783l2290Q9094n1197k0179M4204n6986J2217l3225L4392k8161L9089
79I481m57l0897O6772m9508K295j9181L8382m2704K0033J4546l882J3979q906
92I953j1538L580J5540l9525m401M7737m6989J4592J1221J0841k7219K7639j3804
105b373k60K0733j9280k394K6399j9692o736L510J1945k1803O131L332r817N437
119d868N556k5837L0337j818j9404J9407K5532l1795J5617P551j9584j327m385
$$ plain form
132 -5018 -15984 -10440 -5355 -10583 -1577 12657 2966 4015 3331 2989 -11629 -2809 -6113 700 8501
147 8501 7206 9910 10062 14321 -15980 -1336 2084 -23973 -8169 867 -6098 -979 8687 -1811
161 -1811 3669 6114 -6772 7188 4629 4633 -111 9247 1257 -2048 -4703 -3169 -10608 354 -9526
176 -9526 -6381 10880 -3143 -3835 12004 2568 725 -98 11642 -6650 7997 -4128 1888 -2557
190 -2557 -754 -7636 -718 -3242 -2481 -1764 -62 4314 94 -3732 8770 -9332 9528 -8210 7475
205 7475 3553 7012 -7584 12424 325 -12171 768 -6311 -9348 2182 -5782 6540 -1065
218 -1065 10908 -5479 13258 -5311 6062 -6732 3233 -1379 -1182 -797 -812 -261 -1328 -8055 4473
233 4473 -5148 4029 -9974 13478 -4926 3279 -1014 7584 -7156 5515 -3211 3183 -860 1349
$$ packed form
132e018j0966N544N085n228R006J4234r691J049o84l42j4618Q820l304O813P801
147H501j295K704J52M259l0301J4644L420k6057J5804R036o965N119R666j0498
161a811N480K445j2886J3960k559Mm744R358p990l305k655J534p439J0962r880
176i526L145J7261j4023o92J5839r436j843q23J1740j8292J4647j2125O016m445
190b557J803o882O918k524P61P17J702M376m220l826J2502j8102J8860j7738J5685
205G475l922L459j4596K0008j2099j2496J2939p079l037J1530p964J2322p605
218a065J1973j6387J8737j8569J1373j2794R965m612J97L85j5N51j067o727J2528
233D473r621R177j4003K3452j8404Q205m293Q598j4740J2671q726O394m043K209
$$ plain form
247 1349 -4124 2138 -3893 3210 -7717 7704 -6001 4528 -6262 7450 -5756 7837 -7569
260 -7569 8721 2181 -3838 42 5914 -8562 1241 -3204 2993 -7748 7734 -7054 8385 -4908
274 -4908 5550 -5180 4782 -3088 2773 -3108 2873 -120 1559 -5183 9071 -6558 5495 -6241
288 -6241 3881 -1697 -2639 -2668 6964 -7324 4964 -1599 5871 -6790 7181 -7387 2553 -2218
302 -2218 143 -1532 569 1068 1411 -3607 7221 -7582 6780 -8195 7241 -3780 1318 -2381
316 -2381 4361 -2274 -2167 3013 286 -3712 3121 -2061 4116 -4101 6799 -5314 5956 -3595 3843
331 3843 -3017 -703 784 -3074 -2474 2733 -558 1352 658 3828 -1883 3231 -6389 6173 -3963
346 -3963 -1760 3873 1947 -2853 5226 -1784 -1781 -497 -1243 -3730 -955 -1284 1048 -1288 4050 1494
$$ packed form
247A349n473O262o031P103j0927J5421j3705J0529j0790J3712j3206J3593j5406
260g569J6290o540o019L880N872j4476R803m445O197j0741J5482j4788J5439j3293
274d908J0458j0730R962p870N861n881N981k993J679o742J4254j5629J2053j1736
288f241J0122n578r42k9R632j4288J2288o563P470j2661J3971j4568R940m771
302b218K361j675K101M99L43n018J0828j4803J4362j4975J5436j1021N098l699
316b381O742o635J07N180k727l998O833n182O177q217J0900j2113J1270r551P438
331C843o860K314J487l858O00N207l291J910o94L170n711N114r620J2562j0136
346c963K203N633j926m800Q079p010LJ284p46k487K775l29K332k336N338k556
$$ plain form
362 1494 1711 201 3699 1234 -541 -2618 2736 -3956 -2094 402 -915 621 -3287 3651 -3127
377 -3127 105 896 -357 584 1098 5221 -723 3417 990 306 -2985 -3241 3188 -10174 4572 -3910
393 -3910 2373 -171 -167 3201 -870 -292 -709 1990 -2367 909 5691 -4296 7706 -1485 2924 -4455
409 -4455 1484 -6045 -3516 -3058 -1171 -802 2012 3004 6663 408 4071 53 734 -7396 3042 -6356
425 -6356 1948 -2415 2549 101 -299 -3340 1119 -8083 1076 -2152 1787 110 7669 619 4987
440 4987 -609 3410 -5767 597 -2493 602 -4761 3419 -5411 3867 -5887 2718 -2690 -602 -1129
455 -1129 4087 -2333 4440 1090 5122 -3594 7747 -5350 3866 -6416 3156 -7120 -246 -4314
469 -4314 928 -2923 432 2191 4690 -2806 10313 -3067 5079 -3856 2961 -7065 2468 -6700
$$ packed form
362A494K17j510L498k465j775k077N354o692J862K496j317J536l908O938o778
377c127L232P91j253R41N14M123n944M140k427o84l291k56O429j3362J4746q482
393c910O283k544ML368m071N78m17K699m357L276M782r987J2002r191M409p379
409d455N939p529K529M58J887L69K814R92L659o255L663m018O81q130J0438r398
425f356Q304m363M964k448m00l041M459r202R159l228L939j677P559p050M368
440D987n596M019r177O364l090L095n363Q180q830R278r754Q605n408K088n27
455a129N216o420O773l350M032q716J1341j3097R216j0282R572j0276O874m068
469d314N242l851L355J759K499p496J3119j3380Q146q935O817j0026R533r168
$$ plain form
483 -6700 3910 -2759 1833 1988 593 -4866 3703 -7626 739 -4620 6454 -2361 8474 2919
497 2919 7120 -2217 2707 -5667 -1014 -8472 1127 -3717 2100 -2061 5175 -4039 3212 -2387 2047
512 2047 -3122 5731 -568 5370 -1496 5419 -4732 332 -4539 1455 -6271 1347 -2207 3534 -4179
527 -4179 2518 -655 -774 -1213 5861 -2342 8361 -1479 5590 -2603 276 -3552 -1478 -6427 1415
542 1415 -960 -174 2494 4504 -3524 1554 -3538 1507 -5993 4925 -1 6201 1644 5074 3420
557 3420 -2346 -4836 -2440 -9496 -3466 -1507 1633 1774 7491 2030 4925 -2036 515 -4383 -2257
572 -2257 -1678 3111 -42 4141 4063 1169 -3203 -2130 -3426 -5017 -2923 1918 -1105 3474 1683 3931
588 3931 792 1670 599 286 -358 -493 1046 -4117 57 -368 -3109 -229 52 1579 -970 1246 466
$$ packed form
483f700J0610o669M592J55j395n459Q569j1329Q365n359J1074q815J0835n555
497B919M201r337M924q374M653p458R599m844N817m161P236r214P251n599M434
512B047n169Q853o299N938o866O915j0151N064m871N994p726P618l554N741p713
527d179O697l173j19m39P074q203J0703r840P069q193K879l828K074m949P842
542A415k375P86K668K010q028N078n092N045p500J0918m926O202m557L430j654
557C420n766k490K396p056O030J959L140J41N717n461K895o961K551m898K126
572b257N79M789l153M183p8k894m372J073j296j591K094M841l023M579j791K248
588C931l139Q78j071l13o44j35J539n163M174m25k741K880K81J527k549K216p80
$$ plain form
605 466 -1708 -42 -720 2329 69 958 4267 983 -1182 1620 -3637 -3116 -2641 -1170 -2384 2311
621 2311 1786 2892 2335 2280 913 -352 -4335 994 -2312 -128 651 4927 -1349 2780 -99 -1279
637 -1279 -4491 -1756 -3638 -185 -1704 4383 1959 3960 1072 5156 -4437 597 -3432 -2970 -3111 2836
653 2836 -531 2670 -2560 3395 -3904 432 -2138 2049 -2534 2579 2024 3654 -3150 4069 -1526
668 -1526 -1 -2347 3047 -4019 2738 -2365 928 -2868 3018 -1122 1504 -2911 4517 -2094 1658
683 1658 -2473 3303 -4151 2294 -625 2137 -3027 3891 -3715 2447 -4149 2119 -2176 1644 -3211
698 -3211 5007 -2827 2553 563 853 -3248 4245 -4852 2362 -4033 4103 -3762 2326 -1655 2744
713 2744 -2566 1033 -1183 1630 -4293 3567 -2111 2380 -2445 5446 -4764 4465 -3450 1170 -2401
$$ packed form
605D66k174J666o78L049k260Q89L309l284k165K802n257N21M75J471j214M695
621B311n25J106n57n5j367j265l983N329l306K184P79M276o276M129k879j180
637a279l212K735j882L453j519O087k424K001k888M084r593N034m029M62j41N947
653B836l367L201n230N955p299M336k570M187m583N113n55J630o804P219n595
668a526J525k346N394p066O757n103L293l796N886m140K626m415P428o611L752
683A658m131N776p454O445k919K762n164O918p606O162o596O268m295L820m855
698c211Q218p834N380j990K90m101P493r097P214o395Q136p865O088l981M399
713B744n310L599k216K813n923P860n678M491m825P891j0210R229p915M620l571
$$ plain form
728 -2401 331 -736 1754 -2081 4052 -1934 1616 -3140 3815 -5159 2887 -2829 3154 -3520 3793
743 3793 -379 496 -1327 816 -2094 1738 -3643 4658 -4378 2667 -1351 2518 -3172 3821 -2018
758 -2018 243 -842 639 -2411 490 -2258 3399 -3888 3517 -1035 1997 -3051 1000 -451 -1081
773 -1081 -955 3588 -2690 3199 452 1551 -2513 1398 -2157 2076 -2326 1684 545 -396 -154 3614
789 3614 -1836 377 -789 549 -3100 1556 -708 157 -1542 1069 308 171 -469 2500 -913 -71
805 -71 720 211 -2086 2124 -86 -149 472 427 -298 -265 -1779 1905 -1377 263 2095 799 478 460 692
824 692 -1114 -1650 993 -1415 -469 1292 223 -113 927 41 216 -367 -960 962 -2332 508 905
841 905 -751 -826 1728 530 636 -84 1479 -2189 -583 -215 -534 -1304 535 -246 1669 -2501 2847
$$ packed form
728b401K732j067K490l835O133n986L550m756O955q974Q046n716N983o674P313
743C793m172Q75j823K143k910L832n381Q301r036P045m018L869n690O993n839
758b018K261j085J481l050K901k748N657p287P405m552L032n048M051j451o30
773a081J26M543o278N889k747J099m064L911l555M233m402M010j139r41K42L768
789C614n450K213j166J338l649M656k264Q65j699K611p61j37o40K969l413Q42
805g1P91n09k297M210k210o3O21m5p25L3j514L684l282J640J832j296l21j8K32
824F92j806n36K643k408R46J761j069l36J040q86J75n83n93J922l294K840L97
841I05j656p5K554j198J06p20J563l668J606L68l19p70J839p81J915m170N348
$$ plain form
858 2847 -1064 -283 -482 2210 -2816 2002 -45 -434 -394 72 -934 1169 -2774 3429 -2509 1391 -1885
875 -1885 3010 -2659 746 1104 275 -920 2453 -1618 942 -2168 1980 -2825 1977 -2245 3792 -2264
891 -2264 1171 433 299 -2786 2572 -2624 1579 -1025 3848 -1614 2451 -1583 2064 -3527 1615 -1882
907 -1882 392 -3251 2310 -761 1783 -1417 4807 -3495 2503 -1735 312 -2166 1243 -2166 2458
922 2458 -2615 3969 -1104 1580 -2621 2073 -4376 1770 -1569 2537 -2584 3459 -1326 1124 -1747
937 -1747 1921 -3171 2446 -3967 3531 -2255 1879 -417 1890 -3384 3948 -2080 770 -1492 2812
952 2812 -3141 2874 -1882 2208 -3323 3366 -1455 1998 -2881 2713 -1728 449 -2644 2962 -2584
967 -2584 2055 -594 2155 -2188 2449 -2237 1694 -2623 1683 -792 -184 -1023 3764 -2713 2560 -2028
$$ packed form
858B847l911P81j99K692n026M818k047l89M0M66j006K103l943O203n938L900l276
875a885M895n669L405L58q29j195L373m071K560l110M148m805M802m222O037o056
891b264L435p38j34l085N358n196M203k604M873n462M065m034L647n591N142l497
907a882K274l643N561l071K544l200O224q302N998m238K047k478L409l409M624
922B458n073O584n073K684m201M694o449O146l339M106n121O043m785K450k871
937a747L668n092N617o413P498n786M134k296K307n274P332o028K850k262M304
952B812n953O015m756M090n531O689m821L453m879N594m441K177l093N606n546
967b584M639k649K749m343M637m686L931m317M306k475O08q39M787o477N273m588
$$ plain form
983 -2028 1344 -3226 1082 -1624 -446 -696 2272 -793 1380 -1746 2641 -2410 193 -2559 1554
998 1554 -2496 2106 414 739 720 2555 -3415 423 -2606 737 -2724 2284 -245 2509 -560 1979
1014 1979 -958 -453 -2519 1424 -1500 -125 1640 1374 -1507 1938 -2060 300 -736 -293 886 -15
1030 -15 -369 2509 -1631 -32 -215 -270 -1492 995 486 221 -13 1133 -776 -350 -541 358 -267 -868
1048 -868 1305 923 -785 1309 526 -1391 -882 -52 -765 201 684 270 1845 -708 1664 -922 -886 -28
1066 -28 -239 -554 171 817 747 -911 1476 -661 -708 -890 770 -1747 1452 -385 1559 -121 -33 394
1084 394 130 -2261 1834 -1234 922 -510 2059 -1855 807 -830 91 -1493 1255 -651 1936 -1073
1100 -1073 2008 -1175 676 -2244 2744 -2046 1393 413 -238 -779 2619 -2765 1756 -2819 1343 -1912
$$ packed form
983b028L372m570M308k706J178k50K968l065K173l126M387n051K603k752M113
998A554m050M602j692L25j9J835n970L838l029L343l461N008k529K754l069K539
1014A979k937N05k066L943k924J375J765k66k881L445l998K360j036M43J179r01
1030a5l54K878m140J599j83n5j222K487n09k65k34J146j909M26j91Q99o25o01
1048h68K173l82j708K094p83j917N09Q30p13R66M83m14J575k553K372k586L6Q58
1066b8k11l15P25O46p0j658K387k137m7j82J660k517L199j837J944j680Q8M27
1084C94k64k391M095l068K156j432K569l914K662j637R21j584K748j906K587l009
1100a073L081l183J851k920M988m790L439r80o51n41L398n384M521m575M162l255
$$ plain form
1116 -1912 296 -366 3476 -1872 1022 -783 933 -1801 1317 -1520 622 -1537 2982 -2834 2974
1131 2974 -1426 2212 -1912 503 -1098 1899 -2824 2744 -1244 797 -949 1851 -1714 1193 -1743
1146 -1743 2059 -2843 2651 -1865 1357 -1656 1939 -1073 1066 -2183 2944 -2354 1755 -522 1666
1161 1666 -2676 2494 -2186 1387 -1795 1648 -1540 1597 -2020 2722 -2422 1471 -1049 1826 -2329
1176 -2329 2814 -1097 1106 -1551 2075 -2484 1306 -1327 1611 -1714 1558 -1630 2613 -3236 2068
1191 2068 -749 -68 -492 2257 -1992 2009 -1631 1553 -2146 1483 -1169 1260 -1766 1860 -1217
1206 -1217 1017 -1574 2131 -1503 631 -239 1465 -2249 2324 -1546 860 -1102 1318 -898 836
1221 836 -1195 1801 -1588 633 -360 882 -1106 1486 -468 874 -1464 1528 -1212 -6 -732 1216
$$ packed form
1116a912K208o62L842n348K894j805J716k734L118k837K142k159M519n816N808
1131B974m400L638m124K415j601K997m723N568l988K041j746K800l565K907k936
1146a743L802m902N494m516L222l013L595l012K139l249N127n298M109k277K188
1161A666m342N170m680L573l182L443l188L137l617M742n144L893k520K875m155
1176b329N143l911K203k657L626m559L790k633K938l325L272l188M243n849N304
1191B068k817O81m24K749m249M001l640L184l699L629k652K429l026L626l077
1206a217K234k591L705l634K134q70J704l714M573l870K406j962K420k216J734
1221H36k031K996l389K221r93J242j988K592j954J342k338K992k740J206p26J948
$$ plain form
1237 1216 -1327 867 -986 1093 -1476 235 447 -748 -477 1968 -1173 158 110 322 -551 907
1253 907 408 96 -368 594 -254 -639 -1013 522 115 -820 771 1302 -1242 898 1002 -1082 -248 686
1271 686 141 698 -875 1319 -486 -1101 726 -19 -1040 820 1144 -771 967 763 334 -1027 413
1288 413 465 315 -534 384 -265 -136 -615 1079 -862 -88 475 -125 -1878 1657 -1692 616 -602 696
1306 696 -269 998 34 890 -1531 357 -522 891 -1141 1117 -270 696 -1455 1991 -1850 504
1322 504 -681 529 -680 698 -745 1477 -2123 1405 -677 220 -897 1686 -1619 1393 -823
1337 -823 1086 -1827 1458 -1173 861 -1096 1360 -1121 795 -1681 1811 -1643 589 -147 1393
1352 1393 -2213 2554 -1640 787 -1046 1033 -1049 1266 -1396 2054 -1948 990 -1049 1082 -2287
$$ packed form
1237A216k543K194j853K079k569J711K12j195K71K445l141J331m8K12q73J458
1253I07m99l12m64R62q48l85l74J535m07r35J591N31k544K140J04k084Q34R34
1271F86n45N57j573K194j805o15J827p45j021J860L24j915J738k04m29j361J440
1288D13N2j50q49R18o49J29m79J694j941P74N63o00j753L535l349K308j218J298
1306F96r65J267r64Q56k421J888q79J413k032K258j387R66k151L446l841K354
1322E04j185J210j209J378j443K222l600L528k082Q97j117K583l305L012k216
1337h23J909k913L285k631K034j957K456k481J916k476L492l454K232p36J540
1352A393l606M767m194K427j833K079k082K315k662L450m002K938k039K131l369
$$ plain form
1367 -2287 1856 -1126 891 -1114 1987 -1646 1062 -737 1378 -1549 1777 -1562 1729 -2121 1217
1382 1217 -808 236 -1191 2079 -1938 1321 -900 1420 -1895 1581 -1212 1425 -1333 1959 -1006
1397 -1006 749 -1259 1059 -1360 527 -1059 2125 -2613 2331 -904 371 -773 1244 -1224 1237
1412 1237 -1176 1685 -1199 717 -895 1302 -2223 1459 -952 587 -1250 1624 -1280 532 -369
1427 -369 973 -1245 1543 -993 1362 -1318 642 -99 90 -1256 1810 -1476 495 -144 493 -1215
1443 -1215 939 -752 931 -1111 1343 -502 218 -734 860 -790 42 -271 956 -1247 840 -288
1459 -288 -271 -655 929 -674 383 -232 1066 -303 351 -64 358 -871 651 124 -149 -85 880 -545
1477 -545 -279 109 341 -690 353 580 351 -184 -58 652 -78 -500 607 -92 -444 671 -88 -716 948
$$ packed form
1367b287M143k982K017k005L101l633K708j799K115k927L326l339L291l850L338
1382A217k025J044j427L270m017L259k221K320l315L476k793K637k758L292k965
1397a006J755k008K318k419J887j586L184m738M944l235J275j144K017k468K461
1412A237k413K861k884J916j612K197l525L682k411J539j837K874k904J812r01
1427c69J342k218K788k536K355k680J960p41J89j346L066l286J971o39O37j708
1443a215K154j691J683k042K454j845P20r52J594j650Q32l13J227k203K087j128
1459b88J7l84J584j603J057o15J298j369O54m15M22j229J522n27k73O4R65j425
1477e45K66L88K32j031J043K27k29n35J26P10p30m22J107o99l52J115p59o28J664
$$ plain form
1496 948 -709 -20 -46 37 524 -419 952 188 -28 -484 571 162 -255 -184 1022 -842 371 416 -304
1515 -304 265 438 -349 818 -959 -50 -613 -551 -242 1076 -684 226 -542 696 -687 862 -843 -68
1533 -68 -1 1513 -984 690 -503 862 -495 751 -749 1474 -1627 1403 485 174 -519 461 -973
1550 -973 699 -258 694 -1158 1083 -943 708 -1231 1012 -417 758 -1251 1529 -1061 745 -248
1566 -248 498 -1418 1430 -1900 1491 -1486 775 -245 921 -1162 1376 -1122 1167 653 509 -1226
1582 -1226 956 -1041 -410 -434 893 -524 1702 -1387 1300 -814 1139 -802 1261 -2097 1247 -520
1598 -520 302 -813 1773 -1443 1802 -1186 2377 -361 625 -456 964 -2428 1711 -374 1327 -6
1614 -6 1451 -514 412 -138 926 -2303 1353 -1212 818 -563 622 -173 -186 -1590 1970 -794 1345
$$ packed form
1496I48j657O89k6Q3M87r43J371p64k16m56J055m09m17P1J206j864J213M5p20
1515c04N69J73p87J167j777R09n63O2L09J318j760R10p68J238j383J549j705P75
1533f8O7J514k497J674j193J365j357J246j500K223l101L030r18l11o93R80j434
1550i73J672r57R52j852K241k026J651j939K243j429J175k009K780k590J806r93
1566b48P46j916K848l330L391k977K261j020J166k083K538k498K289n14j44j735
1582a226K182j997O31k4J327j417K226l089K687k114J953j941K063l358L344j767
1598e20Q22j115K586l216L245k988L563k738R86j081J420l392M139k085J701j333
1614fJ457j965R26n50J064l229L656k565K030j381J185p95j3j404L560k764K139
$$ plain form
1631 1345 -676 1139 -1634 988 -199 271 -1130 678 -1191 427 -758 780 -1685 459 -693
1646 -693 1391 -1958 1074 2 449 -2221 848 -1334 735 -251 -105 23 85 -1151 492 -1043 -55
1663 -55 -633 238 -676 851 -138 -32 411 791 -1685 15 496 351 -271 -145 355 644 -1338 1234 -817
1682 -817 -998 358 847 -1979 380 -662 -359 -226 522 -145 -202 -372 706 -607 65 -128 260 -258
1700 -258 -165 378 -260 -742 592 -688 -350 668 -109 -183 238 -216 428 -652 -144 911 -507 130 544
1719 544 172 -273 529 -242 -441 -608 840 -484 436 47 270 -45 -284 -54 484 -1072 861 197 -288
1738 -288 -311 679 -587 618 -128 450 -592 481 -121 466 -675 814 25 314 -766 1116 -741
1755 -741 255 -321 480 -1249 840 -254 384 -206 756 -494 699 -1057 1060 -599 167 -366 625
$$ packed form
1631A345k021J815k773K622j187M70j401J808j869J618j185J538k465K144j152
1646f93K084l349L032j072M47k670L069k182K069r86J46J28O2j236J643j535R88
1663e5n78Q71r14J527r89J06M43L80k476J700M81j45o22J26N00K89j982K572k051
1682h17j81J356M89k826K359j042L03J33P48o67n7j70J078j313O72j93L88n18
1700b58R3N43o38m82J334j280L38J018p77p4M21m54O44j080N08J055j418O37M14
1719E44l72m45Q02p71j99j67J448j324R20l89K23l15k39K30N38j556J933o64m85
1738b88k3R90j266J205p46N78j042J073o02N87j141J489p89K89j080J882j857
1755g41R96n76Q01j729K089j094O38n90R62j250J193j756K117j659P66n33R91
$$ plain form
1772 625 -925 1182 -919 165 -860 1004 -446 275 -348 732 -1036 844 -1096 1157 -1048 1067
1788 1067 -50 175 -551 1096 -1219 576 -744 736 -915 252 -873 1005 -1230 1246 -579
1803 -579 682 -757 1082 -807 444 -461 1411 -1522 1094 -655 386 -702 801 -764 1215
1818 1215 -890 1043 -572 226 -448 1173 -1283 1053 -586 176 -1236 1208 -887 695 -548 850
1834 850 -682 608 -1242 744 -861 661 67 224 -1250 1358 -920 301 -403 651 -563 1073
1850 1073 -739 1002 -1512 688 -231 304 -850 1058 -858 459 -390 910 -1025 416 -323 628
1866 628 -578 755 -323 299 -527 847 -556 296 72 472 -1349 1124 -280 253 -391 553 -105
1883 -105 371 -443 918 -528 269 -383 259 -349 162 108 410 -1108 320 -562 -224 247 123 -704 377
$$ packed form
1772F25j550K107k101J084j025J864j450P21o23J080j768J880j940K253k205K115
1788A067j117K25p26J647k315J795j320J480j651J167j125J878k235K476j825
1803e79J261j439J839j889J251r05J872k933K616j749J041j088J503j565J979
1818A215k105J933j615P98o74J621k456K336j639P62j412K444k095J582j243J398
1834H50j532J290j850J986j605J522n94J57j474K608k278J221p04J054j214J636
1850A073j812J741k514K200r19N35j154J908j916J317q49J300j935J441p39R51
1866F28j206J333j078O22q26J374j403Q52k24M00j821K473j404N33o44R44o58
1883a05M76q14J361j446P97o52O42o08N11n4L02j518J428q82L38M71j24q27J081
$$ plain form
1902 377 -806 266 -60 -455 1192 -337 -373 116 586 380 261 68 -1068 488 -19 -127 -717 -53
1920 -53 -102 672 -128 70 49 -913 693 782 -447 -752 525 -361 362 -424 -193 590 -76 -613 969 -458
1940 -458 -23 13 240 -740 -62 395 -624 -155 210 -680 569 321 -962 -461 629 79 54 5 127 -950
1960 -950 -574 288 911 -862 533 -28 -222 -12 1442 -553 -191 -204 210 -1128 527 -1092 93 -296
1978 -296 944 223 54 -422 1268 -1454 -23 -48 342 -1010 1170 -397 83 -490 421 -249 516 -516
1996 -516 1375 -560 1057 -79 1206 -1666 427 -423 761 258 1271 -205 388 -1124 166 -696
2012 -696 657 81 1214 -1515 1093 -905 921 -563 608 -483 306 -241 962 -872 753 -385
2028 -385 365 -795 970 -376 256 -584 1557 -1229 737 64 227 -1091 1503 -241 1213 -344
$$ packed form
1902C77j183J072l26l95J647j529l6M89M70k06j19j93j136J556n07j08n90O64
1920e3m9P74q00J98k1r62J606Q9j229l05J277q86P23p86K31P83o66n37J582j427
1940d58M35L6K27r80O78M57j019M69L65q90J249k48j283N01J090n50k5m9J22j077
1960i50L76Q62O23j773J395n61j94K10J454j995L62j3M14j338J655j619J185l89
1978b96J240p21j69m76J690k722J431k5L90j352K180j567M80n73R11o70P65j032
1996e16J891j935J617j136J285k872K093q50J184n03J013j476N93j512J290q62
2012f96J353n76J133k729K608j998J826j484J171j091P89n47J203j834J625j138
2028c85P50j160J765j346O32q40K141k786J966o73J63j318K594j744J454j557
$$ plain form
2044 -344 599 -607 508 -584 655 35 372 -864 776 -1907 1602 927 146 -1504 1235 -736
2060 -736 127 -279 1058 -836 -32 94 1359 -1465 671 -555 212 -1224 814 -1139 1340 -238
2076 -238 1096 -1110 701 -1054 1494 -29 682 -714 1541 -287 140 -564 -363 680 713 703 1034
2093 1034 435 -291 -652 -168 -923 98 -569 496 -132 631 158 1123 -152 428 16 -115 -958 919
2111 919 -658 293 -365 43 -408 -1 -242 695 -206 222 -26 -66 -736 582 -70 299 176 268 -267 -50
2131 -50 -230 21 -556 81 -96 378 -1050 416 -554 -536 -74 373 185 228 605 -98 501 -13 -562 -242
2151 -242 -534 80 -361 152 232 -448 -164 -280 173 -94 -451 -51 124 -131 410 86 -587 -621 591 -120
2171 -120 136 -492 579 -46 150 672 243 -316 232 -99 631 -136 129 -50 234 -145 336 -35 112 -561
$$ packed form
2044c44R43j206J115j092J239o20L37j236J640k683L509o75p81j650K739j971
2060g36Q63m06J337j894Q04J26J265k824K136j226P67j436K038j953K479j578
2076b38J334k206J811j755K548j523P11j396K255j828M27p04K01J043L3j0L31
2093A034n99p26l61M84p55J021o67J065o28P63m73R65j275N80m12j31q43J877
2111I19j577R51o58M08m51M07k41R37r01M28k48m0o70J318o52L69j23R2n35K17
2131e0j80K51n77O37j77M74j428J466r70J8M62M47j88M3L77p03N99n14n49L20
2151b42k92O14m41N13Q0o80K84j16M53k67l57M00J75k55N41l24o73l4J212p11
2171a20K56o28J071o25J96N22m29n59N48l31P30p67K65j79K84l79M81l71J47o73
$$ plain form
2191 -561 58 -1398 650 -151 187 -424 1263 -1150 170 -932 581 -303 -315 -643 767 -901 600
2208 600 -286 -61 -237 912 -663 68 -455 532 -852 541 -418 834 -1035 569 -366 255 -112 423
2226 423 -202 -723 -355 -457 -390 352 -645 688 -374 -3 -859 898 -1383 421 -1042 -143 19 917
2244 917 -780 908 -117 -74 -346 1608 -760 912 -961 1085 -99 1214 -1603 1261 -922 726
2260 726 -92 857 -453 1493 -1161 -140 -204 119 -654 370 -305 345 -467 1173 -469 982 150 713
2278 713 -140 -362 69 994 -1318 1180 -162 312 -53 841 -519 308 -1138 1000 -228 537 239 984
2296 984 -670 -195 50 1281 -1567 1516 -208 1077 -365 827 -220 101 -28 410 -842 348
2312 348 112 196 -850 1098 -85 157 -443 1455 10 700 382 740 -21 -470 -934 -90 -9 1224 -474
$$ packed form
2191e61O19j456K048q01L38o11J687k413J320j102J513q84j2l28J410j668J501
2208F00q86K25j76J149j575P31n23R87j384J393r59J252j869J604r35O21l67N35
2226D23o25n21L68j02O7P42r97J333j062L71q56J757k281J804j463Q99J62Q98
2244I17j697J688j025M3k72J954k368J672j873K046j184J313k817K864k183J648
2260G26q18R49j310J946k654J021o4L23p73J024o75O50q12J640j642J451q32N63
2278G13q53k22M31R25k312K498j342M74l65Q94j360Q27j446K138j228P65k98P45
2296I84j654M75K45J231k848L083j724J285j442J192j047L21j29M38j252J190
2312C48k36Q4j046J948j183K42o00J898j445O90l18L58p61m49m64Q44Q1J233j698
$$ plain form
2331 -474 1058 -520 396 -305 -231 269 -172 149 -360 -686 -555 -174 272 60 -132 234 560 -324 390 -282
2351 -282 755 -377 83 -161 -288 -76 -87 -595 -63 -327 59 -2 -379 5 35 -430 642 -413 -145 250
2371 250 199 -239 -295 272 -129 -583 21 347 -32 112 296 478 -116 -204 50 -618 -1081 513 -134 752 -226
2392 -226 -404 -261 238 -598 966 -158 709 -28 204 -442 65 -861 269 -344 625 -412 667 6
2410 6 29 -648 258 -249 111 -273 419 -636 14 45 129 -532 455 -47 170 -759 487 -348 164 -393 550
2431 550 -556 185 -226 511 -480 142 -363 233 -669 685 -305 -39 -45 490 -543 358 -475 547 -408
2450 -408 475 -201 325 -842 570 -393 158 -392 638 -460 433 -224 326 -508 447 -398 469 -570
2468 -570 551 -265 165 -426 803 -954 684 -473 149 -329 581 -475 424 -482 535 -406 272 -503
$$ packed form
2331d74J532j578R16p01P4N00m41L21n09l26J31L81M46k12j92L66L26q84P14o72
2351b82J037j132M60k44j27K12j1n08N32k64L86o1l77L84L0m65J072j055K68L95
2371B50n1m38n6N67m01m54O04L26l79J44J84J82n94q8K54o68m63J594o47Q86r78
2392b26j78J43M99q36J564j124Q67p37K32o46N07r26J130o13R69j037J079o61
2410FK3o77R06n07L60l84O92j055O50L1Q4o61R87n02K17r29J246q35N12n57R43
2431E50j106P41m11P37r91O22n05N96r02J354r90K66oN35j033R01q33J022r55
2450d08Q83o76N26j167J412r63N51n50J030j098Q93o57N50q34R55q45Q67j039
2468e70J121q16M30n91J229j757J638j157O22m78R10j056Q99r06J017r41O78p75
$$ plain form
2486 -503 611 -522 443 -402 399 -593 780 -125 50 -325 448 -665 345 -482 474 -431 271 -188
2504 -188 312 -740 659 -510 218 -245 574 -524 311 -177 247 -559 365 -290 286 -314 447 -265 337
2523 337 -544 516 -550 138 56 267 -594 526 -391 227 -257 205 -237 236 -222 371 -321 195 -116
2542 -116 170 -412 422 -279 97 -316 452 -354 194 -97 169 -38 92 -217 320 -432 361 -172 -259 66
2562 66 231 -293 148 -141 218 -313 190 -66 -88 -110 237 -52 186 -115 158 -182 -82 147 26 -311 211
2583 211 -173 -83 -16 32 44 20 143 156 -37 -3 224 -158 -49 130 164 -140 48 148 -107 -168 253 -154 -41
2606 -41 -28 130 158 -38 -120 286 -393 157 69 -181 -49 292 -267 10 13 211 -248 110 1 137 -168 146
2628 146 -62 206 -213 478 -37 -82 -28 203 -285 242 -242 189 -72 144 -21 116 -300 319 -299 -18 -72
$$ packed form
2486e03J114j133R65q45Q01r92J373r05J75l75P73j113J010q27R56r05P02m59
2504a88N00j052J399j169P28m63Q19j098Q35m88M24q06R24o55N76o00P61p12O02
2523C37q81J060j066O88q2K11q61J120r17O18m84M62m42M73m58N93o92N16l11
2542a16K86n82Q34p01L76m13P68q06N48k91K66k07J30l09N37p52P93n33q7L25
2562F6J65n24M41k89L59n31N03k56k2k2L47k89K38l01K73l40J00K29j21l37N22
2583B11l84R0O7M8J2k4J23J3j93L4K27l82J09J79L4l04J88J00k55o1M21m07J13
2606d1J3J58K8j96q2M06o79N50q8k50J32L41n59K77LJ98m59L58j09J36l05L14
2628A46k08K68m19O91n15m5N4K31m88N27m84M31k61K16j65J37m16O19o18K81n4
$$ plain form
2649 -72 332 -138 247 -24 271 -356 254 -206 144 -279 294 -218 174 -257 513 -366 180 -100 -11 -350 399
2670 399 -414 324 -317 311 -246 101 -78 226 -328 271 -230 234 -311 396 -107 149 -33 357 -463 303
2690 303 -216 203 -69 260 -93 220 -406 492 -206 120 -277 258 -274 339 11 152 -173 255 -34 469
$$ packed form
2649g2M04m70L85k71K95o27O10m60L50m23N73n12L92m31P70q79N46k80Q9l39P49
2670C99q13P38o41O28n57L47j79L04n54N99n01M64n45P07n03K56j82L90q20P66
2690C03n19M19k72L29l53L13o26Q98o98L26l97N35n32O13l28J41l25M28k89N03
$$ [...]
8191f0
##END NTUPLES=NMR FID
##END=
